##TITLE=31Pdec_LR-745-M1
 CDCl3, 24 sc
 21.1.2022
##JCAMPDX= 6.0         $$ Bruker NMR JCAMP-DX V2.0
##DATA TYPE= NMR SPECTRUM
##DATA CLASS= NTUPLES
##ORIGIN= UXNMR, Bruker Analytische Messtechnik GmbH
##OWNER= root
$$ XWIN-NMR		Version 3.5
$$ Fri Jan 21 11:10:24 2022 Russian Standard Time (UT+4h)  she@DPX200
##.OBSERVE FREQUENCY= 81.013821
##.OBSERVE NUCLEUS= ^31P
##.ACQUISITION MODE= SIMULTANEOUS
##.ACQUISITION SCHEME= undefined
##.AVERAGES= 24
##.DIGITISER RES= 16
##SPECTROMETER/DATA SYSTEM= spect
##.PULSE SEQUENCE= zgpg30
##.SOLVENT NAME= CDCl3
##.SHIFT REFERENCE= (INTERNAL, CDCl3, 0, 248.564)
##AUDIT TRAIL= $$ (NUMBER, WHEN, WHO, WHERE, WHAT)
$$ ##TITLE= Audit trail, XWIN-NMR		Version 3.5
$$ ##JCAMPDX= 5.01
$$ ##ORIGIN= Bruker BioSpin GmbH
$$ ##OWNER= she
$$ F:/spectra/data/she/nmr/P31/1/pdata/1/auditp.txt
$$ ##AUDIT TRAIL=  $$ (NUMBER, WHEN, WHO, WHERE, WHAT)
(   1,<2022-01-21 11:09:30.76 +0400>,<she>,<DPX200>,
      <created by zg, POWCHK disabled, PULCHK disabled
       configuration hash MD5:
       00 E9 B6 7A A2 85 ED C7 34 08 36 98 17 FE 4E 26
       data hash MD5: 32K
       FF FC AD 14 71 7F 0E 59 81 58 A7 43 37 CD D1 74>)
(   2,<2022-01-21 11:09:35.29 +0400>,<she>,<DPX200>,
      <Start of raw data processing
       efp BC_mod = 2 LB = 1 FT_mod = 6 PKNL = 1 PHC0 = -9343.708 PHC1 = 102.2737 SI = 64K 
       data hash MD5: 64K
       CD 72 A5 12 98 01 7C CD A8 F3 E8 23 ED 78 A1 29>)
(   3,<2022-01-21 11:09:50.96 +0400>,<she>,<DPX200>,
      <pk PHC0 = 1.204023 PHC1 = 0 
       data hash MD5: 64K
       B5 96 F5 58 CF F9 AE 9A DE FD 28 01 EC C3 59 9E>)
(   4,<2022-01-21 11:09:59.60 +0400>,<she>,<DPX200>,
      <abs ABSG = 5 
       data hash MD5: 64K
       28 F2 04 1A FA 2B 09 C2 40 5A A4 6E 8C BB 31 69>)
$$ ##END=
$$ 
$$ hash MD5
$$ 47 47 27 A5 DC AF 9B 41 16 75 33 BE D8 EF 50 38
##$RELAX= 
##$RELAX= 
##$RELAX= 
##$RELAX= 
##$RELAX= 
##$RELAX= 
##$RELAX= 
##$RELAX= 
$$ Bruker specific parameters
$$ --------------------------
##$DU= <F:/spectra>
##$EXPNO= 1
##$NAME= <P31>
##$PROCNO= 1
##$TYPE= <nmr>
##$USER= <she>
##$AMP= (0..31)
100 100 100 100 100 100 100 100 100 100 100 100 100 100 100 100 100 100 
100 100 100 100 100 100 100 100 100 100 100 100 100 100 
##$AQSEQ= 0
##$AQ_mod= 1
##$AUNM= <au_zg>
##$AUTOPOS= <>
##$BF1= 81.014009
##$BF2= 200.13
##$BF3= 200.13
##$BF4= 200.13
##$BF5= 200.13
##$BF6= 200.13
##$BF7= 200.13
##$BF8= 200.13
##$BYTORDA= 1
##$CFDGTYP= 0
##$CFRGTYP= 5
##$CHEMSTR= <none>
##$CNST= (0..31)
1 1 145 1 1 1 1 1 1 1 1 1 1 1 1 1 1 1 1 1 1 1 1 1 1 1 1 1 1 1 1 1 
##$CPDPRG= <waltz16>
##$CPDPRG1= <>
##$CPDPRG2= <waltz16>
##$CPDPRG3= <>
##$CPDPRG4= <mlev>
##$CPDPRG5= <mlev>
##$CPDPRG6= <mlev>
##$CPDPRG7= <mlev>
##$CPDPRG8= <mlev>
##$CPDPRGB= <>
##$CPDPRGT= <>
##$D= (0..31)
0 1 0 0 0 0 0 0 0 0 0 0.03 2e-05 3e-06 0 0 0 0 0 0 0 0 0 0 0 0 0 0 0 0 
0 0 
##$DATE= 1642748970
##$DBL= (0..7)
120 120 120 11 120 120 24 19 
##$DBP= (0..7)
150 150 150 150 150 150 150 150 
##$DBP07= 0
##$DBPNAM0= <>
##$DBPNAM1= <>
##$DBPNAM2= <>
$$ [...]
##$SUBNAM3= <"">
##$SUBNAM4= <"">
##$SUBNAM5= <"">
##$SUBNAM6= <"">
##$SUBNAM7= <"">
##$SUBNAM8= <"">
##$SUBNAM9= <"">
##$SW= 501.771253377433
##$SWIBOX= (0..15)
0 1 3 0 0 0 0 0 0 0 0 0 0 0 0 0 
##$SW_h= 40650.406504065
##$TD= 32768
##$TD0= 1
##$TE= 0
##$TE2= 300
##$TE3= 300
##$TEG= 300
##$TL= (0..7)
0 120 53 12 22 120 120 120 
##$TP= (0..7)
150 150 150 150 150 150 150 150 
##$TP07= 0
##$TPNAME0= <>
##$TPNAME1= <>
##$TPNAME2= <>
##$TPNAME3= <>
##$TPNAME4= <>
##$TPNAME5= <>
##$TPNAME6= <>
##$TPNAME7= <>
##$TPOAL= (0..7)
0.5 0.5 0.5 0.5 0.5 0.5 0.5 0.5 
##$TPOFFS= (0..7)
0 0 0 0 0 0 0 0 
##$TUNHIN= 0
##$TUNHOUT= 0
##$TUNXOUT= 0
##$USERA1= <user>
##$USERA2= <user>
##$USERA3= <user>
##$USERA4= <user>
##$USERA5= <user>
##$V9= 5
##$VALIST= <valist>
##$VCLIST= <CCCCCCCCCCCCCCC>
##$VD= 0
##$VDLIST= <DDDDDDDDDDDDDDD>
##$VPLIST= <PPPPPPPPPPPPPPP>
##$VTLIST= <TTTTTTTTTTTTTTT>
##$WBST= 1024
##$WBSW= 4
##$XGAIN= (0..3)
0 0 0 0 
##$XL= 0
##$YL= 0
##$YMAX_a= 535
##$YMIN_a= -753
##$ZGOPTNS= <>
##$ZL1= 120
##$ZL2= 120
##$ZL3= 120
##$ZL4= 120
##$ABSF1= 248.5645
##$ABSF2= -253.2056
##$ABSG= 5
##$ABSL= 3
##$ALPHA= 0
##$AQORDER= 0
##$ASSFAC= 0
##$ASSFACI= 0
##$ASSFACX= 0
##$ASSWID= 0
##$AUNMP= <proc_1d>
##$AZFE= 0.1
##$AZFW= 0.5
##$BCFW= 0
##$BC_mod= 2
##$BYTORDP= 0
##$COROFFS= 0
##$CY= -3
##$DATMOD= 1
##$DC= 0
##$DFILT= <>
##$DTYPP= 0
##$F1P= 0
##$F2P= 0
##$FCOR= 1
##$FTSIZE= 65536
##$FT_mod= 6
##$GAMMA= 0
##$GB= 0
##$INTBC= 1
##$INTSCL= 5.30512e-09
##$ISEN= 30
##$LB= 1
##$LEV0= 0
##$LPBIN= 0
##$MAXI= 10000
##$MC2= 0
##$MEAN= 0
##$ME_mod= 0
##$MI= 50
##$NCOEF= 0
##$NC_proc= -10
##$NLEV= 6
##$NOISF1= 182.463
##$NOISF2= 159.3651
##$NSP= 0
##$NTH_PI= 0
##$NZP= 0
##$OFFSET= 248.5645
##$PC= 4
##$PHC0= -9342.504
##$PHC1= 102.2737
##$PH_mod= 1
##$PKNL= yes
##$PPARMOD= 0
##$PSCAL= 0
##$PSIGN= 0
##$REVERSE= no
##$SF= 81.014009
##$SI= 65536
##$SIGF1= 159.3651
##$SIGF2= -187.1042
##$SINO= 113.3802
##$SIOLD= 16384
##$SREGLST= <1H.CDCl3>
##$SSB= 0
##$STSI= 65536
##$STSR= 0
##$SW_p= 40650.406504065
##$SYMM= 0
##$S_DEV= 0
##$TDeff= 32768
##$TDoff= 0
##$TI= <>
##$TILT= no
##$TM1= 0
##$TM2= 0
##$TOPLEV= 0
##$USERP1= <user>
##$USERP2= <user>
##$USERP3= <user>
##$USERP4= <user>
##$USERP5= <user>
##$WDW= 1
##$XDIM= 65536
##$YMAX_p= 221290484
##$YMIN_p= -206545709
$$ End of Bruker specific parameters
$$ ---------------------------------
##NTUPLES= NMR SPECTRUM
##VAR_NAME=  FREQUENCY,     SPECTRUM/REAL,   SPECTRUM/IMAG
##SYMBOL=    X,             R,               I
##VAR_TYPE=  INDEPENDENT,   DEPENDENT,       DEPENDENT
##VAR_FORM=  AFFN,          ASDF,            ASDF
##VAR_DIM=   65536,         65536,           65536
##UNITS=     HZ,            ARBITRARY UNITS, ARBITRARY UNITS
##FACTOR=    0.620285442955139, 1,           1
##FIRST=     20137.2065510759, 0,            0
##LAST=      -20513.1999529892, 0,           0
##MIN=       -20513.1999529892, -206545709,  0
##MAX=       20137.2065510759, 221290484,    0
$$ Real data points
##PAGE= N=1
##DATA TABLE= (X++(R..R)), XYDATA
$$ [...]
##PAGE= N=2
##DATA TABLE= (X++(I..I)), XYDATA
13062c018530j042942K029794K686483k51047k286380j98756K761506J660167
$$ -3018530 -4061472 -2031678 654805 403758 -1882622 -2081378 680128 2340295
13054B340295k651830m557828j516731K599308K985146J11967j634083j78426
$$ 2340295 -311535 -4869363 -6386094 -3786786 -801640 -689673 -2323756 -2502182
13046b502182J943338J602388p77840k172834q84365J606039K345464J4192l367874
$$ -2502182 -558844 1043544 265704 -1907130 -2791495 -1185456 1160008 1174200 -2193674
13037b193674m039967o43711L656111M635139K174335j40234l50284j04663p66775
$$ -2193674 -6233641 -6877352 -3221241 1413898 3588233 3447999 3097715 2993052 2226277
13028B226277j000270Q1382N86244q86949k410540j938773q58999j239338j843182
$$ 2226277 1226007 1307389 1893633 1006684 -1403856 -3342629 -4201628 -5440966 -7284148
13019g284148m31990J875435K360462J305869R28049J019696j42779j524004n28086
$$ -7284148 -7716138 -5840703 -3480241 -2174372 -1246323 -226627 -369406 -1893410 -2421496
13010b421496J893996K028118l77373j263277J287846L925418L056838l84524
$$ -2421496 -527500 1500618 1123245 -140032 1147814 5073232 8130070 7745546
13002G745546l046534l397004k173506o29963L09444N56555J039920K065578K014182
$$ 7745546 4699012 1302008 -871498 -1501461 -1192017 -635462 404458 2470036 4484218
12993D484218k25040k381384j427365J397397J797189j164870l558055k301735
$$ 4484218 4259178 1877794 450429 1847826 3645015 2480145 -1077910 -3379645
12985c379645R64353K847234K167435q7276k245451k595388q56608O61174k33411
$$ -3379645 -2415292 431942 2599377 2512101 266650 -2328738 -3185346 -2524172 -2757583
12976b757583j956156j184162J770916L290723K164703Q92496P77936K5720k112378
$$ -2757583 -4713739 -5897901 -4126985 -836262 1328441 2220937 2998873 3024593 912215
12967I12215l357791k141785J40278J863245K820002K398678j601k031723l95918
$$ 912215 -2445576 -4587361 -4447083 -2583838 236164 2634842 2633241 601518 205600
12958B05600L183426L126849j229864l671986o52290K899923J367674k986533
$$ 205600 3389026 6515875 5286011 1614025 961735 3861658 5229332 2242799
12950B242799m292003k011738j17797M329L37463J361077J354288J03436o27537
$$ 2242799 -2049204 -4060942 -4178739 -4174410 -3836947 -2475870 -1121582 -1018146 -1645683
12941a645683j72635M57503O91397O78571J20599j072632j815130j335020m95761
$$ -1645683 -1818318 -1360815 -669418 9153 129752 -942880 -2758010 -4093030 -4588791
12932d588791o7467P19571K209860K791810J334312n95859j002056l44440k38553
$$ -4588791 -4656258 -3936687 -1726827 1064983 2399295 1803436 801380 456940 218387
12923B18387q19803j200690j123176p03327J5186L60549k10274k18800K163697
$$ 218387 -601416 -1802106 -2925282 -3628609 -3613423 -3252874 -3463148 -3681948 -1518251
12914a518251N009317L913899j326943n302165m194804n61147J303851R30838
$$ -1518251 3491066 7404965 6078022 775857 -3418947 -3980094 -2676243 -1745405
12906a745405J44810k83451P2173J737881K962660J019482k283250j667530K728180
$$ -1745405 -1600595 -1884046 -1811873 -73992 2888668 3908150 1624900 -42630 2685550
12897B685550L998917m45955l700841n54743L502648J698520k329744j282844
$$ 2685550 6684467 6238512 2537671 1982928 5485576 7184096 4854352 3571508
12889C571508K749366K294936k058850l105604k7031R46496j512663j974673O53819
$$ 3571508 6320874 8615810 6556960 3451356 3424325 4370821 2858158 883485 1537304
12880A537304O36928l512286n192506p85249L929072L087638o38672j722261j86328
$$ 1537304 2174232 -1338054 -6530560 -7315809 -3386737 -299099 -937771 -2660032 -2846360
12871b846360P42535P78836J542591K639924K618371J395415n56008k667177k818409
$$ -2846360 -2103825 -1324989 217602 2857526 5475897 6871312 6315304 3648127 829718
12862H29718N79595M112659K203954l953781o309718j497504L816383L086826
$$ 829718 1409313 5521972 7725926 3772145 -2537573 -4035077 -218694 2868132
12854B868132p10583j194429J159333J412263q89742k098583j650523k202576
$$ 2868132 2157549 963120 2122453 3534716 2644974 546391 -1104132 -3306708
12846c306708l547506k625536M00152J813334Q37475J111176L994569N252930
$$ -3306708 -6854214 -9479750 -9079598 -7266264 -6428789 -5317613 -1323044 3929886
12838C929886J400008m200546n369668j392743K594122L028875J846233J855785
$$ 3929886 5329894 1129348 -4240320 -5633063 -3038941 -10066 1836167 3691952
12830C691952J859864m13989k823545j054865L788270N152472O20128l536847
$$ 3691952 5551816 5137827 2314282 1259417 5047687 10200159 10820287 7283440
12822G283440j392832L242637K245305m476408q665346n327651J530485N599159
$$ 7283440 5890608 9133245 11378550 6902142 -1763204 -7090855 -5560370 38789
12814C8789N204043K112323j635437l744535k673209m14364n36759k284454j069986
$$ 38789 5242832 7355155 5719718 1975183 -698026 -1112390 -1649149 -3933603 -5003589
12805e003589L657937O155854K695996k607859l876335j419801M02475J31131
$$ -5003589 -1345652 4810202 7506198 4898339 1022004 -397797 4678 135809
12797A35809l13755o2284r2301n26291l65339M17784O63439l46919k052443k757727
$$ 135809 -177946 -240230 -332531 -858822 -1224161 -806377 -142938 -489857 -2542300 -5300027
12787e300027o97792L333952N020639J244055m570195n887628j965514J568307
$$ -5300027 -5997819 -2663867 2356772 3600827 -969368 -6856996 -8822510 -7254203
12779g254203J663514J384366K633206K076842j802914l872091n7026N103412
$$ -7254203 -5590689 -4206323 -1573117 503725 -1299189 -5171280 -5228306 -124894
12771a24894M834059K43968k414266j742211j674726l588636m525253k960035
$$ -124894 4709165 4953133 2538867 796656 -878070 -4466706 -8991959 -11951994
12763a1951994p58264P32129J904669K319895J133718j84008M62664J918532J525277
$$ -11951994 -12710258 -11978129 -10073460 -7753565 -6619847 -6803855 -6341191 -4422659 -2897382
12754b897382p0000j11639J064972O99910r85857r70826R44971J668202M94104
$$ -2897382 -2967382 -3079021 -2014049 -1314139 -2299996 -3270822 -2325851 -657649 -163545
12745a63545L20897K101464K886838J157238k98954Q19712K402798J539100q87307
$$ -163545 157352 2258816 5145654 6302892 6003938 6823650 9226448 10765548 9878241
12736I878241k077811j643971j221229j156937l54637R90332Q83369j544959l961567
$$ 9878241 7800430 6156459 4935230 3778293 3423656 4413988 5297357 3752398 -209169
12727b09169l123374O40235K789964Q5974m251157l884750J910720O526715M623628
$$ -209169 -3332543 -2692308 97656 183630 -4067527 -7952277 -6041557 485158 5108786
12718E108786j146871m613671l909723j436662R46370K543086J976644q64099
$$ 5108786 3961915 -651756 -4561479 -5998141 -5051771 -2508685 -532041 -1396140
12710a396140k778817j330029Q86974L59170j200394k7612K424910J648236j623532
$$ -1396140 -4174957 -5504986 -4618012 -4258842 -5459236 -5486848 -3061938 -1413702 -3037234
12701c037234k056231J341955L646711K259025K96297K93937O16413k767j17922
$$ -3037234 -5093465 -3751510 -104799 2154226 2450523 2744460 3360873 3358106 3240184
12692C240184K61013j158096l595237k962488P19014K054912o07293j650301K054518
$$ 3240184 3501197 2343101 -1252136 -4214624 -3495610 -1440698 -2047991 -3698292 -1643774
12683a643774M817995J445262l287788j926793L403052M330862o73356m831462
$$ -1643774 3174221 4619483 1331695 -595098 2807954 7138816 6465460 1633998
12675A633998m023121j543229r71011q94230R89218L331100L346827P01460k583873
$$ 1633998 -2389123 -3932352 -4903363 -5797593 -4808375 -1477275 1869552 2571012 -12861
12666a2861m224873l072715k64240J159332j52344j362096P20731M113924L672814
$$ -12861 -4237734 -7310449 -7574689 -6415357 -6567701 -7929797 -7209066 -3095142 577672
12657E77672j220017m847618k436580L707818P163811M609336j416702n646151
$$ 577672 -642345 -5489963 -7926543 -4218725 2945086 7554422 6137720 491569
12649D91569m856219m79620K865613K195901m74711p86377K079184M043659J388584
$$ 491569 -4364650 -4844270 -1978657 217244 -257467 -1043844 1035340 5078999 6467583
12640F467583m181016p097439m080740K299836O391579N286921J265282j697364
$$ 6467583 2286567 -4810872 -8891612 -6591776 -200197 5086724 6352006 4654642
12632D654642k666754l480219m505115l532728K26209L819086M285825K660339
$$ 4654642 1987888 -1492331 -5997446 -9530174 -9303965 -5484879 -1199054 1461285
12624A461285J733214J456590k44089k815777k816346R26407M720965M301960
$$ 1461285 3194499 4651089 4407000 1591223 -1225123 -298716 4422249 8724209
12616H724209J92018l032299k379436K51240R81761q64879k111974m74712K037156
$$ 8724209 8916227 5883928 3504492 3755732 4737493 3872614 1760640 1285928 3323084
12607C323084K165354K97573m68017O01047J155850K72541k5065J209753J855491
$$ 3323084 5488438 5786011 5317994 5919041 7074891 7347432 7322367 8532120 10387611
12598A0387611L63132j876202l452625m751483n072772k113079L017162M739878
$$ 10387611 10750743 8874541 5421916 670433 -4402339 -6515418 -3498256 1241622
12590A241622P78020l270357j830206K183046K515302l61995j253221K29568o3865
$$ 1241622 2019642 -1250715 -3080921 -897875 1617427 1255432 2211 231779 167914
12581A67914k176214j826456R90483J394905j073580q35315L406336M962941J29130
$$ 167914 -2008300 -3834756 -2844273 -1449368 -2522948 -3358263 48073 5011014 5140144
12572E140144m674680k675779K534251L158455m93562j711273J172521K982962
$$ 5140144 465464 -2210315 323936 3482391 2988829 1277556 2450077 5433039
12564E433039Q81865j735509j600745j23304K19263l71177q40951j422370k061186
$$ 5433039 6314904 4579395 2978650 2855346 3074609 2703432 1862481 440111 -1621075
12555a621075j485080L82831J400003L18136j022705l64917J626469K462755J252294
$$ -1621075 -3106155 -2723324 -1323321 -1005185 -2027890 -2392807 -766338 1696417 2948711
12546B948711n89812j456554j023786O7478R05390P88286k20353j279610j722783
$$ 2948711 2358899 902345 -121441 -53963 851427 1639713 1419360 139750 -1583033
12537a583033j627705j005373P29459L363072M697936K687020j205341l017861
$$ -1583033 -3210738 -4216111 -3486652 -123580 4574356 7261376 6056035 3038174
12529C038174j502475J13568p04174j559579O96705L785445K902784j048730k145114
$$ 3038174 1535699 1649267 945093 -614486 82219 3867664 6770448 5721718 3576604
12520C576604P41954J480319k927803o177334k391378L601731L258606k205605
$$ 3576604 4318558 5798877 2871074 -3306260 -5697638 -2095907 1162699 -1042906
12512a042906m113663l31572K479119J002940L0265K340755K894756j790870n942611
$$ -1042906 -5156569 -5488141 -3009022 -2006082 -1975817 364938 3259694 1468824 -4473787
12503d473787k932998L809644N500018N80039m208060l987791r71347N31777l25963
$$ -4473787 -7406785 -3597141 1902877 2482916 -1725144 -5712935 -6684282 -6152505 -6478468
12494f478468j223712J93535L791787O221770L897456j942006n400053l163822
$$ -6478468 -7702180 -7508645 -3716858 2504912 6402368 4460362 -939691 -4103513
12486d103513J073415K042610j17980j688579j470836r38825l46535R21883J536676
$$ -4103513 -3030098 -987488 -1105468 -2794047 -4264883 -5203708 -5550243 -4628360 -3091684
12477c091684P7250j380371J59113L233244L518391M86445j854526j078859Q13154
$$ -3091684 -3014434 -4394805 -4235692 -1002448 2515943 3002388 1147862 69003 882157
12468H82157J305610O09127R2498K54023R95517J801045J507816k12073j674593
$$ 882157 2187767 2796894 2889392 3143415 4138932 5939977 7447793 7235720 5561127
12459E561127j475425q00049j083511j088969N35331J700363j3879k283459r91440
$$ 5561127 4085702 3285653 2202142 1113173 1648504 3348867 3334988 1051529 60089
12450F0089K637423L255184k61862l167964k351523j72317O62105J002005J902037
$$ 60089 2697512 5952696 5690834 2522870 171347 -970 661135 1663140 3565177
12441C565177J851070n6075j807819j741373r96519p69274l32928L83339k90783
$$ 3565177 5416247 5360172 3552353 1810980 814461 45187 -287741 95598 -195185
12432a95185k196172k202125Q99009L654266K846790J23419j155096q51488o34501
$$ -195185 -2391357 -4593482 -3694473 -40207 2806583 2930002 1774906 923418 288917
12423B88917j27205J863055L884371L207435J913k682296k796080j116203L27474
$$ 288917 161712 2024767 5909138 9116573 9118486 6436190 3640110 2523907 2851381
12414B851381K6208k113116m224324l681078j96653L135240L172438L32166k193418
$$ 2851381 2877589 764473 -3459851 -7140929 -7337582 -4202342 -1029904 -697738 -2891156
12405b891156k121196j50325J115559M4992j724329o43940L702244O357581K832734
$$ -2891156 -5012352 -5162677 -4047118 -4002126 -5726455 -6370395 -2668151 3689430 6522164
12396F522164l708419n449144o03316L712979J465938l791383m162770J595569
$$ 6522164 2813745 -2635399 -3238715 474264 1940202 -1851181 -6013951 -4418382
12388d418382O719447N490171O7307k839859m10107L043279J995222k456750l903205
$$ -4418382 2301065 7791236 7858543 5018684 4608577 7651856 9647078 7190328 3287123
12379C287123m75987J417930k951119p703933m418239L875319O028557k32657
$$ 3287123 2811136 4229066 1277947 -6425986 -10844225 -6968906 -940349 -1173006
12371a173006m831233j277956L976157L150122q82954j285880J202511J512655
$$ -1173006 -6004239 -7282195 -3306038 -155916 -1038870 -2324750 -1122239 390416
12363C90416j44088p5600J156306N50898n70796J034133L564706K572299j444852
$$ 390416 246328 170728 1327034 1877932 1307136 2341269 5905975 8478274 7033422
12354G033422m250546m752373m430166k305007K549855N725793K481564l474514
$$ 7033422 2782876 -1969497 -6399663 -8704670 -6154815 -429022 2052542 -1421972
12346a421972m269484M3489K199255K13216j18576L546841N623996K376767j942420
$$ -1421972 -5691456 -5647967 -3448712 -3235496 -3354072 192769 5816765 8193532 6251112
12337F251112k596758j096077m25391J93123J521780R67005k419415m492843k148461
$$ 6251112 3654354 2558277 2132886 2326009 3847789 4814794 2395379 -2097464 -4245925
12328d245925J379291J828998N50181J102381K640536J770129j302351l215723
$$ -4245925 -2866634 -1037636 -487455 614926 3255462 5025591 3723240 507517
12320E07517k668408j264013k04839N55944P28024J6475o28624j31930J084916
$$ 507517 -2160891 -3424904 -3629743 -3073799 -2345775 -2329300 -2957924 -3089854 -2004938
12311b004938J882826J638381K3021k533139l725626j497547K155230L014505
$$ -2004938 -122112 1516269 1539290 -993849 -4719475 -6217022 -4061792 -1047287
12303a047287J077679O96633K759088K237247l183149p528955m743797J863178
$$ -1047287 30392 727025 3486113 5723360 2540211 -4988744 -9732541 -7869363
12295g869363M494621K101133Q7240P44894J191582M61230J333813L681047K707856
$$ -7869363 -3374742 -1273609 -1186369 -441475 750107 1211337 2545150 6226197 8934053
12286H934053l087012p646020n300884P74310K826776p79610l918791j529497
$$ 8934053 5847041 -1798979 -7099863 -6325553 -3498777 -4278387 -8197178 -9726675
12278i726675M021205O701938M211278l70852k972022k518889p25187M26065K91003
$$ -9726675 -5705470 996468 5207746 4836894 1864872 -654017 -1379204 -953139 -662136
12269f62136m88682q58710m36241l8510o52208j686209j243817J216987L626035
$$ -662136 -1150818 -2009528 -2445769 -2484279 -3136487 -4822696 -6066513 -4849526 -1223491
12260a223491L802627K119767K52215j473960l323291l781872j011745L319801
$$ -1223491 2579136 4698903 4951118 3477158 153867 -3628005 -4639750 -1319949
12252a319949M833914K045567j495670k047955l27299M36888q05233k265019k201623
$$ -1319949 3513965 5559532 4063862 2015907 1688608 2125496 1320263 -944756 -3146379
12243c146379n81235J477532K438743J162710j622823l172690j455205K141942
$$ -3146379 -3727614 -2250082 188661 1351371 -271452 -3444142 -4899347 -2757405
12235b757405M081483K754845K03927p01627J09647L20709q63201j048708J628001
$$ -2757405 1324078 4078923 4282850 3581223 3690870 4011579 3148378 2099670 3727671
12226C727671M538151L257963j852076n264431l698882l52414N82683M1476J059385
$$ 3727671 8265822 11523785 9671709 4407278 708396 355982 938665 980141 2039526
12217B039526K604241J316044k199177l903885k639461j153391q65284k01628
$$ 2039526 4643767 5959811 3760634 -143251 -2782712 -3936103 -4801387 -5003015
12209e003015J461617K526012K441715K282126J734044l46787k275234j157036
$$ -5003015 -3541398 -1015386 1426329 3708455 5442499 5095712 2820478 1663442
12201A663442J544984J382665j445086j838298J287782K399714j386075m871979
$$ 1663442 3208426 4591091 3146005 1307707 2595489 4995203 3609128 -1262851
12193a262851l067063O64322L28205l012949l444933L54270L727871L219564M46024
$$ -1262851 -4329914 -3665592 -3337387 -6350336 -9795269 -9440999 -5713128 -2493564 -2047540
12184b047540j153762k07849J927697K539229K78632k585042k464936M04232K127370
$$ -2047540 -3201302 -3409151 -1481454 1057775 1336407 -1248635 -3713571 -3309339 -1181969
12175a181969J204222L08639O64977k39082k813462k826905J387436M518477K032401
$$ -1181969 22253 330892 995869 756787 -2056675 -4883580 -3496144 1022333 3054734
12166C054734k456100l191727j218238r07081j511975M03665K970403J457388
$$ 3054734 598634 -2593093 -3811331 -4718412 -6230387 -5826722 -2856319 -1398931
12158a398931k678789l039580J560488N324203M372601J012971j577403k926032
$$ -1398931 -4077720 -7117300 -5556812 -232609 4139992 5152963 3575560 649528
12150F49528k682819j88122K346394J555404j298103j551506J136166K070019
$$ 649528 -2033291 -2221413 124981 1680385 382282 -1169224 -33058 2036961
12142B036961l40031j915800k82670R76278j076609l345403j940586J377387K271463
$$ 2036961 1696930 -218870 -501540 474738 -601871 -3947274 -5887860 -4510473 -2239010
12133b239010L98725j061927m68403J061460K129057K122646Q54883r36964j675919
$$ -2239010 -1840285 -2902212 -3370615 -2309155 -180098 1942548 2797431 1860467 184548
12124A84548p51249Q36322K119760K793420K076460n54755l103636k527633O06711
$$ 184548 -566701 269621 2389381 5182801 7259261 6704506 3600870 1073237 1679948
12115A679948K078881J5442k206749j043225K047599L043110R24336j775344k751729
$$ 1679948 3758829 3774271 1567522 524297 2571896 5615006 6539342 4763998 2012269
12106B012269k054147j043924p36604q93864k74782J544681K862356J910849r9712
$$ 2012269 -41878 -1085802 -1822406 -2716270 -2991052 -1446371 1415985 3326834 3227122
12097C227122l52531J099168J101477j614116m197443l898873j858799p12985
$$ 3227122 2874591 3973759 5075236 3461120 -736323 -4635196 -6493995 -7206980
12089g206980n82692J89672J686392K210384J081748j39169M09867K400863L219690
$$ -7206980 -7789672 -7600000 -5913608 -3703224 -2621476 -2760645 -2350778 50085 3269775
12080C269775Q68414k944419l989667q73030K505180K013569p73504r91620J994966
$$ 3269775 4138189 1193770 -2795897 -3668927 -1163747 849822 76318 -915302 1079664
12071A079664L570969Q98795k953054l649616j363479L67329k84413j691973j423073
$$ 1079664 4650633 5549428 2596374 -1053242 -2416721 -2049392 -2333805 -4025778 -5448851
12062e448851P91329K819421K690250J226233R80134K188014K064797m06971j963734
$$ -5448851 -4657522 -1838101 852149 2078382 3058516 5246530 7311327 6904356 4940622
12053D940622k58357J447803p76782m300964l310380J772592M468066J906867
$$ 4940622 4682265 6130068 5353286 1052322 -2258058 -485466 3982600 5889467
12045E889467j798744k752734j926500j094938J96493J554508Q67103j345206
$$ 5889467 4090723 1337989 -588511 -1683449 -1486956 67552 934655 -410551
12037d10551j685329J52594N67891r29131j94845L358055M028579n78579m166622
$$ -410551 -2095880 -1943286 -1375395 -2304526 -2499371 858684 4887263 4308684 142062
12028A42062j539709K607102J549555k334117k304083J095906J941537j77259
$$ 142062 -1397647 1209455 2759010 424893 -1879190 -783284 1158253 980994
12020I80994k69545K113479K057394j131856k093187R66764K639156n56839m168331
$$ 980994 711449 2824928 4882322 3750466 1657279 2624043 5263199 4706360 538029
12011E38029l123664L19319Q37631j445606j826225J409633M762202M630283J497860
$$ 538029 -2585635 -2266316 -1428685 -2874291 -4700516 -3290883 1471319 6101602 7599462
12002G599462j466322k146421j150671m49946q77592j363175p83819L63175J002357
$$ 7599462 6133140 3986719 2836048 2386102 1508510 145335 -638484 -275309 727048
11993G27048J148250J193471O49993o08544r91456N97858K158592J029402j636760
$$ 727048 1875298 3068769 3718762 3110218 2118762 2716620 4875212 5904614 4267854
11984D267854k056505M67700K360538J075795j533786k495824j677022p14132
$$ 4267854 2211349 2679049 5039587 6115382 4581596 2085772 408750 -305382
11976c05382j21642N50617J085205R58756N16412L92905L55343k11030j091792
$$ -305382 -427024 123593 1208798 2167554 2683966 3076871 3432214 3221184 2129392
11967B129392j287662j07224J895960K801338Q12627l050458m692220j529091
$$ 2129392 841730 734506 2630466 5431804 6244431 3193973 -1498247 -3027338
11959c027338L142600L365419j424972m999045k731728J921898K553865j005076
$$ -3027338 115262 3480681 2055709 -2943336 -5675064 -3753166 -1199301 -2204377
11951b204377l011610o12204K379065J703271j271727k219184J9714K881869M073892
$$ -2204377 -5215987 -5828191 -3449126 -1745855 -3017582 -5236766 -5217052 -2335183 1738709
11942A738709L260117Q15847k135758l064033o21397K252034J350307k266637
$$ 1738709 4998826 5814673 3678915 614882 -6515 2245519 3595826 1329189
11934A329189k844489J503608N212549L239294j398612k544790l45051q2820l020897
$$ 1329189 -1515300 -11692 5200857 8440151 7041539 4496749 4151698 4068878 1047981
11925A047981m636314k407338M67011R02816M68648J469827K627992J814737k7915
$$ 1047981 -3588333 -5995671 -5528660 -4625844 -4157196 -2687369 -59377 1755360 1727445
11916A727445q49418r71185j664910k219589j208530Q38922K364331K896374K330976
$$ 1727445 878027 -93158 -1758068 -3977657 -5186187 -4347265 -1982934 913440 3244416
11907C244416M3269l127087m100798j352311K311844L329751J948682N96687k45450
$$ 3244416 3287685 160598 -3940200 -5292511 -2980667 349084 2297766 2894453 2649003
11898B649003j301271j487213M38604K344862R88887k540206l672482r16520K239371
$$ 2649003 1347732 -139481 299123 2643985 3632872 1092666 -2579816 -3496336 -1256965
11889a256965K743821J689086J238793J074968n1862j592986k241085k148960
$$ -1256965 1486856 3175942 4414735 5489703 5437841 3844855 1603770 -545190
11881e45190k064317j338865J077561M003485M379481R27605l630816n083454
$$ -545190 -2609507 -3948372 -2870811 1132674 5512155 6439760 2808944 -2274510
11873b274510k371312J129237J486824j198730l067487j230721K880789N201550
$$ -2274510 -4645822 -3516585 -2029761 -3228491 -6295978 -7526699 -4645910 555640
11865E55640L239363j591911n086969l836304J213941N052811L900825j87441
$$ 555640 3795003 2203092 -2883877 -6720181 -5506240 -453429 3447396 3259955
11857C259955k052528l54772J252649K21670j308964p14973P64535O39750m55478
$$ 3259955 1207427 852655 2105304 2326974 1018010 303037 1067572 1707322 1251844
11848A251844j99370J301646J959187J228443L91078O14m94597j042441r69128
$$ 1251844 1052474 2354120 4313307 5541750 5932828 5933442 5438845 4396404 3427276
11839C427276k95581M53826J087443J222023J56980j499653j748314j91242Q49474
$$ 3427276 3131695 3585521 4672964 5894987 6051967 4552314 2804000 2612758 3462232
11830C462232j29874j458399j488268j480984k615640k877099m39391K247262
$$ 3462232 3332358 1873959 385691 -1095293 -3710933 -6588032 -7027423 -4780161
11822d780161J823639m19116o94199J090073J947836J496443J989400L177965
$$ -4780161 -2956522 -3375638 -4069837 -2979764 -1031928 464515 2453915 5631880
11814E631880K378157j31634j017754K1318o13371l654895m661069j143280K790441
$$ 5631880 8010037 7878403 6860649 6881967 6268596 2613701 -2047368 -3190648 -400207
11805d00207K600671K31535L79977K566133K083832k052482n140862l689136k72404
$$ -400207 2200464 2431999 2811976 5378109 7461941 5409459 268597 -3420539 -3692943
11796c692943O40420j036661j807145k28997J622697K259875K770677L384670
$$ -3692943 -3052523 -4089184 -5896329 -6125326 -4502629 -2242754 527923 3912593
11788C912593J687325k750853n161027j660946L603847L397130j417935k813893
$$ 3912593 5599918 2849065 -2311962 -3972908 -369061 3028069 1610134 -1203759
11780a203759J491301M220534P55916l094697j138184K800085K097245j061699
$$ -1203759 287542 4508076 5263992 2169295 1031111 3831196 5928441 4866742
11772D866742l61937K710899J696863k527941k767044J688676L567022M7868l010387
$$ 4866742 4504805 7215704 8912567 6384626 3617582 5306258 8873280 8921148 5910761
11763E910761j651519K93206q12117k563921k412774k112098k389262k13022M359291
$$ 5910761 4259242 4552448 3740331 1176410 -1236364 -3348462 -5737724 -5950746 -1591455
11754a591455N538754R91194k868788m97822L796877K968189j750767m034562
$$ -1591455 3947299 4938493 2069705 1571883 5368760 8336949 6586182 2551620
11746B551620k757354j660532j332591R69366M459490M648669N49294l302895
$$ 2551620 -205734 -1866266 -3198857 -2229491 2229999 6878668 7427962 4125067
11738D125067l133594l98594J091836m0026j634793o20425K978231M745548Q98906
$$ 4125067 991473 592879 1684715 1644689 9896 -610529 2367702 7113250 8012156
11729H012156n296677o276758o53958M187291K725395j090901j277640P01110
$$ 8012156 2715479 -3561279 -4215237 -27946 2697449 1606548 328908 1030018
11721A030018J60783j648020l21558K634780J822829k113735k800844J247678
$$ 1030018 1190801 -457219 -778777 1856003 3678832 1565097 -1235747 11931
11713A1931M096026K136047o68906n7055K040758J906665K14851k75114K7917
$$ 11931 4107957 6244004 5575098 5518043 7558801 9465466 9680317 9405203 9433120
11704I433120j350500m262806n686330l737610L8386K361728J484906j007887
$$ 9433120 8082620 3819814 -1866516 -5604126 -5565740 -3204012 -1719106 -2726993
11696b726993j845344q2377J509498L66190j920047j816123J016387L478959L402113
$$ -2726993 -4572337 -4654714 -3145216 -2779026 -4699073 -6515196 -5498809 -2019850 1382263
11687A382263J565312l26732j306239j081079l39236m66639j243747m07869K340849
$$ 1382263 2947575 2620843 1314604 233525 -105711 -572350 -1816097 -2223966 116883
11678A16883L356299L75803k782961j390634K500978L016984l06169k314624p17387
$$ 116883 3473182 3848985 1066024 -324610 2176368 5193352 4887183 2572559 1855172
11669A855172J471548K054401J918452Q09941k478846m941967j754961M574865
$$ 1855172 3326720 5381121 7299573 8109514 5630668 688701 -1066260 3508605
11661C508605N439142p20129m901619j477299K935934Q38948l859407l308169
$$ 3508605 8947747 8227618 3325999 1848700 4784634 5623582 1764175 -1543994
11653a543994Q08990J051776k586458l441322j32654K063331J324484J481992
$$ -1543994 -735004 316772 -2269686 -5711008 -5843662 -3780331 -2455847 -973855
11645i73855L401365K894524r42921l210294j523733K32316p13807j571239j92131
$$ -973855 2427510 5322034 4379113 1168819 -354914 -122598 -836405 -2407644 -2599775
11636b599775N95715j206080k308714R5000K996986K577682K59730p67262r94102
$$ -2599775 -2004060 -3210140 -5518854 -5423854 -2426868 150814 410544 -356718 -1350820
11627a350820j792218j118801K527511N196018K534593k637759l916524q54782
$$ -1350820 -3143038 -4261839 -1734328 3461690 5996283 3358524 -558000 -1412782
11619a412782J209481m9458j520878j022790j62916l9796N72823J576516R66498
$$ -1412782 -203301 -252759 -1773637 -2796427 -2959343 -2999139 -2426316 -849800 116698
11610A16698p94723n24781K043613L037771P57048j354491m29378J477832J608364
$$ 116698 -678025 -1202806 840807 3878578 4635626 3281135 2851757 4329589 5937953
11601E937953R36189R68736j14883l925468p294592n789737k14717M372938N026513
$$ 5937953 6874142 7842878 7727995 3802527 -3492065 -9281802 -9496519 -5123581 -97068
11592i7068K842336k42113k890723l367952q28484K379604K803372M51981j340128
$$ -97068 2745268 2503155 -387568 -3755520 -4584004 -2204400 598972 1050953 -289175
11583b89175o53350R66823J409053N95260l09547n30797j52612m1818r90887k078512
$$ -289175 -942525 24298 1433351 2028611 1719064 1188267 1035655 993837 2950 -2075562
11573b075562j173672J589990K865042R14776r00792R75398L817427J909252m274498
$$ -2075562 -3249234 -1659244 1205798 2120574 1219782 2195180 6012607 7921859 3647361
11564C647361p608958m087564J970828M656170L925907L061262K291457n26442
$$ 3647361 -3961597 -8049161 -6078333 -1422163 2503744 5565006 7856463 7330021
11556G330021m475419n388222j656932K881125L426861R5256k423527r65006J973687
$$ 7330021 2854602 -2533620 -4190552 -1309427 2117434 2212690 -210837 -1175843 797844
11547G97844J667912j981391l782476m93388M210838M780689J558914m29038P27439
$$ 797844 2465756 484365 -3298111 -3791499 419339 5200028 6758942 6329904 7057343
11538G057343J832197N18916j375871j615844q01249j33348O11013J137215j9161
$$ 7057343 8889540 9408456 8032585 6416741 5615492 5482144 6093157 7230372 7211211
11529G211211k337964k839548q87524m3108k471901m829412l079825J366229M052962
$$ 7211211 4873247 2033699 1146175 1103067 -1368834 -6198246 -9278071 -7911842 -3858880
11520c858880L803246K725718J608247m70257k697217k694644k59408K127868
$$ -3858880 -55634 2670084 4278331 3808074 1110857 -1583787 -1843195 284673
11512B84673K684838J796890L58207r59011j121790J79594J157351j17965k749629
$$ 284673 2969511 4766401 5124608 4165597 3043807 3223401 4380752 4262787 1513158
11503A513158m084958l125368p88191K162399M878175N279534K301603j482096
$$ 1513158 -2571800 -5697168 -6485359 -4322960 555215 5834749 8136352 6654256
11495F654256k702649j884013j846545k504814j667776k75998j336439l401747
$$ 6654256 3951607 2067594 221049 -2283765 -3951541 -4227539 -5563978 -8965725
11487h965725j437695M136966O039507J231154l143307l60600N061739M465621
$$ -8965725 -10403420 -6266454 -226947 1004207 -2139100 -2499700 2562039 7027660
11479G027660j180100l432162l53479J296093j515894l084907L75813L708919
$$ 7027660 5847560 2415398 2061919 3358012 1842118 -1242789 -866976 2841943
11471B841943J773824j711547j030117J525837M45873k328187o20563M124731
$$ 2841943 4615767 2904220 1874103 3399940 3845813 1517626 897063 5021794
11463E021794L929132k358478o189309k391649L286681L791510O00352j198535
$$ 5021794 8950926 6592448 403139 -1988510 1298171 5089681 5690033 4491498
11455D491498j366996j996796j696910J019153K594360l28114l769144j932897
$$ 4491498 3124502 1127706 -569204 449949 3044309 2716195 -1052949 -2985846
11447b985846K640295K547251k194165m033496l66577K609730O44953k008710
$$ -2985846 -345551 2201700 7535 -4025961 -4392538 -1782808 -1137855 -3146565
11439c146565m91778K873375L257400P74490j253981j707729j343227j36664J624393
$$ -3146565 -3638343 -764968 2492432 3266922 2012941 305212 -1038015 -1174679 449714
11430D49714K220287J107914q961m96090j715895l123848j987379J014371J334675
$$ 449714 2670001 3777915 3768954 3272864 1556969 -1566879 -3554258 -2539887 -1205212
11421a205212j494225j666375K991322N581611P41901n468958m342683J616651
$$ -1205212 -2699437 -4365812 -1374490 4207121 4949022 -519936 -4862619 -3245968
11413c245968L083111p88210j892985K498273N391515K112578k474858k594053
$$ -3245968 -162857 -951067 -2844052 -345779 5045736 7158314 4683456 2089403
11405B089403J3211Q80889K50146P29994J673080O80814j886662l749349m126541
$$ 2089403 2102614 2983503 3233649 3963643 5636723 6317537 4430875 681526 -3445015
11396c445015l406542j322753J902545M196366L685118R85712j847056l248048
$$ -3445015 -6851557 -8174310 -6271765 -2075399 1609719 2595431 748375 -2499673
11388b499673k400736K93600K418127J732910l72910o40836N83870k30945l079519
$$ -2499673 -4900409 -4606809 -2188682 -455772 -828682 -1469518 -885648 -1116593 -4196112
11379d196112l324760L67120K508356p62844m668553k755681K870593M776425
$$ -4196112 -7520872 -7153752 -4645396 -5408240 -10076793 -12832474 -9961881 -5185456
11371e185456J430567j658204j255360L0604J18837P82137K569121K311303j069087
$$ -5185456 -3754889 -5413093 -6668453 -6637849 -6519012 -5736875 -3167754 -856451 -1925538
11362a925538l110645j93092M272837M436724L27108k868558k401472n07387J81554
$$ -1925538 -5036183 -5229275 -956438 3480286 3807394 938836 -1462636 -1970023 -1788469
11353a788469j86856m94182m43771J69830J486488K321538J166652j092525j778336
$$ -1788469 -1975325 -2469507 -2913278 -2743448 -1256960 1064578 2231230 1138705 -639631
11344f39631k90291J002759M85374n10456l01502O49314J133295J021165L87837
$$ -639631 -929922 72837 558211 47755 -253747 395567 1528862 2550027 2937864
11335B937864j135802k835078k904982j314751k69808m16454L97499K649640L083845
$$ 2937864 1802062 -1033016 -3937998 -5252749 -5522557 -5939011 -5541512 -2891872 191973
11326A91973K14505j810791P47093M445078L349128j742183m797700l846628k212122
$$ 191973 406478 -1404313 -657220 3787858 7136986 5394803 597103 -3249525 -5461647
11317e461647j094088J780338N339510M556111q98588m273586j521181K630251
$$ -5461647 -6555735 -4775397 564113 5120224 4221636 -51950 -1573131 1057120
11309A057120K515821j02538m28607J290404J585971K40442m46047m03548r84126
$$ 1057120 3572941 3470403 3041796 4332200 5918171 6158613 5712566 5309018 4324892
11300D324892j455073o01724J79881o44562j412921l09027Q10377j57156j047787
$$ 4324892 2869819 2268095 2447976 1803414 390493 81466 891843 734687 -313100
11291c13100Q25186K983183J347919k434501l110267j60146J788604N04835j379509
$$ -313100 512086 3495269 4843188 2408687 -701580 -861726 926878 1431713 52204
11282E2204j569958q07445m3492O72007L82461j528345k599533k48118K958542
$$ 52204 -1517754 -2325199 -2368691 -1696684 -1314223 -2842568 -5442101 -5690219 -2731677
11273b731677J915677l124669o318169m391607k41202K339990K920193K504613
$$ -2731677 -816000 -3940669 -10258838 -14650445 -14891647 -12551657 -9631464 -7126851
11265g126851J617990J245470J998904K109315J5313j678023M12626L852995L104705
$$ -7126851 -5508861 -4263391 -2264487 -155172 -139859 -1817882 -1405256 2447739 5552444
11256E552444j290587k977511r1819J893750k84441k441144o34260K343119K370232
$$ 5552444 4261857 1284346 1192527 3086277 2801836 360692 -273568 2069551 4439783
11247D439783M37874p10289j566399l018281k857179K43172K959679K024371n59751
$$ 4439783 4877657 4167368 2600969 -417312 -3274491 -3031319 -71640 1952731 1392980
11238A392980j202544m40775p45964j585950r57278O37219J595364K156185K546709
$$ 1392980 190436 -250339 -996303 -2582253 -3539531 -2902312 -1306948 849237 3395946
11229C395946J128841k108409l544173j325107P38793q93390l221286j539780
$$ 3395946 4524787 2416378 -1127795 -2452902 -1714109 -2607499 -5828785 -7368565
11221g368565K605487M044655K127136M10416J36996k45758p37275n64483j450167
$$ -7368565 -4763078 -718423 1408713 1819129 1956125 1710367 973092 408609 -1041558
11212a041558m254884m662944P59488O281566L416349n087289p405134j54862
$$ -1041558 -5296442 -9959386 -9199898 -2918332 498017 -4589272 -11994406 -12149268
11204a2149268O349967M092367j119845m72730L657939K972614k500068m825857
$$ -12149268 -5799301 -1706934 -2826779 -3299509 358430 3331044 830976 -3994881
11196c994881q90562L647939L351679n53953l694257l578418l11744L699365M478749
$$ -3994881 -4885443 -1237504 2114175 1560222 -2134035 -5712453 -6024197 -2324832 2153917
11187B153917P78349k627390m68067M457559M001906l047795p894379m068096
$$ 2153917 2932266 304876 -163191 4294368 8296274 5248479 -2645900 -6713996
11179f713996L109638M453618j86095l262488j191295K109343K809487J952048
$$ -6713996 -3604358 849260 663165 -2599323 -3790618 -1681275 1128212 3080260
11171C080260J513192Q94979o49605j963477k206484j999406j139470J411875
$$ 3080260 4593452 5488431 4838826 2875349 668865 -1330541 -2470011 -1058136
11163a058136M107140L323343r52228l900172k505988N01044J735859J910517
$$ -1058136 3049004 6372347 5420119 1519947 -986041 -484997 1250862 3161379
11155C161379K454018J838204p63481k336299j058771l82291k996192m979911
$$ 3161379 5615397 7453601 6690120 4353821 3295050 2912759 -83433 -5063344
11147e063344k136856J954251J641076o91805J003327M749399L505153j466127
$$ -5063344 -7200200 -5245949 -3604873 -4296678 -3293351 1456048 4961201 3495074
11139C495074j655572L484323M491377j820323o134258k280785K315890k16531
$$ 3495074 1839502 5323825 9815202 7994879 1860621 -420164 1895726 1679195
11131A679195m689081k503086L224124L588946o64740j601938J321299J121959
$$ 1679195 -3009886 -5512972 -2288848 1300098 635358 -966580 354719 1476678
11123A476678l289996m913736q51964L308856L373931K022480J829256Q01276
$$ 1476678 -1813318 -6727054 -7579018 -4270162 -896231 1126249 2955505 3756781
11115C756781j866549k685965k78979J244449p70610k630824m97735L201623L911837
$$ 3756781 1890232 -795733 -1074712 169737 -600873 -3231697 -3729432 -527809 3384028
11106C384028J700466l08313j114469j544060j428887o43492n60052j382943p76710
$$ 3384028 5084494 4776181 3661712 2117652 688765 45273 -514779 -1897722 -2674432
11097b674432J709370K174366j595797m899758k313834L231672L976567q71458
$$ -2674432 -965062 1209304 -386493 -5286251 -7600085 -4368413 -391846 -1263304
11089a263304l760522l28186M358862M175649Q62539j67314J154988O46912k034716
$$ -1263304 -5023826 -5352012 -993150 3182499 4045038 3877724 5032712 5679624 3644908
11080C644908k673080q807J759942j85208k718229j990654N21936R71091m73199
$$ 3644908 971828 963021 2722963 2537755 -180474 -2171128 -1649192 -678101 -1151300
11071a151300m89193J485240K582000J524033K58292J7586n51476k159980l024943
$$ -1151300 -1640493 -155253 2426747 3950780 4209072 4226658 3675182 1515202 -1509741
11062a509741j860904o9300P48438J195743K339922L576706L796153K869572P94804
$$ -1509741 -3370645 -3439945 -2691507 -1495764 844158 4420864 8217017 11086589 11881393
11053A1881393k432271m904817l628066P99586L248760M98032m000904m968042
$$ 11881393 9449122 4544305 916239 1715825 4964585 5462617 1461713 -3506329
11045c506329k474335m03454K26982J537474L223976K127186j711466l438289
$$ -3506329 -5980664 -6384118 -6157136 -4619662 -1395686 731500 -979966 -4418255
11037d418255j70984M295393M574290R23451j936186j688900m66676l09757k63023
$$ -4418255 -4589239 -293846 4280444 5203895 3267709 1578809 1112133 802376 539353
11028E39353P35930J110048o29963k317363p47455K745013L330741Q1863k025086
$$ 539353 1275283 2385331 1755368 -561995 -1309450 1435563 4766304 4848167 2823081
11019B823081J06071K265680l56611m660130m047757O90324K382994p19987k270206
$$ 2823081 2929152 5194832 4838221 178091 -3869666 -3179342 -796348 -1516335 -3786541
11010c786541R87313L462290M58897l628505k962257p3860n92049k761210p95951
$$ -3786541 -2799228 663062 1121959 -2506546 -5468803 -5542663 -6134712 -8895922 -9691873
11001i691873M026630M760036O13297j523367J516785M520311L164883M66498
$$ -9691873 -5665243 -905207 -291910 -1815277 -298492 4221819 7386702 7853200
10993G853200J86236K76133k191342m662573l296434R474N77192j163011m73651
$$ 7853200 8039436 8315569 6124227 1461654 -1834780 -1825306 -1248114 -2411125 -2884776
10984b884776L605105O225609L669506j680311m851064m035118j273099P05986
$$ -2884776 720329 6945938 10615444 8935133 4084069 48951 -1224148 -518162
10976e18162P66786m34407j300994p66136O17766J540810J782465K072110K119823
$$ -518162 248624 -185783 -1486777 -2252913 -1635147 -94337 1688128 3760238 5880061
10967E880061O23174j964799k727156k51430K307093R93952k889170m094867j178412
$$ 5880061 6503235 4538436 1811280 1559850 3866943 4860895 1971725 -2123142 -3301554
10958c301554J127648p72616l564524k171875K247121M202175K210450j4310m46013
$$ -3301554 -2173906 -2946522 -6511046 -8682921 -6435800 -2233625 -23175 -37485 -483498
10949d83498j319106l579666l946420k97763L896439L922529J64888k921558k537845
$$ -483498 -1802604 -5382270 -9328690 -9626453 -5730014 -1807485 -1642597 -4564155 -7102000
10940g102000K65763K907084L745988L010772K369627K733236K513463L981k906900
$$ -7102000 -6836237 -3929153 -183165 2827607 5197234 7930470 10443933 10447914 7541014
10931G541014k715015j25327L64721k258165l499679p86852K029310R86259j678643
$$ 7541014 4825999 4700672 5065393 2807228 -692451 -1479303 550007 1536266 -142377
10922a42377j813561j49784M3705q87157l08115J366406J709174J149955J985042
$$ -142377 -1955938 -2105722 -2062017 -2949174 -3257289 -1890883 -181709 968246 2953288
10913B953288L537517K857123k99312l158009m073747l526380j883036L73130
$$ 2953288 6490805 9347928 9048616 5890607 1816860 -1709520 -3592556 -3219426
10905c219426J265566k66863j724559m02494J920266J529863j208172k513260
$$ -3219426 -1953860 -2220723 -3945282 -4347776 -2427510 -897647 -2105819 -4619079
10897d619079r50147J491318L159704L596395J760958k216424m549249j899300
$$ -4619079 -5569226 -4077908 -918204 2678191 4439149 2222725 -2326524 -4225824
10889d225824K653677K856815j559163m208029j274629L533367M786733J967582
$$ -4225824 -1572147 1284668 -274495 -4482524 -5757153 -2223786 2562947 4530529
10881D530529j543321k981531k012409j80027M66305l39816m05044J658936L685676
$$ 4530529 2987208 5677 -2006732 -2186759 -1720454 -2060270 -2465314 -806378 2879298
10872B879298K853011q4962k242504k669142j956070J63675L176896L948823Q01972
$$ 2879298 5732309 5647347 3404843 735701 -1220369 -1056694 2120202 6069025 6870997
10863F870997k607068k066392O94065J288276M5443K46060J282628L04840j176075
$$ 6870997 4263929 2197537 2891602 4179878 4225321 4471381 5754009 6058849 4882774
10854D882774K53337K280370j32978m920773m992768k38107K017847l66708j314419
$$ 4882774 5136111 7416481 7283503 2362730 -2630038 -2868145 -850298 -1217006 -2531425
10845b531425J493031K034522k430381n207131j556414K785792J553602j537308
$$ -2531425 -1038394 996128 -1434253 -6641384 -8197798 -5412006 -3858404 -5395712
10837e395712k39727L055677K473910l33543K91360L142957K256706k086498l535154
$$ -5395712 -5635439 -2579762 -105852 -439395 -148035 2994922 5251628 3165130 -370024
10828c70024m50831J732868j96407k753852k431249r63636j355860k899152k818365
$$ -370024 -820855 912013 715606 -2038246 -4469495 -5433131 -6788991 -9688143 -12506508
10819a2506508l07266L023916N142503M942246K718010j39875k365699l376310
$$ -12506508 -12813774 -9789858 -4647355 294891 3012901 2873026 507327 -2868983
10811b868983k561321K80843L148697K869042n98376l254059k305499O6417L40323
$$ -2868983 -5430304 -5149461 -2000764 868278 269902 -2984157 -5289656 -5223239 -4882916
10802d882916j374314k561442k255673r78826J212301L617762L756571O46450
$$ -4882916 -6257230 -8818672 -11074345 -12053171 -10840870 -7223108 -3466537 -2820087
10794b820087k346628j455284J808620K567910l45997k888414j708385J612636
$$ -2820087 -5166715 -6621999 -4813379 -2245469 -2591466 -5479880 -7188265 -5575629
10786e575629L310453K169211O7513j033570j208441j568975j974424r96511J281452
$$ -5575629 -2265176 -95965 -28452 -1062022 -2270463 -3839438 -5813862 -6810373 -5528921
10777e528921K055182n26166l579438k530343K226720N309167L700638L75796
$$ -5528921 -3473739 -3999905 -7579343 -10109686 -7882966 -2573799 1126839 1502635
10769A502635r64777j002926k011243l117238j909974J000408K495095J445984
$$ 1502635 537858 -465068 -2476311 -5593549 -7503523 -6503115 -4008020 -2562036
10761b562036J3504L88130K024709K501374M36694k625354l549863j359917J210344
$$ -2562036 -2548532 -2160402 -135693 2365681 2802375 177021 -3372842 -4732759 -3522415
10752c522415J229920m62019q80020O01863K046756K286715J395218j059643m507187
$$ -3522415 -2292495 -2754514 -3634534 -3032671 -985915 1300800 2696018 1636375 -2870812
10743b870812n277378p35067N114541N560911P71250k408075q51158J106876k3751
$$ -2870812 -8148190 -8883257 -3768716 1792195 2563445 155370 -695788 411088 387337
10734C87337j576394p25354M03591m86899j278195K92507K418832L090256L532485
$$ 387337 -1189057 -1914411 -1510820 -1997719 -3275914 -2983407 -564575 2525681 6058166
10725F058166M072651J709186l752992o357322k259705L221287K887699j799862
$$ 6058166 10130817 11840003 8087011 1729689 -530016 2691271 5578970 3779108
10717C779108l872312j483234J286127K079246J989269Q66019k519841n818358
$$ 3779108 -93204 -1576438 -290311 1788935 3778204 4644223 2124382 -3693976
10709c693976m637569N51078M081889K728988n03386j422903L6415J136010N83334
$$ -3693976 -8331545 -7780467 -3698578 -969590 -1472976 -2895879 -2859464 -1723454 -1140120
10700a140120k48904L77380J863379J474896j818454m614974k895580J782192
$$ -1140120 -1389024 -1011644 851735 2326631 508177 -4106797 -7002377 -5220185
10692e220185L845919J911109M99591K061863K989325O33426j466735O1846K011601
$$ -5220185 -1374266 536843 1036434 3098297 6087622 6721048 5254313 5316159 7327760
10683G327760J97827k818279k051474J088966J176367k034733l588915j618926
$$ 7327760 7525587 4707308 2655834 3744800 4921167 2886434 -702481 -2321407
10675b321407O54593J068483R59031J130343M93851n79560O763K136634K984950
$$ -2321407 -1666814 -598331 360700 1491043 1984894 1405334 1412097 3548731 6533681
10666F533681J192188j504964l068702k805862m91982L113528N134817L117303
$$ 6533681 7725869 6220905 3152203 346341 -145641 2967887 8102704 11220007
10658A1220007j247001l742264k975149j412974j057598q66752P55434K875482
$$ 11220007 9973006 6230742 3255593 1842619 785021 -81731 673703 3549185
10650C549185K632239j379490o522836p603642k408309M657692O898205L267857
$$ 3549185 6181424 4801934 -1720902 -9324544 -11732853 -7075161 -176956 3090901
10642C090901j041967k057486j046657k74040N50113J585989J179781m91560l41496
$$ 3090901 2048934 -8552 -1055209 -1329249 -779136 806853 1986634 1495074 1153578
10633A153578K198403K988636k57955l479006k252909J464380K779015R28451
$$ 1153578 3351981 6340617 6082662 2603656 350747 1815127 4594142 5522593
10625E522593j095628j408589k82267J270828J412626j146844l883541k566884
$$ 5522593 4426965 3018376 2736109 4006937 5419563 4272719 389178 -2177706
10617b177706J665582K653478j070051l319452m40504K613641J253857q57344
$$ -2177706 -512124 2141354 1071303 -2248149 -2688653 -75012 1178845 321501
10609C21501P50177K705446K82170l147000j737101K112151J607880k869532m784880
$$ 321501 1071678 3777124 4059294 912294 -824807 1287344 2895224 25692 -4759188
10600d759188k171780P73640J659209K008346K132985P16513q63790J17819K373603
$$ -4759188 -6930968 -6157328 -4498119 -2489773 -356788 359725 -504065 -386246 1987357
10591A987357K028923r03562k368999m01510K629094L631858J732379j556689
$$ 1987357 4016280 3112718 743719 342209 2971303 6603161 8335540 6778851
10583F778851l225658j643650N17733m95734l072994k277850J215800J581981
$$ 6778851 3553193 1909543 2427276 1931542 -1141452 -3419302 -2203502 -621521
10575f21521j376559j045683L465396M039666k251993o609114l058021J323787
$$ -621521 -1998080 -3043763 421633 4461299 2209306 -4399808 -7457829 -6134042
10567f134042o42119l587521k20542M972825M206725L90097P18232L353061K343726
$$ -6134042 -6776161 -10363682 -10584224 -5611399 -1404674 -1014577 -296345 3056716 5400442
10558E400442m90173r2320J398503l06543k333776q23968M94362j796999k482382
$$ 5400442 4910269 4817949 6216452 5909909 3576133 2752165 3246527 1449528 -1032854
10549a032854J871397L646709k463532p141710j515593N936856L332448l949695
$$ -1032854 838543 4485252 2021720 -5119990 -6635583 -698727 2633721 -1315974
10541a315974l833599R35014M64712k253088J127698N284671P69906n290783k23478
$$ -1315974 -5149573 -4214559 -3749847 -6002935 -4875237 409434 1179340 -4111443 -4334921
10532d334921R525782P938774k485424o016556j520907m81021k456584J810276
$$ -4334921 5190861 13129635 10644211 4627655 3106748 2625727 169143 1979419
10524A979419P421190K150787p782601o225991K680858J668928o420100l881084
$$ 1979419 9400609 11551396 3768795 -2457196 223662 1892590 -4527510 -8408594
10516h408594O612223N769874m867057m838169N773591O082834m671825n027873
$$ -8408594 -1796371 3973503 -893554 -5731723 41868 6124702 1452877 -3574996
10508c574996O347547O988536n358848p467819L853602N443145n120438l682575
$$ -3574996 2772551 9761087 4402239 -3065580 788022 6231167 1110729 -2571846
10500b571846R939322P522361r968736p986041J3517281J2657752j3213088j3516549
$$ -2571846 7367476 14889837 4921101 -3064940 10452341 23110093 9897005 -3619544
10492c619544J8171265J9389260j9711009p194110R6496006J66331628P3310045
$$ -3619544 14551721 33940981 14229972 7035862 103531868 269863496 343173541
10485C43173541j04686810j70817124q0549749J7777538J6060024k4316233j4969999
$$ 343173541 238486731 67669607 -12880142 4897396 20957420 -3358813 -18328812
10478a8328812J9038726J4416767j2879796j1392685R430744P628775j0224392
$$ -18328812 709914 15126681 2246885 -9145800 284944 7913719 -2310673
10471b310673q649242P271279O516593o781516m754821Q981777Q010340n875390
$$ -2310673 -10959915 -3688636 2827957 -3953559 -8708380 273397 8283737 2408347
10463B408347q062640K064768L327136n319843n267122M165099N611669j879144
$$ 2408347 -5654293 -3589525 -262389 -5582232 -10849354 -6684255 -1072586 -2951730
10455b951730k207142N650996O163133k613724o100201p43434J680788k016647
$$ -2951730 -5158872 492124 6655257 4041533 -2058668 -2802102 -1121314 -3137961
10447c137961k358967K057580K104316k507299k068222L827698N047173k3260
$$ -3137961 -5496928 -3439348 -1335032 -3842331 -5910553 -2082855 2964318 2941058
10439B941058k138875J207608K645505M9463r11507L71083j113616l960634k083282
$$ 2941058 802183 2009791 4655296 4704759 3793252 4164335 3050719 -909915 -2993197
10430b993197K271613J334703l489490l835479N7643M03121k608208j091990M937026
$$ -2993197 -721584 613119 -2876371 -6711850 -6654207 -6251086 -8859294 -9951284 -5014258
10421e014258O736447K308056q71790L55418J027955q26712j301149M7365p69864
$$ -5014258 1722189 4030245 3158455 3513873 4541828 3715116 2413967 2461332 1691468
10412A691468k993595j780761J605061J073071k649511k630374J628399L202050
$$ 1691468 -1302127 -3082888 -1477827 -404756 -3054267 -5684641 -4056242 -854192
10404h54192K32713j447752M18757J046445j566327k864917k74113K601998K509096
$$ -854192 -621479 -2069231 -1650474 -604029 -2170356 -5035273 -5309386 -2707388 -198292
10395a98292O06059j079751j464261Q82708N153387O320573J832459k879317k440548
$$ -198292 407767 -671984 -2136245 -1253537 3899850 10220423 12052882 9173565 6733017
10386F733017o29456l040502n830916k372730L472357L010575j789664j764535
$$ 6733017 6103561 3063059 -2767857 -5140587 -1668230 1342345 -447319 -2211854
10378b211854K717766K633683k812421m693945o61439J558276q43133j247400
$$ -2211854 505912 3139595 327174 -4366771 -5028210 -3469934 -4313067 -5560467
10370e560467K502718L290459j473517l974357K70886M382969K287108j519167
$$ -5560467 -3057749 232710 -1240807 -5215164 -4944278 -561309 1725799 206632
10362B06632j167277R89801R43414P46038K638251L031856o02929l541826j404820
$$ 206632 -960645 29156 972570 1718608 4356859 7388715 6785786 3243960 1839140
10353A839140J982405J054328k388693l104540j010286L91632N57404J127290
$$ 1839140 3821545 4875873 2487180 -617360 -1627646 -1236014 -678610 448680
10345D48680J500149J93638j662902k125474j487076o30620Q95651K667754K511496
$$ 448680 1948829 2142467 479565 -1645909 -3132985 -3763605 -2867954 -200200 2311296
10336B311296L03687p96091O47091J688614q3507k501325k430233l78306J075170
$$ 2311296 2614983 1818892 2465983 4154597 4071090 1569765 -860468 -1238774 -163604
10327a63604R61970Q6708l65051N48481K080428J348796k490787m910108j672329
$$ -163604 798366 885074 520023 1068504 3148932 4497728 2006941 -2903167 -4575496
10318d575496L418480K892750k679146n066946j392522J741966r7027j929375
$$ -4575496 -1157016 1735734 -943412 -6010358 -7402880 -5660914 -5757941 -7687316
10310g687316J356566N807025M855042k83939l196029j837301L21299N58489n19179
$$ -7687316 -6330750 -523725 4331317 4047378 851349 -985952 -664653 -106164 -625343
10301f25343j345053q78274J094910L016733K633291K80372j354426j439635j582399
$$ -625343 -1970396 -2848670 -1753760 1262973 3896264 4176636 2822210 1382575 -199824
10292a99824j747533q5154K347015J964653q70148j525484R09720J668121j111312
$$ -199824 -1947357 -2032511 314504 2279157 1409009 -116475 793245 2461366 1350054
10283A350054k738514n39205J034747j251350k843048O42664N003687M159225
$$ 1350054 -1388460 -1927665 -892918 -2144268 -4987316 -4344652 659035 4818260
10275D818260J90771r98134J28533r09031l200485k050712J653907K166419j292331
$$ 4818260 5009031 4010897 4139430 3230399 29914 -2020798 -366891 1799528 507197
10266E07197l202135r16720J782017J584878o492q52651j295548j304980P05845
$$ 507197 -2694938 -3611658 -1829641 -244763 -251255 -1103906 -2399454 -3704434 -2998589
10257b998589M172656N495698K882396j112257l391157l702296l008814j437553
$$ -2998589 1174067 6669765 9552161 8439904 5048747 1346451 -1662363 -3099916
10249c099916P04852K206567K397831J630500J67916j441895j487810O30472J999731
$$ -3099916 -2395064 -188497 2209334 3839834 4007750 2565855 1078045 1708517 3708248
10240C708248l05239l821361l292746J122092L404855Q04795j991173n61321K486468
$$ 3708248 3403009 -418352 -3711098 -2589006 815849 1620644 -370529 -931850 1554618
10231A554618K567412O11240K02765M17020k154534n744186m672671J191068M825308
$$ 1554618 4122030 4733270 4936035 5353055 3198521 -2545665 -7218336 -6027268 -1201960
10222a201960K254653j455226k52626L643445L845733m4527k662719k009117j757710
$$ -1201960 1052693 -402533 -655159 2988286 6834019 6789492 4126773 2117656 359946
10213C59946l690461m125738n98338L127737K731578J14351j81786J465092J102510
$$ 359946 -3330515 -7456253 -8054591 -4926854 -2195276 -2080925 -2262711 -797619 304891
10204C04891j381371j929095M48332J605473q51645l264632j454968K694094L703582
$$ 304891 -1076480 -3005575 -2557243 -951770 -1803415 -5068047 -6523015 -3828921 -125339
10195a25339m2595m430413m823716r55072L438304M507448J744455j724835k407987
$$ -125339 -167934 -4598347 -9422063 -10377135 -6938831 -2431383 -686928 -2411763 -4819750
10186d819750k13275J717706J131611o27553q51684P35776J867582J038865n10046
$$ -4819750 -5033025 -3315319 -2183708 -2811261 -3662945 -2927169 -1059587 -20722 -530768
10177e30768n31037J361958L301583L409122J649532p38291k729279l615449k575935
$$ -530768 -1061805 300153 3601736 7010858 8660390 7922099 5192820 1577371 -998564
10168i98564J54287K114863R09884k044310k629704J49028K256697M55283k609067
$$ -998564 -844277 1270586 2180470 136160 -2493544 -2344516 -87819 367464 -2241603
10159b241603k110583J925594M706527L156551p04844k910686j777339J151432
$$ -2241603 -4352186 -2426592 2279935 5436486 4731642 1820956 43617 1195049
10151A195049K790474J338007j515876k170534Q8379J797103M34928j735305j606561
$$ 1195049 3985523 5323530 3807654 1637120 1725499 3522602 3957530 2222225 615664
10142F15664l56423q70381k174844j030353K091757L363105J583714n47329j054607
$$ 615664 259241 -611140 -2785984 -3816337 -1724580 1638525 3222239 2674910 1620303
10133A620303m93667O68448K277189K319041r12598m450432l332397J843510M979421
$$ 1620303 1126636 1795084 4072273 6391314 5478716 1028284 -2304113 -460603 4518818
10124D518818K982148p42259k504441k957111l668337l848702k766980j348362
$$ 4518818 7500966 6758707 4254266 1297155 -2371182 -6219884 -8986864 -10335226
10116a0335226M40916L585269N964470L423925k983408o282099l065494J662523
$$ -10335226 -9894310 -6309041 -344571 3079354 95946 -6186153 -9251647 -7589124
10108g589124K659813J875655L030840M097648J422882k516330k379415J158070
$$ -7589124 -4929311 -3053656 -22816 4074832 5497714 2981384 601969 1760039
10100A760039K398075l88883k973960k188878L38137K064910K611901J998832
$$ 1760039 4158114 3769231 795271 -1393607 -1055470 1009440 3621341 5620173
10092E620173k85867l145308l941943k114688k83607m00209q60560Q39752L830585
$$ 5620173 5334306 2188998 -1752945 -3867633 -4151240 -4551449 -5412009 -4572257 -741672
10083g41672M324098O59343l624540l533208P43472L567741J622739j178469Q0238
$$ -741672 3582426 4241769 617229 -2915979 -2172507 1395234 3017973 1839504 1919742
10074A919742L119276K090279k210493l024300J001224L073203m79949m041437
$$ 1919742 5039018 7129297 4918804 1894504 2895728 5968931 5488982 1447545
10066A447545k377155P51466q1591k220914k73593L429563K429256k498722m402868
$$ 1447545 -929610 -178144 -259735 -2480649 -2754242 675321 3104577 605855 -3797013
10057c797013j604105L54252j377088k889173j005421J921131L058237L305482
$$ -3797013 -5401118 -5046866 -6423954 -9313127 -10318548 -8397417 -5339180 -2033698
10049b033698L848909L227810N77889j940228k392211j690767j108126j98556
$$ -2033698 1815211 5043021 5620910 3680682 1288471 -402296 -1510422 -1708978
10041a708978J009359P05614j725000l753888k763929N46871L298561L683832
$$ -1708978 -699619 5995 -1719005 -5472893 -8236822 -7689951 -4391390 -707558
10033g07558K097031J27740r06036j091078j436691j722263k01304L165873N108267
$$ -707558 1389473 1517213 611177 -479901 -1916592 -3638855 -3840159 -674286 4433981
10024D433981L116548n70125j987246r26001r1810k42130K5442O89782M86893
$$ 4433981 7550529 6980404 4993158 4067157 3975347 3733217 3758659 4448441 4935334
10015D935334p1369K92211M74455j148442k860470k091174m82036j238010k610358
$$ 4935334 4863965 5156176 5630631 4482189 1621719 -469455 -951491 -2189501 -4799859
10006d799859k93164M190877M634345K96811k562351j053130N6923k558332m798703
$$ -4799859 -5093023 -902146 3732199 4029010 1466659 413529 470452 -2087880 -6886583
9997f886583k639849Q89642J427479M79092J433712L152493L136509K787775L714829
$$ -6886583 -9526432 -8636790 -7209311 -6730219 -5296507 -2144014 992495 3780270 7495099
9988G495099K883037k116282o499266m190204K109130M190246M09928k915893
$$ 7495099 10378136 8261854 1762588 -2427616 -318486 3871760 4281688 1365795
9980A365795j935718K94786P92649J084453K332517K077024p78823k486055P4545
$$ 1365795 -569923 -275137 517512 1601965 3934482 6011506 5232683 2746628 2821173
9971B821173L751948L121494j679996m995282l175496J021484K400236j73777
$$ 2821173 6573121 9694615 8014619 3019337 -156159 865325 3265561 3091784
9963C091784k839029j992420J183314K683744J172331p78406r05554M3029O83144
$$ 3091784 252755 -1739665 -556351 2127393 3299724 2521318 1615764 1658793 2341937
9954B341937J177395J512914N14750j403786j540622N84316J385168r29608k393408
$$ 2341937 3519332 5032246 5546996 4143210 2602588 3186904 4572072 3642464 1249056
9945A249056L46164L317042R49769m124995m285184J143748M888538L107303J0826
$$ 1249056 1595220 4912262 5862031 1737036 -2548148 -1404400 3484138 6591441 6602267
9936F602267o62504j061851k763853k150989K655974O126144K818563l488833
$$ 6602267 5939763 4877912 2114059 -36930 2619044 8745188 11563751 8074918
9928H074918m672949J09085L916581K194134k186578m283711k848922K34093K775739
$$ 8074918 3401969 3511054 7427635 9621769 7435191 3151480 302558 536651 3312390
9919C312390L248307J247798j790694l471691k559444K09606K977350L938842
$$ 3312390 6560697 7808495 6017801 2546110 -13334 196272 3173622 7112464
9911G112464K584912L15510j182227k106388l285466l204498L23079N064623N298225
$$ 7112464 9697376 10012886 8830659 6724271 3438805 234307 557386 5622009 10920234
9902A0920234k11427n314029m413100L79148L238058K280040l07386k419795k539400
$$ 10920234 10708807 5394778 981678 1360826 4598884 6878924 6571538 4151743 1612343
9893A612343O19293N052808N496941N67547l993203l550251j329593j667972k089473
$$ 1612343 2231636 7284444 12781385 13348932 9355729 5805478 4475885 2807913 718440
9884G18440Q98453L851808K851920J989594M918344M604470m271712q943540N388330
$$ 718440 1616893 5468701 8320621 10310215 15228559 19833029 15561317 6617777 12006107
9875A2006107K5040354J8187032j7876898m4617537l1812326J928814J7937710
$$ 12006107 37046461 55233493 37356595 -7260942 -39073268 -37144454 -19206744
9868a9206744R592126P26315L149275M795787j470854n007705N09242M748599
$$ -19206744 -9614618 -8888303 -5739028 -943241 -2414095 -7421800 -6912558 -2163959
9860b163959J49947m337349M1082O180446M175034j825174k387013P80055p5294
$$ -2163959 -2014012 -6351361 -6310279 -129833 4045201 2220027 -166986 613069 537775
9851E37775l906104l640127N07129K113408M06057M75001K910983K837528q07918
$$ 537775 -3368329 -7008456 -6501327 -4387919 -3981862 -3506861 -595878 2241650 1433732
9842A433732l341538k212032J39334J718018L054839L543729J524813j576246
$$ 1433732 -1907806 -4119838 -3980504 -2262486 792353 4336082 5860895 4284649
9834D284649k435712j250207r63539j509845l39212J698866J157870j133151n47827
$$ 4284649 1848937 598730 -364809 -1874654 -2213866 -515000 642870 -490281 -1038108
9825a038108L029801M157094R80453j449915l7385J006732j814362m184689j184919
$$ -1038108 1991693 6148787 7129240 5679325 5641940 6648672 4834310 649621 -535298
9816e35298L237956J727279m185949n604356q910M629810J966021l450400l703860
$$ -535298 2702658 4429937 243988 -5360368 -5369278 -739468 1226553 -2223847 -5927707
9807e927707O94559K788957M72922j103841J229386L417774J034932l421168m430587
$$ -5927707 -5233148 -2444191 -1971269 -3075110 -1845724 1572050 2606982 -814186 -5244773
9798e244773j667422N97353P61920J244818K621659J863840j844821m262256k069030
$$ -5244773 -6912195 -6314842 -5552922 -4308104 -1686445 177395 -1667426 -5929682 -7998712
9789g998712J832493K552460K79277o93988J370209L653401L169863K53397k605671
$$ -7998712 -6166219 -3613759 -3334482 -4028470 -2658261 995140 4165003 4418400 1812729
9780A812729l489937k429247j104570q54207o27293J542692M525306M355029J90574
$$ 1812729 -1677208 -4106455 -5211025 -6065232 -6692525 -5149833 -624527 3730502 3921076
9771C921076l158338j655137J835232J831675j512613l216189j360463R51484
$$ 3921076 762738 -892399 942833 2774508 1261895 -1954294 -3314757 -2363273
9763b363273J448418J433298J759107P96023j754067l034422j411009M96125k80670
$$ -2363273 -914855 518443 2277550 3073573 1319506 -1714916 -3125925 -2629800 -2910470
9754b910470k538056k851608l77361K565641L614635K282666l92690k699649l286946
$$ -2910470 -5448526 -8300134 -8677495 -6111854 -2497219 -214553 -607243 -3306892 -6593838
9745f593838k159785k12551K086075M326062M914949K458463j390336k958907
$$ -6593838 -8753623 -8966174 -6880099 -2554037 2360912 4819375 3429039 470132
9737D70132j234890Q42359P80690k51886j40157N71353l4774j862217k873412
$$ 470132 -764758 77601 858291 606405 466248 1037601 1002827 -859390 -3732802
9728c732802j830467N44145K519399K497526J68010k561522k904155m07250K277271
$$ -3732802 -5563269 -5019124 -2499725 -2199 165811 -2395711 -5299866 -5707116 -3429845
9719c429845K597200P50756j504749k870779k402674L75132L643125L817259K08299
$$ -3429845 -832645 -81889 -1586638 -4457417 -6860091 -6484959 -2841834 975425 1183724
9710A183724k776860r80178L403484M525146J051980k221384j510726R63973J091837
$$ 1183724 -1593136 -2573314 830170 5355316 6407296 4185912 2675186 3639159 4730996
9701D730996r37624j661071j71486N84619j247723l158420j838573J687377L116919
$$ 4730996 3793372 2132301 1960815 2545434 1297711 -1860709 -3699282 -2011905 1105014
9692A105014P77257k160019k265206l38552N49637j96306m96682O62816K072289
$$ 1105014 1882271 -277748 -2542954 -2881506 -2331869 -2528175 -3024857 -2362041 -289752
9683b89752K825061L296527L178433J245614j956257l726424k869628j432996
$$ -289752 2535309 5831836 9010269 10255883 8299626 4573202 1703574 270578
9675B70578j226490r67760R87327L180978L012729P33128j217742j815173j781424
$$ 270578 -955912 -1923672 -936345 2244633 5257362 5990490 4772748 2957575 1176151
9666A176151j311264l16312j38506j867378l447683j943872J440708K528696Q04291
$$ 1176151 -135113 -451425 -589931 -2457309 -5904992 -7848864 -6408156 -3879460 -3075169
9657c075169M06502K920033L935068P8100m603314m015515Q49124L501545J453665
$$ -3075169 -2668667 251366 4186434 4264534 -338780 -4354295 -3505171 -3626 1450039
9648A450039j398786j909465j628432k210101k007903J10414J747403R74380r8932
$$ 1450039 51253 -1858212 -3486644 -5696745 -7704648 -7594234 -5846831 -4872451 -4971383
9639d971383Q23384J932052P77211q05824J24155J750847K04998l194122l325316
$$ -4971383 -4147999 -2215947 -1438736 -2244560 -2120405 -369558 -164560 -3358682 -6683998
9630f683998L28967K803317J964192J342409K685963K233577j892887m600984
$$ -6683998 -6355031 -3551714 -1587522 -245113 2440850 4674427 2781540 -1819444
9622a819444j514293K978808J912858l102784m154448P12792M774518L041666
$$ -1819444 -3333737 -354929 1557929 -1544855 -5699303 -4986511 -211993 2829673
9614B829673j056857j926674K33728J220885n35617k632835k599077n18767J755964
$$ 2829673 1772816 -153858 79870 1300755 765138 -1867697 -4466774 -4985541 -3229577
9605c229577K460707J265367m73335j135714o38943j80218l87013o96644l87320
$$ -3229577 -768870 496497 23162 -1112552 -1751495 -1931713 -2318726 -3015370 -3402690
9596c402690P05685K081591K323898J3686l739016n077629j889437K649403L676488
$$ -3402690 -2697005 -615414 1708484 1722170 -2016846 -7094475 -8983912 -6334509 -2658021
9587b658021R23167j606085j613565o68392l59649J8538J035744J595958J118384
$$ -2658021 -1734854 -3340939 -4954504 -5622896 -5982545 -5964007 -4928263 -3332305 -2213921
9578b213921O53526P58271O73678L94450R01502J574498M00650k156832k755936
$$ -2213921 -1560395 -802124 -128446 266004 1167506 2742004 3142654 985822 -1770114
9569a770114k19818K257289J980518O33262O87680R88707o39277k714187k047412
$$ -1770114 -1989932 267357 2247875 2881137 3568817 4557524 3918247 1204060 -843352
9560h43352Q40041K224961Q29286p14913n20024j65444j329962k405859q68139
$$ -843352 -3311 2221650 3050936 2336023 1815999 1650555 320593 -2085266 -2953405
9551b953405K320390L364573Q34246k138576k179065l85082k80777k027206k245817
$$ -2953405 -633015 2731558 3565804 1427228 -751837 -1136919 -1417696 -3444902 -5690719
9542e690719p8981Q42008j189115j829721K642938P808495O267338j141841n890612
$$ -5690719 -5769700 -4927692 -6116807 -7946528 -5303590 2504905 8772243 7630402 1739790
9533A739790l755634K85875P77057q64786p81784P75240J238376L02073q32728
$$ 1739790 -2015844 -1729969 -952912 -1817698 -2599482 -1824242 -585866 -283793 -1116521
9524a116521j787257j847983K43798K945067K317174j506903k874859Q09001M037532
$$ -1116521 -2903778 -4751761 -4507963 -1562896 754278 -752625 -3627484 -2818483 1219049
9515A219049J563188k912628k544666J969228M469979L379609K212777J684488
$$ 1219049 2782237 -130391 -2675057 -705829 3764150 7143759 9356536 11041024
9507A1041024q83883m527633m616414q43947J618142M28946r09007j55120N6713
$$ 11041024 10157141 5629508 1013094 169147 1787289 2216235 1307228 1152108 1208821
9498A208821j603741j632569J869235M639366K665312j223212k047023m88244
$$ 1208821 -394920 -2027489 -158254 4481112 7146424 5923212 3876189 3387945
9490C387945p84505l185579l886110j526376J052532J610105J168809J352055
$$ 3387945 2603440 -582139 -4468249 -5994625 -4942093 -3331988 -2163179 -811124
9482h11124K096226K626609K355604M95886k928839n415912l885371Q74074M044902
$$ -811124 1285102 3911711 6267315 6763201 3834362 -1581550 -5466921 -4592847 -547945
9473e47945K594306o87406j067791J605602L165481J613440j57053M03075Q64468
$$ -547945 2046361 1358955 291164 1896766 5062247 6675687 6518634 6921709 7786177
9464G786177k121631o196248n636226k55775L387473J545325j178475M55776L676123
$$ 7786177 5664546 -531702 -6167928 -6423703 -3036230 -1490905 -2669380 -2213604 1462519
9455A462519K405125k419574m118480r83013J353147o43026l108693j664169J788376
$$ 1462519 3867644 1448070 -2670410 -3653423 -2300276 -2943302 -6051995 -7716164 -5927788
9446e927788K880223J435562L47502N34795P11533L08142m18411j535153k298992
$$ -5927788 -3047565 -1612003 -1264501 -729706 -18173 289969 -128442 -1663595 -3962587
9437c962587j011757J629339J869639j321915l020859O97335N456963M162094
$$ -3962587 -4974344 -3345005 -1475366 -2797281 -5818140 -5120805 336158 4498252
9429D498252j783822l940634K10828L392509K81694m092259k906032J235215R29823
$$ 4498252 2714430 -1226204 -1015376 2377133 2658827 -1433432 -4339464 -3104249 -2174426
9420b174426l433620m163434R40324M611670J482408l717233l943121l31051J156842
$$ -2174426 -5608046 -9771480 -8831156 -4219486 -2737078 -6454311 -10397432 -10728483 -9571641
9411i571641p3767N21799L661957M762958K080239l17290J96031N22797j958348
$$ -9571641 -9645408 -9123609 -5461652 -698694 1381545 1064255 1260286 1783083 -175265
9402a75265m164944k590081M23693O59431j002210r77942J81792o49128k294237
$$ -175265 -4340209 -6930290 -6506597 -5847166 -6849376 -7827318 -7645526 -8294654 -10588891
9393a0588891n02070L996825N191808J018264l004538j946705J736613K972583
$$ -10588891 -11090961 -7094136 -1902328 -884064 -3888602 -5835307 -4098694 -1126111
9385a126111J573378Q75392J596203J414964l58656j425372j08061K000373J802735
$$ -1126111 447267 1322659 2918862 4333826 3975170 2549798 2441737 4442110 6244845
9376F244845j595552n276369n081881n20012L833498L577198R5734j791670q30543
$$ 6244845 4649293 -627076 -5708957 -6228969 -2395471 1181727 1277461 -514209 -1344752
9367a344752J1986l25970O83618L419181M027270Q94611j696892k86590J744017
$$ -1344752 -1332766 -1658736 -975118 2444063 6471333 7365944 5669052 5382462 7126479
9358G126479k31393m040198m123548o68051J029668n79349j443063N93468K356214
$$ 7126479 6895086 2854888 -1268660 -1936711 -907043 -1486392 -2929455 -2335987 20227
9349B0227J148658r89722j305961o40773q69459j096632M58181K693429K761828
$$ 20227 1168885 179163 -1126798 -1767571 -2637030 -3733662 -3275481 -582052 2179776
9340B179776K83650j784169n83504L288170N909149L702869k321952o651038n118918
$$ 2179776 2463426 679257 95753 3383923 9293072 12995941 10673989 4022951 -1095967
9331a095967n793K960095K074234Q45559J560906J817852o36268l361930k816594
$$ -1095967 -1101760 1858335 3932569 4778128 6339034 8156886 7520618 4158688 1342094
9322A342094K604J249748K09492k14812J348201K709015J883924j13854j493450
$$ 1342094 1344698 2594446 2803938 2589126 3937327 6646342 8530266 8416412 6922962
9313F922962k322441l292647l603762k125563J68730R51623k70175j363344n40884
$$ 6922962 4600521 1307874 -2295888 -4421451 -4252721 -3301098 -3571273 -4934617 -5475501
9304e475501J100921J117358p75476k089071p59689K127818L686438K732609Q76457
$$ -5475501 -4374580 -3257222 -4032698 -6121769 -6881458 -4753640 -1067202 1665407 2541864
9295B541864J79437P34775R47241l83240k624448l724278k178223R63280K486301
$$ 2541864 2721301 3456076 4403317 4020077 1395629 -2328649 -4506872 -3543592 -1057291
9286a057291M75732k825702l169295L39657L738890L074290p30386l377958k467471
$$ -1057291 -581559 -3407261 -6576556 -6236899 -2498009 576281 -154105 -3532063 -5999534
9277e999534N38259K936129L416474K249847O66351J79777J017106J298520n18710
$$ -5999534 -5461275 -2525146 891328 3141175 3807526 3987303 5004409 6302929 5784219
9268E784219k632316j767064J665257L261762P91672k300783j906381P28546J222214
$$ 5784219 3151903 1384839 3050096 6311858 7103530 4802747 2896366 3624912 4847126
9259D847126j303391l451633k801555m06866J886586L193066K411003j046125
$$ 4847126 3543735 92102 -2709453 -3116319 -1229733 1963333 4374336 3328211
9251C328211m456700l449248J853767N728725M072454l70279k603156k206415
$$ 3328211 -1128489 -4577737 -2723970 3004755 7077209 6706930 4103774 1897359
9243A897359k153197l162392l300321k042713q95129l67935M24930J427772J785321
$$ 1897359 -255838 -3418230 -6718551 -8761264 -9656393 -10024328 -9599398 -8171626 -6386305
9234f386305J913854K648903K956681J486477l40332j83364R49068J40693k135726
$$ -6386305 -4472451 -1823548 1133133 2619610 2279278 2095914 3044982 3185675 1049949
9225A049949k483649m06257R63534N00326N52192J724047J447023m86178m90452
$$ 1049949 -1433700 -1839957 -876423 -376097 176095 1900142 3347165 2860987 2370535
9216B370535K067264K408931j570435m372155j254963L385709K476431k547012
$$ 2370535 4437799 6846730 5276295 904140 -350823 3034886 5511317 2964305
9208B964305m249103p47727K586612K136140k74740k604095m629454m222867J352824
$$ 2964305 -1284798 -2032525 554087 2690227 2415487 -188608 -4818062 -9040929 -7688105
9199g688105Q784916J0154396L705255l038706m086846k690664l943185n668355
$$ -7688105 1096811 11251207 14956462 11917756 7830910 5140246 1197061 -4471294
9191d471294k937549K496571M381570J654079o50089L16515J896959J401109j98485
$$ -4471294 -7408843 -4912272 -530702 1123377 473288 789803 2686762 4087871 3889386
9182C889386j224590j755304j765106m43730J199325M70825k531262l766993p98221
$$ 3889386 2664796 909492 -855614 -1299344 -100019 370806 -2160456 -5927449 -6725670
9173f725670L234062L794895J012766j284146j080574K65097J137162J389015
$$ -6725670 -3491608 303287 1316053 31907 -1048667 -783570 353592 1742607
9165A742607J138084M61160L56296J507893J993398q18590n359155o198757j265421
$$ 1742607 2880691 3341851 3698147 5206040 7199438 6380848 1021693 -5177064 -6442485
9156f442485M252343M275566l4698k275493K58775L861335M539580K492719m83127
$$ -6442485 -2190142 2085424 2050726 -224767 34008 3895343 8434923 10927642 10444515
9147A0444515l738251n875451m138068J132962M621637K391533k291645l516669
$$ 10444515 6706264 830813 -3307255 -2174293 2447344 4838877 2547232 -969437
9139i69437j022097P88767O20501J289373K955398J622610l479513o557022l136165
$$ -969437 -1991534 -1202767 -582266 707107 3662505 5285115 1805602 -4751420 -7887585
9130g887585K666316L429413j219828m351885j390609M221572O150213L088199
$$ -7887585 -5221269 -1791856 -3011684 -7363569 -8754178 -4532606 1617607 4705806
9122D705806m77794l98154K174777K763257k66717l466027l259564j101524q73122
$$ 4705806 4228012 3829858 6004635 8767892 8501175 5035148 1775584 674060 -199062
9113a99062k343089j398793K773997N281849K447634k651821m593621k587055
$$ -199062 -2542151 -3940944 -1166947 4114902 6562536 3910715 -682906 -3269961
9105c269961K40372J974155K644520J862452k96558j422942L36542K629426K008821
$$ -3269961 -3029589 -1055434 1589086 3451538 3154980 1732038 2068580 4698006 6706827
9096F706827m20549q07881P92532N54914k254047l744826j847297O24474J143666
$$ 6706827 6286278 5478397 6270929 6825843 4571796 826970 -1020327 -395853 747813
9087G47813J092643J840932J601735o44268j965282l2423K282153J101968k020341
$$ 747813 1840456 3681388 5283123 4638855 2673573 2641150 4923303 6025271 4004930
9078D004930k426212L31276K119808P16763j665308k635292k493463j969015n39444
$$ 4004930 1578718 1909994 4029802 4746565 3081257 445965 -2047498 -4016513 -4555957
9069d555957J581810K543410J521422J46372j06422P5621j68044k1906R96699
$$ -4555957 -2974147 -430737 1090685 1237057 1130635 1206256 1038212 1016306 2013005
9060B013005J186330o50819k222660p13739J966678R10312l956897n930046l75187
$$ 2013005 3199335 2548516 325856 -387883 1578795 2489107 -1467790 -7397836 -7773023
9051g773023P522003Q395095R88578o191478o183966j518479J477479J542200
$$ -7773023 -251020 8144075 9132653 2941175 -3242791 -4761270 -3283791 -1741591
9043a741591J325267R48935j344402l602350j579177L757166N997938K386649
$$ -1741591 -416324 532611 -811791 -4414141 -5993318 -2236152 3761786 6148435
9035F148435k055889k187125J15212O3771k532679m089136l061281r34594Q72308
$$ 6148435 4092546 1905421 2020633 2084404 -448275 -4537411 -7598692 -8533286 -7660978
9026g660978J667267P44784q71882j3277L870102N869242J832107m571036o036587
$$ -7660978 -5993711 -5248927 -6120809 -6134086 -2263984 3605258 5437365 866329 -5170258
9017e170258j721045K184831J652366p60303j190645P74186L580218N489460M085786
$$ -5170258 -6891303 -4706472 -3054106 -3814409 -5005054 -4230868 -650650 4838810 8924596
9008H924596j404742o478271n133542J372007M985317K070357j729472j012760
$$ 8924596 7519854 1041583 -4091959 -2719952 2265365 4335722 2606250 1593490
9000A593490J069657q89853m915473m829455k04917L400177K955682Q66733k93324
$$ 1593490 2663147 1773294 -3142179 -7971634 -8176551 -4776374 -1820692 -953959 -1247283
8991a247283o58030l10175J593212L900299L619189L36670k655023k889541j669935
$$ -1247283 -1905313 -2215488 -622276 3278023 6897212 7233882 4578859 1689318 19383
8982A9383j255727j540540j037920N40410K078963K425150J171828j075330k769061
$$ 19383 -1236344 -2776884 -3814804 -3274394 -1195431 1229719 2401547 1326217 -1442844
8973a442844k535660n42965J633721K364503J046555j275280k057025M43184M226955
$$ -1442844 -3978504 -4521469 -2887748 -523245 523310 -751970 -2808995 -2365811 1861144
8964A861144M813307P63154m022242n164680k803814K22532K551386L816091K685185
$$ 1861144 6674451 7437605 3415363 -1749317 -4553131 -4330599 -1779213 2036878 4722063
8955D722063p40725k711676m78691K528665J241089k603114k603485J840907L979948
$$ 4722063 3981338 1269662 790971 3319636 4560725 1957611 -645874 1195033 5174981
8946E174981L01807l870592k802385J158086K188956K1578j010066M59286J579542
$$ 5174981 5476788 1606196 -1196189 -38103 2150853 2172431 1162365 1621651 3201193
8937C201193P74685k82982m52653r05987k097494k116613K38258K841287K689411
$$ 3201193 3975878 3692896 3240243 2334256 236762 -1879851 -1641593 1199694 3889105
8928C889105j0827k094676j690968n06906j017584k687538k805418o84199J234875
$$ 3889105 3878278 1783602 92634 -414272 -1431856 -4119394 -6924812 -7609011 -6374136
8919f374136J033486j32229k51478Q89847K634197M626917N323088K272379l390022
$$ -6374136 -5340650 -5472879 -5724357 -4834510 -2200313 2426604 7749692 10022071 6632049
8910F632049n854882j943371L226174K699856k351387m727500j802494K143868
$$ 6632049 777167 -1166204 2059970 4759826 2408439 -2319061 -4121555 -1977687
8902a977687L565416L128962J467728j809272m087193j630958L115259L217994
$$ -1977687 1587729 4716691 6184419 4375147 287954 -1343004 1772255 4990249
8894D990249j838165m510922j277813J707211o64853l960504k277853K072169
$$ 4990249 3152084 -1358838 -2636651 -929440 -1594293 -5554797 -7832650 -5760481
8886e760481L620431K577736J721262p3813l765023m670307P03801O535419N074301
$$ -5760481 -2140050 437686 2158948 2085135 -1679888 -6350195 -5646394 889025 5963326
8877E963326j130415l337982l93181J060150j204101k186008O32411L452111L235774
$$ 5963326 4832911 1494929 1101748 2161898 957797 -1228211 -595800 2856311 6092085
8868F092085J338404q39998l206309l697608l71749L242989J874668k636155l656883
$$ 6092085 7430489 6590491 3384182 -313426 -685175 2557814 4432482 1796327 -1860556
8859a860556n67219J074589N5050Q01263L357920K269107k364215l166451J670546
$$ -1860556 -2427775 -1353186 -1298136 -496873 2861047 5130154 2765939 -400512 1270034
8850A270034M207931J71370l620083j280657K373287J389420r21639L88912J831631
$$ 1270034 5477965 5649335 2029252 748595 3121882 4511302 3589663 3978575 5810206
8841E810206j495905n448406l534640J136053J004784k770496k836035J264246
$$ 5810206 4314301 -1134105 -4668745 -3532692 -2527908 -5298404 -8134439 -6870193
8833f870193K981104N98773p26725J173299K567771J566992P80921J154181L20210
$$ -6870193 -3889089 -3290316 -4017041 -2843742 -275971 1291021 2071942 3226123 3546333
8824C546333j776312k184286q19116p83122k088746j352260J469410K432019P03719
$$ 3546333 1770021 -414265 -1233381 -2016503 -4105249 -5457509 -3988099 -1556080 -852361
8815h52361j02813J053581Q57286j386884j623042J535324L458658Q26707l107134
$$ -852361 -955174 98407 955693 -431191 -2054233 -518909 2939749 3766456 659322
8806F59322m007166k437349r43461M30515K122886K443987O64364m96585J111290
$$ 659322 -3347844 -5785193 -6728654 -6298139 -4175253 -1731266 -1066902 -1563487 -452197
8797d52197L316989K966086N06947j518673k194800j927416p21157R05850J431015
$$ -452197 2864792 5830878 6337825 4819152 2624352 696936 -24221 881629 2312644
8788B312644P02314N30109J286369O93310k116831m283580l225921k98179J776925
$$ 2312644 3014958 3545067 4831436 5524746 3407915 -875665 -4101586 -4399765 -2622840
8779b622840K503999K481643J444549j90705n06770P86857J141981n02650j325847
$$ -2622840 -118841 2362802 3807351 3616646 3109876 3896733 5038714 4536064 3210217
8770C210217M57894J598917j216961n107583m653510l65303J759586p92914l439569
$$ 3210217 3668111 5267028 4050067 -1057516 -5711026 -6076329 -4316743 -5109657 -8549226
8761h549226j496562K977122M224125Q75504k200509n57508L706874M756496J232461
$$ -8549226 -10045788 -7068666 -2844541 -1969037 -4169546 -4727054 -1020180 3736316 4968777
8752D968777j679252J47057L478310K592312j952138m396614k663805n61290p51450
$$ 4968777 3289525 3436582 6914892 9507204 7555066 3158452 494647 -66643 -818093
8743h18093j266799n51516l70902j235281k29110L363658N180997K416605j072941
$$ -818093 -2084892 -2636408 -3007310 -4242591 -4471701 -1108043 4072954 6489559 5416618
8734E416618p25051J464641N72105l196436n093027k826818J219002L637925K802387
$$ 5416618 4691567 6156208 6728313 3531877 -1561150 -4387968 -3168966 468959 3271346
8725C271346n39048l196547k178939R44281J569153n98618o58540K711062L984302
$$ 3271346 2732298 -464249 -2643188 -1698907 -129754 -728372 -1386912 1324150 5308452
8716E308452M22780j967189J654081N655628K645882l983396n584324k138005
$$ 5308452 5731232 3764043 5418124 11073752 13719634 9736238 4151914 2013909
8708B013909m74241j583796m82217K784496K861133n16507k299781k261684m550113
$$ 2013909 1539668 -44128 -526345 2258151 5119284 4602777 2302996 41312 -4508801
8699d508801o880903k261869O752647Q451793N06552m794480J15963O029755K751562
$$ -4508801 -11389704 -13651573 -6898926 1552867 2059419 -2735061 -2619098 3410657 6162219
8690F162219m272800m013819K060837M064811L09129k050887q7525J842156J031036
$$ 6162219 1889419 -2124400 -63563 4001248 4310377 2259490 2171965 4014121 5045157
8681E045157m19848r69422j071876j6000K561201L480395K45268l504013k782227
$$ 5045157 4625309 3655887 2584011 2568011 5129212 8609607 8854875 5350862 2568635
8672B568635P83455K109825J205819J536769K274237O3151l175383k548393O13135
$$ 2568635 3352090 5461915 6667734 8204503 10478740 10541891 7366508 4818115 5431250
8663E431250M18840k922757k982314J541757M279567J978574p09461j61662N69166
$$ 5431250 5850090 2927333 -54981 1486776 5766343 7744917 7035456 6873794 7442960
8654G442960j109571j964821N41529K723959Q75026k264618k481560j052994j419233
$$ 7442960 6333389 4368568 4910097 7634056 8509082 6244464 3762904 2709910 1290677
8645A290677k620882j491381J279820K340840J091984m06147j361267k289838
$$ 1290677 -1330205 -2821586 -1541766 799074 1891058 1484911 123644 -2166194
8637b166194k575601j388079K48869J059055J495032J705296Q3176l131711l785259
$$ -2166194 -4741795 -6129874 -5881005 -4821950 -3326918 -1621622 -1538446 -4670157 -8455416
8628h455416M96613N073534L825591j621945l746838J65620M761533M910056J941958
$$ -8455416 -7958803 -2885269 940322 -681623 -4428461 -4262841 498692 5408748 7350706
8619G350706m66102j938483l604456m124201j685630J764342K373155P3248j213879
$$ 7350706 6884604 4946121 1341665 -2782536 -4468166 -2703824 -330669 -257421 -1471300
8610a471300M73729K378511J661053k27024m18581L16095r73006l762385l977616
$$ -1471300 -997571 1380940 3041993 2814969 2396388 2712483 1739477 -2022908 -6000524
8601f000524k41378L648803M188724K592290J286136n24514l967563n925546k474329
$$ -6000524 -6241902 -2593099 1595625 4187915 5474051 4949537 981974 -4943572 -7417901
8592g417901M043204O536166K336776l466796m994396k101231J527251L383382
$$ -7417901 -3374697 3161469 5498245 2031449 -2962947 -5064178 -3536927 -153545
8584a53545L181831J451021p27641j965510j856024j004741L30119J891912K067368
$$ -153545 3028286 4479307 3751666 1786156 -69868 -1074609 -744490 1147422 3214790
8575C214790m31889l554092l773081j350449j98021j640813k188247P52566M542747
$$ 3214790 2782901 -771191 -4544272 -5894721 -6092742 -7733555 -9921802 -9169236 -4626489
8566d626489N114420K316377r13684k415525j730067O96108L185438L474241J267567
$$ -4626489 487931 2804308 1890624 -524901 -2254968 -1558860 1626578 5100819 6368386
8557F368386j426884l171002l987654l163768K82467M116966M062476J02038k595925
$$ 6368386 4941502 1770500 -2217154 -5380922 -5098455 -981489 3080987 3183025 587100
8548E87100j052253J638713K099305J393686R08359j128817m768216n244100k25712
$$ 587100 -465153 1173560 3272865 4666551 5574910 4446093 -322123 -5566223 -5791935
8539e791935M505713K976918j405999j380993K347107K951027p59084l030175
$$ -5791935 -1286222 1690696 284697 -1096296 1250811 4201838 3442754 412579
8531D12579j336531M62989O6976J6219J221141N66897k330463k765014J168764
$$ 412579 -923952 -460963 -393987 -377768 843373 1410270 -920193 -3685207 -2516443
8522b516443M333907K285456j892296k915772j100264o6064j77728O54603K005323
$$ -2516443 1817464 4102920 2210624 -705148 -1805412 -1871476 -2049204 -1394601 610722
8513F10722J676211O2379n33720j09420n98600j832222j614563J44760R05033
$$ 610722 2286933 2349312 1815592 1706172 1107572 -724650 -2339213 -2194453 -1289420
8504a289420k29496q45025Q20096K775821K115111p02003k706384k759469k448003
$$ -1289420 -1518916 -2363941 -1543845 1231976 3347087 2645084 -61300 -2820769 -5268772
8495e268772k526639j394410J397993K953556J317838l04623J966384N380433
$$ -5268772 -7795411 -9189821 -7791828 -4838272 -3520434 -3825057 -1858673 3521760
8487C521760L728683j991581l491526J568756M329220j458031p864454m198022
$$ 3521760 7250443 5258862 1767336 3336092 7665312 6207281 -1657173 -5855195
8479e855195N325644P020742j083161o268655j186505N478359L784474k564715
$$ -5855195 -529551 6491191 5408030 -860625 -2047130 3431229 7215703 4650988
8471D650988m135694p59299Q41594m75651R313K732384K622102j537583m229465
$$ 4650988 515294 -244005 597589 121938 131251 2863635 5485737 3948154 -281311
8462b81311j762149K171403K400003m10380j703235J6990J516032j42826l260346
$$ -281311 -2043460 127943 2527946 2117566 414331 431321 1947353 1804527 -1455819
8453a455819l586922k22857K576061R29667k968217l658776k39992K574066J756420
$$ -1455819 -5042741 -5265598 -2689537 -1759870 -4728087 -8386863 -8626855 -6052789 -4296369
8444d296369m0240L53431J649551J271276O2865K98446J504445J692082Q00368
$$ -4296369 -4336609 -3983178 -2333627 -1062351 -999486 -701040 803405 2495487 3295855
8435C295855o5788q77760j515524o96519J232180J190135j905446m349189l048281
$$ 3295855 3230067 2352307 836783 140264 1372444 2562579 657133 -3692056 -6740337
8426f740337l54554N30988J141623L511628M269062j53708n395704m352121J217050
$$ -6740337 -7094891 -6563903 -5422280 -1910652 2358410 2204702 -3191002 -7543123 -6326073
8417f326073L111676K28902j44548M014952M974999j368292p230133m731229J795233
$$ -6326073 -3214397 -2985495 -3130043 884909 5859908 4491616 -2738517 -7469746 -5674513
8408e674513L395175N58116M99492L942330M378894j96518l806240k266420Q91182
$$ -5674513 -2279338 -1721222 -1221730 2720600 7099494 6902976 3096736 830316 1721498
8399A721498R91255j023716j727301q62701l43230m21153m9332P06749J172416
$$ 1721498 2712753 1689037 -38264 -900965 -1244195 -1665348 -1714680 -1007931 164485
8390A64485J623094K183555J380028j913739n631600n839435j452282L595667
$$ 164485 1787579 3971134 5351162 3437423 -2194177 -8033612 -9485894 -5890227
8382e890227L942611j268855o643969n862705R56385O830964O097253J164877
$$ -5890227 -1947616 -3216471 -9860440 -15723145 -14766760 -7935796 -1838543 -673666
8374f73666j400811O3197J209484o62709k776112k363170j265449j705501j390360
$$ -673666 -2074477 -2011280 -801796 -1464505 -4240617 -6603787 -7869236 -9574737 -10965097
8365a0965097K410104O518416N325937k38455l149815m77707K580287J181569
$$ -10965097 -8554993 -2036577 3289360 3050905 -98910 -576617 2003670 3185239
8357C185239j837756j170044K207399K712767j062293m465410l837969j034435
$$ 3185239 1347483 177439 2384838 5097605 4035312 -430098 -4268067 -5302502
8349e302502M37173L10967M66293J294660J701169J615433K095235L019663K641923
$$ -5302502 -4865329 -4554362 -4088069 -2793409 -1092240 523193 2618428 5638091 8280014
8340H280014J29783k748669l627156k606959j890043k313418k007136L92243K780648
$$ 8280014 8409797 5661128 2033972 -572987 -2463030 -4776448 -6783584 -6391341 -3610693
8331c610693K082662r82217k427727o51338J300385M37886j763692j860022M46619
$$ -3610693 -1528031 -2510248 -4937975 -5589313 -4288928 -3851042 -5614734 -7474756 -7028137
8322g028137K303594K026978R86388J070875J957017J543067j229003m183804
$$ -7028137 -4724543 -2697565 -1711177 -640302 1316715 2859782 1630779 -2553025
8314b553025l485280J280697M854765K254650l597902m797828K54108M118025
$$ -2553025 -6038305 -4757608 97157 2351807 -1246095 -6043923 -5789815 -1671790
8306a671790J442396l160685k986921N08069J698046N62758Q51133J749189j14237
$$ -1671790 -229394 -3390079 -6377000 -5868931 -4170885 -3608127 -2756994 -1007805 -1122042
8297a122042k479704n14754L021976Q23425n428929n667011J964024O546269J443132
$$ -1122042 -3601746 -4116500 -1094524 -271099 -5700028 -11367039 -9403015 -2856746 -1413614
8288a413614m918245k774845L797474M832151M69059j435393R56961K568375J749996
$$ -1413614 -6331859 -9106704 -5309230 -477079 -8020 -1443413 -486452 2081923 3831919
8279C831919J829415L255560K685932k76188k647293l875353n304564m866785
$$ 3831919 5661334 8916894 11602826 11326638 8679345 4803992 -500572 -5367357
8271e367357K31493O132798N664094n48217m215346j747255J421228P89992q29152
$$ -5367357 -5135864 996934 6661028 6112811 1897465 150210 1571438 2361430 1532278
8262A532278j28137O87351r79178k807858j924209Q7321P28216J000705K244011
$$ 1532278 1404141 2091492 1112314 -1695544 -3619753 -3532432 -2804216 -1803511 440500
8253D40500K425378j55422k677674j573438J904161L608736K032481j089309l600663
$$ 440500 2865878 2710456 32782 -1540656 363505 3972241 6004722 4915413 1314750
8244A314750l769226p86692L036648L364558k73466k907499j409338M43069j723375
$$ 1314750 -2454476 -3241168 -204520 3160038 2886572 -20927 -1430265 -987196 -2710571
8235b710571n168573m104969J039703M488426M011472K815394K664633J265376
$$ -2710571 -7879144 -11984113 -10944410 -6455984 -2444512 370882 3035515 4300891
8227D300891k192172m365908l042078p54742l53197m83417J335464L801116L559332
$$ 4300891 2108719 -2257189 -5299267 -6054009 -6407206 -6890623 -5555159 -1754043 1805289
8218A805289M54140k199944k162301m80842Q39014J200110R95970M55460l28703
$$ 1805289 2259429 59485 -2102816 -2583658 -1744644 -544534 451436 906896 578193
8209E78193j065645j487418j477756q82553L27786J735855K797767L277186K801589
$$ 578193 -487452 -1974870 -3452626 -4335179 -4007393 -2271538 526229 3803415 6605004
8200F605004N95234l062408n521513l974530N21426L417054K295567n7282j38702
$$ 6605004 7200238 4137830 -1383683 -5358213 -4836787 -1419733 875834 818552 679850
8191F79850J027488L45382j378299l90329L321634N111926K651962o09479j032349
$$ 679850 1707338 2052720 674421 284092 3605726 8717652 11369614 10760135 9727786
8182I727786J92531K40286q71053k079375l927156n834548m416214J026575M839420
$$ 9727786 9920317 10160603 9289550 7210175 3283019 -2551529 -6967743 -5941168 -1101748
8173a101748K313165k368906k014994J995613J818780l764287o809022k412572
$$ -1101748 1211417 -1157489 -3172483 -1176870 641910 -3122377 -9931399 -12343971
8165a2343971M256624O271248L758238O63294j581485k906939j969764Q71189
$$ -12343971 -8087347 -1816099 1942139 2605433 1023948 -1882991 -3852755 -2981566
8157b981566J949702j73545j447890J219330M289834L159071m03889j795563j160077
$$ -2981566 -1031864 -1205409 -2653299 -1433969 2855865 6014936 5611047 3815484 2655407
8148B655407j346352j165970K236699N896868L577878l957277q376393n059675
$$ 2655407 1309055 143085 2379784 8276652 11854530 7897253 -479140 -5538815
8140e538815J233463M112066L271843J593404l05728k655695l476826j280110
$$ -5538815 -4305352 -193286 3078557 4671961 4366233 1710538 -1766288 -3046398
8132c046398J417769J052020j907798l876497l001029m70379J921354L053316
$$ -3046398 -1628629 -576609 -2484407 -6360904 -9361933 -9832312 -7910958 -4857642
8124d857642K298347M11706k83154J205296K476482R36796k072864l173097j997484
$$ -4857642 -2559295 -2147589 -2430743 -1225447 1251035 2187831 114967 -3058130 -5055614
8115e055614r59143n62768R23199K818104J753025k250434m045776p93250K976087
$$ -5055614 -6014757 -6577525 -5654326 -2836222 -1083197 -3333631 -7379407 -8172657 -5196570
8106e196570J980304j587816j941962O52702Q62455j891002k123686J866028M307074
$$ -5196570 -3216266 -4804082 -6746044 -6093342 -5230887 -7121889 -9245575 -7379547 -3072473
8097c072473J453522j946615o04340K609690K138305o05648l69905K135518J572683
$$ -3072473 -1618951 -3565566 -4169906 -1560216 578089 -27559 -397464 1738054 3310737
8088C310737k096614l091846L14044K998960J765999q7995L58645O87774j210683
$$ 3310737 1214123 -1877723 -1563679 1435281 3201280 3113285 3471930 4159704 2949021
8079B949021k140902R77808M852972M127230o02514l777777k504960P32250K311130
$$ 2949021 808119 1785927 6638899 10766129 10163615 6385838 3880878 4613128 6924258
8070F924258J338775n56291j336272n53641J09676q40393k057564j148018J124195
$$ 6924258 8263033 7706742 6370470 5816829 5926505 5086112 3028548 1880530 3004725
8061C004725J659918K35276j75341R20329L31572k534622l325987K77671L989304
$$ 3004725 4664643 4899919 4724578 5644907 5976479 3441857 115870 393541 4382845
8052D382845L178060m26805k463606k550813k660791k418437r36112k50057j851255
$$ 4382845 7560905 7134100 4670494 2119681 -541110 -2959547 -3895659 -4145716 -5996971
8043e996971k646145L06463L746457K696632j313924k680533n63231J124671J163820
$$ -5996971 -8643116 -8336653 -4590196 -1893564 -3207488 -5888021 -6451252 -5326581 -4162761
8034d162761J655417K024646l72643l554007k164386L441046O354817L189245
$$ -4162761 -2507344 -482698 -855341 -4409348 -6573734 -3132688 3222129 6411374
8026F411374j575990l490275l766333m078101k286490K366613N332437L039094
$$ 6411374 4835384 1345109 -2421224 -6499325 -8785815 -6419202 -1086765 1952329
8018A952329j071611j677584O59710J674412N24475j68752N07741J109220J121583
$$ 1952329 880718 -796866 -137156 1537256 2061731 1892979 2400720 3509940 4631523
8009D631523J002706Q9103j980462l016200j101816J496899J111826j514448k327492
$$ 4631523 5634229 5723332 3742870 726670 -375146 1121753 2233579 719131 -1608361
8000a608361m83437O96613j93463j98952K462692M360739J589847l788811n727100
$$ -1608361 -2091798 -1395185 -1588648 -1787600 675092 5035831 6625678 2836867 -2890233
7991b890233k042099K874591L843555J009480j360870p90120Q77466R00402m14700
$$ -2890233 -4932332 -2057741 1785814 2795294 1434424 644304 1521770 2422172 2007472
7982B007472o06869J017358K250176J122724j258815k101453n27314J432238J569577
$$ 2007472 1400603 2417961 4668137 5790861 4532046 2430593 1903279 3335517 4905094
7973D905094K06220o26733j89494J12984p81237j694114j115950M8486k80619
$$ 4905094 5111314 4484581 4295087 4408071 3626834 1932720 816770 865256 584637
7964E84637j750212j745838L51388J694622P2767k785699l794953k524200o50321
$$ 584637 -1165575 -2911413 -2560025 -865403 -792636 -3578335 -7373288 -9897488 -10547809
7955a0547809R59282K418382L374645L555679L651856L725202K214319j200920
$$ -10547809 -9588527 -7170145 -3795500 -239821 3412035 7137237 9351556 8150636
7947H150636l413076j574120K210205L161889J71808l326687m376546l143037
$$ 8150636 4737560 3163440 5373645 8535534 8707342 5380655 1004109 -2138928
7939b138928q06500J736833K854901J223194j483792j964117l1544R37576q88707
$$ -2138928 -2945428 -1208595 1646306 2869500 1385708 -578409 -609953 327623 -561084
7930e61084l133034k823333j98804K337108L053693J687571p99832k475696j985644
$$ -561084 -3694118 -6517451 -6716255 -4379147 -1325454 362117 -437715 -2913411 -4899055
7921d899055k00161J098177J757178K551914K757463J151387j177071k098490
$$ -4899055 -5099216 -4001039 -2243861 308053 3065516 4216903 3039832 941342
7913I41342j930574k227664j929919Q53876L723839K200349k316961k927844K338254
$$ 941342 -989232 -3216896 -5146815 -4292939 -569100 1631249 -685712 -3613556 -1275302
7904a275302O506815L629418k491660m171403m13505L366232L376437M77918k826494
$$ -1275302 5231513 8860931 6369271 2197868 1784363 5150595 8527032 9004950 6178456
7895F178456m218859k054801K237479L961329Q14408l305891l720017j617673
$$ 6178456 1959597 -95204 2142275 6103604 6918012 3612121 -107896 -1725569
7887a725569r22125j183203O71529L245743K071131k042459k962546R76131L698019
$$ -1725569 -2647694 -3830897 -3159368 86375 2157506 115047 -2847499 -1871368 1826651
7878A826651R22862k842993j451817L058817L502493j692094o429174n544185
$$ 1826651 2749513 -93480 -1545297 1513520 5016013 3323919 -3105255 -8649440
7870h649440p07285L297185M367469L364780J542570R0473L56009K044042K372643
$$ -8649440 -9356725 -6059540 -1692071 1672709 3215279 3305752 3661761 5705803 8078446
7861H078446n31366m217445m566146j444316J319197J690653J587808K307293
$$ 8078446 7547080 3329635 -1236511 -2680827 -1361630 329023 1916831 4224124
7853D224124J842440q02993k415155m31066K062324Q51060k210084k080757P67616
$$ 4224124 6066564 5263571 2848416 2417350 4479674 5330734 3120650 1039893 1807509
$$ [...]
##END NTUPLES=NMR SPECTRUM
##END=
