##TITLE=31Pdec_LR-745-M1-PE-MT
 CDCl3, 24 sc
 15.4.2022
##JCAMPDX= 6.0         $$ Bruker NMR JCAMP-DX V2.0
##DATA TYPE= NMR SPECTRUM
##DATA CLASS= NTUPLES
##ORIGIN= UXNMR, Bruker Analytische Messtechnik GmbH
##OWNER= root
$$ XWIN-NMR		Version 3.5
$$ Fri Apr 15 13:56:21 2022 Russian Standard Time (UT+4h)  she@DPX200
##.OBSERVE FREQUENCY= 81.013821
##.OBSERVE NUCLEUS= ^31P
##.ACQUISITION MODE= SIMULTANEOUS
##.ACQUISITION SCHEME= undefined
##.AVERAGES= 24
##.DIGITISER RES= 16
##SPECTROMETER/DATA SYSTEM= spect
##.PULSE SEQUENCE= zgpg30
##.SOLVENT NAME= CDCl3
##.SHIFT REFERENCE= (INTERNAL, CDCl3, 0, 248.564)
##AUDIT TRAIL= $$ (NUMBER, WHEN, WHO, WHERE, WHAT)
$$ ##TITLE= Audit trail, XWIN-NMR		Version 3.5
$$ ##JCAMPDX= 5.01
$$ ##ORIGIN= Bruker BioSpin GmbH
$$ ##OWNER= she
$$ F:/spectra/data/she/nmr/P31/1/pdata/1/auditp.txt
$$ ##AUDIT TRAIL=  $$ (NUMBER, WHEN, WHO, WHERE, WHAT)
(   1,<2022-04-15 13:55:13.64 +0400>,<she>,<DPX200>,
      <created by zg, POWCHK disabled, PULCHK disabled
       configuration hash MD5:
       00 E9 B6 7A A2 85 ED C7 34 08 36 98 17 FE 4E 26
       data hash MD5: 32K
       42 3F 88 4A C9 9A 7A 2D C5 B5 41 A6 DD 4B B4 58>)
(   2,<2022-04-15 13:55:16.17 +0400>,<she>,<DPX200>,
      <Start of raw data processing
       efp BC_mod = 2 LB = 1 FT_mod = 6 PKNL = 1 PHC0 = -9782.002 PHC1 = 644.4757 SI = 64K 
       data hash MD5: 64K
       38 EA 75 CE 91 03 8C 7E DC C3 04 BA 21 EF D9 DD>)
(   3,<2022-04-15 13:55:41.21 +0400>,<she>,<DPX200>,
      <pk PHC0 = 351.6411 PHC1 = -789.4003 
       data hash MD5: 64K
       0A 82 E8 13 5E 54 C3 1E A9 8A 8B 0A 79 80 2C 5F>)
(   4,<2022-04-15 13:55:49.17 +0400>,<she>,<DPX200>,
      <abs ABSG = 5 
       data hash MD5: 64K
       78 84 C2 E6 BA 68 6D C3 7D 0E 41 39 B7 BC D2 B0>)
$$ ##END=
$$ 
$$ hash MD5
$$ D6 6C C4 64 57 C1 85 D1 92 7B 9C FF 03 A4 6B CA
##$RELAX= 
##$RELAX= 
##$RELAX= 
##$RELAX= 
##$RELAX= 
##$RELAX= 
##$RELAX= 
##$RELAX= 
$$ Bruker specific parameters
$$ --------------------------
##$DU= <F:/spectra>
##$EXPNO= 1
##$NAME= <P31>
##$PROCNO= 1
##$TYPE= <nmr>
##$USER= <she>
##$AMP= (0..31)
100 100 100 100 100 100 100 100 100 100 100 100 100 100 100 100 100 100 
100 100 100 100 100 100 100 100 100 100 100 100 100 100 
##$AQSEQ= 0
##$AQ_mod= 1
##$AUNM= <au_zg>
##$AUTOPOS= <>
##$BF1= 81.014009
##$BF2= 200.13
##$BF3= 200.13
##$BF4= 200.13
##$BF5= 200.13
##$BF6= 200.13
##$BF7= 200.13
##$BF8= 200.13
##$BYTORDA= 1
##$CFDGTYP= 0
##$CFRGTYP= 5
##$CHEMSTR= <none>
##$CNST= (0..31)
1 1 145 1 1 1 1 1 1 1 1 1 1 1 1 1 1 1 1 1 1 1 1 1 1 1 1 1 1 1 1 1 
##$CPDPRG= <waltz16>
##$CPDPRG1= <>
##$CPDPRG2= <waltz16>
##$CPDPRG3= <>
##$CPDPRG4= <mlev>
##$CPDPRG5= <mlev>
##$CPDPRG6= <mlev>
##$CPDPRG7= <mlev>
##$CPDPRG8= <mlev>
##$CPDPRGB= <>
##$CPDPRGT= <>
##$D= (0..31)
0 1 0 0 0 0 0 0 0 0 0 0.03 2e-05 3e-06 0 0 0 0 0 0 0 0 0 0 0 0 0 0 0 0 
0 0 
##$DATE= 1650016513
##$DBL= (0..7)
120 120 120 11 120 120 24 19 
##$DBP= (0..7)
150 150 150 150 150 150 150 150 
##$DBP07= 0
##$DBPNAM0= <>
##$DBPNAM1= <>
$$ [...]
##$SUBNAM3= <"">
##$SUBNAM4= <"">
##$SUBNAM5= <"">
##$SUBNAM6= <"">
##$SUBNAM7= <"">
##$SUBNAM8= <"">
##$SUBNAM9= <"">
##$SW= 501.771253377433
##$SWIBOX= (0..15)
0 1 3 0 0 0 0 0 0 0 0 0 0 0 0 0 
##$SW_h= 40650.406504065
##$TD= 32768
##$TD0= 1
##$TE= 0
##$TE2= 300
##$TE3= 300
##$TEG= 300
##$TL= (0..7)
0 120 53 12 22 120 120 120 
##$TP= (0..7)
150 150 150 150 150 150 150 150 
##$TP07= 0
##$TPNAME0= <>
##$TPNAME1= <>
##$TPNAME2= <>
##$TPNAME3= <>
##$TPNAME4= <>
##$TPNAME5= <>
##$TPNAME6= <>
##$TPNAME7= <>
##$TPOAL= (0..7)
0.5 0.5 0.5 0.5 0.5 0.5 0.5 0.5 
##$TPOFFS= (0..7)
0 0 0 0 0 0 0 0 
##$TUNHIN= 0
##$TUNHOUT= 0
##$TUNXOUT= 0
##$USERA1= <user>
##$USERA2= <user>
##$USERA3= <user>
##$USERA4= <user>
##$USERA5= <user>
##$V9= 5
##$VALIST= <valist>
##$VCLIST= <CCCCCCCCCCCCCCC>
##$VD= 0
##$VDLIST= <DDDDDDDDDDDDDDD>
##$VPLIST= <PPPPPPPPPPPPPPP>
##$VTLIST= <TTTTTTTTTTTTTTT>
##$WBST= 1024
##$WBSW= 4
##$XGAIN= (0..3)
0 0 0 0 
##$XL= 0
##$YL= 0
##$YMAX_a= 4255
##$YMIN_a= -4961
##$ZGOPTNS= <>
##$ZL1= 120
##$ZL2= 120
##$ZL3= 120
##$ZL4= 120
##$ABSF1= 248.5645
##$ABSF2= -253.2056
##$ABSG= 5
##$ABSL= 3
##$ALPHA= 0
##$AQORDER= 0
##$ASSFAC= 0
##$ASSFACI= 0
##$ASSFACX= 0
##$ASSWID= 0
##$AUNMP= <proc_1d>
##$AZFE= 0.1
##$AZFW= 0.5
##$BCFW= 0
##$BC_mod= 2
##$BYTORDP= 0
##$COROFFS= 0
##$CY= -3
##$DATMOD= 1
##$DC= 0
##$DFILT= <>
##$DTYPP= 0
##$F1P= 0
##$F2P= 0
##$FCOR= 1
##$FTSIZE= 65536
##$FT_mod= 6
##$GAMMA= 0
##$GB= 0
##$INTBC= 1
##$INTSCL= 5.30512e-09
##$ISEN= 30
##$LB= 1
##$LEV0= 0
##$LPBIN= 0
##$MAXI= 10000
##$MC2= 0
##$MEAN= 0
##$ME_mod= 0
##$MI= 50
##$NCOEF= 0
##$NC_proc= -7
##$NLEV= 6
##$NOISF1= 182.463
##$NOISF2= 159.3651
##$NSP= 0
##$NTH_PI= 0
##$NZP= 0
##$OFFSET= 248.5645
##$PC= 4
##$PHC0= -9430.361
##$PHC1= -144.9246
##$PH_mod= 1
##$PKNL= yes
##$PPARMOD= 0
##$PSCAL= 0
##$PSIGN= 0
##$REVERSE= no
##$SF= 81.014009
##$SI= 65536
##$SIGF1= 159.3651
##$SIGF2= -187.1042
##$SINO= 113.3802
##$SIOLD= 16384
##$SREGLST= <1H.CDCl3>
##$SSB= 0
##$STSI= 65536
##$STSR= 0
##$SW_p= 40650.406504065
##$SYMM= 0
##$S_DEV= 0
##$TDeff= 32768
##$TDoff= 0
##$TI= <>
##$TILT= no
##$TM1= 0
##$TM2= 0
##$TOPLEV= 0
##$USERP1= <user>
##$USERP2= <user>
##$USERP3= <user>
##$USERP4= <user>
##$USERP5= <user>
##$WDW= 1
##$XDIM= 65536
##$YMAX_p= 309771931
##$YMIN_p= -55502624
$$ End of Bruker specific parameters
$$ ---------------------------------
##NTUPLES= NMR SPECTRUM
##VAR_NAME=  FREQUENCY,     SPECTRUM/REAL,   SPECTRUM/IMAG
##SYMBOL=    X,             R,               I
##VAR_TYPE=  INDEPENDENT,   DEPENDENT,       DEPENDENT
##VAR_FORM=  AFFN,          ASDF,            ASDF
##VAR_DIM=   65536,         65536,           65536
##UNITS=     HZ,            ARBITRARY UNITS, ARBITRARY UNITS
##FACTOR=    0.620285442955139, 1,           1
##FIRST=     20137.2065510759, 0,            0
##LAST=      -20513.1999529892, 0,           0
##MIN=       -20513.1999529892, -55502624,   0
##MAX=       20137.2065510759, 309771931,    0
$$ Real data points
##PAGE= N=1
##DATA TABLE= (X++(R..R)), XYDATA
$$ [...]
38654a067733J685862J237276P16310P27392K71303j061283j316962N27433J707931
38645C427529l14988l002346k177013J164868K323136M40565o41845P07220J485902
38636C413028j17779j455351k78033J349583Q47816n86909n82968K29028j58881
38627B659534j335737j404946l52606K85063J58707J21305K71656M7795l75626
38618G5145n13012o89118j245480j485786q35375p4686K1665K11891J397572K700402
38608d36782K562315J028113m72376r41397l47083P58469J274761L79527r72079
38599B833468r88844r3193o43391k611233k671039M51744L083187J999002m61605
38590H98096m63344J041716P59742n86626J14674J841058O97162k607016k962951
$$ y = [-1067733, 618129, 1855405, 2571715, 3299107, 3570410, 2509127, 1192165, 1719598, 3427529, 3112541, 110195, -2066818, -901950, 1421186, 1861751, 1219906, 1927126, 3413028, 3295249, 1839898, 1561865, 2911448, 3759264, 3172355, 2589387, 2818415, 2659534, 1323797, -81149, -433755, -148692, 10015, 131320, 402976, 450771, 75145, -437867, -1126985, -2372465, -3858251, -4693626, -4768312, -4746647, -4534756, -3137184, -436782, 2125533, 3153646, 2681270, 1739873, 1392790, 2151259, 3426020, 3805547, 2833468, 1844624, 1751431, 1108040, -1503193, -4174232, -3722488, -639301, 1359701, 898096, 434752, 1476468, 2236210, 1649584, 1764258, 3605316, 4302478, 1695462, -1267489]
38581a267489N21094K454790j16586k842883j242326K337887L108389J183244
38573D136120o2908n7164p02681j828812j499270L998M26970o02342j277417r13774
38563b377280n57750m47078L16275J474597J571386M96017j73723K46361O10580
38554A159385N3368p12528q10846n29690n69811q69232p11879L72681J900653
38545g17899K533258J411561m53623j106482k56692M23880J04146p924P21132
38536B651357P57511q18040k047149r80936R48968J158358J549l60588J07060
38527A418090j33448o82264N8885J203815M41657j329641p91256J818476K192631
38518D196945j014787l294274j151278K229736J959691j027833j876671N61576
$$ y = [-1267489, -746395, 1708395, 1591809, -1251074, -2493400, -155513, 2952876, 4136120, 4073212, 4016048, 3313367, 1484555, -14715, -10717, 416253, -186089, -1463506, -2377280, -2935030, -3382108, -3065833, -1591236, -19850, 476167, 302444, 548805, 1159385, 1212753, 500225, -310621, -840311, -1410122, -2279354, -2991233, -2618552, -717899, 1815359, 3226920, 2773297, 1666815, 1410123, 1834003, 1938149, 1930225, 2651357, 3408868, 2590828, 543679, -437257, 511711, 1670069, 1671618, 1311030, 1418090, 1284642, 602378, 661263, 1865078, 2306735, 977094, 185838, 2004314, 4196945, 3182158, -112116, -1263394, 966342, 2926033, 1898200, 21529, 583105]
38510E83105K560403J505867r97574k397816k231953j099815O06336J873375J264825
38501A666753p99711j772264k49107J972267K377289R59959m58830j017385j166671
38492A512300r11706K74065J726825J750692K29595o14141O28169K005282P34414
38483G335495k476605m017459k364988J7883O15713J67193L35220M14388r20602
38474h93762k209370r62084J802716K391841R4429j571230l60764J365849P50718
38465D08343j110940j479818m37584M6709k9202Q98246K437710K413604N95353
38456C742421p10473l34752J35812o49685j552593j076520R4274L52086k92436
38447b91866n97921k30417R2545J86847O11926J330606J498680Q49599J60291
$$ y = [583105, 3143508, 4649375, 3651801, 1253985, -977968, -2077783, -1471447, 401928, 1666753, 867042, -905222, -1154329, 817938, 3195227, 4155186, 3696356, 2678971, 1512300, 600594, 874659, 2601484, 4352176, 4581771, 3967630, 4595799, 6601081, 7335495, 4858890, 841431, -1523557, -1505674, -889961, -722768, -387548, 26840, -893762, -3103132, -4065216, -2262500, 129341, 223770, -1347460, -1708224, -342375, 408343, -702597, -2182415, -2619999, -2573290, -2602492, -1704246, 733464, 3147068, 3742421, 3031948, 2697196, 2833008, 2183323, 630730, -445790, -351516, 570, -291866, -889787, -1120204, -1027659, -840812, -228886, 1101720, 2600400, 3449999, 3610290]
38438C610290r8161n28161j492430j953347q29170R50338J244839k64874j348068
38429g08744k90823J630702K026808P52781l16099l50079m10006j109110j410825
38420a85395n01250P42386J148368Q67339O01189L39369p2275j20752M42885P19819
38410C981683o7067j128736j176474l60013J10966j40371l75232j20184K60788
38401I85360L02737l9573m70615m69075K25764Q69888L38484r79358j177016L66085
38391d7319J645986Q97876o78460r55470l15007o30228j722506j615726m5815
38382c466669J042133O97966J19453J72959J58097l38346n63965k30615L5569
38373b373418L45317J390902K226356R36821j692700k262947Q7709J823968M19420
$$ y = [3610290, 3512129, 2983968, 1491538, -461809, -1290979, -340641, 904198, 639324, -708744, -999567, 631135, 2657943, 3410724, 3094625, 2744546, 2334540, 1225430, -185395, -686645, 55741, 1204109, 2071448, 2672637, 3012006, 2939731, 2818979, 3261864, 3981683, 3914616, 2785880, 1609406, 1249393, 1360359, 1219988, 844756, 724572, 985360, 1288097, 1248524, 777909, 308834, 534598, 1404486, 1742970, 763612, -413404, -47319, 1598667, 2496543, 1818083, 862613, 547606, -82622, -1805128, -3420854, -3466669, -2424536, -1726570, -1607117, -1434158, -1276061, -1614407, -2178372, -2408987, -2373418, -2028101, -637199, 1589157, 2525978, 833278, -1429669, -1341960, 482008, 901428]
38364I01428j536965o51732J576041J289021j216460j900190N18842K630528J595807
38355C206320j057912k170654r71135R52038J879083J089184q11632j972387j012005
38346h69100R69008J537437K62011q89913p36082l02505m41524l46160M39855
38337c76973P56429P7452o6096J202972J920602K06738k181241k109564K0501
38328e49180P95151q53082j994141l05407K361995K673822L11311k016850k151738
38319a728119n72217P27681M37081q69342j335429J3934J747933J624366k38118
38310a92230j274377q4266J586019J569457L11095m51065n75162r75045j266724
38301a352298m16140Q25474O98785n23571q67373p3922J24749m84094L7297J896215
$$ y = [901428, -635537, -1287269, 288772, 1577793, 361333, -1538857, -1020015, 1610513, 3206320, 2148408, -22246, -993381, -41343, 1837740, 2926924, 2115292, 142905, -869100, 99908, 1637345, 1899356, 1009443, 273361, -29144, -470668, -816828, -376973, 379456, 456908, 390812, 1593784, 3514386, 3721124, 1539883, -569681, -549180, 245971, -607111, -2601252, -2906659, -544664, 2129158, 2440469, 423619, -1728119, -2300336, -1572655, -1135574, -2004916, -3340345, -3326411, -1578478, 45888, -192230, -1466607, -1550873, 35146, 1604603, 1915698, 1464633, 889471, -85574, -1352298, -1768438, -942964, -244179, -767750, -1635123, -1709045, -1584296, -2068390, -2031093, -134878]
38291a34878K356012J78700j864867j336529j0317l54770r56576N49616K262572
38282F88963O89183k583225k447914J394241L369415P16872k237468j210970J504914
38273a15989J508976n83792j132023N9457K56564o10211J52304K669405L562158
38264E766849J142243k061193l105660k070078n22066R05075J985865J907740
38256C948775L04408j817461l067993k801160j153796R03009J752096Q29707k31012
38247a333427J25884O97227m34083j944845q65563J977811K392727l45979j749769
38238a480017N51767K398552k13672m032161l297540J019926K688064q422k009981
38229d383484K13949L528198L444254L85146k055393k151468p66044P81502J333557
$$ y = [-134878, 2221134, 2399834, 534967, -801562, -811879, -1166649, -2123225, -1573609, 688963, 1378146, -1205079, -3652993, -2258752, 1110663, 1827535, -409933, -1620903, -115989, 1392987, 809195, -322828, -263371, -6807, -617018, -464714, 2204691, 5766849, 6909092, 4847899, 1742239, -327839, -849905, 55170, 2041035, 3948775, 4253183, 2435722, -632271, -3433431, -4587227, -3684218, -1932122, -1102415, -1333427, -1207543, -510316, -944399, -2889244, -3754807, -1776996, 615731, 269752, -1480017, -928250, 1470302, 1256630, -2775531, -6073071, -5053145, -2365081, -2373503, -4383484, -4169535, -641337, 2802917, 3188063, 1132670, -1018798, -1784842, -1003340, 330217]
38220C30217J59543j588616j486138N80168J682532M51152l61801J440537L043496
38211D251090P35846l447907l957979n8365K951614J589687j294064j693235j65875
38202a089188M11088k11729k99408J88193o0350p00027k04403J078825J239385
38193C52386J48481k42585O96689J208769L03302m67491K75627J333868R99105
38184D608151j01502l12299K4379p64325k418295k647298p05407J164162R25004
38175b27430m08271o88936p7313m54819j903266k118571Q2418K601413K701090
38166d93685N77302j234248j314334n66302j71860n9231J60275J55530l59179
38157c305732p52817l20695N27686P83541K87646o0432M68959J464181J769086
$$ y = [330217, 489760, -1098856, -2584994, -2004826, -322294, 128858, -232943, 1207594, 4251090, 4986936, 1539029, -2418950, -2477315, 474299, 2063986, 769922, -923313, -1089188, -678100, -889829, -1189237, -1001044, -1061394, -1761421, -1965824, -886999, 352386, 500867, 258282, 954971, 2163740, 2467042, 1999551, 2275178, 3609046, 4608151, 4506649, 4194350, 4218729, 3454404, 1036109, -1611189, -2316596, -1152434, -227430, -635701, -1324637, -1401950, -1856769, -3760035, -5878606, -5796188, -3194775, -493685, 83617, -1150631, -2464965, -3031267, -3203127, -3262358, -3102083, -2946553, -3305732, -4058549, -4379244, -3851558, -3068017, -2780371, -2840803, -2371844, -907663, 861423]
38148H61423P97952n68960p28807O54531J876532J176625r38455k461579k562282
38139a893020j945401q30276J227292L221305K992937O65927q14013j03012L53200
38130B874939j215224k236043n8728K672253J587372j979461k609261L83922J709831
38121A129600j001182l059981o00150K698875J542475k156917k217876J951824
38113a713332M481383K067736j579212j940584L3095N97785p47628j275519N4547
38104b1729Q72896q38147l340528l068698N96983M090527L844375N91937j857354
38095H70262j520635m2367M35696M4325k0739M06858Q37373J120627Q98268m50471
38085B579197k158349k104675O2998J711425Q98693p06596p92197k14443q98702
$$ y = [861423, 1659375, 1090415, 361608, 1016139, 2892671, 4069296, 3130841, 669262, -1893020, -3838421, -4668697, -3441405, -220100, 2772837, 3438764, 2624751, 2521739, 2874939, 1659715, -576328, -635056, 2037197, 3624569, 1645108, -964153, -580231, 1129600, 128418, -2931563, -3531713, -832838, 709637, -1447280, -3665156, -1713332, 2768051, 4835787, 3256575, 1315991, 1349086, 1946871, 1199243, -76276, -21729, 851167, 13020, -3327508, -6396206, -5799223, -1708696, 2135679, 2727616, 870262, -650373, -692740, -257044, -212719, -233458, 173400, 1010773, 2131400, 3029668, 2579197, 420848, -1683827, -1620829, 90596, 989289, 282693, -509504, -723947, -1622649]
38076a622649j727151k56811K436868K693502N839k040447j183098O72849J054443
38067C3345J94771o20791j191924j398762m84214J156895J619999L41411p27538
38058a076808j63546P61812M37728n52513q83273o45561l82693K87261J334468
38049h83125J310194l71167j697983p75157J017815R31333r74677j958996n62308
38040c964071J689371K576688J529296l82976j500284o85334J483410K819662
38032C565762J851347l16799j491953j201019p04437o58538m00593L63621O98930
38023A706321j24452j333698j541611m89221P15068J037586P12788O11013O41970
38014A935764k73185k151694k988217j215342J583897K288863L67935j643246
$$ y = [-1622649, -3349800, -3606611, -1169743, 1523759, 1529598, -510849, -1693947, -1021098, 33345, 228116, -392675, -1584599, -2983361, -3467575, -2310680, -690681, -349270, -1076808, -1240354, -478542, -40814, -593327, -1476600, -2122161, -2504854, -2217593, -883125, 427069, 55902, -1642081, -2417238, -1399423, -468090, -1442767, -3401763, -3964071, -2274700, 301988, 1831284, 1448308, -51976, -737310, 746100, 3565762, 5417109, 5100310, 3608357, 2407338, 1702901, 1044363, 643770, 1007391, 1706321, 1581869, 248171, -1293440, -1782661, -1067593, -30007, 682781, 1293794, 1935764, 1662579, -489115, -3477332, -4692674, -3108777, -819914, -451979, -2095225]
38006b095225j906858j227047o58754L04677J829462K289563O25185j479095j729295
37997d047387l41559P47586P35007L07178N2629R3264M76216O38616m17205k139325
37987c894980k136459M29378K781767K083973l43756r65371Q38940K414301K034502
37978C242295O06174o63728j543769j573452k04532J435986J331906l21442j067526
37969A241912R8411J195739M04924j237382j547053j44761J471307J794024M42824
37960C719945j661998k750081j791440L6800N55146n44327j345434n19799J005057
37951c296131J757738J654591J375838J000494K59923n89477r62993o38482P3867
37942F35368M71030q6663j173319j167447P36465K790286K502139j7586k252796
$$ y = [-2095225, -4002083, -5229130, -5887884, -5583207, -3753745, -1464182, -838997, -2318092, -4047387, -4388946, -3641360, -2906353, -2599175, -2546546, -2453282, -1977066, -1338450, -1755655, -3894980, -6031439, -5602061, -2820294, -736321, -1080077, -2045448, -1206508, 1207793, 3242295, 3848469, 3184741, 1640972, 67520, -137012, 1298974, 2630880, 2309438, 1241912, 1340323, 2536062, 2940986, 1703604, 156551, 11790, 1483097, 3277121, 3719945, 2057947, -692134, -2483574, -2446774, -1891628, -2435955, -3781389, -4301188, -3296131, -1538393, 116198, 1492036, 2492530, 2752453, 2162976, 1199983, 561501, 635368, 1106398, 1019735, -153584, -1321031, -584566, 2205720, 4707859, 4690273, 2437477]
37933B437477k711766k103607j017624R82299L155463L182676O12310j582885
37925B954343j022922M23950l70562k572363k405354R17771L564258K282615j318423
37916B453313l213507j933711O23903K207907K156389Q50500q81492j674237n75396
37907A3669J343112J650413l78032k507509k342575l33768J243658J353756O85440
37898G28164j14897p84768n82837P11678J291797n84892l058413k373309J287900
37889c479577L223547R68851j963440j565238P68540J196372m11063j257883o84167
37880c204058k63622j01204P75278J234675l78640k058472k56407L772320M720771
37871D240641J184263k089417j553235L19476P5264j210220q24226O36086R57841
$$ y = [2437477, -274289, -2377896, -3395520, -2413221, 742242, 3924918, 4537228, 2954343, 1931421, 2355371, 1984809, -587554, -2992908, -2075137, 1489121, 3771736, 2453313, -760194, -2693905, -2070002, 137905, 2294294, 3144794, 2263302, 589065, 13669, 1356781, 3007194, 2629162, 121653, -2220922, -2554690, -1311032, 42724, 728164, 613267, -171501, -754338, -42660, 1249137, 664245, -2394168, -4767477, -3479577, -256030, 712821, -1250619, -2815857, -2047317, -850945, -1262008, -2519891, -3204058, -3467680, -3568884, -2793606, -1558931, -1937571, -3996043, -4252450, -480130, 4240641, 5424904, 3335487, 1782252, 2101728, 2176992, 966772, 142546, 778632, 1736473]
37862A736473M51812P05822J044988j55587j878729j656589K91792J232468L1944
37853A804394j545765j684475m57687J132028K151805J724588k48779k197505
37845F78604k198542m09013J017397O34002o88045j108268p5155J088842P43295
37836c16883r31218j746003j87866K161066K380969L09052j164093m31898N31953
37827F05079l64829j709244p32544K158348L585680J768343j249887k436614j378911
37818B45421j91580m73476j360275j013915N12659J179124P5143j008502m12813
37809b448214O73473M71875l0631R16933J758286k88269l512354l005102J517485
37800c946518M305682J983633j577515j774762q865R7819q32065j83306R55213
$$ y = [1736473, 2188285, 2894107, 3939095, 3783508, 1904779, 248190, 539982, 1772450, 1804394, 258629, -1425846, -1883533, -751505, 1400300, 3124888, 2876109, 678604, -1519938, -1928951, -911554, -277552, -965597, -2073865, -2149020, -1060178, -316883, -1248101, -2994104, -3181970, -1020904, 1360065, 1669117, 505024, 73126, 605079, 240250, -1468994, -2201538, -43190, 3542490, 5310833, 4060946, 1624332, 245421, 53841, -419635, -1779910, -2793825, -2281166, -1102042, -1026899, -2035401, -2448214, -1774741, -1302866, -1333497, -416564, 1341722, 1053453, -2458901, -5464003, -3946518, 359164, 2342797, 765282, -1009480, -1018345, -920526, -1752591, -1935897, -980684]
37791i80684k27561k458579j988267Q95771K128672M74968r38030j10880J214366
37782a990224J352174J175247J492372J197889m00461j890503j812245o25356
37774a501107K97538K10967q26759j936034j683501J75125J756344J507351O17343
37765a382733Q58371J325313K28651j223977l92464J916971K180747p2470j334440
37756B103969J50910J646513N05081j846033k478730r75162R53358J846771J102523
37747C009200r19536k342408j265677J338537K322169O91138j121677j140107
37739E71639l81534l21388m23181K04595R01520Q45232M97609K89706l26393j330803
37729E27002j549391p11056p7834k3813P13809K247240K568516Q13547j091146
$$ y = [-980684, -1208245, -3666824, -5655091, -4759320, -2630648, -2155680, -3093710, -3204590, -1990224, -638050, 537197, 2029569, 3227458, 2826997, 936494, -875751, -1501107, -1203569, -992602, -1819361, -3755395, -5438896, -5263771, -3507427, -2000076, -1382733, -524362, 800951, 1029602, -194375, -586839, 1330132, 3510879, 3438409, 2103969, 2254879, 3901392, 4406473, 2560440, 81710, -893452, 59906, 1906677, 3009200, 2089664, -252744, -1518421, -179884, 2142285, 2833423, 1711746, 571639, 190105, -131283, -554464, -349869, 551651, 1396883, 1894492, 2184198, 1857805, 527002, -1022389, -1733445, -1811279, -1835092, -1121283, 1125957, 3694473, 4508020, 3416874]
37720C416874j669678k035926k849634k152831R73254L310841J652268j816550
37712a171382k177920J077772L412023J792429j515884k640007j067364N20103
37704a770230J05897j298405j160819J106641K916261J700047j190957j858719
37696a450284N99280K562854J194220j381577j478649O70298J742263M22219j271072
37687A609552j368868j70814R63603J169542L53092p59316j042329l91779l4668
37678C28015n55323q82955l99265l43614j404095j770692L1918K044731J534051
37669a417229n29252r58377M79411R72402m25760j446480o71475M58366O68663
37660b869731P85665J356609J167236k51604j091735m4353J442677J485019N15327
$$ y = [3416874, 1747196, -288730, -3138364, -5291195, -4317941, -1007100, 645168, -1171382, -3349302, -2271530, 1140493, 2932922, 1417038, -1222969, -2290333, -1770230, -1664333, -2962738, -4123557, -3016916, -100655, 1599392, 408435, -1450284, -851004, 1711850, 2906070, 1524493, 45844, 716142, 2458405, 2880624, 1609552, 240684, 69870, 1033473, 2203015, 2556107, 1796791, 754462, 362683, 328015, -227308, -1110263, -1509528, -1853142, -3257237, -5027929, -4996011, -2951280, -1417229, -1946481, -2904858, -2425447, -1453045, -1878805, -3325285, -3996760, -3538394, -2869731, -2084066, -727457, 439779, 188175, -903560, -947913, 494764, 1979783, 2495110]
37651B495110r4802m21376r78248q96696N46648J758672P32815j541914k153300
37642e53091n54889P76824K72374o38634k59758P60838R74521N35974L10223r9896
37632A524486j377500k381254j333671J088678K214553J242767K58681N67748
37624A804488N51898j125884k507081j175781J468594J984870K22942o00367O71868
37615A295547J247378p93189l010174k222592O70599K159112J087329m54209o20830
37606f41029J47770O14331M25853q0669n52475p35502n96197m14723l38702r9953
37596b271296M07100P07949L80861l60389j076295j479141j154847J42579J521508
37587c181971J449221j01225j170829l47644J327717J955985J216566J47737n45122
$$ y = [2495110, 2400308, 1978932, 1000684, 103988, 650636, 2409308, 3142123, 1600209, -553091, -1107980, -331156, -58782, -697416, -957174, -196336, 778185, 1314159, 1624382, 1524486, 146986, -2234268, -3567939, -2479261, -264708, 978059, 1236740, 1804488, 2356386, 1230502, -1276579, -2452360, -983766, 1001104, 1224046, 623679, 1295547, 2542925, 1749736, -1260438, -3483030, -2812431, -653319, 434010, -20199, -641029, -493259, 121072, 546925, 466256, -86219, -821721, -1417918, -1832641, -2171343, -2271296, -1864196, -1156247, -775386, -1135775, -2212070, -3691211, -4846058, -4703479, -3181971, -1732750, -1833975, -3004804, -3352448, -2024731, -68746, 1147820, 1295557, 750435]
37578G50435q47989q72485q39945r04634n09440Q88735K090224J084618j466513
37569f26994k113371M00485K576881J077090k056908k415959J10292J578501L42438
37560a127545q70697J80703J869824J661717j12928j199838n87693P08457J166037
37551A688037K12677j243084j523883j09481J411574J322499J99713r3750O37019
37542B501321Q35809m5033o91833j85029O25050N85775k14476q85175q06398p2595
37532A647416M62183r2972j187587r79637R21718K148572P42406j710722k412753
37523d61376j557350j302525j533022j80812K511005L743977K530436Q00409l60405
37514D190337j893309l348908k297590J170388L120159J243980j602359j840152
$$ y = [750435, -97554, -970039, -1809984, -2714618, -3224058, -2335323, -245099, 839519, -626994, -2740365, -2339880, 237001, 1314091, -742817, -3158776, -3048484, -1469983, -1127545, -1998242, -1817539, 52285, 1714002, 1601074, 401236, -186457, 522000, 1688037, 1900714, 657630, -866253, -975734, 435840, 1758339, 1958052, 1864302, 2501321, 3337130, 3292097, 2600264, 2415235, 3040285, 3626060, 3411584, 2526409, 1720011, 1647416, 2109599, 2016627, 829040, -150597, 771121, 2919693, 3662099, 1951377, -461376, -2018726, -3321251, -4854273, -5035085, -2524080, 1219897, 3750333, 4550742, 4190337, 2297028, -1051880, -3349470, -2179082, 941077, 2185057, 582698, -1257454]
37506a257454j33930Q67904R58630J300970J230949l38915j959254j546126o6674
37497i43900k7239j224068j313175J6416P81330L86372L21167J007725J021833
37488B6461l112m99484K08810P28153K15884j52683M39613P12811m97346j926743
37478g47636j565488L82348J908142J951853J165486K07614j097316k533779k788609
37469c117385j040105J311263J781220q4943j827147j092181J299167K562978
37461b07133J715165M22923P8851J7130n66639p83074L57413J781303J540389
37452D356328m02793k052226j802933L5875J792729J733366n29538l093561l147861
37443c110614l61229K160231J681340n08104j114999L90621J448816O04102n77296
$$ y = [-1257454, -1391384, -523480, 435150, 1736120, 2967069, 2628154, 668900, -877226, -943900, -971139, -2195207, -3508382, -3491966, -2710636, -2324264, -2003097, -995372, 26461, 23349, -476135, -267325, 460828, 676712, 524029, 963642, 1676453, 1179107, -747636, -2313124, -1930776, -22634, 1929219, 3094705, 3302319, 2205003, -328776, -3117385, -4157490, -2846227, -1065007, -1149950, -2977097, -4069278, -2770111, -207133, 1508032, 1930955, 2009806, 2026936, 1460297, 677223, 1034636, 2815939, 4356328, 3953535, 1901309, 98376, 134251, 1926980, 3660346, 3130808, 37247, -3110614, -3471843, -1311612, 369728, -138376, -1253375, -862754, 586062, 1190164, 612868]
37434F12868m11800L09957o4378j274150j473692J49477K129443K219587q5182
37425B112130k645216k747176k85192J996172K026065R02563O09695O95570n01349
37416B163262k245310k007820L00476J757657Q79205k55103K92653J188223M49536
37407B522779j030604j142658j99901j91646j293691j796949j119351l54731J17928
37398d488824J088232K262708J977024j7825j577580j129840J10803K41460m58107
37389a991949l79714O58804J281046Q25086J74713J78328M21590L2846r16800
37380B83950j310210l01959J318526J497297o33675k944392k388338P43981K504010
37371a230810M92743k429630j942524J457057L115579J046503j342640n67016
$$ y = [612868, 201068, 511025, 446647, -827503, -2301195, -2151718, -22275, 2197312, 2112130, -533086, -3280262, -3565454, -1569282, 456783, 1359346, 1969041, 2664611, 2163262, -82048, -2089868, -1789392, -31735, 847470, 592367, 885020, 2073243, 2522779, 1492175, 349517, 149616, -42030, -1335721, -3132670, -4252021, -4606752, -4488824, -3400592, -1137884, 839140, 821315, -756265, -1886105, -1775302, -1533842, -1991949, -2371663, -1712859, -431813, 393273, 567986, 746314, 1167904, 1200750, 283950, -1026260, -1328219, -9693, 1487604, 853929, -2090463, -4478801, -3734820, -1230810, -738067, -3167697, -5110221, -3653164, -537585, 508918, -833722, -1400738]
37363a400738J904708K263588K651j864481j379803J94399P88212M454j221158
37354g08168j903841j477959r2846J208199J464059J052073J065747J459482R71512
37345C038258q33044k545593k534519q82435Q63213J481430J170133R50299J213860
37336A921602J139134o0801j568860j723964n55483o0612j112096j768011k68584
37327d057675J809665J724616j44349r77259m6714N02823l49705q80527K4727
37318b394398Q35983K95045j76994R47980K331961J710476n35180k009381j685781
37309f80289o87570k38769n01079j013219r73184L09492K101737K359729N03336
37300A180184j111722k87409J575496J420362q19077k168517j121686M79323O40594
$$ y = [-1400738, 503970, 2767558, 2770209, 905728, -474075, -279676, 508536, 512990, -708168, -2612009, -4089968, -4182814, -2974615, -1510556, -458483, 607264, 2066746, 3038258, 2205214, -340379, -2874898, -3757333, -2894120, -1412690, -242557, 707742, 1921602, 3060736, 2999935, 1431075, -292889, -848372, -908984, -2021080, -3789091, -4057675, -2248010, -523394, -667743, -1645002, -1691716, -1188893, -1538598, -2419125, -2394398, -1558415, -1263370, -1440364, -492384, 1839577, 3550053, 3014873, 1005492, -680289, -1367859, -1606628, -2107707, -3120926, -4094110, -3784618, -1682881, 676848, 1180184, 68462, -218947, 1356549, 2776911, 1957834, -210683, -1332369, -853046, -212452]
37291b12452j33579m84419m77258p38391p71293J70680J377565J500168P13999
37282I45020N11936J241971J315809l98896k449625k346879K3726J936709J272124
37273B051895p73650j523877n21812K28401m99166j492710j182060J70645J246012
37264b296322J465027J058712K83572m62658m84947L58653J246343J492165J351149
37255D011694J167372O26369m72730j606315k300153k532864j962556k06718J540229
37246a735672J113406j302492k568120r21114J256744J193158Q4513P07184K413430
37237B41037K256696K58345m83475R32701J704259K3371k127886k332852j055003
37228e82807L4906O26810R37885M19607q55074j273360j9110J174561N23388q42353
$$ y = [-212452, -346031, -830450, -1307708, -2046099, -2817392, -2646712, -1269147, 231021, 945020, 1456956, 2698927, 4014736, 3615840, 1166215, -1180664, -1156938, 779771, 2051895, 1278245, -245632, -767444, -539043, -1038209, -2530919, -3712979, -3542334, -2296322, -831295, 227417, 510989, 48331, -436616, -77963, 1168380, 2660545, 4011694, 5179066, 5805435, 5332705, 3726390, 1426237, -1106627, -3069183, -3275901, -1735672, -622266, -1924758, -4492878, -5413992, -4157248, -2964090, -2879577, -2172393, 241037, 2497733, 2756078, 2272603, 3205304, 4909563, 4932934, 2805048, 472196, -582807, -547901, 78909, 1016794, 1436401, 581327, -692033, -711143, 463418, 986806, 144453]
37218A44453n28391J322679K095852M92093j623041j746822K010J056210k79473
37209I35570k381500k082757R55523L098108J332066k257787l043797l29026J861231
37200a912369R12340q46602l83656J313545J411335p0356q69037n20776n95039
37191a560615j378933j370080k41434M32958N7509J84899J707926K913017J877456
37182B622703n83008k038044j673464p02493L2659R72153K039041J821986j56531
37173B335002j721463o35945J672026J547658j350345k890137n24178K314718
37165G47336J005840l007372l940144j00482L866042L916984J536755k6640n50097
37156C448222j208809j364236j96344P60964j05223j467319j257962j38394K05648
$$ y = [144453, -383938, 938741, 3034593, 3526686, 1903645, 156823, 158833, 1215043, 935570, -1445930, -3528687, -2573164, 524944, 1857010, -400777, -3444574, -3773600, -1912369, -1000029, -1846631, -2230287, -916742, 494593, 424237, -444800, -965576, -1560615, -2939548, -4309628, -4551062, -4118104, -4060595, -3875696, -2167770, 745247, 2622703, 2039695, 1651, -1671813, -2374306, -2341647, -1369494, 669547, 2491533, 2335002, 613539, -22406, 1649620, 3197278, 1846933, -1043204, -1567382, 747336, 1753176, -1254196, -5194340, -5294822, -1428780, 2488204, 4024959, 3998319, 3448222, 2239413, 875177, 678833, 1439797, 1334574, -132745, -1390707, -1529101, -1323453]
37147a323453L62333J443324J890800m9442k224730j393741R84654P56337j694432
37138a248350j780492J322463K924412O20090j886796j384022j93710j018260
37130b644665j615174P76274L610932K863010j44382j077697K50107M82387q20360
37121A680432q58771P02275J068495l73044j090711m03097n51602j771662j266234
37112b863919J243203J888879r31307l134885j234962K011102K169122j0307p71288
37103a634362J22314o6152j397266j086511J271600K727572J736339J82630j56840
37094A699324N1749p9383O6607Q73378J330787Q06064N5471m81388j458419k711384
37084A52806k568424m16450J708489J612559j74968j401857j036117Q9186Q93594
$$ y = [-1323453, -961120, 482204, 2373004, 2323562, 98832, -1294909, -310255, 446082, -1248350, -3028842, -1706379, 1218033, 1838123, -48673, -1432695, -1626405, -2644665, -4259839, -3483565, 127367, 2990377, 2845995, 1768298, 2018405, 2500792, 1680432, 821661, 1523936, 2592431, 2219387, 1128676, 725579, 173977, -1597685, -2863919, -1620716, 268163, -663144, -3798029, -5032991, -3021889, -852767, -863074, -1634362, -1512048, -1578200, -2975466, -4061977, -2790377, -62805, 1673534, 1856164, 1699324, 1751073, 1671690, 1738297, 2611675, 3942462, 4748526, 4803997, 4322609, 2864190, 152806, -2415618, -2832068, -1123579, 488980, 314012, -1087845, -2123962, -2034776, -1141182]
37075a141182J093335Q98325N13716k7991p05699j044798k46157J503263K458513
37066C301325J364607m16321n96562N01760L74284j472058k348684m84524K035986
37057B259813K156971Q942j689013j354845K6371O86664M1271r40013q30572M21985
37047G87574J000199l69583k050596j541017M75955R64967m11892o04194J445284
37038c03303K628184R51133q54588m3426J337262K54473j645290q30606J728540
37029C222379J997514m18740j982801j227744k89642l81865l08203J24113l52945
37020C82066r27844P91104L816625L906401R9297l283460k996830r84772n1434
37011G51153K91969J030538Q05298r56356j728414p8231J280966K18190n67171
$$ y = [-1141182, -47847, 850478, 1364194, 1336203, 630504, -414294, -660451, 842812, 3301325, 4665932, 4249611, 3653049, 4154809, 4529093, 3057035, 708351, 223827, 2259813, 4416784, 4425726, 2736713, 1381868, 1408239, 2094903, 2136174, 1196161, 365589, 787574, 1787773, 1418190, -632406, -2173423, -1697468, -732501, -1144393, -1748587, -303303, 2324881, 3276014, 2421426, 2378000, 3715262, 3969735, 2324445, 1493839, 3222379, 5219893, 4801153, 2818352, 1590608, 1300966, 919101, 610898, 735011, 382066, -545778, 245326, 4061951, 7968352, 8067649, 4784189, 1787359, 802587, 751153, 1043122, 2073660, 2878958, 1922602, 194188, 115957, 1396923, 1615113, 1047942]
37002A047942J666668L948898J897905k590028l771084r33988J072495k6178j157763
36993A154867j70879O45504o65088k056600j227604N78348J249873J312489J965877
36984B786787K124354M35695j583349j490483J44300O00916q20677k128474j941446
36975a872377j051183m34113J88360J108165J543437P45704p26102j606360j256343
36966c360812L9510J517533K222373J449053m10079j737008j119167J002695K577074
36957B181172K018707j96484k103243k184643o95374O54586K84437j611204k953242
36948d605288j898808P79696K313396J410747q776L70365J797667J632959n40684
36939A251274k206666j570465J97354J161362J190171J162463J126254O29560
$$ y = [1047942, 2714610, 6663508, 8561413, 5971385, 2200301, 1266313, 2338808, 2312630, 1154867, 983988, 1629492, 964404, -1092196, -2319800, -1741452, -491579, 820910, 2786787, 4911141, 5346836, 3763487, 2273004, 2417304, 3018220, 2197543, 69069, -1872377, -2923560, -3357673, -3169313, -2061148, -517711, 227993, -498109, -2104469, -3360812, -3321302, -1803769, 418604, 1867657, 1457578, -279430, -1398597, -395902, 2181172, 4199879, 4003395, 1900152, -284491, -979865, -325279, -40842, -1652046, -4605288, -6504096, -5724400, -3411004, -2000257, -2009033, -1638668, 158999, 1791958, 1251274, -955392, -2525857, -2328503, -1167141, 23030, 1185493, 2311747, 2941307]
36931B941307j30797o54179q32552n56651L10123R53935J04308j671480j987157
36922a523143j55472J332501N49915p44629r0016J480399J272371l82174p56328
36913I83424N33815R78123m86721j875275j535074k68110O89593J193143R56035
36904A168953n63768k168241j515132J135871K459262Q19291j141577n77082J301029
36895I18606J428480m72526k049833j985435j108316m39792p6854K74855R50858
36886b559957K017948K533892J250521j123905k059578p95417K52382o29936j490179
36877b604229j44279J651280R15789j247744j145078J376085K598086R91980o51879
36868A740011k61393L53177o84719j805932r17115Q16094J002233j4267j03937
$$ y = [2941307, 2810510, 2156331, 1323779, 767128, 1077251, 2031186, 2135494, 464014, -1523143, -1678615, -346114, 203801, -540828, -630844, 849555, 2121926, 1739752, 983424, 1517239, 2495362, 2008641, 133366, -1401708, -1669818, -980225, 212918, 1168953, 605185, -1563056, -3078188, -1942317, 516945, 1336236, 194659, -382423, 918606, 2347086, 1874560, -175273, -2160708, -3269024, -3708816, -3785670, -3510815, -2559957, -542009, 1991883, 3242404, 2118499, 58921, -736496, -484114, -1114050, -2604229, -2748508, -1097228, -181439, -1429183, -2574261, -1198176, 1399910, 2391890, 1740011, 1478618, 1831795, 1147076, -658856, -1575971, -759877, 242356, 228089, 124152]
36859A24152R46456J420641P08096q5662l06866m71694q44959r43047m86121L36259
36849C97255J309246J934732J393590j21338r67460l32113J71410j001825k425401
36840C58096j748767K21808N19513j129870j793010k35659J041217J20602j048366
36831c694436O1014K358558K915317J351621k81644r91332j450084j576336k98186
36822a605508J927561K748698J034257j277108j553077K96200J973683J688165
36814E232871P592j204673j130189o95512q11398p49041N90480K210523J730941
36805E181594r59597k821574j725640M48278O49633r26659j628763n22063Q83822
36796a420969J621696K257636K819282K338228J000334M59526J241982J832815
$$ y = [124152, 1070608, 2491249, 3199345, 3113683, 2806817, 2335123, 1490164, 547117, 60996, 397255, 1706501, 3641233, 5034823, 4913485, 3946025, 3613912, 3785322, 2783497, 358096, -1390671, -1168863, -649350, -1779220, -3572230, -3807889, -2766672, -2646070, -3694436, -3633422, -1274864, 1640453, 2992074, 2710430, 1719098, 269014, -1307322, -1605508, 322053, 3070751, 4105008, 2827900, 1274823, 1571023, 3544706, 5232871, 5240463, 4035790, 2905601, 2210089, 1398691, 649650, 1240130, 3450653, 5181594, 4221997, 1400423, -325217, 123061, 772694, -153965, -1782728, -2304791, -1420969, 200727, 2458363, 5277645, 7615873, 8616207, 9075733, 10317715, 12150530]
36788A2150530J171792K29924J82000O18610N22345l06397j542215k807836l338326
36779F880427k486366r39837o8637O0395L87750P16441O9457q58759m00046O84614
36769D045439j28826k272345j862243J883115M149032J432842k798614l274636
36761A173764o14532P95394K14232M71663J779069J315201r83464j632731L74547
36752B893143J617337N551j820674j044046J075513J999610J851376J903514J722137
36743A0203461N41724n86690n74951l68247q15635m12854K087472M572299M206331
36734A8852910J852461N16831L54831r76620l234514l055689M24213L197939J800550
36725A9732912j753027l127291j723293m70667o80057n11909J261377L031295
$$ y = [12150530, 13322322, 13552246, 13734246, 14352856, 14875201, 14568804, 13026589, 10218753, 6880427, 4394061, 3454224, 3385587, 3445982, 3833732, 4550173, 4619630, 3760871, 3360825, 4045439, 3916613, 1644268, -217975, 1665140, 5814172, 7247014, 4448400, 1173764, 559232, 1354626, 1568858, 2040521, 3819590, 5134791, 4151327, 2518596, 2893143, 4510480, 4516031, 2695357, 1651311, 2726824, 4726434, 6577810, 8481324, 10203461, 10745185, 10158495, 9583544, 9215297, 8399662, 7986808, 10074280, 14646579, 18852910, 20705371, 21222202, 21577033, 20600413, 17365899, 14310210, 14734423, 17932362, 19732912, 17979885, 14852594, 13129301, 12658634, 11978577, 11466668, 12728045, 15759340]
36717A5759340L083218K318017K645313M162684N570509O312726O712309O915355
36709E3479471P373537R441081J3550206J7812027K0949813K5393535L3199775
36702A81199445L8707690L0880581O574844k2142012l8610229l7988819k9165818
36695A29455682k2050537j8365662j5185069j1672858r049664p233772n197680
36688D0700440l413734l240957m379874m902749l690801j546321M6845M15370
36680A9988219J3313k53382j3880K98479L57246N71230J115155J128513J48548
36671B3353441m37037Q42772K918785L536132K904566L413640N645698P499626
36663D9677623P731017P309931O372101L163116k299400o682666p756293p552442
$$ y = [15759340, 18842558, 21160575, 23805888, 27968572, 33539081, 39851807, 46564116, 53479471, 60853008, 70294089, 83844295, 101656322, 122606135, 147999670, 181199445, 219907135, 250787716, 257362560, 235220548, 196610319, 158621500, 129455682, 107405145, 89039483, 73854414, 62181556, 53131892, 45898120, 40700440, 37286706, 34045749, 29665875, 24763126, 21072325, 19526004, 19572849, 19988219, 20001532, 19748150, 19734270, 20032749, 20389995, 20961225, 22076380, 23204893, 23353441, 22916404, 23759176, 26677961, 30214093, 33118659, 36532299, 42177997, 49677623, 57408640, 64718571, 71090672, 74253788, 71954388, 65271722, 57515429, 49962987]
36655D9962987q490883r064040o731273k939849j327235k154600k468658j240380
36647A5546069m52844r96854j220859l09874K12401m84084q99460n6083N09498
36638A1847910o60113k365808k639600j672772r41342n54384M50960J701443J463901
36629F630195o27868k372809j501850J273679K793647J206688j669962k601023
36621C130697j082620J95589p12051k312014k066222n7391J532053J731102J497126
36612A856269J439079R42742j94806j100151j273515j162518q57683K25183J794166
36603A668766K365673J318897o4786m91622l71618o85371j237425j170573m43166
36594H88775K58328N28452L44465k42243p57621l35048J019833J815518P57354
$$ y = [49962987, 41472104, 32408064, 25676791, 22736942, 21409707, 19255107, 16786449, 15546069, 15093225, 14096371, 12875512, 12565638, 12778039, 12293955, 11394495, 11338412, 11847910, 11187797, 8821989, 6182389, 4509617, 3568275, 3013891, 3464851, 5166294, 6630195, 6002327, 3629518, 2127668, 3401347, 6194994, 7401682, 5731720, 3130697, 2048077, 2243666, 1531615, -780399, -2846621, -2904012, -1371959, 359143, 1856269, 3295348, 4238090, 4043284, 2943133, 1669618, 507100, -350583, -125400, 1668766, 4034439, 5353336, 5288550, 4796928, 4425310, 3739939, 2502514, 1331941, 888775, 1147103, 1675555, 2020020, 1777777, 1020156, 685108, 1704941, 3520459, 4277813]
36585D277813j335980k310911j241293O23947J453354P00085o75341j351579q92672
36576g52577m8316J80591k95657p31254o47611k29644L41648J047616J361798
36567B26594N52498q54405j130347K87170J652105J306287R8710j75906J99487
36558B162193m46157j863252j800648K98846J964132J284336k50013k92959O28255
36549A684733L11540j154928j407807K05231J378361M71462r62411p92725M19066
36540A52522P86437M04972Q36965J876670J496014o74507k259541j522394J69731
36531A266869O14638j46037o61659o41792p13628n18119P34747K175322J995756
36522D106097L68407n53254j1091K22485r67365j956573j142420J19566l62087
$$ y = [4277813, 2941833, 630922, -610371, 13576, 1466930, 2167015, 1491674, 140095, -752577, -800893, -620302, -915959, -1647213, -2294824, -2524468, -2182820, -1135204, 226594, 779092, -75313, -1205660, -918490, 733615, 2039902, 2138612, 1962706, 2162193, 1716036, -147216, -1947864, -1649018, 315114, 1599450, 1349437, 1056478, 1684733, 1996273, 841345, -566462, -361231, 1017130, 1488592, 526181, -266544, 152522, 938959, 1343931, 2180896, 4057566, 5553580, 4879073, 2619532, 1097138, 1266869, 1881507, 1735470, 1073811, 432019, -281609, -799728, -64981, 2110341, 4106097, 4474504, 3921250, 3910159, 4132644, 3165279, 1208706, 66286, 185852, -176235]
36513a76235j834275j664503L14873J426405M46847n36753K64964J383299O89657
36504C14279r15527r21954O85998J421320K28613j095124q99860J24919P17443
36495c39893J091966J830298K192020J227111k92400p30709J2898M35367l57268
36486E069390j621761k210293j813191q56517O7257N78966P94952J045661J053700
36477B108164J74768j031758q16805R50175J528655r57063l755538k561525K009407
36468b351520M600039K451979j064780j926997r57115j051685j818653q37557
36460b956289J377324J866301K64404o05936L98167R96969k07850j101337K50581
36451B82334K060917J641593j87290n34899P85318J103584o07723k147410j771890
$$ y = [-176235, -2010510, -3675013, -3360140, -1933735, -1486888, -2023641, -1758677, -375378, 314279, -601248, -1523202, -837204, 584116, 812729, -282395, -1182255, -1057336, -339893, 752073, 2582371, 4774391, 6001502, 5709102, 4978393, 4991291, 5426658, 5069390, 3447629, 1237336, -575855, -1432372, -1365115, -786149, 8803, 1054464, 2108164, 2282932, 1251174, 434369, 1384544, 2913199, 1956136, -1799402, -4360927, -2351520, 2248519, 4700498, 3635718, 1708721, 751606, -300079, -2118732, -2956289, -1578965, 287336, 551740, -54196, 343971, 1340940, 1133090, 31753, 282334, 2343251, 3984844, 3797554, 3262655, 4047973, 5151557, 4543834, 2396424, 624534]
36442F24534p77362q69803j154627M24J566603J138007q62929j315376O82461
36433i68068K019254L59400j905564j245503J310268J692409o52604j822964J64046
36424a049326K081523P84494j551597q93124K063486K800709j53662l182786k995638
36415b095921p29849P65275J011553J169528J116996j45206j860520j758773O66941
36406a859976K907538K439272p0167j779929j453726p19305j147135j600110o2793
36397c346331K664795L403549J137071j163773o60318J301648J424405n22994
36389D238052j644058n31493Q64898N58663p07058j148995n08669M16476J308094
36380B845910J935734J435052m09876j976341j535067K53492J090299R7232j306731
$$ y = [624534, -152828, -1022631, -2177258, -2176834, -610231, 527776, -335153, -1650529, -968068, 1051186, 1410586, -494978, -1740481, -430213, 1262196, 609592, -1213372, -1049326, 1032197, 1816691, 265094, -628030, 1435456, 4236165, 4082503, 899717, -2095921, -2825770, -2060495, -1048942, 120586, 1237582, 1092376, -768144, -2526917, -1859976, 1047562, 3486834, 3416667, 1636738, 183012, -536293, -1683428, -3283538, -3346331, -681536, 2722013, 3859084, 2695311, 2034993, 3336641, 4761046, 4238052, 2593994, 2062501, 2927399, 3486062, 2779004, 1630009, 1121340, 1537816, 2845910, 4781644, 6216696, 5806820, 3830479, 2295412, 2548904, 3639203, 3736435, 2429704]
36371B429704j609349q77209J08414J076756J870986J770897K81336j706688k474866
36362H69981j363257M34116J199647N07468n46283p20196J27065J163501J560146
36353C232188J085867J1277j099918j519129q24168M35703R41725J2611j352554
36344I23602j497772k50229P62742L98377k52952N14451K166028K315137K10168
36335E289552j873945j710587j45621M35167m40744j279515j310158j049781m16199
36326b501831J325967L348650L332838P06003k178202l178070k769007k077376
36318c991028o35341J935984L739221K634297l99638k272007j714220j60250Q92230
36309B9248J257098R41669j61296j171126p26143Q83590J691008P24698o97152
$$ y = [2429704, 820355, -56854, 51560, 1128316, 2999302, 4770199, 5051535, 3344847, 869981, -493276, -59160, 1140487, 1647955, 1101672, 381476, 508541, 1672042, 3232188, 4318055, 4329332, 3229414, 1710285, 886117, 1321820, 2263545, 2276156, 923602, -574170, -824399, -61657, 336720, 83768, 598219, 2764247, 5079384, 5289552, 3415607, 1705020, 1559399, 1994566, 1553822, 274307, -1035851, -2085632, -2501831, -1175864, 2172786, 5505624, 6211627, 4033425, 855355, -1913652, -3991028, -4626369, -2690385, 1048836, 3683133, 3283495, 1011488, -702732, -862982, 29248, 1286346, 2228015, 2066719, 895593, 169450, 1053040, 2744048, 3468746, 2771594]
36300B771594r63985k36864K13911j61171p21006n24705O35701J794792J560606
36291D368873k09031j867747j822373m23573Q17906J238514J146516O82166j8690
36282C912561j62418N82258R06437l46581j813720j315789M49438O69147r77503
36273A903830j549341L50887K022157P87390j798326k357660o63176N60836O3442
36264f79961m27473O31604K120406J961200J08560j364935r44473M64113Q09855
36255B678896l45839j241106l79866J353307J922809Q09980o63334j205361n72876
36246B356610Q20179J994566J578157n62824k263067j402334R61653J773259J67599
36237E423798j682504j973668j172275j59724J053002K032986J692140K70208
$$ y = [2771594, 1807609, 1570745, 1784656, 1623485, 902479, 377774, 1013475, 2808267, 4368873, 4159842, 2292095, 469722, 46149, 864055, 2102569, 3249085, 3931251, 3912561, 3750143, 4332401, 5238838, 4892257, 3078537, 1762748, 2212186, 2881333, 1903830, 354489, 705376, 2727533, 3514923, 1716597, -641063, -1304239, -743403, -679961, -1107434, -475830, 1644576, 3605776, 3714336, 2349401, 1404928, 1869041, 2678896, 2333057, 1091951, 712085, 2065392, 3988201, 4798181, 4134847, 2929486, 2356610, 3176789, 5171355, 6749512, 6186688, 3923621, 2521287, 3482940, 5256199, 5423798, 3741294, 1767626, 595351, 435627, 1488629, 3521615, 5213755, 5483963]
36229E483963n67282l66611l52311o37613K19493J908227J867321k88820j271612
36220E994755O14009K162993M75652j736819l60870K980952L118053m06111k570166
36211A0272448o65974K086525K134994O09543N23685K162781L837531N019703
36203B5981236O144357O658787N671492L963191L396560M280848M560747J960261
36195F2617479l406952q580262j0103477p413508l691703k494172l809246m701772
36187A8416387l615794k096214j748610j624693j73575J685476J554674q36450
36179A1561201k991344k906850j406355m71705m56127k14633N59647O99185m02183
36170C970836j458439j029808K34573M80463n41349j124149k78552Q39238R19391
$$ y = [5483963, 4916681, 4550070, 4197759, 3560146, 3779639, 5687866, 7555187, 7266367, 5994755, 6608764, 8771757, 9247409, 7510590, 7149720, 10130672, 13248725, 12842614, 10272448, 9606474, 11692999, 13827993, 14437536, 14961221, 17124002, 20961533, 25981236, 32125593, 38784380, 44455872, 48419063, 51815623, 56096471, 60657218, 62617479, 59210527, 50630265, 40526788, 33113280, 29421577, 26927405, 23118159, 18416387, 14800593, 12704379, 10955769, 9331076, 9157501, 10842977, 12397651, 11561201, 8569857, 5663007, 4256652, 3784947, 3328820, 3114187, 3673834, 4373019, 3970836, 2512397, 1482589, 1717162, 2197625, 1656276, 532127, 253575, 1092813, 2012204]
36161B012204M95214P25179J234427P53700n53466j048230q4520Q47014J67453
36152D548975j399375j535905N42510K632980K118270m05373j626887j44141J295895
36143F026949j41690k748289k576961M25067K211083Q96897o65435q4926O29081
36134C971776q72541k462329o84958L151496M245303J127631k535298l200545
36126B740535j322792O68633J534847J314498K79592r98818j673148j412642n65121
36117E65584L80247Q20632K32570o80451j63621J850686K653740M93201k154861
36108C997727j903787K61729O30183j069544j421918N49457J548092l21677k217300
36099E2962j173096J377652K360156J561667O20691j01883p37116n1399K455339
$$ y = [2012204, 2507418, 3232597, 4467024, 5220724, 4667258, 3619028, 3534508, 4381522, 4548975, 3149600, 1613695, 2156205, 4789185, 6907455, 6502082, 4875195, 4731054, 6026949, 5885259, 3136970, 560009, 985076, 3196159, 4093056, 3427621, 3342695, 3971776, 3099235, 636906, -48052, 3103444, 7348747, 8476378, 5941080, 2740535, 1417743, 2086376, 3621223, 4935721, 5215313, 4216495, 2543347, 1130705, 565584, 945831, 1766463, 1999033, 1318582, 1154961, 3005647, 5659387, 6152588, 3997727, 2093940, 2355669, 2985852, 1916308, 494390, 1043847, 2591939, 2270262, 52962, -1120134, 257518, 2617674, 4179341, 4800032, 4698149, 3961033, 3909634, 6364973]
36090F364973M155525K330400j365114k762777j024024O31457Q4308j002852m74998
36081F936898J064015J688853R56846j54891q51774q28463Q1105J439918K070902
36072A2403409J387247L83322L79347J111505J054826l26918j548680q21690J596386
36063A5618754L391402K681774J99941j343304p9984L050044N283844M913108
36055C3715579L020417K218154L748700O272702P819783Q328115R265173J1028764
36047H5417387J2365002J2944164J4789922J9604577K5805642L0130702L1469464
36040B32526860L0771871K7289778J7837198J346224j7562412l1498112l6411761
36033B24299646l3904690k8319941k2941854j8736770j5230730j1781279q369106
$$ y = [6364973, 10520498, 12850898, 11485784, 8723007, 7698983, 8330440, 8414748, 7411896, 6936898, 8000913, 9689766, 10646612, 10491721, 9639947, 8811484, 8892589, 10332507, 12403409, 13790656, 14173978, 14553325, 15664830, 16719656, 16392738, 14844058, 14022368, 15618754, 19010156, 21691930, 21891871, 20548567, 20468583, 23518627, 28802471, 33715579, 36735996, 38954150, 42702850, 48975552, 56795335, 65123450, 74388623, 85417387, 97782389, 110726553, 125516475, 145121052, 170926694, 201057396, 232526860, 263298731, 290588509, 308425707, 309771931, 292209519, 260711407, 224299646, 190394956, 162075015, 139133161, 120396391, 105165661, 93384382, 85015276]
36026H5015276n675873m437429m516943m564338k971556L10108L134653L348705
36018F9642603J819941J973165N517919J0041263J2319057J2801732J4670698
36011A28786378J9125331K4140773K7795681K9899466K9413030K3141639R368422
36004B91670720q445975k3635320l1687512l2667508k9321731k4444385j9815723
35997A21652566j6122995j3268667j1067724r617356q829726q104800o927270
35990D7714028n396356l796934k189144r21006r28329k636982m736684m953687
35982B2154906k486035O92402J596359m47477k780995k506661k43736O62919j102440
35973A5539242k889355k150214l85947n99782k239559j974236P94267K692782
$$ y = [85015276, 79339403, 74901974, 70385031, 65820693, 62849137, 63159245, 66293898, 69642603, 71462544, 73435709, 78953628, 88994891, 101313948, 114115680, 128786378, 147911709, 172052482, 199848163, 229747629, 259160659, 282302298, 291670720, 283224745, 259589425, 227901913, 195234405, 165912674, 141468289, 121652566, 105529571, 92260904, 81193180, 71575824, 62746098, 54641298, 47714028, 42317672, 38520738, 36331594, 35410588, 34482259, 31845277, 27108593, 22154906, 19668871, 20361273, 21957632, 21510155, 18729160, 16222499, 15978763, 16641682, 15539242, 12649887, 10499673, 10113726, 9513944, 7274385, 5300149, 6094416, 8787198]
35965H787198J433892j015858j791540r92190k98232J8616M12304J20599j509534
35956E165255k819411j587269J432241L137686K280795P90204M60896N04006m26579
35947H937824j491853q96607Q23694R42030j494218l682115k589083O74267K225116
35938C449055Q66885n06231K85655J346135J32650k148285k508441r67823k9043
35929g9443k24392K37129J567113J795683N32725j53641N04210O68802m90936
35920D357250j177111m35724J551q26012j055627L23999R47712q73552k480046
35911a217560q08358K248457K425528l70499k176404j057141P98055J193939O42450
35902A678467K46359j63069o56504k99423J092111J965034J069743o08050j075881
$$ y = [8787198, 10221090, 9205232, 7413692, 6421502, 6123270, 6141886, 6554190, 6674789, 5165255, 2345844, 758575, 2190816, 5328502, 7609297, 8399501, 8860397, 9364403, 8937824, 7445971, 6549364, 7373058, 8315088, 6820870, 3138755, 549672, 1223939, 3449055, 4315940, 3809709, 4095364, 5441499, 5574149, 3425864, 917423, -50400, -79443, -303835, -66706, 1500407, 3296090, 3828815, 3675174, 4179384, 4848186, 4357250, 3180139, 2744415, 2745966, 1919954, 864327, 1188326, 2136038, 1262486, -1217560, -2025918, 222539, 2648067, 2277568, 101164, -955977, -157922, 1036017, 1678467, 1924826, 1761757, 1105253, 805830, 1897941, 3862975, 4932718, 4324668, 3248787]
35893C248787Q5613J260652Q50372p15945j446733m20411P36959K5001j801950
35884A822345k083234k69202J156758N07748o90122m77119N04397O05602K6826
35875A103999Q979M91755N22042l4552p45508j411526j385433K27871K370035
35866A147662K243853m87143k219183m95760K017574J641933p26481j754993j159720
35857B07742q36816l66664J761844L592975J663290k678751m160267j352937J474683
35848f94901J342746M06370J028221J775651R79096J88382R29474J379608l02210
35839G032437k047335r90053J377426J014696k481266m997162l460815L59440
35831d192632K464457J427248n00788o28943P30382Q65827j198282k696229q42000
$$ y = [3248787, 3334400, 4595052, 5445424, 4729479, 3282746, 2862335, 3599294, 3624295, 1822345, -260889, -530091, 626667, 1134415, 444293, -32826, 471571, 1077173, 1103999, 1112978, 1604733, 2126775, 2092223, 1346715, -64811, -1450244, -1222373, 1147662, 3391515, 2904372, 685189, 189429, 2207003, 3848936, 3122455, 1367462, 207742, -629074, -995738, 766106, 4359081, 6022371, 3343620, -816647, -2169584, -694901, 647845, 1054215, 2082436, 3858087, 4837183, 5025565, 5955039, 7334647, 7032437, 4985102, 3995049, 5372475, 6387171, 3905905, -1091257, -4552072, -4192632, -1728175, -300927, -801715, -1430658, -700276, 165551, -1032731, -3728960, -4570960]
35822d570960K633761L379029N92767j853453j182726N63849K69395j472612j784635
35813c425585l7194J617774J540153L42481m88956k64765O05586J142866P64415
35804A796775O5256R2814O59639L74895j202481k525251j909821L30856K232940
35795h4378K150840J31150k096890k513596r17361N88589J43373j302955j325360
35786e226588M74491K038177J864731O93219l5707J56103Q81013J316931N55279
35777B717649j205402k144540r08912J354925K573199K357468J222524j195349
35769D771562m344159m907369p91386M069146L709794j167196l695331q47659
35761c202598K542114J787491q89882r66160J240241K118228P10397p40272o13612
$$ y = [-4570960, -1937199, 1441830, 2034597, 181144, -1001582, -437733, -168338, -1640950, -3425585, -3462779, -1845005, -304852, 37629, -451327, -716092, -110506, 1032360, 1796775, 1862031, 1954845, 2614484, 2989379, 1786898, -738353, -2648174, -2317318, -84378, 2066462, 2197612, 100722, -2412874, -3330235, -2741646, -2598273, -3901228, -5226588, -4752097, -2713920, -849189, -155970, -191677, -35574, 845439, 2162370, 2717649, 1512247, -632293, -1541205, -186280, 2386919, 4744387, 5966911, 4771562, 427403, -4479966, -5271352, -1202206, 2507588, 1340392, -2354939, -3202598, -660484, 1127007, 237125, -729035, 511206, 2629434, 3339831, 2599559, 1985947]
35752A985947O46822J781592J525884m44335k262160j600595N74011Q02904j459129
35743A550941k753645j157442J043195J815205K183500K580803J153487j688783
35735D727261k040760R76349K627451K29881k064165n96112J498340P57461J40116
35726F255822K627444M143082J052414j130927L440620Q790000O293079K130833
35718C3602367R847482K5298398K6350242L731089k2807173k9234141j6851025
35711B9937239n351157m594990p089052m952158o54138O60241o41023j725419
35703E589543k058864j976600q99974O97785R60103q6771o2656J558167J893869
35694E614602p87699l608648k723673J112506L321284J553288j445820j892043
$$ y = [1985947, 2632769, 4414361, 5940245, 5495910, 3233750, 1633155, 2207166, 3010070, 1550941, -1202704, -2360146, -1316951, 498254, 2681754, 5262557, 6416044, 4727261, 2686501, 3662850, 6290301, 6520182, 4456017, 3859905, 5358245, 6115706, 6255822, 8883266, 13026348, 14078762, 12947835, 16388455, 25178455, 31471534, 33602367, 43449849, 68748247, 95098489, 98829578, 76022405, 46788264, 29937239, 24586082, 19991092, 12902040, 7949882, 7295744, 7955985, 7314962, 5589543, 3530679, 1554079, 654105, 1351890, 2311993, 2225222, 2162566, 3720733, 5614602, 4826903, 1218255, -1505418, -392912, 2928372, 4481660, 3035840, 1143797]
35686A143797o3392O81566p06294j383602O33425K876885J973839j185925k934374
35677A035925k205136r54031l2869J396096K544950J405934j042232j400054M22867
35668A171450O25059j785502k592973O80855M038711K897861j002764k693268
35660A339429j128586Q44960J463821J049036j95187j725198j586915Q02508K504395
35651C368263J097196j056844m21360J713675J368657j246674j973295M02908
35643C252526K337318J335138o74258j136605n88155q44570j940937k512767j747699
35634b520009R130J601331J825661P80243R366L22216N69093j22213n92017j4144
35624A868657J9697j620552k729358j065363J396335J370825k78131l67732P99052
$$ y = [1143797, 1080405, 1761971, 1055677, -327925, 305500, 3182385, 5156224, 3970299, 1035925, -1169211, -2123242, -2156111, -760015, 1784935, 3190869, 2148637, 748583, 1171450, 1796509, 11007, -2581966, -1901111, 2137600, 5035461, 4032697, 1339429, 210843, 1055803, 2519624, 3568660, 3373473, 1648275, 61360, 863868, 3368263, 4465459, 3408615, 2987255, 4700930, 6069587, 4822913, 2849618, 3252526, 5589844, 6924982, 6250724, 5114119, 4525964, 3681394, 1740457, -772310, -2520009, -2510879, -909548, 916113, 1696356, 1705722, 2027938, 2597031, 2474818, 1882801, 1868657, 1888354, 267802, -2461556, -3526919, -2130584, -759759, -1037890, -1405622, -606570]
35615f06570M99253o06148M94154K628232J318766k974604m069436L68390M703737
35606A755774L897205M64033j041128j225918k615066l535924j056446K699489
35598f57981K939830m34128k910958k152798k20883P63759J147143J601874J736756
35589A812614J387657R34299J98839j041181j834725j278748k63969l1365J5523
35580a01056Q62325J475545M84189q67710m67430Q54087N37599j259636j938550
35571d20637r83483n46078j204576q57170J223444K704163J974390N73419K31063
35562B694535K48424l84047q27157l91853l67069j540582j968155Q6706K618129
35553A68931K350416k11378j457075k05140P74225m47407j767830o08496J645053
$$ y = [-606570, -107317, -713465, -219311, 2408921, 3727687, 753083, -3316353, -2947963, 1755774, 5652979, 6117012, 5075884, 3849966, 1234900, -2301024, -3357470, -657981, 2281849, 1847721, -1063237, -3216035, -3436918, -2673159, -1526016, 75858, 1812614, 3200271, 4134570, 4333409, 3292228, 1457503, 178755, -85214, -116579, -101056, 761269, 2236814, 2721003, 1853293, 1385863, 2239950, 2777549, 1517913, -420637, -1404120, -1950198, -3154774, -4011944, -2788500, -84337, 1890053, 2463472, 2694535, 2942959, 2558912, 1731755, 1339902, 972833, -567749, -2535904, -2449198, 168931, 2519347, 2307969, 850894, 645754, 1419979, 972572, -795258, -1403754, 241299]
35544B41299J596157p89561j926781p9359J883623Q20977j919509k684349j079043
35535c936546j02535r76340j341693M12104K241846J803992J25729m75209n9041
35526b307693K6239J39674J182599J787645J38172k150082j663226J350537K847982
35517A351847R07461j731604k146183r61223l4008N97420J400095J457797J91337
35508A032939r26032n66053J63086k35074q42022M8007J705208J957455P33766
35499C071280N9045O71344J048013J54187r39530j004354o02642r23725j652733
35490a19115j363245J36351J082412L3697j827100j877506M21783K605424K525064
35481A617765J133319N60495P64303J90478j153263j799759j533271j340359r36651
$$ y = [241299, 1837456, 1047895, -878886, -958245, 925378, 1746355, -173154, -2857503, -3936546, -4039081, -5015421, -6357114, -5945010, -3703164, -1899172, -1773443, -2248652, -2307693, -2281454, -2141780, -959181, 828464, 966636, -1183446, -2846672, -1496135, 1351847, 2259308, 527704, -1618479, -2579702, -2613710, -2016290, -616195, 841602, 1032939, 106907, -459146, -296060, -531134, -1373156, -1325149, 380059, 2337514, 3071280, 3130325, 3801669, 4849682, 5003869, 4064339, 3059985, 2457343, 1533618, -119115, -1482360, -1346009, -263597, -229900, -2057000, -3934506, -3512723, -907299, 1617765, 2751084, 3311579, 4075882, 4266360, 3113097, 1313338, -219933, -1560292, -2496943]
35472b496943O56172K112838R12751k024380k656913K5162K152780J124211n30008
35463g24330p1000P80137k79711j329152J88211K118782J007005j409284p61129
35454d80471K230837K548285q50052l383137k228970M8862O91493O33029J202187
35445D12063J278606J18267n98513J52002P87848K84693O9644P30393K91624j781128
35435A745499k389975K45912K668882J045766k565645l104557p0949K213136J310724
35426A098793n61571q39413o4880J16038k59229j67564N15187J072190J043083
35417A952634N15039j66038n81625m45250K01161R77717J195701K42863j369415
35408B522787j849717l27091J281378N74036j471722j654911K44922Q39618j194668
$$ y = [-2496943, -1840771, 272067, 1184818, -839562, -3496475, -3471313, -1318533, -194322, -724330, -795330, -15193, -294904, -1624056, -1435845, 682937, 1689942, 280658, -480471, 1750366, 4298651, 3448599, 65462, -2163508, -2114646, -1423153, -790124, 412063, 1690669, 1808936, 1210423, 1362425, 2150273, 2434966, 2504610, 3235003, 3526627, 1745499, -644476, -398564, 2270318, 3316084, 750439, -2354118, -2425067, -211931, 1098793, 537222, -302191, -367071, -251033, -510262, -677826, -162639, 909551, 1952634, 2467673, 2301635, 1720010, 1274760, 1475921, 2453638, 3649339, 3892202, 2522787, 673070, 345979, 1627357, 2201393, 729671, -925240, -680318, 159300, -1035368]
35399a035368k583377q08801J632809J565438N18454J597402L420178K166446
35391F473181j526312k917109n00101J798723P93410j711769k481762j329802
35383a401541j01118L31949J84344l63736q81667n73821N35309J407731J476862
35374F14312J134144O36743l4266l58028K605J5505j151125j937444m37598J813099
35364B97947J464389j175028k156075j77748J269046k53132k183556j489051M55767
35355c947441Q70184N07748J650959L210430K092266j419677l589757k497243
35347c122531p1746J426756K030277K455395K308246J058543o54497j649183j444162
35338B337098n48249M3540j88551n14796J60096J314075J048547r62555k486452
$$ y = [-1035368, -3618745, -4427546, -2794737, -1229299, -710845, 886557, 4306735, 6473181, 4946869, 2029760, 1529659, 3328382, 4121792, 2410023, -71739, -1401541, -1502659, -1170710, -986366, -1350102, -2231769, -2805590, -2270281, -862550, 614312, 1748456, 2385199, 2350933, 1992905, 1995510, 2011015, 859890, -1077554, -1515152, 297947, 1762336, 587308, -1568767, -1746515, -477469, -730601, -2914157, -4403208, -3947441, -3077257, -2569509, -918550, 2291880, 4384146, 2964469, -625288, -3122531, -3194277, -1767521, 262756, 2718151, 5026397, 6084940, 5430443, 3781260, 2337098, 1788849, 1832389, 1643838, 1129042, 1289138, 2603213, 3651760, 2689205, 202753]
35329B02753j921104n71412m6638N04341K122676L021496J127305j749895k017862
35320F71660J38646J195254J05208m44376Q58227J733122N90281p58469o40637
35311C448916m28381j507765k262629q95936J068247J127884r4388j75659R00189
35302A180478R85289l82538j342620r18793k71995l32023l25944N59645J558165
35293G09664J261741m99222k205813j981965L44182K466949J878256p42005j910322
35284f78535M3010K540129K412987J60607j545740j938502k045149j815253n36866
35275c403312O27918o9712j410033n03117K182049K881623M41489j695375r16872
35266a865342Q50628J007440L74546O21224O75579q68182k176261q06909J785112
$$ y = [202753, -1718351, -2289763, -2336401, -1832060, 290616, 3312112, 4439417, 2689522, 671660, 810306, 2005560, 2110768, 1666392, 2524619, 4257741, 4848022, 4089553, 3448916, 3020535, 1512770, -749859, -1645795, -577548, 550336, 455948, 280289, 1180478, 2165767, 1783229, 440609, -478184, -750179, -1082202, -1408146, -848501, 709664, 1971405, 1472183, -733630, -2715595, -2371413, 95536, 1973792, 1231787, -678535, -635525, 1904604, 4317591, 4478198, 2932458, 993956, -1051193, -2866446, -3403312, -2775394, -2845106, -4255139, -4758256, -2576207, 305416, 746905, -948470, -1865342, -1014714, -7274, 367272, 988496, 1664075, 795893, -1380368, -2187277, -402165]
35257d02165K254917O94362l3872M58601j75821j966526j740287J484239M062748
35248D636196K723286q66529k731327j696197K35182J076010M99245p13085j371234
35239A791547p61149K99418K61637p88591j081393r5236M42300m49978j191040
35230a572485m49944L65440l34739j168012m6453J746296J147619j458234k207742
35221c978254L94576K900835J858616j251562k416697q47620M89809k47227j178323
35212d275847j3516K133970K355487M82290n57013O68869J694743M8120k526278
35203A0825k520339k05589P48237q15751j746103J28066K437408K171940J66841
35194C75535j072843j517213k274111k141243N43701L742120L626813M95228j284831
$$ y = [-402165, 1852752, 2547114, 2513242, 2971843, 2796022, 829496, -910791, 573448, 4636196, 7359482, 6492953, 3761626, 2065429, 2300611, 3376621, 3875866, 3162781, 1791547, 1030398, 1329816, 1591453, 802862, -278531, -373767, 68533, -381445, -1572485, -2022429, -1656989, -1991728, -3159740, -3206193, -1459897, -312278, -1770512, -3978254, -3583678, -682843, 1175773, -75789, -2492486, -3340106, -2850297, -3097524, -4275847, -4289363, -2155393, 200094, 682384, 125371, 794240, 2488983, 2537103, 10825, -2509514, -2715103, -1966866, -2782617, -4528720, -4400654, -1963246, 208694, 375535, -697308, -2214521, -4488632, -6629875, -6086174, -2344054, 1282759, 1777987, 493156]
35185D93156K18083J921513R21291j255142j595803p5143J150960J164778P02671
35176C646364L38816O8783o8969k30381q73418j774066j903462r87867l8637K92512
35166a530325N21974Q86873P10695k7208k71368O7773l49820j588604j535458
35157c115468O60296K525931J811792K925l00559M09629O9295q31898l51239O39696
35147A520400n30631l089671k969716P01220L372849J528540k036967k405683
35139c909659M26551K230824J035616o99392n05944O28798M48845r69172j510389
35130b823922j10451J873594K376293Q86278j229297k231152j534816P1941J311736
35121a409796J382750L99136p57277j154171o92480j63082j91727m49383l24680
$$ y = [493156, 711239, 2632752, 3554043, 2298901, 703098, 627955, 1778915, 2943693, 3646364, 3985180, 4053963, 3984994, 3754613, 2881195, 1107129, -796333, -1784200, -1822837, -1530325, -1008351, -121478, 589217, 562009, 290641, 358414, 8594, -1580010, -3115468, -2455172, 70759, 1882551, 1885476, 1584917, 1994546, 2063841, 1231943, 880704, 1520400, 989769, -2099902, -5069618, -4368398, -995549, 532991, -1503976, -3909659, -3483108, -1252284, -216668, -916060, -1422004, -793206, -344361, -1313533, -2823922, -2934373, -1060779, 1315514, 2201792, 972495, -1258657, -2793473, -2721532, -1409796, -27046, 372090, -385187, -1539358, -2231838, -2394920, -2586647, -3036030, -3360710]
35112c360710N2710J90608K95906R53215J836254J884668R53355J19594n8422
35103B867178l71109j333065j913136j022579N77285J187049N24008j53824p3908
35094B87899K11435J07913q7897O9733L52295K19480m72565j307504j518466n80615
35084b718292Q73775J235838l6026j134975j54520J785923J720585p45690k613314
35075a786696j858186p7329O88797J133733K287798K341796o18757m137096l762247
35066e788187L04038K998122J537852j072272j147885O34259J580809J397500
35058D44236J386706J337754K34180j237557j618933j199911j175906j156630
35050b986061L0989J748209K231730J427927P72004N08335l43199j541539j643634
$$ y = [-3360710, -3308000, -3117392, -2821486, -1868271, -32017, 1852651, 2806006, 2925600, 2867178, 2496069, 1163004, -750132, -1772711, -1195426, -8377, 515631, 361807, 287899, 499334, 607247, 519350, 589083, 941378, 1160858, 688293, -619211, -2137677, -2718292, -1844517, -608679, -644705, -1779680, -1934200, -148277, 1572308, 826618, -1786696, -3644882, -3722211, -3033414, -1899681, 388117, 2729913, 2111156, -2025940, -5788187, -5484149, -2486027, -948175, -2020447, -3168332, -2534073, -953264, 444236, 1830942, 3168696, 3402876, 2165319, 546386, -653525, -1829431, -2986061, -2955072, -1206863, 1024867, 2452794, 3224798, 3733133, 3389934, 1848395, 204761]
35041B04761o02780m180l83302m95867K87203R01021M87929l94001r81704j150686
35031b131606p50266K95779J064287N23834n73712n49745M71267Q34657L75910
35022d39595O26651J670158J602790k6363j037267j66354Q10300R5711j324047
35013A811984j656245j006969l36402L33225Q79443K24999j540255k156698m98184
35004c945102J054560J08794j610703p09312K420753L911410J914524j241915
34996A903009k674535k091467o83771Q24497J900374J640568j04203j784222j507354
34987b577104O67847K463471J828090n21561j787797p12750O47154M8685j282687
34978a226652n61813J681785J994403l92079k042334p94997Q86719L10983j082866
$$ y = [204761, -398019, -402199, -785501, -1281368, -994165, -93144, 394785, 784, -980920, -2131606, -2881872, -2586093, -1521806, -997972, -1571684, -2121429, -1650162, -815505, -439595, 187056, 1857214, 3460004, 3433641, 2396374, 2230020, 3040320, 3136031, 1811984, 155739, -851230, -1187632, -854407, 25036, 250035, -1290220, -3446918, -3945102, -2890542, -2781748, -4392451, -5101763, -2681010, 1230400, 3144924, 1903009, -771526, -2862993, -3546764, -2722267, -821893, 818675, 714472, -1069750, -2577104, -1909257, 554214, 2382304, 1860743, 72946, -639804, 7350, 56035, -1226652, -1788465, -106680, 1887723, 1495644, -546690, -1341687, -454968, -143985, -1226851]
34969a226851q15321J10061n14826j564292m65097J828139J993605j76591j467153
34960b298326k98905J541006K355738K336333J624068j54144j878427j504889
34952A722454O18934J698486M60546j302138j764702j213423n28708J15012L75451
34943A81912k14873p91729K8489J446150J030771j398814k949789j656238R52531
34934c371590K324817J927755Q13451p2083k43943J51054K0373j289378k281080
34925b020624j002619J593780K512717J155633Q1842P47434J453355O20923o96721
34916D445720r96073n78130k23850J52527K85891p17703k229858k072468N9381
34907a874563J628953J111977J88390M29199N40468r22401k550332k270597n88887
$$ y = [-1226851, -2042172, -1932111, -2446937, -4011229, -4476326, -2648187, -654582, -831173, -2298326, -2597231, -1056225, 1299513, 3635846, 5259914, 5105770, 3227343, 1722454, 2341388, 4039874, 4500420, 3198282, 1433580, 220157, -308551, -193539, 181912, -32961, -824690, -796201, 649949, 1680720, 281906, -2667883, -4324121, -3371590, -1046773, 880982, 1694433, 1622350, 1378407, 1529461, 1549834, 260456, -2020624, -3023243, -1429463, 1083254, 2238887, 2320729, 3068163, 4521518, 5142441, 4445720, 3449647, 2871517, 2647667, 2800194, 3086085, 2368382, 138524, -1933944, -1874563, -245610, 866367, 1054757, 1483956, 2024424, 1102023, -1448309, -3718906, -4307793]
34898d307793P09036J345202J801910J511085J24744q93939k02989J180764J543559
34889B811579R65950L00920o59902j929332j978617l6128J782801J139976r86459
34880A410788j850484r06174J26809J73067m40240j235045j659144r44459M60536
34871d864346P79216j75091o3103K018917L260791J551437o44082m24121K99877
34862A739495j630091m059245k320494K420352L932617N13761k341329o58045
34854b402979K265363J827055q12912j565793j04088N01074p83314j633176k21970
34845b930740K187254K864046O68087k581859l614386j214744K027050K790664
34837A95372J353182O66792J438929J256094q27064k305472j456414l80390j404508
$$ y = [-4307793, -3598757, -2253555, -451645, 1059440, 1184184, 290245, 87256, 1268020, 2811579, 3777529, 4078449, 3418547, 1489215, -489402, -525530, 1257271, 2397247, 1410788, -439696, -1345870, -1219061, -1045994, -1486234, -2721279, -4380423, -5324882, -4864346, -4085130, -4260221, -4323324, -2304407, 956384, 2507821, 1863739, 1439618, 1739495, 109404, -3949841, -6270335, -3849983, 82634, 596395, -1744934, -2402979, -137616, 1689439, 876527, -689266, -793354, -292280, -1075594, -2708770, -2930740, -743486, 2120560, 2788647, 206788, -3407598, -4622342, -2595292, 195372, 1548554, 2215346, 3654275, 4910369, 4083305, 1777833, 321419, -58971, -1463479]
34828a463479l015473k265103N46607K524848K399018J378783N13506k54991o97916
34819c34200k00018Q78742J398089R76532R6046r37138j862403j874470o14061
34810b472881P66906R98810O14788R23851J640359J368369J18144o13743k57360
34801C087243K27915L21161O20747J173924R95112q1186q16254p03833r80141
34792C844688k300066l017897j512812R25718J622117M22511j32364J199077K273305
34783C324277O27823k710200m122842j848054J817512L217039J504120o60368
34775A149307n67507J159447J503186p41099l042560k412686M31694K041212J083607
34766F04601j08261N08894J615246J102539l15830n92834j08671r04192k645261
$$ y = [-1463479, -4478952, -6744055, -6197448, -3672600, -1273582, 105201, 618707, 363716, -334200, -534218, 344524, 1742613, 2719145, 2815191, 1878053, 15650, -1858820, -2472881, -1705975, -707165, -92377, 831474, 2471833, 3840202, 3958346, 3344603, 3087243, 3315158, 3636319, 4257066, 5430990, 6426102, 6344916, 5528662, 4824829, 3844688, 1544622, -1473275, -2986087, -2060369, -438252, -15741, -148105, 1050972, 3324277, 3952100, 1241900, -2880942, -4728996, -2911484, 305555, 1809675, 1149307, 581800, 1741247, 3244433, 2503334, -539226, -2951912, -2520218, -479006, 604601, 496340, 1005234, 2620480, 3723019, 3407189, 2814355, 2705684, 1801492, -843769]
34757h43769k582401M1710K498154K460648Q36395m46939j067571j325022q16499
34748a245294K42870M15818n79129r45978K6794K71286j386656k398677l57096
34739e956062K524038K496599K47497l88649J163746J554545o21409k536705j707661
34730c224061O90173K310377K451082J292679q44574k435350j722712K48561M43802
34721g90023j358572j853504L43876K113723Q39576j362186j237620O04131J438682
34712a261917R01750M61923K64107k36788n8587J547636K451655L10938l030799
34703A349918l486285o83286J611150J091978n13172r98660o06831m03814l48411
34694b987413q5366L01859R73046J927112J842756l16000k516957j504234K064927
$$ y = [-843769, -3426170, -3384460, -886306, 1574342, 2410737, 1963798, 896227, -428795, -1245294, -1002424, -586606, -1165735, -2111713, -2084919, -1813633, -3200289, -5598966, -5956062, -3432024, -935425, -687928, -1076577, 87169, 1641714, 1020305, -1516400, -3224061, -2533888, -223511, 2227571, 3520250, 2675676, 240326, -1482386, -1233825, -790023, -2148595, -4002099, -3658223, -1544500, -704924, -2067110, -3304730, -2700599, -1261917, -360167, 101756, 365863, 129075, 70488, 1618124, 4069779, 4380717, 1349918, -2136367, -2819653, -1208503, -116525, -629697, -1628357, -2235188, -2639002, -2987413, -3072779, -2770920, -1797874, 129238, 1971994, 1655994, -860963, -2365197, -300270]
34685c00270L705881J488598j186449j084813J24702n15156k025634j679907j84419
34676a657467l39240j715375j171993J510163K910335J539270j3990J27441J21689
34667A310833j599483k822290j139279J527832J553617q13562k069476q33563
34659d885371Q44218J319142J162730Q55781j66821j406962j126985O56610J640532
34650a107126Q67836K38411R79598J435553L57612m11676P63353J856868M16062
34641E396491j764631j227007J161252J299602j360743k809661j033758R26179
34633E87724K54291j326229j125441n2333l84550j396757p41126J238536J957546
34624i88339P04386o46363p66000j35747O89219J641544J918143N59209j436533
$$ y = [-300270, 3405611, 4894209, 3707760, 2622947, 2747649, 2232493, 206859, -1473048, -1657467, -1996707, -3712082, -4884075, -3373912, -463577, 1075693, 1061703, 1189144, 1310833, -288650, -3110940, -4250219, -2722387, -1168770, -1982332, -4051808, -4885371, -4041153, -2722011, -1559281, -703500, -870321, -2277283, -3404268, -2747658, -1107126, -239290, -879, 978719, 2414272, 2771884, 2360208, 3123561, 4980429, 5396491, 3631860, 2404853, 3566105, 4865707, 3504964, 695303, -338455, 587724, 842015, -484214, -1609655, -1661988, -2046538, -3443295, -4184421, -2945885, -988339, -283953, -930316, -1696316, -1832063, -1142844, 498700, 2416843, 2976052, 1539519]
34615A539519j806785l74337M49093o41414j707270n28228J889951K596709P21458
34606B138696j535473j885858n46314N90279M83540j39248j91159K43841K84009
34597e57687k36985n20750k14509q7834o51493r75649N538J543827J810694N11709
34587F26861o36268l97119L09931J1222j025010j225073o0281J139807R22177
34578c33753m26853j201843k87536J500156K268049J182800n59942j161814l57296
34569F21968M34208R9822p29161o78574M28960J354961J045650k30616j424691
34560I22527j737595r22407O90047J994223J693239j08639j514349j100195k1824
34551a04973l62242j712544j512589Q00923K381818J079835j176753j254245N34403
$$ y = [1539519, -267266, -641603, -192510, -833924, -2541194, -3069422, -1179471, 1417238, 2138696, 603223, -1282635, -1828949, -1238670, -755130, -894378, -1085537, -841696, -557687, -794672, -1315422, -1529931, -1617765, -2269258, -3244907, -3239369, -1695542, 115152, 626861, -9407, -406526, -96595, -85373, -1110383, -2335456, -2395737, -1255930, -333753, -760606, -1962449, -2249985, -749829, 1518220, 2701020, 2141078, 979264, 621968, 1056176, 1155998, 426837, -251737, 177223, 1532184, 2577834, 2347218, 922527, -815068, -1737475, -1047428, 946795, 2640034, 2531395, 1017046, -83149, -104973, -467215, -2179759, -3692348, -2891425, -509607, 570228, -606525, -1860770, -1326367]
34542a326367J323041K68491p53458p40055p37627j025424j99099J814093K606706
34533A230301Q70102j153633q44539R38643J409822L576j347593j397406q69912
34524a160639p24000r01998r10343m05020P68321K141127K500980J198687p28856
34515A778259j670677j281909l34470O40865J413398J337565J2519j547829j733917
34506a386196l67541J134708J599240J127546L37951m34477j033007j301280j178887
34497a501943o43096K48981R98032Q94084L6460n69324m37524k48505m44284l05352
34487a972471N89467J132383K55229j199911j609503p86566K97266J106560J376115
34478h11431M43149j367946j748363Q35274M086866M223440J066535j925057k624325
$$ y = [-1326367, -3326, 265165, -488293, -1228348, -1965975, -2991399, -3190498, -1376405, 1230301, 2100403, 946770, 102231, 1040874, 2450696, 2454272, 1106679, -290727, -1160639, -1884639, -2786637, -3696980, -4102000, -3333679, -1192552, 1308428, 2507115, 1778259, 107582, -1174327, -1508797, -867932, 545466, 1883031, 1895550, 347721, -1386196, -1753737, -619029, 980211, 2107757, 2445708, 2011231, 978224, -323056, -1501943, -2145039, -1896058, -898026, -3942, 32518, -536806, -974330, -1222835, -1667119, -1972471, -1383004, -250621, 4608, -1195303, -2804806, -3591372, -3294106, -2187546, -811431, -368282, -1736228, -3484591, -2649317, 1437549, 5660989, 6727524, 4802467, 2178142]
34469B178142k229739j945270j009744P02819J223772l24977j562204k82592J839002
34460a410791J661578n90557j767274n19685J184810J438612P98512N09951L27905
34451A633061n41135j551584j402987j00153Q77171O17407J9683M41050J661501
34442A654014K022304N86623j581689k650675k002855n22774O46551J012313O90316
34433a45872J58269k4583J86668J16324o80579j437661r20186P86666K007860
34424D6906J384215m35110j520059r61837P3136l8009r97123p85616J318225L084521
34414A169249K090820o44256j856667o77213M29380j47906q34973p4092Q64559
34405C18901M02746l63916J61653R02341J28953r72708j83814J470988J085837
$$ y = [2178142, -51597, -1996867, -3006611, -2303792, -1080020, -1404997, -2967201, -3249793, -1410791, 250787, -339770, -2107044, -2626729, -1441919, -3307, 795205, 1305156, 1633061, 1091926, -459658, -1862645, -1962798, -1085627, -468220, -448537, -7487, 1654014, 3676318, 4262941, 2681252, 30577, -1972278, -2495052, -1848501, -836188, -145872, 12397, -12186, 174482, 290806, -389773, -1827434, -2747620, -1960954, 46906, 1431121, 996011, -524048, -1485885, -1412749, -1450758, -2447881, -3233497, -1915272, 1169249, 3260069, 2615813, 759146, 81933, 511313, 363407, -471566, -545658, 318901, 721647, 357731, 519384, 1421725, 1550678, 577970, 394156, 1865144, 2950981]
34396B950981j075265j797772k16742R70638J92960p49999j95218Q93453J210792
34387B183828J016816N81297n51247j696434j224260L95516P22909n06327p59322
34378A62776N45307N91143j559075k355874N78601L905362L434517M92859p28688
34369E066928K18300N39038m07510q04111n53170j337900k762668k474438l15011
34360b830542J225017J007283M41797L80582n828p82851p13263K13158M94689
34351e69958o2763J5750Q45289O65277q27674j516455l93258O81227K05315n01461
34341a458711J63956J265971J079976J234l81911J5584k3031p62318j153767n18484
34331a771501O00785J243012J030395M34501K16118L62543p1891j322412j750866
$$ y = [2950981, 1875716, 77944, -138798, 831840, 1024800, 274801, 79583, 973036, 2183828, 3200644, 3781941, 3230694, 1534260, 310000, 705516, 1428425, 922098, 162776, 708083, 1299226, -259849, -2615723, -2037122, 1868240, 5302757, 5795616, 5066928, 5285228, 5824266, 5416756, 4612645, 4059475, 2721575, -41093, -2515531, -2830542, -1605525, -598242, -156445, 224137, 218309, -564542, -1277805, -1064647, -569958, -632721, -616971, 228318, 893595, 65921, -1450534, -1843792, -1162565, -957250, -1458711, -1294755, -28784, 1051192, 1052426, 670515, 686099, 663068, -99250, -1253017, -1771501, -1170716, 72296, 1102691, 1537192, 1753310, 2115853, 2043962, 721550, -1029316]
34322a029316J28303K805895L078439M72308j889832j699084m86503p17051j806054
34313a142895j299985R77543K368613J042895j575277k668426j294356R37889
34305b653999K044503J763218J202514R23562L52175p32755j360990q98951l06185
34296C33092n49121p74458J70915J248416N40507j342545j745102k463J624031
34287d96728J639071J325984J965349K435801J169525j296941l226529l684319
34279a68787k488592J85788K910538L419136J364468q43595j242765o61143m93063
34270A981985j73728J150520K243776J477944l74952j404875j570089k087047
34262A243534k694071k006826j65048J127757J024531J87936o01370q58669q4871
$$ y = [-1029316, -901013, 1904882, 4983321, 5455629, 3565797, 1866713, 1380210, 663159, -1142895, -2442880, -1465337, 903276, 1946171, 370894, -2297532, -3591888, -2653999, -609496, 1153722, 2356236, 3279798, 3631973, 2899218, 1538228, 639277, 333092, -216029, -990487, -819572, 428844, 969351, -373194, -2118296, -2120759, -496728, 1142343, 2468327, 4433676, 6869477, 8039002, 6742061, 3515532, -168787, -2657379, -2471591, 438947, 3858083, 5222551, 4378956, 3136191, 2475048, 1981985, 1808257, 2958777, 5202553, 6680497, 6305545, 4900670, 3330581, 1243534, -1450537, -3457363, -3622411, -2494654, -1470123, -1282187, -1883557, -2742226, -2827097]
34253b827097J260340J388948l10319j545537k26829J925463J803308o7955m90883
34244I09439Q66122R42611j213571k502168q08836J584381J719208J89511o64386
34235A022311m25781q1782K32054N98462O4971j601736k325481l98249K306376
34226f08855K396162l23362k656248k378017n36139P89106J001593O82754L14091
34217a318915J30568L64501R31756J213027N33561j050035k333056j698746Q94514
34208b332825K917311J797392j317310k307896M61919L546574K961154n63471
34200E162848l140993l026211j613110j72979J277951K145272J408065n0790o2555
34191A927498J304753J540631j94985j532078p69326L45905l88823k016916k075830
$$ y = [-2827097, -1566757, -177809, -488128, -2033665, -2260494, -335031, 1468277, 1400322, 909439, 1775561, 2718172, 1504601, -997567, -1806403, -222022, 1497186, 1686697, 1022311, 596530, 514748, 746802, 1345264, 1410235, -191501, -2516982, -2915231, -608855, 1787307, 1463945, -1192303, -3570320, -4106459, -3317353, -2315760, -1633006, -1318915, -1188347, -823846, 107910, 1320937, 1854498, 804463, -1528593, -3227339, -2332825, 584486, 2381878, 1064568, -1243328, -781409, 2765165, 5726319, 5162848, 2021855, -1004356, -2617466, -2790445, -1512494, 632778, 2040843, 1990053, 1927498, 3232251, 4772882, 4577897, 3045819, 2276493, 2622398, 2233575, 216659, -1859171]
34182a859171l80691J112436J294419P23362Q3839l93313m27114r9975k80223
34173b26431j312670j988016j224095O6737M34526L25609J015721J825682R32055
34164a50882j176882j768438L0823J714169J119719m83557o23336P08526J471192
34155H41334O70324p10319j368830q52687N48325J813011J489859o42626k450176
34146f61785j525738J401977K692883K36710l512003m257835j140084K220718
34138d545157K293819r3617j274528J90274J847107J183263p32583j036015N98220
34129a569217J587281L23048j676904k144938q82346P47612J738993J758030P64804
34120F46363m52315m61610P55420J036541j024453l392866k982617j27524J818555
$$ y = [-1859171, -2239862, -1127426, 166993, 890355, 974194, 580881, 153767, 53792, -226431, -1539101, -3527117, -4751212, -4684475, -4249949, -3924340, -2908619, -1082937, -150882, -1327764, -3096202, -3065379, -1351210, -231491, -715048, -1338384, -629858, 841334, 1511658, 801339, -567491, -1420178, -871853, 941158, 2431017, 1788391, -661785, -2187523, -785546, 1907337, 2144047, -1367956, -5625791, -6765875, -4545157, -2251338, -2344955, -3619483, -3429209, -1582102, -398839, -1131422, -2167437, -1569217, 18064, 341112, -1335792, -3480730, -4363076, -3615464, -1876471, -118441, 646363, 194048, -267562, 487858, 1524399, 499946, -2892920, -5875537, -6003061, -4184506]
34111d184506J310811L38701O46901R90073j90006j611452j072908Q59333J681794
34102a231259P98730p5211k02659p48815j840244j469330J113732L189096K031563
34093A565603r23887k028644o98995K22006o61333j270255N1663J564233J089958
34084a089651l24471l24846P35607O64848n69374q94786J9777K59103n44795k38454
34074b307042J826047K947960J222221j185512j381305j21529J3178r45067r81251
34065i12300l8388O1580q39432j041408k49882J35096J06981J099551K478546
34056H00344J589099j515205k989903q17342J776406J163227j260001j735457
34048b988832k8452J098512Q97389J079433J712176P67009j633100k237947N15213
$$ y = [-4184506, -2873695, -2534994, -1888093, -898020, -1088026, -2699478, -3772386, -2913053, -1231259, -432529, -507740, -710399, -1459214, -3299458, -4768788, -3655056, -465960, 1565603, 641716, -1386928, -2085923, -1863917, -2525250, -3795505, -3743842, -2179609, -1089651, -1414122, -1738968, -1003361, -338513, -907887, -1802673, -1782896, -1523793, -2068588, -2307042, -480995, 2466965, 3689186, 2503674, 1122369, 1000840, 1014018, 68951, -912300, -950688, -889108, -1728540, -2769948, -3019830, -2884734, -2777753, -1678202, 800344, 2389443, 874238, -2115665, -2933007, -1156601, 6626, -1253375, -2988832, -3017284, -1918772, -1021383, 58050, 1770226, 2537235, 904135, -1333812, -818599]
34039h18599L622332L456190N34070j720394j542091j03648Q68339P78663k08085
34030D866777j549502k244120j570486j04775P99909O02073l8580l98725m55689
34021i3118m30210k74010R3407M53594M46280j10518j040314j738373j490344
34012d183606k90907Q49153J027706P49052J220412K264640K134160J07428j873900
34003B004138j528634M87055J399455L01319p23981q0406Q20453L0302j587597
33994A122104j674068j52425P58837J55187l90453K18416P74364L7536j008002
33985a58504p37499M85249R06576K8r46616o98821M67385J213610O04578p83542
33975C52444j294381k63542P51340O0959j241589n67826J850490K696457O15623
$$ y = [-818599, 2803733, 6259923, 6793993, 5073599, 3531508, 3427860, 4296199, 5074862, 4866777, 3317275, 1073155, -497331, -602106, 197803, 799876, 761296, 362571, -93118, -523328, -797338, -703931, -250337, 195943, 85425, -954889, -2693262, -4183606, -4474513, -3625360, -2597654, -1848602, -628190, 1636450, 3770610, 3878038, 2004138, 475504, 962559, 2362014, 2663333, 1939352, 1858946, 2679399, 2709701, 1122104, -551964, -704389, 54448, 209635, -180818, 37598, 811962, 849498, -158504, -896003, -410754, 495822, 495850, -450766, -1149587, -682202, 531408, 1135986, 352444, -941937, -1205479, -454139, -393180, -1634769, -2202595, -352105, 2344352, 2959975]
33966B959975j474075j039168R6733o50577j759657l30381K202306J862145j073534
33957G93767k136997K7855J464091l99270k520233j418254J259243J739062j02486
33948a293222j521857j517229j173940p05581N18672J725702J520055M92336L88053
33939a567011J074388R41343k1491k91892J56920k26773j366631j254422L27017
33930b228552P33418j315110l024198j380256K068631L114343Q71731j048349
33922b208342J47608K474751K232300m91660j920663j89825J787516O22849k334143
33913A20391k869437k40705J753132O42870j217359r10602L81020K1101j086324
33904c405913q5779K388433K650633p1231k203987j363220M06235N94048L3694
$$ y = [2959975, 1485900, 446732, 543465, -107112, -1866769, -2197150, 5156, 1867301, 793767, -1343230, -1315375, 148716, -250554, -2770787, -4189041, -2929798, -1190736, -1293222, -2815079, -4332308, -5506248, -6211829, -5693157, -3967455, -2447400, -1955064, -1567011, -492623, 448720, 427229, 135337, 292257, 65484, -1301147, -2555569, -2228552, -1495134, -2810244, -5834442, -7214698, -5146067, -2031724, -1159993, -2208342, -2060734, 414017, 2646317, 2154657, 233994, 44169, 1831685, 2454534, 120391, -2749046, -2989751, -1236619, -593749, -1811108, -2721710, -2340690, -2319589, -3405913, -3491692, -1103259, 1547374, 1476143, -727844, -2091064, -1684829, -1090781, -1057087]
33895a057087L54331M94286j124249k887252j913742J187678K775529J353023
33887h17483o03171n42788R01015J634307J191050O30788M47338Q2734p60301
33878B163489j429135j160149j07601P36755N89538k83140q94118o60680O7171
33869i77870O14279O63050J82739o96891j318797o66373J315952K980795K518992
33860D615876J82858j910859k310643j697083j473133j702505j229413M58833
33852e066069K283063K667400J198851r63002k091977j266766Q58597K417336
33844C7433J882684k74759j822192j298771L8118j34177j717163j963428N70934
33835d681321L466201L404647O31424j591934j576908r38615j338140j768803
$$ y = [-1057087, -702756, -208470, -1332719, -4219971, -6133713, -4946035, -2170506, -817483, -1420654, -1963442, -1062427, 571880, 1762930, 2393718, 2841056, 2923790, 2163489, 734354, -425795, -533396, 203359, 792897, 509757, -384361, -1045041, -977870, -363591, 299459, 482198, -214693, -1533490, -2199863, -883911, 2096884, 4615876, 4798734, 2887875, 577232, -1119851, -2592984, -4295489, -5524902, -5066069, -2783006, -115606, 1083245, 120243, -1971734, -3238500, -2379903, 37433, 1920117, 1645358, -176834, -1475605, -1437487, -1571664, -3288827, -5252255, -4681321, -1215120, 2189527, 2820951, 1229017, -347891, -1286506, -2624646, -4393449]
33827d393449n03021J758653K587547J225630m02169l79945P01948P74096p18276
33818F51014j965872j292742M40214J048903J88098l50872L34515R56791O77393
33809F87442Q38927K233445K710954K89410k851214k903548j72416J475565O99817
33800C008382P1594Q12548O27778j535013k841504j301719N99103J69300r24655
33791a314186o4274J292239L55257j480603p58929J746979J982598n39016j894850
33782f74785k47667J588872J280522K56572P4885m25111j882144j909691R69126
33773i69421L574290J959451k405738m015042o72401L650030M046211N53774k553667
33764C167487k227347J90753J409890N53299k66542M40758J232631K00294j738999
$$ y = [-4393449, -4896470, -3137817, -550270, 675360, 273191, -106754, 595194, 1369290, 651014, -1314858, -2607600, -2167386, -1118483, -930385, -1281257, -946742, 10049, 687442, 1526369, 3759814, 6470768, 6760178, 3908964, 1005416, 833000, 2308565, 3008382, 3079976, 3892524, 4520302, 2985289, 143785, -1157934, -558831, -389531, -1314186, -1378460, -86221, 269036, -1211567, -1970496, -223517, 1759081, 1220065, -674785, -922452, 666420, 1946942, 2203514, 2278399, 1853288, -28856, -1938547, -969421, 2604869, 4564320, 2158582, -1856460, -2528861, 1121169, 5167380, 5721154, 3167487, 940140, 1130893, 2540783, 3094082, 2827540, 3268298, 4500929, 4701223, 2962224]
33755B962224k026531k44887J429453J418280L97092l66490n26806k73179K3036
33746B792192l19921j370632j804986o29824Q94845J000591K68942K65275K63463
33737A359945j330904k929067j332008K458588L619037P74456j825165j233729
33729d38847n9505r66170j664708N62992L288463K703722O8006o31260O26436
33720C489129O22175j073498j858485j149863q28633r69300J25766J612164O31740
33711F01195k280364l025221l21683K175062J723161K64893K69890P11000j00131
33702A7802r12316J10647J805503J844235M79741l22120k03457k59687n02514
33693B057834M5839J184573J557813O95475n32959j308214j461716j014953k53033
$$ y = [2962224, 935693, 690806, 2120259, 3538539, 3935631, 3569141, 3042335, 2769156, 2792192, 2472271, 1101639, -703347, -1333171, -438326, 562265, 831207, 1096482, 1359945, 29041, -2900026, -4232034, -1773446, 1845591, 2620047, 794882, -438847, -498352, -1464522, -3129230, -2566238, 722225, 3425947, 3493953, 2862693, 3489129, 4111304, 3037806, 1179321, 29458, -799175, -1768475, -1642709, -30545, 601195, -1679169, -4704390, -5026073, -2851011, -1127850, -862957, -593067, 117933, 17802, -894514, -783867, 1021636, 2865871, 3345612, 3023492, 2820035, 2560348, 2057834, 2103673, 3288246, 4846059, 5541534, 5008575, 3700361, 2238645, 1223692, 970659]
33684I70659O2092m71598j171056j149863m79658J78814N05184M66969Q6623j06184
33674a108018O96068K128134K444328P60320j449823k247551j708697j143661
33666a628900o83836N28769K028912J899210m72158k967008l066894q48385J292905
33657c917385J569946N54435n7521L94668J152774J325355P36203l70678j504633
33648a16836j682429k00965J809924J929739m01189k517584j839431N36391J551760
33639i30620O90211K26436J158222J741742P82852k87977n1261L96700n25656
33630C200649j935172j717151J14421J314978N24468j068061j424919j06560J293350
33621A96003R09905j157472k549719j255000J618559K849421J105941j443103
$$ y = [970659, 1032751, 561153, -609903, -1759766, -2239424, -2060610, -1555426, -1088457, -1001834, -1108018, -411950, 1716184, 4160512, 4920832, 3471009, 1223458, -485239, -1628900, -2312736, -1783967, 244945, 2144155, 1671997, -1295011, -4361905, -5210290, -3917385, -2347439, -1793004, -1850525, -1455857, -303083, 1022272, 1758475, 1387797, -116836, -1799265, -2000230, -190306, 1739433, 1338244, -1179340, -3018771, -2482380, -930620, -240409, -13973, 1144249, 2885991, 3668843, 3380866, 3329605, 3726305, 3200649, 1265477, -451674, -337253, 977725, 1502193, 434132, -990787, -1097347, 196003, 1105908, -51564, -2601283, -3856283, -2237724, 611697, 1717638, 274535]
33613B74535k141153j043757k0071J73636M32572J407510K392219K196026N08321
33604D179838j615866k512237j525586J38007Q15175M92436M78260J078671J098187
33595B626885j7708j112041j078339l33321K00364L00883m9381j008014j961819
33586b432491j638800Q1760J804288K653741L031338K773155Q05182k224119l412208
33577A441846j528577P33840O13293p15825o41471K97110l36842k211341k456411
33568d804378l21640J751138K029713J474123J188720O73444l01992m49712R32586
33559B172002K280008J675875n66964k432946k650116j675540o33331l6851L68682
33550a499181P79938P48581p9092q84022m81026O44231O63521o36773j134736
$$ y = [274535, -1866618, -2910375, -2930446, -2756810, -2324238, -916728, 1475491, 3671517, 4179838, 2563972, 51735, -1473851, -1335844, -520669, -28233, 450027, 1528698, 2626885, 2609177, 1497136, 418797, 85476, 285840, 586723, 537342, -470672, -2432491, -4071291, -3989531, -2185243, 468498, 3499836, 6272991, 7078173, 4854054, 1441846, -86731, 647109, 1260402, 544577, -96894, 200216, -136626, -2347967, -4804378, -5126018, -3374880, -1345167, 128956, 1317676, 1991120, 1689128, 1239416, 2172002, 4452010, 6127885, 5560921, 3127975, 477859, -1197681, -1831012, -1867863, -1499181, -719243, 29338, -49754, -933776, -1414802, -770571, -107050, -743823, -1878559]
33541a878559K00277J260391J58407j281975j35637K794818L826960J568670j612655
33532D900697l153774k738600j209851M73279J051467k2189j285553r65098L09583
33523b640039O18384j5453q5628L17274m9812m85075Q00110K780306K410863k51491
33513C399439j724746p61572j48671j421678k085208l39117J436082P84792p15980
33504a576659o02089K94497J28163k81999M17015Q52464m00152j190270R31786
33495a427244L661473K795314r99783l045531j822267m41582o84401m62862J438281
33486i88602K545052R24071j270102j203663K75952N54714l25812j94334J230706
33477A547982J801667N17693q09745l90123P21934J40572k172111l445688j796427
$$ y = [-1878559, -1678282, -417891, -259484, -1541459, -1677096, 1117722, 4944682, 6513352, 4900697, 1746923, -991677, -2201528, -1728249, -676782, -698971, -1984524, -2949622, -2640039, -2021655, -2037108, -2122736, -1805462, -1855274, -2340349, -1540239, 1240067, 3650930, 3399439, 1674693, 913121, 764450, -657228, -2742436, -3081553, -1645471, -860679, -1576659, -2178748, -1884251, -1756088, -2038087, -1621072, -768608, -1168760, -2359030, -1427244, 2234229, 5029543, 4029760, 984229, -838038, -1279620, -1964021, -2426883, -988602, 1556450, 2480521, 1210419, 6756, 282708, 837422, 511610, 317276, 1547982, 3349649, 3867342, 3057597, 2667474, 3389408, 3529980, 1357869, -2087819, -3884246]
33468c884246R78400J658700m1861j255211j66519J652271J986754J058082K71989
33459B258359m51237j893467l075941k086653P05982K453507J393106r03907j540023
33450c140274L55675K832714L287580J233917j085724j234556L85409J092745
33442C727486l49071k163234k340158j151119J86148J365121J993480Q41476j816573
33433B93556l085150j214346J321842J391779L7327K25798J382675N55690j763324
33424h54153j881339P40635K224265N77434j260803n93463Q97999O69287n29614
33415i752p99029m72756n01607L577J667319K511453Q05303j579597j784388m02607
33405e62084q6276r11379n92643J155633J814767l1816k578704l229135j420861
$$ y = [-3884246, -2905846, -1247146, -1289007, -2544218, -2710737, -1058466, 928288, 1986370, 2258359, 1807122, -86345, -3162286, -5248939, -4542957, -2089450, -696344, -1600251, -3140274, -2784599, 48115, 3335695, 4569612, 3483888, 2249332, 2634741, 3727486, 3378415, 1215181, -1124977, -2276096, -2089948, -724827, 1268653, 2110129, 293556, -2791594, -4005940, -2684098, -1292319, -1254992, -1029194, 353481, 909171, -854153, -2735492, -1994857, 229408, 806842, -453961, -1047424, -149425, 519862, -9752, -808781, -1281537, -1783144, -1779567, -112248, 2399205, 3204508, 1624911, -159477, -562084, -648360, -1559739, -2152382, -996749, 818018, 786202, -1792502, -5021637, -6442498]
33396f442498J302959K771710J846127k83958r91292M96860J773141P02970j253279
33387g7260j408613j76145j4122q62683k23233K094355L014300J104203r13127
33378B537675m82082P42070j89912k473013k557482L96588L008968K201258r06401
33369B277669k831150k182574p33223l90831p15362j62964J271283K014617J249848
33360b02687r5698q68030q79638k69286Q33952J448340L10080j705447j732021
33351c160435R00732K717196Q03223k362218k170616J103297K623149L89739j929299
33342a085232r12476J665812K141717L13659j299039j514219r61296J16220J729019
33333A94165K615726J460938o99045j539798p00635J15756R4706J07792M11901
$$ y = [-6442498, -5139539, -2367829, -521702, -805660, -1796952, -1300092, 473049, 1176019, -77260, -1485873, -1662018, -1676140, -2538823, -2762056, -667701, 2346599, 3450802, 2537675, 2055593, 2797663, 2607751, 134738, -2422744, -2026156, 982812, 3184070, 2277669, -553481, -2736055, -3469278, -3860109, -4575471, -4738435, -3467152, -1452535, -202687, -298385, -1166415, -2046053, -2315339, -1481387, -33047, 277033, -1428414, -3160435, -2259703, 457493, 1260716, -1101502, -3272118, -2168821, 454328, 844067, -1085232, -1997708, -331896, 1809821, 2123480, 824441, -689778, -1651074, -1534854, 194165, 2809891, 4270829, 3571784, 2031986, 1331351, 1447107, 1541813, 1649605, 2061506]
$$ [...]
##END NTUPLES=NMR SPECTRUM
##END=
