##TITLE=31Pdec_LR-743-R2-RM3
 , 24 sc
 13.1.2022
##JCAMPDX= 6.0         $$ Bruker NMR JCAMP-DX V2.0
##DATA TYPE= NMR SPECTRUM
##DATA CLASS= NTUPLES
##ORIGIN= UXNMR, Bruker Analytische Messtechnik GmbH
##OWNER= root
$$ XWIN-NMR		Version 3.5
$$ Thu Jan 13 11:00:12 2022 Russian Standard Time (UT+4h)  she@DPX200
##.OBSERVE FREQUENCY= 81.013821
##.OBSERVE NUCLEUS= ^31P
##.ACQUISITION MODE= SIMULTANEOUS
##.ACQUISITION SCHEME= undefined
##.AVERAGES= 24
##.DIGITISER RES= 16
##SPECTROMETER/DATA SYSTEM= spect
##.PULSE SEQUENCE= zgpg30
##.SOLVENT NAME= CDCl3
##.SHIFT REFERENCE= (INTERNAL, CDCl3, 0, 248.564)
##AUDIT TRAIL= $$ (NUMBER, WHEN, WHO, WHERE, WHAT)
$$ ##TITLE= Audit trail, XWIN-NMR		Version 3.5
$$ ##JCAMPDX= 5.01
$$ ##ORIGIN= Bruker BioSpin GmbH
$$ ##OWNER= she
$$ F:/spectra/data/she/nmr/P31/1/pdata/1/auditp.txt
$$ ##AUDIT TRAIL=  $$ (NUMBER, WHEN, WHO, WHERE, WHAT)
(   1,<2022-01-13 10:58:53.76 +0400>,<she>,<DPX200>,
      <created by zg, POWCHK disabled, PULCHK disabled
       configuration hash MD5:
       00 E9 B6 7A A2 85 ED C7 34 08 36 98 17 FE 4E 26
       data hash MD5: 32K
       A2 9A 6D 34 BE B8 61 80 AC 46 79 56 15 BE 07 D7>)
(   2,<2022-01-13 10:59:00.95 +0400>,<she>,<DPX200>,
      <Start of raw data processing
       efp BC_mod = 2 LB = 1 FT_mod = 6 PKNL = 1 PHC0 = -9177.373 PHC1 = 119.2699 SI = 64K 
       data hash MD5: 64K
       16 2C BC 3B B9 E0 12 28 06 B7 1F 56 1F A2 54 14>)
(   3,<2022-01-13 10:59:19.87 +0400>,<she>,<DPX200>,
      <pk PHC0 = -100.2045 PHC1 = 6 
       data hash MD5: 64K
       32 45 9C C0 8D C9 DA CD A7 90 8C 9D 29 63 96 FA>)
(   4,<2022-01-13 10:59:26.76 +0400>,<she>,<DPX200>,
      <abs ABSG = 5 
       data hash MD5: 64K
       EE 05 56 7F 3C 8A AF BD 78 6B 86 6B 1D 6E 2D 00>)
$$ ##END=
$$ 
$$ hash MD5
$$ 97 2D 94 FA 88 68 BC 57 EC 86 9F 18 59 20 84 66
##$RELAX= 
##$RELAX= 
##$RELAX= 
##$RELAX= 
##$RELAX= 
##$RELAX= 
##$RELAX= 
##$RELAX= 
$$ Bruker specific parameters
$$ --------------------------
##$DU= <F:/spectra>
##$EXPNO= 1
##$NAME= <P31>
##$PROCNO= 1
##$TYPE= <nmr>
##$USER= <she>
##$AMP= (0..31)
100 100 100 100 100 100 100 100 100 100 100 100 100 100 100 100 100 100 
100 100 100 100 100 100 100 100 100 100 100 100 100 100 
##$AQSEQ= 0
##$AQ_mod= 1
##$AUNM= <au_zg>
##$AUTOPOS= <>
##$BF1= 81.014009
##$BF2= 200.13
##$BF3= 200.13
##$BF4= 200.13
##$BF5= 200.13
##$BF6= 200.13
##$BF7= 200.13
##$BF8= 200.13
##$BYTORDA= 1
##$CFDGTYP= 0
##$CFRGTYP= 5
##$CHEMSTR= <none>
##$CNST= (0..31)
1 1 145 1 1 1 1 1 1 1 1 1 1 1 1 1 1 1 1 1 1 1 1 1 1 1 1 1 1 1 1 1 
##$CPDPRG= <waltz16>
##$CPDPRG1= <>
##$CPDPRG2= <waltz16>
##$CPDPRG3= <>
##$CPDPRG4= <mlev>
##$CPDPRG5= <mlev>
##$CPDPRG6= <mlev>
##$CPDPRG7= <mlev>
##$CPDPRG8= <mlev>
##$CPDPRGB= <>
##$CPDPRGT= <>
##$D= (0..31)
0 1 0 0 0 0 0 0 0 0 0 0.03 2e-05 3e-06 0 0 0 0 0 0 0 0 0 0 0 0 0 0 0 0 
0 0 
##$DATE= 1642057133
##$DBL= (0..7)
120 120 120 11 120 120 24 19 
##$DBP= (0..7)
150 150 150 150 150 150 150 150 
##$DBP07= 0
##$DBPNAM0= <>
##$DBPNAM1= <>
##$DBPNAM2= <>
$$ [...]
##$SUBNAM3= <"">
##$SUBNAM4= <"">
##$SUBNAM5= <"">
##$SUBNAM6= <"">
##$SUBNAM7= <"">
##$SUBNAM8= <"">
##$SUBNAM9= <"">
##$SW= 501.771253377433
##$SWIBOX= (0..15)
0 1 3 0 0 0 0 0 0 0 0 0 0 0 0 0 
##$SW_h= 40650.406504065
##$TD= 32768
##$TD0= 1
##$TE= 0
##$TE2= 300
##$TE3= 300
##$TEG= 300
##$TL= (0..7)
0 120 53 12 22 120 120 120 
##$TP= (0..7)
150 150 150 150 150 150 150 150 
##$TP07= 0
##$TPNAME0= <>
##$TPNAME1= <>
##$TPNAME2= <>
##$TPNAME3= <>
##$TPNAME4= <>
##$TPNAME5= <>
##$TPNAME6= <>
##$TPNAME7= <>
##$TPOAL= (0..7)
0.5 0.5 0.5 0.5 0.5 0.5 0.5 0.5 
##$TPOFFS= (0..7)
0 0 0 0 0 0 0 0 
##$TUNHIN= 0
##$TUNHOUT= 0
##$TUNXOUT= 0
##$USERA1= <user>
##$USERA2= <user>
##$USERA3= <user>
##$USERA4= <user>
##$USERA5= <user>
##$V9= 5
##$VALIST= <valist>
##$VCLIST= <CCCCCCCCCCCCCCC>
##$VD= 0
##$VDLIST= <DDDDDDDDDDDDDDD>
##$VPLIST= <PPPPPPPPPPPPPPP>
##$VTLIST= <TTTTTTTTTTTTTTT>
##$WBST= 1024
##$WBSW= 4
##$XGAIN= (0..3)
0 0 0 0 
##$XL= 0
##$YL= 0
##$YMAX_a= 1086
##$YMIN_a= -998
##$ZGOPTNS= <>
##$ZL1= 120
##$ZL2= 120
##$ZL3= 120
##$ZL4= 120
##$ABSF1= 248.5645
##$ABSF2= -253.2056
##$ABSG= 5
##$ABSL= 3
##$ALPHA= 0
##$AQORDER= 0
##$ASSFAC= 0
##$ASSFACI= 0
##$ASSFACX= 0
##$ASSWID= 0
##$AUNMP= <proc_1d>
##$AZFE= 0.1
##$AZFW= 0.5
##$BCFW= 0
##$BC_mod= 2
##$BYTORDP= 0
##$COROFFS= 0
##$CY= -3
##$DATMOD= 1
##$DC= 0
##$DFILT= <>
##$DTYPP= 0
##$F1P= 0
##$F2P= 0
##$FCOR= 1
##$FTSIZE= 65536
##$FT_mod= 6
##$GAMMA= 0
##$GB= 0
##$INTBC= 1
##$INTSCL= 5.30512e-09
##$ISEN= 30
##$LB= 1
##$LEV0= 0
##$LPBIN= 0
##$MAXI= 10000
##$MC2= 0
##$MEAN= 0
##$ME_mod= 0
##$MI= 50
##$NCOEF= 0
##$NC_proc= -7
##$NLEV= 6
##$NOISF1= 182.463
##$NOISF2= 159.3651
##$NSP= 0
##$NTH_PI= 0
##$NZP= 0
##$OFFSET= 248.5645
##$PC= 4
##$PHC0= -9277.577
##$PHC1= 125.2699
##$PH_mod= 1
##$PKNL= yes
##$PPARMOD= 0
##$PSCAL= 0
##$PSIGN= 0
##$REVERSE= no
##$SF= 81.014009
##$SI= 65536
##$SIGF1= 159.3651
##$SIGF2= -187.1042
##$SINO= 113.3802
##$SIOLD= 16384
##$SREGLST= <1H.CDCl3>
##$SSB= 0
##$STSI= 65536
##$STSR= 0
##$SW_p= 40650.406504065
##$SYMM= 0
##$S_DEV= 0
##$TDeff= 32768
##$TDoff= 0
##$TI= <>
##$TILT= no
##$TM1= 0
##$TM2= 0
##$TOPLEV= 0
##$USERP1= <user>
##$USERP2= <user>
##$USERP3= <user>
##$USERP4= <user>
##$USERP5= <user>
##$WDW= 1
##$XDIM= 65536
##$YMAX_p= 517021244
##$YMIN_p= -2993844
$$ End of Bruker specific parameters
$$ ---------------------------------
##NTUPLES= NMR SPECTRUM
##VAR_NAME=  FREQUENCY,     SPECTRUM/REAL,   SPECTRUM/IMAG
##SYMBOL=    X,             R,               I
##VAR_TYPE=  INDEPENDENT,   DEPENDENT,       DEPENDENT
##VAR_FORM=  AFFN,          ASDF,            ASDF
##VAR_DIM=   65536,         65536,           65536
##UNITS=     HZ,            ARBITRARY UNITS, ARBITRARY UNITS
##FACTOR=    0.620285442955139, 1,           1
##FIRST=     20137.2065510759, 0,            0
##LAST=      -20513.1999529892, 0,           0
##MIN=       -20513.1999529892, -2993844,    0
##MAX=       20137.2065510759, 517021244,    0
$$ Real data points
##PAGE= N=1
##DATA TABLE= (X++(R..R)), XYDATA
$$ [...]
##PAGE= N=2
##DATA TABLE= (X++(I..I)), XYDATA
41723 166760 207388 259550 265538 229096 203255 195438 166048 132510 164173 240484 239311 126117
41711 126117 28611 42182 85711 55051 3414 39467 138354 195151 200682 224494 268480 273412
41699 273412 246020 254404 305151 331501 301523 248359 197029 142743 100598 104711 152689 201753
41687 201753 217596 193448 141327 96584 101305 152803 203072 228923 250939 266025 236245 176308
41675 176308 167750 239277 314701 328742 307443 282271 226249 144949 125645 205317 283909 267244
41663 267244 208534 203270 228582 205457 149064 131704 149598 147495 133971 157961 204313 218218
41651 218218 204128 205347 216465 204242 181469 179275 186671 191182 222390 276723 272017 173526
41639 173526 88796 122042 204936 202407 125367 93560 131306 153769 135867 145066 204741 258626
41627 258626 282022 311561 354190 372536 366851 370900 365324 297713 193095 143433 177399 232007
41615 232007 258705 267205 260714 221016 168590 153021 174342 189703 195339 219494 240558 207193
41603 207193 143642 137099 203469 258127 245637 211505 208915 212553 176828 124795 120903 176071
41591 176071 224104 199892 125046 93546 155105 237797 238595 175304 162471 226643 257259 192411
41579 192411 140357 223535 387918 474639 422988 304738 208611 182086 234972 310673 309335
41568 309335 226311 197438 307802 437514 423396 298219 219783 221606 202694 133256 96344
41557 96344 125481 160413 176925 213936 255928 233581 166130 161461 239274 290610 259160 231319
41545 231319 283751 358488 365496 316559 280619 276969 282348 289004 294553 275452 221153 166041
41533 166041 152519 183386 226855 245863 220076 166850 135481 152548 188356 205883 211281 218445
41521 218445 209518 185202 202728 290021 369160 352036 272933 232619 246074 249386 231650 247194
41509 247194 303872 344899 344970 332610 317629 283505 247189 241432 246410 221164 183540 170626
41497 170626 149743 74617 2467 33446 148519 232912 251075 265785 289251 265273 214013
41486 214013 236144 330801 363137 280852 221047 306486 450445 476992 358721 224014 171492
41475 171492 178561 184392 183462 211655 271517 304277 258766 181432 182857 285062 368216 330903
41463 330903 235662 203796 227933 211279 149994 132038 167928 172478 128845 126804 203404 277693
41451 277693 290699 290299 322697 348488 326788 288034 264630 234268 186383 164449 189038 212463
41439 212463 197803 172330 160839 140837 107169 104314 144869 168743 139050 115372 172469 292492
41427 292492 389076 406014 358026 302872 291847 320242 327883 282404 236600 245311 262479 212260
41415 212260 134826 143544 241075 305881 280917 248412 278251 322408 314235 266748 215943 164782
41403 164782 138060 190655 296309 328174 229698 117917 129341 235553 303999 285064 241742
41392 241742 225353 213477 172083 119294 112638 187866 304104 358193 290941 172357 125459
41381 125459 167377 198284 159135 117365 159301 265889 342835 330312 247222 158953 121015
41370 121015 128368 123323 84592 78476 162244 272141 295140 229694 176446 183682 210107 233447
41358 233447 276557 319641 308193 263482 264915 307396 304540 252764 250218 319082 358581 325443
41346 325443 308052 350812 356867 260326 158315 162126 233439 277940 294233 317458 315600 260741
41334 260741 215420 230314 237559 164961 78848 86615 162907 202723 194436 208316 250632 259025
41322 259025 225120 205926 219600 226980 211109 193292 181262 172802 190024 241291 277577 256128
41310 256128 212947 201006 200062 169258 141241 164348 190292 134193 27530 -7155 63389 140970
41298 140970 153979 151996 200832 270044 285937 244665 214098 243184 308536 347503 326794 275925
41286 275925 250558 264095 275523 252838 217447 203093 201319 182355 150244 141603 177285 239142
41274 239142 288777 298980 280633 281484 334407 407536 439834 423078 401476 391284 363887 318882
41262 318882 301541 321511 325807 289353 262680 283783 308481 282908 227670 193596 184564 177257
41250 177257 166244 138582 63323 -32708 -41154 96997 284798 376877 357161 325317 335374
41239 335374 340192 290090 204742 138245 132684 207706 338972 444016 443493 347327 243033 198250
41227 198250 209125 236714 251037 238888 207176 185320 197925 233635 260952 268459 268724 271686
41215 271686 276113 280316 283999 287146 296923 320738 344653 340714 304860 261717 223609 178656 132354
41202 132354 120891 159480 212678 242587 255546 275952 305727 337243 375922 419596 440819
41191 440819 418793 368758 317814 274230 239321 221929 219291 211045 195379 203993 254530 310047
41179 310047 313158 248995 158573 102405 118188 194452 276473 314968 312825 307278 312117 304638
41167 304638 266231 207366 155714 144259 196293 286864 335931 286413 181081 118282 140543
41156 140543 209832 276876 321638 335109 315384 280195 244934 204415 169654 180737 232847
41145 232847 246080 183112 136506 199798 307123 322757 246283 190222 187313 179006 179268 268088
41133 268088 403417 425957 305699 210361 252395 330581 320037 268658 280189 323056 295540
41122 295540 203495 145926 169278 233209 284196 292844 259905 234647 270327 323944 281497 129049
41110 129049 4326 16978 112159 181887 213391 241253 243731 189102 120022 99104 121546
41099 121546 153656 198567 256773 287535 275994 269296 283965 259591 174967 120825 171108 264665
41087 264665 307338 314505 354282 417510 443245 416793 355766 261068 164914 153718 247629 328347
41075 328347 290021 196077 177579 237124 271699 243263 206520 195452 191070 185475 188650 190204
41063 190204 186756 213741 280205 318979 279178 217546 214379 250765 259086 243632 252304 272426
41051 272426 257205 223001 222571 247763 248035 219291 191092 156650 99751 60335 88581 160872
41039 160872 219478 263839 323809 376643 373665 321835 263088 203613 136931 101030 133822 201409
41027 201409 242276 251611 257425 253945 226796 202206 204979 213489 218119 263848 362089 425377 376651
41014 376651 268386 208330 221446 268121 335803 416252 447193 378280 256526 163633 115658
41003 115658 97012 124347 190928 223924 194304 190149 274774 358698 338414 276861 295867 359283
40991 359283 333048 220715 167063 235652 334861 369400 334380 257593 170509 136917 195808
40980 195808 277394 282059 231786 234516 312880 383535 397393 385336 368239 332081 292624 283215
40968 283215 281943 246829 210503 239142 311077 340566 311412 283331 275351 247807 197470 173260
40956 173260 196563 245541 303582 348121 326561 231137 155661 179807 242722 238979 188913 188336
40944 188336 234453 243347 212483 220757 277035 304898 276762 240599 219095 199549 210891 288998
40932 288998 376962 380458 311380 262499 261338 267243 280881 324506 347063 294302 243595 312101
40920 312101 453287 510944 461866 429925 461276 469178 418640 382694 381136 339041 250838 217262
40908 217262 264489 287379 235754 203444 256913 315277 287496 215205 195403 246775 314922
40897 314922 339559 285134 179981 130871 206492 316673 321966 244482 225194 284978 304261
40886 304261 252469 243825 317648 355022 292540 242835 302343 390946 391426 322341 270074 258752
40874 258752 277203 329196 374757 326709 183777 65413 47760 76821 105741 182348 314888
40863 314888 389218 333340 248500 257714 324639 342805 313363 307497 325693 320050 302383 315833
40851 315833 342323 340060 333160 368931 420725 422163 371592 327019 322754 354369 413875 476353
40839 476353 482283 397402 273495 202068 220109 286659 328364 294865 205321 145814 173948
40828 173948 231485 219081 149539 132656 201682 266869 270410 270473 319119 368148 366869 354888
40816 354888 376350 386743 333490 261146 246875 281563 297085 272751 240719 215700 185346
40805 185346 151871 133797 141520 180871 255329 340442 386550 369004 309677 241649 186980 168434
40793 168434 198583 256845 316895 380277 435100 419037 302507 177090 162941 246875 315418
40782 315418 330095 350469 390715 387143 325564 276918 279664 296039 301282 305929 285054 210278
40770 210278 153952 217917 349693 388590 313255 267422 306072 313608 240608 215517 311576
40759 311576 394712 346789 274221 327449 446622 468031 388112 340534 368755 389231 355488
40748 355488 316652 315790 336770 353950 361694 361562 365927 388573 404201 369657 310000 307579 372375
40735 372375 412120 373150 314049 291505 280185 263868 289674 356539 366273 277002 197719 230967
40723 230967 321088 360852 351617 347811 334155 278147 228870 245654 291081 300830 295413 319692
40711 319692 339037 303315 252068 249835 275351 277191 278010 317747 352980 323238 266333 261862
40699 261862 307743 351083 386012 417672 388439 257046 105743 53815 100679 159427 201388
40688 201388 252762 288289 256480 194527 199659 285916 366696 379112 343030 304212 294228 332380
40676 332380 396373 413556 351347 283371 287217 314720 260322 133621 59277 106765 213563
40665 213563 288821 313625 317051 313893 295205 252060 196467 167120 198769 275606 343942 379983
40653 379983 403191 417264 400816 369791 370664 387689 348422 258604 226400 292093 342871 284716
40641 284716 198414 211972 297621 324999 266753 219893 239041 264926 229795 150171 95753
40630 95753 112448 179565 221045 182428 111981 116639 217028 314650 334164 313960 306455 282390
40618 282390 210389 147341 155266 192777 186357 158996 189846 280878 357256 381490 386256 401059
40606 401059 410761 389786 340505 297878 302420 347736 367664 322576 274329 298172 348164 323802
40594 323802 253000 260110 343103 355824 257135 195770 264024 342008 302314 213706 205836 263596
40582 263596 298158 310176 340035 351164 298554 231235 208546 200764 178347 195476 274282 323034
40570 323034 290372 273623 338423 369408 263729 137430 147830 231695 233827 192431 257171
40559 257171 392209 413080 296758 217819 266669 344898 366757 371858 396716 400703 366971
40548 366971 341989 339032 316703 270727 241602 232145 222054 244019 328672 403600 380503 314608
40536 314608 329575 404668 399948 292862 221799 266719 339353 336487 272576 211387 176112 174928
40524 174928 223808 300338 345370 337853 310241 283752 248379 204552 168670 148676 158518 221406
40512 221406 311817 351931 323354 308568 352542 374557 306170 216091 189682 190469 168371 192306
40500 192306 319236 436745 413779 316556 287478 300581 247780 185176 251265 391404 418144
40489 418144 325371 286618 337385 319998 182972 85531 133401 229316 264420 262366 258230 219936
40477 219936 164868 178690 248489 251175 171600 146678 220917 257050 186732 149522 250248
40466 250248 359068 315502 188732 160562 249783 321607 307822 264254 240668 222769 199160
40455 199160 192971 218967 261637 297253 314816 325263 350289 381774 377812 338680 337536 404016
40443 404016 437474 344852 211336 195298 291551 356384 342596 332813 347595 316528 257944
40432 257944 281632 368056 355210 218626 154508 277065 430525 440047 373532 388673 463010
40421 463010 460783 372720 311549 324171 359583 386813 416491 431790 404334 356998 329297 311735
40409 311735 281582 257321 252917 236577 204086 224816 331429 428636 407154 297592 217019
40398 217019 208238 229029 260426 317537 371594 366314 315372 296231 335840 376362 368254 329647
40386 329647 292401 252434 210253 211545 292743 404975 448093 391187 315129 307012 348677 357079
40374 357079 308629 255563 228118 204891 193062 242592 341488 392121 351283 302769 318868
40363 318868 344606 310928 266811 281714 303399 253052 191656 232456 334394 352273 273079
40352 273079 233880 301314 394543 447375 491918 541574 532301 440471 349642 339925 388359 418890
40340 418890 388960 309117 232957 222370 268415 281388 225806 201339 292386 413395 434654
40329 434654 386426 376904 378124 291575 177992 193492 307538 322793 200839 130482 214344
40318 214344 317497 315932 281926 308812 341624 314206 295058 357018 427564 400776 301294
40307 301294 226527 209917 230605 276552 323829 333593 324243 357735 417423 411881 338587 312310
40295 312310 377756 430679 391329 322078 298684 295036 275742 278741 322639 347244 323846 312617
40283 312617 342275 352441 321936 324704 385119 411456 354240 298303 313348 346031 345913 358609
40271 358609 399035 376424 257002 165847 206229 299942 325839 298652 291626 298962 297032 327307
40259 327307 393625 390811 265876 140870 142169 214652 242453 244424 296359 358489 347954 306885
40247 306885 333358 404320 424127 398096 403743 431332 406205 343251 334046 391241 432810 414561
40235 414561 367921 317010 262608 238566 284945 368206 412124 402405 387917 390115 381618 347416
40223 347416 308882 291295 304560 340822 369323 363785 346520 359605 390463 392421 375876 388368
40211 388368 406335 364106 297633 315104 398066 398655 290359 240810 342681 452879 429165
40200 429165 359691 393770 483471 479784 386356 330219 344532 353508 331242 320667 322764 300356
40188 300356 268179 267788 284937 289521 310104 370095 406584 359716 289427 294245 360749 396574
40176 396574 367584 306575 234525 164765 135015 151210 155592 124303 122801 188339 247312 235925
40164 235925 205292 212716 216023 180649 174648 237562 278936 243768 245427 368833 474381 399509
40152 399509 242705 218186 312627 334470 253429 229497 311297 361944 319299 294410 347259
40141 347259 374540 305939 232489 243760 287389 288293 281310 326405 391898 414114 397123 377636
40129 377636 355726 323676 305991 316530 325307 310547 297532 312221 340759 360900 369384 359065
40117 359065 317283 267144 262244 315187 370120 369272 316507 257952 226986 225365 239838 260809
40105 260809 286993 315436 334481 338738 340759 344500 323544 265707 221469 249312 323809 366728
40093 366728 359885 345244 322876 253659 168115 154151 215048 260745 265053 293469 338324 289337
40081 289337 140894 63102 157478 291353 305164 248434 257594 314336 298756 207866 153326
40070 153326 181758 236717 268551 267978 227898 171821 173457 256972 337252 345675 336574 373651
40058 373651 404932 367126 319784 340919 376064 338504 281230 308545 380136 373362 298753 283668
40046 283668 361174 434550 448532 451653 479271 497065 473718 415393 331427 246479 221470 277728
40034 277728 334853 310837 242462 218203 241731 256549 253876 259001 264189 268833 321799 426295
40022 426295 479441 416245 329901 324066 334531 248150 121062 105199 205539 283563 279023
40011 279023 266971 301549 348723 378040 398615 401405 366410 318484 293181 277164 256980 269304
39999 269304 320486 335251 283871 267905 360539 458208 430642 327841 285690 309950 314618
39988 314618 296401 304266 308719 269730 259941 347297 436745 416244 374191 458241 595009 591472
39976 591472 464155 409017 460680 445400 297592 174523 195843 281180 316400 300907 265238
39965 265238 203544 148678 173042 264853 327878 332876 345046 385850 398447 365646 336776 328967
39953 328967 320477 333502 398548 456116 428595 364363 366957 412715 396526 327905 309713 343645
39941 343645 335132 279881 267171 302181 299091 248349 223136 229570 219635 233556 347211 494795
39929 494795 531928 460440 401268 369772 288260 200662 240571 380003 441319 379365 329569
39918 329569 356518 380506 375585 408507 452789 400053 287438 270153 335354 307207 184609
39907 184609 186859 375746 518750 455362 332813 324612 360237 312961 244861 272770 355588
39896 355588 390668 384789 380503 345293 268768 238044 288843 311261 225325 122095 112261 160681
39884 160681 186528 203224 242941 259877 222638 195803 227050 257272 235509 218415 268499
39873 268499 353423 419237 461398 466463 399472 301590 275627 327810 356437 331787 330787 357143
39861 357143 310283 190046 140794 216288 289414 278191 268623 320430 347900 301861 278307
39850 278307 329509 351844 278095 197711 174619 143025 99519 175632 373208 459208 310748
39839 310748 149365 216881 412692 491051 448510 453017 517503 515594 443270 412691 429133
39828 429133 395026 309481 272723 311524 360777 392047 421082 427845 398214 392634 449865 488781
39816 488781 432014 351261 354622 406396 401670 348412 330024 351095 361377 371342 408506 423719
39804 423719 374776 334397 379492 445169 429392 370170 372530 429894 468273 496579 552473 566671
39792 566671 458527 319065 316810 444150 528343 486299 408443 386191 404203 421151 432107
39781 432107 430061 404135 384672 409681 457617 486593 506377 531671 515649 428992 352387 375218
39769 375218 445088 439998 357443 306220 330096 363640 358358 339870 336198 346881 385926 467312
39757 467312 546111 553460 491503 426580 394496 374700 348175 324409 321758 361363 452861 550764
39745 550764 573032 507673 444481 449514 473156 445697 395082 389511 420535 429010 404591 380395
39733 380395 363920 342502 325810 327533 340369 368483 430774 495330 485993 404274 361029 420495
39721 420495 493918 466947 362220 292642 309929 374768 427643 426074 361212 288418 287545 356725
39709 356725 413472 425731 446951 489094 477191 383508 289582 251531 221706 171676 166602 236450
39697 236450 298829 298689 299761 344958 359433 300127 267950 345559 445776 453785 406427 394460
39685 394460 397500 361370 337086 387759 442277 395770 287564 236698 262196 298136 323299
39674 323299 348744 339186 270550 210528 234927 322775 418333 509134 558615 481043 293523
39663 293523 168292 207493 290409 276004 216901 217289 227092 169363 138370 250714 404352
39652 404352 415667 316957 288394 357813 399854 386255 402535 442018 411674 332932 319155
39641 319155 358047 333038 264079 302692 459441 554261 492520 394659 384673 426813 448845
39630 448845 468427 508046 514995 457274 400894 412940 461998 475704 439406 396754 398286 465471
39618 465471 560372 596101 529719 426427 374259 368654 352189 326749 335475 364402 357654 313735
39606 313735 284444 294746 329506 367635 370759 293960 177267 156774 299302 494983 601046
39595 601046 611747 590928 535911 435135 368746 402959 455639 414795 323601 296449 319484
39584 319484 300562 258739 286161 363086 390463 377734 417711 491091 478810 373081 304179
39573 304179 338678 404462 436013 452364 470801 473855 478630 517652 543767 477697 357431 316372
39561 316372 398545 507895 552086 532046 483639 432109 409593 428679 444386 421896 413206
39550 413206 476722 560582 569551 510101 463018 452761 452511 471542 520905 540903 484464 422092
39538 422092 438502 482380 456259 396139 407223 470796 479468 429135 411451 440468 447459 428630
39526 428630 440987 467158 437006 369483 345779 358550 333096 277070 261782 276904 252276
39515 252276 202860 207142 267043 328951 401994 505962 556849 476405 364571 376323 472218
39504 472218 489665 420235 397929 437929 420544 335709 311277 375455 411654 380697 373597 407833
39492 407833 387068 310194 304271 386684 405742 299970 219439 289508 423973 475684 430064
39481 430064 357436 298958 278904 319081 381179 396533 381754 408429 449680 404720 292041
39470 292041 251130 317360 365759 328084 295749 341259 398467 399166 384832 401378 411222 388851
39458 388851 389737 450933 520781 545180 535221 512164 475739 448298 456002 461616 418705 377953
39446 377953 415626 480221 460103 382455 372243 426165 423509 367625 400919 540694 616132
39435 616132 538592 435215 427135 459536 451926 448126 501384 549060 516561 440527 395293 385125
39423 385125 377549 361291 327681 277789 264539 331012 410930 406933 349597 338424 353461 299712
39411 299712 215891 232917 327474 342004 267629 266921 374237 425874 358743 322623 394232 431307
39399 431307 343800 273514 344103 444093 433608 379461 400119 440542 393072 307796 294780
39388 294780 325693 307682 262246 267864 304676 306911 300331 350146 433089 480978 490788 487351
39376 487351 447284 362999 309327 340639 387696 358701 282871 255849 293852 332780 333229 312366
39364 312366 302878 330476 397784 462671 476642 452899 438653 432731 413759 424506 509793 589286
39352 589286 538839 399721 347950 436415 529984 527456 481174 452413 414756 360396 349829
39341 349829 396899 441495 472518 530008 566131 482654 334514 298018 394486 455263 413599
39330 413599 401048 475202 492640 370161 248769 260120 330536 355548 375968 436681 456363
39319 456363 388510 339960 383395 420708 374708 343165 414045 499096 501868 479953 489821 452104
39307 452104 335441 289193 408576 541367 521336 428065 415746 448403 419957 383079 430088
39296 430088 482686 431615 360619 397334 460256 399669 285081 295141 404589 441880 397651
39285 397651 414596 506501 541908 494416 468419 473651 405916 274753 234319 342557 472585
39274 472585 510763 486114 463136 448278 442116 463316 491920 491259 490197 536756 580423 524050
39262 524050 390970 313552 345030 402399 413833 409512 436289 477991 496493 483333 447701
39251 447701 407285 397564 438227 490355 494688 449082 408743 417987 470700 522596 525801 479113
39239 479113 449156 495856 578656 602746 554104 500683 462877 397719 322396 318752 383083 411637
39227 411637 378684 379616 442374 460402 392172 359558 443157 539224 540757 508999 530352 547536
39215 547536 484712 411934 423568 462385 426209 354033 346150 383935 387962 381706 439616 530026
39203 530026 558110 521144 491676 490071 489826 502344 547545 585151 569984 527452 496425 459177
39191 459177 397297 341509 302515 242406 173529 177499 265621 343700 375520 436831 541554
39180 541554 583461 532963 506023 539519 504948 369193 315412 439999 554724 491879 389289
39169 389289 435200 532186 490492 386519 425838 570504 607478 508966 437037 444855 442565
39158 442565 417611 435958 462017 415401 362114 414750 499424 471842 406810 493941 680245
39147 680245 714027 550583 421772 460798 534928 522074 496731 537960 570094 514398 433568
39136 433568 417868 453992 486435 501115 494462 459759 436075 473696 539947 558929 535344 527397
39124 527397 519814 455349 372426 368320 435905 478517 476871 497775 547437 565019 557453 591319
39112 591319 649799 644809 576547 537868 551622 540979 471643 394837 342777 303352 295565 346317
39100 346317 399765 376369 313995 323697 414504 488252 497577 483949 472989 458620 475447 558709
39088 558709 646249 643677 569249 516666 505890 495051 497922 548875 589415 538604 445003 420027
39076 420027 453317 448369 407563 416011 465955 467559 421648 415198 452495 454349 421481 437322
39064 437322 506645 545568 532714 522189 513008 458185 396594 419087 504871 543106 512033 485116
39052 485116 472063 418450 357084 386144 487234 532364 487293 446316 449149 429430 374300
39041 374300 373748 463566 555165 568484 523965 473759 443232 453938 507309 546328 524830 490999
39029 490999 504666 519176 464395 391126 392736 437917 436840 420324 479689 571954 571778 490405
39017 490405 455567 491801 508923 496029 533002 608490 616548 545041 489593 475302 442801 410938
39005 410938 462436 557652 556916 451304 382358 403375 409518 346463 306321 358117 441331 486089
38993 486089 504688 518990 515898 502450 499749 484052 439294 431356 502988 554278 485784 391974
38981 391974 420767 508374 482368 377603 388615 524110 582632 491573 402260 406116 418666
38970 418666 404099 454639 566910 590713 496943 456558 544665 600376 508869 400647 419769
38959 419769 491408 485351 442962 467018 516381 483152 388550 354705 432806 561719 651869
38948 651869 644644 542278 422557 369489 377500 392064 422371 505713 587909 581404 526587 535910
38936 535910 585901 544599 414923 357369 434220 518321 509634 467968 469756 494740 516599 556553
38924 556553 591663 552658 459027 416261 444934 457665 429548 432204 472745 466770 403349 369330
38912 369330 379852 357072 305152 324207 417442 472145 468973 514580 620932 653513 559875
38901 559875 456960 426878 413025 382288 401741 483842 532714 506912 464999 411548 294377
38890 294377 191801 274598 515857 669141 620648 535376 555751 589412 525403 442985 450390
38879 450390 495181 485266 448290 440055 432651 405546 413920 472901 509465 502725 522713 570296
38867 570296 551821 475325 479591 593383 666032 620516 566746 571314 537034 426323 381159
38856 381159 480086 581687 559273 499274 514337 544054 501200 446153 457139 482984 472851
38845 472851 497553 599090 675956 659355 644643 705376 740941 661787 565366 565014 593918 546346
38833 546346 475164 479341 517673 497983 443600 423079 418661 398473 411968 487514 543515 516830
38821 516830 466860 449961 420472 359416 357138 453523 539497 533084 507997 533926 545047 489081
38809 489081 447459 477434 493544 438813 409934 470336 505538 422305 334221 381098 504229
38798 504229 565225 557785 546426 524902 485468 497302 571269 585185 487948 427822 520298 640500
38786 640500 620898 514616 477319 509960 504703 446595 400103 382737 394002 471968 593961
38775 593961 634537 544390 446048 438174 453486 429636 446144 547231 609260 550377 495907
38764 495907 558650 633034 599458 552715 611509 672396 592703 469386 485055 600162 647718
38753 647718 626373 649249 693146 650213 560457 552121 602607 583311 497913 463545 491940 488542
38741 488542 440029 423758 460170 509722 569777 634554 632613 550657 526800 656986 806613
38730 806613 795215 673921 624686 669315 685775 646903 633846 655937 649543 620168 613137 587966
38718 587966 489999 395768 416588 506672 535270 500409 502420 550921 567043 542431 538119 554794
38706 554794 544479 517763 516943 529566 536787 575748 645318 645992 536151 439180 459220 509347
38694 509347 475226 422577 464449 541836 532799 476859 488654 539290 527739 487370 515145 569587
38682 569587 546897 491573 521895 602722 601728 526295 499825 538441 549836 527471 555561 635477
38670 635477 676908 648139 591486 523228 453135 446988 527906 583707 520618 430977 451272 541299
38658 541299 576295 566693 594391 616034 540563 436751 447422 543239 572610 521100 512216 571420
38646 571420 593541 543273 502895 511539 516348 490604 465454 448969 429492 435653 487984 534657
38634 534657 533413 530273 560112 565226 522954 535555 659067 768818 748611 684606 700869 733930
38622 733930 663916 548980 523846 570876 593378 608733 663246 669306 549491 434557 484061
38611 484061 608659 611421 512572 481865 528440 519316 447976 428913 467267 474563 472691 549948
38599 549948 655679 664947 604400 595560 627319 605095 563107 598432 659058 632356 573848 603228
38587 603228 650667 574143 457387 498907 654031 692104 587111 543615 628365 677565 606931
38576 606931 535883 548278 575022 569869 583319 614628 587497 508529 476069 520363 592066 679632
38564 679632 771610 767100 618854 486092 524894 617553 561247 429237 450662 607752 676024
38553 676024 618725 605040 656175 618656 498489 477453 563447 563215 454368 446619 595466
38542 595466 683197 588958 473643 479309 524440 520054 530765 598456 641219 636683 679901 765236
38530 765236 744947 601510 523443 601084 676038 611800 498856 465517 480488 468939 453739
38519 453739 467743 474785 465865 493125 549775 564504 549813 588040 647064 603303 477274 436597
38507 436597 520989 577727 526098 473321 500004 535004 519702 507630 526464 514729 459679
38496 459679 436438 465532 490624 518274 606723 707483 706250 624889 586168 587059 524432 431119
38484 431119 441613 528255 534174 472536 511857 646417 682054 590573 566452 664404 698210
38473 698210 596778 545218 640581 705615 605416 483074 506336 609273 654193 648526 645651
38462 645651 613052 539601 509692 556482 598879 604532 640613 701340 685781 607694 608146 695658
38450 695658 709842 614822 575777 656173 702481 638211 605949 686130 736183 662462 605196
38439 605196 682858 776338 742696 644094 596458 575547 532032 522684 574881 587898 511988 465407
38427 465407 541176 652470 689005 673653 659548 628958 586225 590320 621107 586606 518040
38416 518040 554740 681313 712208 606125 546215 622940 696748 675017 657148 689814 652466
38405 652466 518129 454107 521441 552414 477181 477750 640087 754934 678161 595890 683749
38394 683749 779342 678477 516514 543973 709325 772428 692224 615625 592098 561335 535785
38383 535785 564422 594471 565512 549884 622052 697088 675774 634405 690490 792785 821310
38372 821310 785591 754760 705335 606122 539533 572384 617367 579294 520999 530942 554106 515370
38360 515370 482732 539770 616100 611235 572305 587270 615739 585457 545287 566817 603267 593300
38348 593300 590304 644391 677822 626062 579714 634075 717347 720542 681038 685754 706751 684188
38336 684188 664505 710965 777845 801592 809702 826705 798875 722853 702744 761791 760778 637211
38324 637211 550220 628631 747279 736396 654632 652708 702113 673330 583011 558300 622888
38313 622888 692061 723299 729752 705510 654784 624438 616404 564475 477266 474078 587645 678208
38301 678208 648885 593241 614347 656942 647470 642863 700287 745026 705942 645631 631856 622629
38289 622629 593989 622819 721418 754556 647882 517254 475399 485761 516964 634760 809865
38278 809865 856820 722348 614868 673877 735321 625978 472527 484778 617546 688747
38268 688747 678952 682248 693867 663495 639372 666107 662254 574819 519324 595606 707975 732109
38256 732109 704168 684435 611786 468022 399806 488143 582781 558619 539680 658131 790844
38245 790844 769834 670624 650517 673076 636487 609099 688401 779199 755006 692503 714385
38234 714385 757132 726817 713490 802647 849069 707397 524108 519933 631377 651894 588766
38223 588766 590319 644724 639341 607130 638787 664659 594199 547083 665071 820386 805334
38212 805334 691631 694822 792659 799102 723992 727078 782865 726916 598455 610214 781700
38201 781700 900516 860280 772336 731835 715245 716693 763933 798292 738885 650536 661325
38190 661325 747727 782486 744052 699657 650855 580637 570172 675380 777934 754499 688804
38179 688804 709867 742132 651777 524873 541489 666492 723765 697074 704185 748153 744859
38168 744859 726434 774117 823062 772078 703204 748256 827978 780585 661847 650264 732774
38157 732774 756032 719071 739513 788290 733619 607006 566279 630371 686868 710688 745970
38146 745970 741671 641567 558110 615551 710114 676512 591288 638927 775041 811660 749651
38135 749651 730085 737423 657838 559645 599243 706712 684024 568449 576075 717961 794904
38124 794904 754370 734599 761829 718237 619181 620293 727707 780977 742715 739925 803841 824178
38112 824178 774049 742096 742159 716944 707216 788799 880593 848010 743155 704619 696079 606077
38100 606077 519287 593287 740191 742931 629810 615946 721167 769250 728665 729138 769401
38089 769401 731624 659071 696416 784397 744763 637109 683235 856272 904580 783999 707028
38078 707028 748354 757865 691250 676649 720782 692442 627047 698737 858199 857595 680250 582891
38066 582891 654273 699424 635256 628079 736979 784032 706157 694552 840243 954656 893284
38055 893284 774267 731284 711013 651470 620000 651878 672561 673489 744756 863183 880229
38044 880229 782779 729128 772443 791322 740036 715179 731741 692328 617604 641438 743542
38033 743542 763236 708239 755548 908849 962881 860072 773924 779726 754777 671257 670319 765651
38021 765651 785494 693631 660969 737115 764248 701261 710228 824380 857125 752056 699114
38010 699114 780517 822646 734073 674101 737996 782700 723830 708005 818505 889720 794345
37999 794345 661660 638199 667163 665375 691688 785072 847521 827234 818437 866985 883781 845877
37987 845877 861886 947158 962874 865346 784266 778146 756009 709669 759067 890581 923787
37976 923787 821917 759933 802896 805563 720056 702064 804336 861550 795599 746124 784465
37965 784465 788351 713031 692085 757056 759278 683055 719731 904745 1004784 907806 804354
37954 804354 830584 852730 767959 700343 727158 724001 652984 685088 856165 927704 787000
37943 787000 661498 724049 809835 757865 713384 828202 954980 917980 826066 841356 879001
37932 879001 810964 743708 816956 922969 891210 781260 751278 794173 819601 840583 885371
37921 885371 884564 816599 792496 845464 836239 716721 661711 772649 885042 851347 779461
37910 779461 797529 817738 742704 682182 746162 827033 798592 738613 756036 790200 769733
37899 769733 772881 848017 879933 813060 791690 896868 970476 893069 805928 852178 926017
37888 926017 894607 844695 882226 902020 792089 668128 671136 718247 681873 635689 697722
37877 697722 799516 826359 821832 853582 850380 769230 741607 851196 948815 894652 804193
37866 804193 841447 939237 939701 858318 805247 787764 773878 807610 895273 927919 865235 831698
37854 831698 894870 936379 879995 841983 908745 976940 962685 951199 992286 978124 872765
37843 872765 819721 870994 869658 758459 721765 843012 917879 811912 704648 752395 808441
37832 808441 729204 664167 764269 876852 821086 713181 728017 782844 750016 740486 870855
37821 870855 981178 900101 775234 822457 948926 943669 853142 848381 894211 864656 823836
37810 823836 886762 957389 900281 816028 857233 932539 884682 799057 836817 919945 887018
37799 887018 812972 866166 983753 993820 934344 951984 1004186 958841 878993 914435 1007682
37788 1007682 990855 888064 854079 894582 899169 871937 893579 933630 913767 870602 867174
37777 867174 854353 797452 799446 914644 999004 937232 846479 856623 877000 796125 718280
37766 718280 769245 854875 848160 828980 902169 969993 926194 879988 943468 998967 926660 851770
37754 851770 905540 957494 858860 735023 751854 808076 752792 689926 762220 852902 818975
37743 818975 797812 944959 1087513 1000385 824097 829818 952418 946297 843382 858515 972240
37732 972240 999067 961167 1017251 1116069 1083658 968159 951575 1005935 972117 888439 908164
37721 908164 981192 947242 858098 884546 988546 1001257 938368 933931 959068 908636 860423
37710 860423 942995 1056306 1027621 926773 921837 954846 881015 791968 860152 989390 968438
37699 968438 854302 852970 934157 922406 863886 936515 1085124 1106408 1018280 997475 1031380
37688 1031380 975828 875638 884101 946815 905941 829904 894280 1025440 1014757 900556 882532
37677 882532 942305 907849 811908 823008 898926 874394 815120 910886 1088933 1115671 1021548
37666 1021548 1037801 1158699 1157496 1010780 925632 956042 957352 916433 974168 1116153 1170300
37655 1170300 1110990 1062129 1027287 922639 830501 899996 1042754 1049160 955165 967101 1079540
37644 1079540 1107847 1050795 1074367 1169884 1166857 1060782 1008429 1028499 1011085 974589 1011279
37633 1011279 1046391 960332 866978 949164 1109116 1115789 1002106 970248 1006344 953544 866119
37622 866119 911164 1012958 981157 895701 963334 1088238 1010490 792471 731996 854092 926426
37611 926426 922642 1018363 1167061 1142650 990611 982629 1123386 1150698 1031011 1001979 1101884
37600 1101884 1109665 993844 977887 1101370 1142702 1044071 1002946 1073452 1075197 968387 934787
37589 934787 1017016 1048201 1001352 1045148 1196091 1268883 1220225 1199340 1229720 1186336 1097605
37578 1097605 1110709 1159105 1042707 835149 813901 980044 1056982 981940 977427 1101142 1150281
37567 1150281 1068600 1035947 1090203 1062300 950087 956510 1086646 1101886 952615 873881 969600
37556 969600 1066315 1054232 1024919 1014486 952924 902537 999262 1144111 1113862 972355 984784
37545 984784 1136388 1156243 1017864 972020 1062541 1067129 962171 983136 1153066 1204508 1058883
37534 1058883 950692 987633 1009306 963677 1001250 1115281 1110654 1007291 1049355 1239118 1294641
37523 1294641 1148224 1048515 1088225 1080011 990713 1039013 1249282 1356074 1271516 1213875 1263786
37512 1263786 1236742 1108924 1115815 1296899 1387001 1294974 1251053 1345395 1366372 1242290 1197975
37501 1197975 1311346 1347380 1202109 1095662 1155333 1206066 1135293 1079641 1105690 1087408 1024415
37490 1024415 1091854 1263178 1284407 1125556 1047167 1128904 1162870 1098142 1131906 1266546 1256568
37479 1256568 1102222 1100677 1287586 1340892 1178655 1123674 1303658 1418252 1303173 1207344
37469 1207344 1287912 1332968 1219189 1156579 1241509 1246223 1091156 1048674 1231987 1356246 1260972
37458 1260972 1197474 1330794 1421483 1285951 1130937 1146342 1186829 1129788 1135078 1283820 1364267
37447 1364267 1268227 1199810 1263902 1268021 1151186 1160844 1370709 1483093 1357012 1265737 1371826
37436 1371826 1424763 1261841 1132093 1216782 1290829 1178300 1095107 1214857 1329580 1265382
37426 1265382 1207506 1292510 1308651 1129758 1018060 1156766 1300532 1233069 1157222 1276859
37416 1276859 1394786 1291754 1128595 1115949 1144286 1080686 1074606 1236304 1361725 1295363
37406 1295363 1221007 1297657 1366997 1303882 1275232 1370275 1377324 1217439 1176893 1397778 1565441
37395 1565441 1434002 1240770 1254487 1328444 1259944 1189743 1278364 1367177 1312974 1284016 1391066
37384 1391066 1414126 1226113 1086690 1183060 1290649 1223097 1187530 1342319 1445555 1319757
37374 1319757 1227090 1387101 1549814 1455438 1301562 1340652 1421229 1345661 1283714 1411579
37364 1411579 1530268 1454782 1391101 1519178 1603830 1437058 1261996 1329199 1432777 1322415
37354 1322415 1180020 1247471 1368814 1335197 1294199 1392484 1421224 1247483 1169443 1392633
37344 1392633 1593078 1474637 1311726 1431282 1602350 1488588 1286181 1336966 1491833 1439184
37334 1439184 1310933 1384466 1515727 1439702 1317249 1421100 1585934 1524463 1386274 1451795
37324 1451795 1571915 1464090 1273108 1289681 1398497 1345541 1261874 1379397 1520139 1418138
37314 1418138 1261428 1362467 1571973 1569720 1454690 1494271 1572487 1449837 1293723 1383931
37304 1383931 1559087 1518081 1401535 1506176 1689728 1637207 1464862 1486253 1623553 1613213
37294 1613213 1545117 1636386 1727309 1569721 1361120 1424484 1612183 1591632 1459290 1503633
37284 1503633 1629989 1594355 1530006 1662896 1794534 1658102 1485448 1611824 1830517 1772275
37274 1772275 1605813 1698276 1896667 1840891 1686370 1796361 2005816 1932229 1745145 1865775
37264 1865775 2154282 2168698 1995460 2039959 2218024 2153747 1967319 2054068 2282371 2235187
37254 2235187 2049759 2171772 2471745 2482907 2326886 2486276 2835502 2861192 2683982 2842408
37244 2842408 3205870 3202449 3016737 3348899 4022741 4195089 4049898 4710218 5985054 5811390
37234 5811390 2960216 -897494 -3033713 -2794243 -1740932 -1252028 -1241874 -1103722 -761689
37225 -761689 -484188 -342111 -219624 -66117 73134 152496 178917 215557 307018 394157
37215 394157 396402 361399 392900 468382 505857 553533 698579 855243 884170 845807 879372
37204 879372 928288 869134 798852 876719 998373 969750 884934 962409 1124082 1131240 1030140
37193 1030140 1049938 1155106 1125685 1000755 1012203 1144846 1182341 1122062 1133141 1184515 1129219
37182 1129219 1061599 1164740 1309898 1247352 1079474 1088311 1219396 1218674 1152781 1276074 1491539
37171 1491539 1483156 1299552 1264060 1376909 1356517 1215440 1234256 1397822 1414883 1281989
37161 1281989 1282007 1430013 1458127 1348340 1350491 1469420 1454313 1298541 1242487 1291719 1238091
37150 1238091 1130952 1207959 1390509 1379581 1219486 1223128 1372777 1360051 1197222 1204044 1385092
37139 1385092 1409597 1240086 1200552 1366484 1448211 1348331 1300815 1387063 1420923 1372218 1418517
37128 1418517 1538330 1524554 1412981 1430801 1541384 1517880 1418693 1488011 1648919 1620698
37118 1620698 1466791 1479826 1604218 1547438 1381979 1431643 1630788 1622492 1435237 1422187
37108 1422187 1578850 1578456 1442967 1499415 1695082 1655158 1419904 1415311 1667606 1758506 1603672
37097 1603672 1561058 1703148 1696642 1490805 1421317 1533624 1498053 1295822 1292685 1524664 1608580
37086 1608580 1475828 1492138 1723587 1793469 1614140 1554481 1715618 1739423 1519878 1419554
37076 1419554 1580498 1681897 1582022 1555938 1698417 1722549 1546824 1470653 1588001 1626403
37066 1626403 1518873 1526628 1663799 1630636 1441958 1470608 1739978 1840591 1679680 1628574
37056 1628574 1786898 1805848 1603759 1545726 1728120 1787290 1610730 1540556 1678525 1691286
37046 1691286 1503492 1478234 1705114 1815476 1705708 1724246 1936120 1945853 1680141 1592654
37036 1592654 1832600 1959188 1763244 1629950 1781131 1884486 1738062 1641059 1760447 1809345
37026 1809345 1667099 1645972 1841466 1894107 1690982 1619641 1831881 1950230 1803689 1747235
37016 1747235 1937072 2001692 1768128 1612445 1742710 1822863 1655207 1555139 1703683 1803944
37006 1803944 1717312 1759417 2028361 2126980 1894258 1729039 1854019 1949550 1841620 1835786
36996 1835786 2032362 2045753 1761075 1631284 1854194 1997130 1814634 1682040 1824858 1889140
36986 1889140 1697652 1658188 1969668 2184575 2025793 1883401 2027085 2090671 1841603 1698926
36976 1698926 1946154 2165181 2008583 1823619 1948987 2089626 1958761 1856446 2032229
36967 2032229 2141474 1918653 1738056 1919530 2117447 1988121 1833492 1985400 2165636
36958 2165636 2059857 1933322 2077380 2218371 2066051 1891924 1990514 2115663 2003077 1897660
36948 1897660 2026274 2116662 1968855 1912774 2160365 2313417 2077601 1853000 2025970 2274765
36938 2274765 2189330 2002319 2079912 2233901 2162712 2060065 2180420 2294207 2153090 2010585
36928 2010585 2131016 2270769 2170378 2058908 2166622 2258599 2139471 2074443 2231763 2286199
36918 2286199 2055625 1919499 2112478 2243717 2033637 1864201 2049961 2236433 2100637
36909 2100637 1974731 2170501 2356872 2231928 2139072 2368466 2523484 2263284 2008196 2190078
36899 2190078 2443794 2287515 1997952 2050202 2257199 2224397 2124823 2275489 2450110 2337530
36889 2337530 2193012 2337191 2500959 2348874 2153254 2273170 2464937 2378031 2233537 2350701
36879 2350701 2504387 2401464 2285206 2431900 2571314 2429373 2298585 2451320 2565206
36870 2565206 2360094 2199488 2408068 2615046 2450457 2258404 2417847 2599295 2429422
36861 2429422 2251609 2460784 2710079 2565093 2336593 2464508 2670958 2534819 2326131
36852 2326131 2453297 2647094 2509078 2314186 2457728 2660891 2535851 2379515 2587747
36843 2587747 2842814 2712061 2496463 2647071 2890376 2776700 2550924 2632193 2774120 2594988
36833 2594988 2399870 2613400 2923353 2841898 2593523 2608543 2681853 2478863 2311626 2548430
36823 2548430 2819659 2681146 2485388 2706013 2994860 2835209 2540473 2649157 2901317
36814 2901317 2787682 2557131 2692631 2925077 2758321 2453734 2512522 2700111 2560159 2364917
36804 2364917 2567796 2849486 2707441 2452351 2610040 2887300 2764720 2553127 2788448
36795 2788448 3129825 2967415 2598677 2672723 2968717 2870609 2577683 2685009 3004795 2958907
36785 2958907 2723219 2839978 3103680 2969825 2668180 2775917 3082130 3006938 2749419 2882193
36775 2882193 3200642 3119125 2825361 2896593 3148922 3014909 2691857 2769521 3081254 3056358
36765 3056358 2838772 2931328 3129313 2949103 2699383 2956112 3389261 3304076 2935033 2987343
36755 2987343 3302236 3223102 2900813 2972161 3296905 3269661 3042943 3194628 3526839 3438701
36745 3438701 3136955 3230941 3501392 3337528 3002172 3157470 3529797 3392801 2993617 3112820
36735 3112820 3566476 3564939 3232501 3323457 3714711 3644488 3213431 3193659 3543734 3544276 3225623
36724 3225623 3246088 3531046 3438969 3100702 3191883 3559116 3479860 3097180 3171188 3591863
36714 3591863 3586014 3230285 3292903 3718730 3744588 3399694 3423222 3792062 3788164 3437318 3435387
36703 3435387 3738683 3668634 3314920 3387286 3780814 3746678 3375614 3435503 3848792 3833806
36693 3833806 3457577 3522961 3990165 4043585 3669150 3632473 3941111 3870282 3475044 3524538
36683 3524538 3959706 3970322 3583441 3611881 4041131 4052025 3650696 3678834 4170533 4290012
36673 4290012 3953318 3930043 4275685 4242647 3817641 3778637 4154983 4186655 3862835 3934772
36663 3934772 4363567 4343689 3908209 3908281 4356550 4405949 4014071 3995497 4378979 4365707 3968026
36652 3968026 4019845 4503429 4548318 4147783 4173531 4629685 4625528 4152513 4130101 4596302
36642 4596302 4626372 4157229 4110169 4581213 4696854 4384762 4481952 4969008 4933205 4410693
36632 4410693 4402957 4930449 4964559 4437559 4383196 4905109 4975787 4472060 4424500 4985342
36622 4985342 5134341 4689610 4627898 5108443 5169238 4697652 4698918 5279437 5378979 4847911
36612 4847911 4760139 5306597 5427733 4916176 4818932 5348211 5465766 4963958 4880363 5411635
36602 5411635 5507279 4982105 4924911 5545242 5732808 5232603 5127312 5674447 5814353 5322917
36592 5322917 5281037 5894481 6039554 5497868 5423928 6053680 6200099 5593724 5447780 6093049
36582 6093049 6337175 5805598 5627515 6147537 6259515 5681296 5578983 6248284 6489715
36573 6489715 5966401 5851080 6460328 6615115 6027561 5915587 6561368 6707974 6078441
36564 6078441 5995928 6779259 7063252 6453816 6275800 6914160 7049680 6344742 6204029 7009925
36554 7009925 7315517 6672069 6504085 7256017 7479975 6732053 6521811 7350651 7690141
36545 7690141 6988025 6772366 7625374 8003489 7269079 6941099 7685480 8031880 7361617
36536 7361617 7170117 8037713 8378528 7568236 7254697 8151035 8621223 7903266 7598809
36527 7598809 8456349 8857590 8069010 7781792 8787725 9363011 8638459 8304465 9233471
36518 9233471 9724830 8906666 8529876 9515514 10103467 9353150 9047331 10126326 10732242
36509 10732242 9888670 9559453 10806346 11468787 10072344 8571352 8737523 9222956 8685806
36500 8685806 8437081 9456429 10122366 9420823 9098598 10204298 10889888 10046565 9594697
36491 9594697 10721143 11480853 10639694 10156853 11264821 11923936 10860598 10221152 11422481
36482 11422481 12336085 11470636 10912043 12140246 13035897 12109151 11530762 12812822 13724964
36473 13724964 12730882 12144129 13550825 14548351 13469627 12786151 14251995 15338748 14203519
36464 14203519 13424981 14947607 16183602 15133797 14404107 15996070 17209635 16017510
36456 16017510 15270685 17091553 18470380 17102480 16078631 17896882 19478476 18233104
36448 18233104 17262325 19197937 20832530 19461274 18448893 20655428 22603005 21267977
36440 21267977 20200037 22521239 24543756 23039650 21912803 24589635 26968996 25381598
36432 25381598 24093581 27020471 29745043 28136245 26821480 30180723 33334266 31598129
36424 31598129 30128137 33986689 37786853 36128230 34714330 39329323 43875707 42117188
36416 42117188 40648249 46312443 52026462 50332802 49031235 56496415 64257953 62978272
36408 62978272 62068306 72207077 83027908 82429684 82284187 96744042 112062879 111683042
36400 111683042 113068335 137928355 164587917 163977303 166851325 220854995 278372227
36393 278372227 216556689 7218517 -210220701 -285467776 -230309839 -168590532 -161258685
36386 -161258685 -164836763 -140436323 -112553061 -107987042 -109065303 -95053576 -79459063
36379 -79459063 -78578870 -80688887 -71620102 -61138950 -61368542 -63620020 -57009982 -49151905
36371 -49151905 -49807473 -52136480 -47192990 -41051234 -41827741 -43961635 -39973467 -34980386
36363 -34980386 -35915461 -38013523 -34756600 -30524645 -31375508 -33191147 -30348001 -26906678
36355 -26906678 -28323542 -30649315 -28359766 -24913250 -25584309 -27311108 -25234680 -22304086
36347 -22304086 -23144608 -24912535 -23113824 -20404201 -21104798 -22733645 -21166726 -18761030
36339 -18761030 -19454711 -20962123 -19468539 -17179215 -17819543 -19292995 -17965331 -15806908
36331 -15806908 -16333903 -17687393 -16499591 -14588534 -15214484 -16539937 -15275240 -13203476
36323 -13203476 -13784545 -15650405 -15532961 -14434583 -15037505 -16085038 -15036248 -13365762
36315 -13365762 -13741969 -14777609 -13852016 -12320321 -12765390 -13867046 -13078642 -11677731 -12156684
36306 -12156684 -13244578 -12457093 -11031184 -11456425 -12568141 -11892784 -10503460 -10820540 -11851185
36297 -11851185 -11254809 -9973905 -10266081 -11210219 -10611248 -9368063 -9614849 -10476262 -9902285
36288 -9902285 -8792350 -9145316 -10024887 -9444233 -8340168 -8638762 -9331282 -8551467 -7602437
36279 -7602437 -8734239 -10726024 -10875588 -9722844 -9649527 -10358209 -9900804 -8783704 -8930809
36270 -8930809 -9788553 -9424688 -8363428 -8507550 -9356252 -9029125 -7982371 -8053045 -8836456
36261 -8836456 -8585695 -7712054 -7890337 -8661435 -8360558 -7465651 -7647273 -8436235 -8163790
36252 -8163790 -7277254 -7427365 -8181686 -7910617 -7038808 -7175422 -7891158 -7581204 -6683088
36243 -6683088 -6832934 -7633479 -7440831 -6590046 -6680726 -7391880 -7147859 -6267104 -6338270 -7096948
36233 -7096948 -6988290 -6240046 -6348177 -7066501 -6901978 -6086438 -6108224 -6774946 -6643096 -5900592
36223 -5900592 -5953828 -6594697 -6419707 -5647990 -5708174 -6407956 -6297526 -5498893 -5431114 -6040181
36213 -6040181 -6000604 -5376113 -5423187 -6023450 -5923607 -5268553 -5330122 -5974813 -5928880 -5298400
36203 -5298400 -5323426 -5893646 -5796066 -5167383 -5222834 -5805663 -5676608 -4991575 -5024073 -5654019
36193 -5654019 -5596462 -4922832 -4898603 -5488465 -5464220 -4847453 -4822837 -5345292 -5240490 -4588955
36183 -4588955 -4618500 -5287200 -5336131 -4709593 -4592553 -5065630 -5034212 -4483629 -4512043 -5101784
36173 -5101784 -5119581 -4561779 -4560446 -5124179 -5106647 -4475715 -4390956 -4941270 -5003220 -4452886
36163 -4452886 -4347135 -4788319 -4757308 -4197439 -4136703 -4606086 -4554247 -3969526 -3965276 -4593746
36153 -4593746 -4694410 -4110676 -3951919 -4427038 -4509555 -4016570 -3949329 -4468207 -4565135 -4073935
36143 -4073935 -4003831 -4527372 -4608963 -4010364 -3740399 -4118955 -4267755 -3912757 -3853603 -4256590
36133 -4256590 -4285983 -3810216 -3705492 -4113200 -4156096 -3713335 -3698183 -4234539 -4346115 -3821233
36123 -3821233 -3608840 -3980782 -4070044 -3637728 -3538918 -3995087 -4129574 -3676939 -3471498 -3787490
36113 -3787490 -3853096 -3455230 -3376415 -3792549 -3876360 -3438301 -3326170 -3745782 -3827849 -3335136
36103 -3335136 -3155802 -3591074 -3778315 -3360574 -3136748 -3480672 -3664806 -3341890 -3193884
36094 -3193884 -3520831 -3646891 -3302955 -3168312 -3485207 -3554554 -3148893 -3009239 -3395807 -3555489
36084 -3555489 -3177390 -2977442 -3281477 -3415288 -3067735 -2890124 -3170367 -3263109 -2910537 -2792197
36074 -2792197 -3181850 -3376161 -3044086 -2848853 -3143818 -3325356 -3065297 -2931865 -3206427
36065 -3206427 -3316117 -3010600 -2886914 -3193529 -3320523 -3011454 -2870063 -3139809 -3202697 -2816934
36055 -2816934 -2625524 -2903946 -3030450 -2732477 -2621116 -2943713 -3053112 -2683502 -2510093
36046 -2510093 -2853167 -3059350 -2772862 -2594369 -2856581 -2966076 -2607767 -2401577 -2696471
36037 -2696471 -2888485 -2610735 -2440900 -2741938 -2945951 -2691645 -2547694 -2885031 -3124195
36028 -3124195 -2834228 -2523273 -2614026 -2667917 -2348055 -2138207 -2379879 -2577231 -2371062 -2242742
36018 -2242742 -2552591 -2825393 -2677434 -2520621 -2677807 -2733798 -2429317 -2264460 -2544088 -2745322
36008 -2745322 -2497526 -2275809 -2462772 -2636242 -2450230 -2313022 -2525165 -2646608 -2385974
35999 -2385974 -2220938 -2467716 -2630275 -2350569 -2116286 -2336065 -2583899 -2453402 -2304204
35990 -2304204 -2469058 -2569088 -2311416 -2131168 -2347749 -2508562 -2259568 -2043826 -2241663
35981 -2241663 -2437739 -2247516 -2062845 -2261303 -2465186 -2302510 -2129974 -2288416 -2408752
35972 -2408752 -2171299 -1989274 -2212251 -2404925 -2157618 -1879085 -2030878 -2277923 -2155716
35963 -2155716 -1912729 -1946390 -2042728 -1899227 -1781272 -1960733 -2114462 -1950974 -1815130 -2017138
35953 -2017138 -2197249 -2012031 -1806966 -1944064 -2106133 -1940612 -1754184 -1887272 -2028612
35944 -2028612 -1837074 -1628246 -1758809 -1932802 -1796357 -1621531 -1728653 -1833493 -1642079
35935 -1642079 -1487283 -1691701 -1902361 -1749042 -1559053 -1713728 -1900313 -1734821 -1535960
35926 -1535960 -1716725 -1965084 -1812483 -1505148 -1528014 -1731035 -1697004 -1544663 -1617187 -1771519
35916 -1771519 -1692486 -1534726 -1582318 -1658116 -1513075 -1392902 -1580003 -1793749 -1684784 -1495162
35906 -1495162 -1582841 -1730196 -1590301 -1386513 -1481365 -1660513 -1539564 -1296724 -1310633 -1440139
35896 -1440139 -1350980 -1199291 -1301921 -1472389 -1371996 -1185856 -1259968 -1397240 -1224180 -946156
35886 -946156 -1005000 -1258094 -1241563 -1020141 -1025838 -1229024 -1215245 -972013 -884331 -1011301 -1038524
35875 -1038524 -918074 -921916 -1060552 -1041215 -827419 -696112 -710369 -646616 -476524 -424881
35865 -424881 -500278 -448846 -248661 -186063 -330654 -377862 -169952 38796 42623 33247 221646
35854 221646 439856 463256 472430 771025 1208911 1389525 1391290 1681338 2241280 2517874
35844 2517874 2514611 3025190 4188564 4897768 4768381 5481973 8068555 9562716 5449990
35835 5449990 -3850298 -11921164 -13544639 -10571190 -8354143 -8545750 -8641636 -7289144 -6130246
35826 -6130246 -6280216 -6471290 -5686881 -4912720 -5039952 -5239645 -4709953 -4177951 -4374981
35817 -4374981 -4625840 -4219194 -3760891 -3931402 -4177018 -3839455 -3418287 -3536122 -3728886
35808 -3728886 -3413629 -3050978 -3218788 -3476203 -3250471 -2950557 -3113692 -3316195 -3019457
35799 -3019457 -2665528 -2841873 -3147981 -2979817 -2684061 -2837443 -3094890 -2861517 -2453548
35790 -2453548 -2493996 -2755519 -2674973 -2452229 -2585211 -2842061 -2723414 -2450973 -2506496 -2672814
35780 -2672814 -2496596 -2223068 -2322520 -2561281 -2472118 -2271097 -2388780 -2576771 -2403937 -2153458
35770 -2153458 -2293599 -2538865 -2380981 -2079165 -2163842 -2413833 -2300859 -2018538 -2087061 -2336101
35760 -2336101 -2261524 -2020984 -2101562 -2342998 -2251234 -1961234 -1950321 -2106840 -2005182 -1796777
35750 -1796777 -1911971 -2175404 -2121442 -1894977 -1947636 -2137775 -2026365 -1773876 -1846560 -2109348
35740 -2109348 -2094470 -1896961 -1932540 -2090051 -1995937 -1827241 -1979396 -2222747 -2087417 -1792355
35730 -1792355 -1872350 -2163658 -2104199 -1788446 -1765170 -2000498 -1997507 -1770981 -1767169 -1961264 -1938871
35719 -1938871 -1738629 -1743606 -1882828 -1792905 -1605274 -1718653 -1971217 -1905192 -1664337 -1740252
35709 -1740252 -2012106 -1954455 -1639643 -1603582 -1842763 -1873913 -1690035 -1732075 -1981524 -1990600
35699 -1990600 -1765180 -1732621 -1877667 -1785305 -1503026 -1490576 -1737634 -1787056 -1616450 -1649805
35689 -1649805 -1901718 -1946635 -1744803 -1686929 -1813195 -1780539 -1601731 -1633000 -1835363 -1819034
35679 -1819034 -1601579 -1560704 -1678347 -1604640 -1412495 -1490102 -1740211 -1705231 -1444346 -1452526
35669 -1452526 -1734222 -1802665 -1598003 -1558834 -1755607 -1790217 -1605290 -1576514 -1742461 -1737633
35659 -1737633 -1545736 -1537475 -1713646 -1689277 -1467567 -1446154 -1622479 -1590346 -1362050 -1378766
35649 -1378766 -1648016 -1692519 -1436980 -1332182 -1502386 -1574450 -1458372 -1495088 -1710273 -1716633
35639 -1716633 -1489098 -1453780 -1670956 -1709217 -1475253 -1389890 -1577875 -1650654 -1472369 -1393668
35629 -1393668 -1539264 -1590480 -1458734 -1461863 -1650620 -1660622 -1411514 -1269789 -1356318 -1372981
35619 -1372981 -1258799 -1318910 -1555254 -1577512 -1337894 -1251991 -1432129 -1507066 -1363152 -1348299
35609 -1348299 -1562787 -1658453 -1530591 -1509848 -1678580 -1691490 -1463382 -1343850 -1426861 -1385065
35599 -1385065 -1169322 -1155730 -1400858 -1474257 -1246934 -1125256 -1273416 -1329144 -1142491 -1073970
35589 -1073970 -1278916 -1397200 -1248015 -1155093 -1287871 -1345855 -1193107 -1147530 -1338972 -1428909
35579 -1428909 -1269593 -1196345 -1360233 -1419974 -1218594 -1119662 -1323912 -1478027 -1325850 -1147733
35569 -1147733 -1185084 -1212012 -1055870 -977661 -1139691 -1226096 -1001253 -771485 -900064 -1279803
35559 -1279803 -1621639 -1862646 -1998875 -1925512 -1712733 -1643889 -1759236 -1768934 -1586195 -1484974
35549 -1484974 -1565929 -1569594 -1402525 -1332957 -1468628 -1557108 -1498060 -1527381 -1698472 -1720347 -1515147
35538 -1515147 -1395349 -1481992 -1493287 -1315258 -1224117 -1330908 -1369556 -1250600 -1252119 -1442629
35528 -1442629 -1499825 -1329305 -1267041 -1431295 -1484607 -1293421 -1201283 -1366524 -1451857 -1277335
35518 -1277335 -1166030 -1315085 -1426398 -1302195 -1218085 -1356619 -1448732 -1330001 -1280796 -1456768
35508 -1456768 -1550091 -1380170 -1254726 -1372896 -1437502 -1247169 -1107853 -1246118 -1364874 -1211330
35498 -1211330 -1058612 -1183187 -1363595 -1335253 -1264356 -1341891 -1374947 -1205947 -1083391 -1200208
35488 -1200208 -1308630 -1195258 -1088927 -1197725 -1296649 -1182869 -1089146 -1229412 -1372404 -1280505
35478 -1280505 -1143729 -1174123 -1200563 -1067657 -998545 -1151995 -1258525 -1115922 -1009015 -1203628
35468 -1203628 -1449674 -1430607 -1296820 -1307053 -1337637 -1198572 -1060570 -1124413 -1222043 -1163598
35458 -1163598 -1117406 -1240404 -1313152 -1157657 -1030816 -1172541 -1344549 -1259155 -1092915 -1122703
35448 -1122703 -1212839 -1126491 -1007405 -1088196 -1232296 -1212065 -1140562 -1200529 -1251821 -1130147 -1025983
35437 -1025983 -1144228 -1294209 -1235301 -1117738 -1159289 -1203832 -1042939 -870112 -959242 -1169330
35427 -1169330 -1217022 -1178287 -1275537 -1414542 -1375227 -1243877 -1238947 -1310563 -1292790 -1240758 -1261762
35416 -1261762 -1245682 -1109129 -1051740 -1218303 -1373869 -1275936 -1097023 -1105919 -1203349 -1162597 -1068647
35405 -1068647 -1117128 -1213941 -1169377 -1074458 -1108542 -1179442 -1111820 -991161 -985729 -1032682 -1012449
35394 -1012449 -1011038 -1109411 -1157088 -1053647 -992421 -1121510 -1242023 -1158349 -1037910 -1088543 -1169140
35383 -1169140 -1077534 -951755 -1017098 -1177141 -1208042 -1134129 -1089541 -1040756 -949238 -960350 -1134874
35372 -1134874 -1251817 -1161315 -1054842 -1107922 -1162760 -1057485 -946121 -981083 -1006190 -887299
35362 -887299 -816736 -956106 -1105591 -1063771 -984330 -1041529 -1088662 -994204 -958275 -1131034 -1275447
35351 -1275447 -1181900 -1052169 -1089978 -1096204 -886408 -721224 -863754 -1074346 -1025626 -878710
35341 -878710 -950982 -1126663 -1106119 -961716 -945496 -997056 -923749 -828085 -892529 -981466 -908109
35330 -908109 -846027 -1022777 -1257539 -1258509 -1127260 -1112413 -1122902 -958512 -773176 -823949 -985049
35319 -985049 -981744 -886004 -921059 -1002103 -931581 -822291 -869173 -935711 -824725 -711493 -834776
35308 -834776 -1010800 -947433 -792374 -855781 -1025371 -990489 -833783 -856877 -1002898 -991680
35298 -991680 -868458 -892063 -1021541 -1020532 -932316 -962517 -1036381 -953263 -825505 -885040 -1019503
35287 -1019503 -983192 -890201 -996398 -1170990 -1109534 -907166 -882927 -985971 -927700 -771797
35277 -771797 -825866 -1041430 -1082732 -931018 -882246 -988239 -1017900 -941632 -956317 -1050399 -1015763
35266 -1015763 -872321 -839243 -917768 -922715 -870014 -915888 -989609 -910704 -782170 -835998 -983068
35255 -983068 -955198 -795735 -762159 -840639 -813327 -713774 -755108 -892271 -909932 -853557 -918379
35244 -918379 -1014068 -912835 -729644 -765263 -957814 -986143 -844571 -814622 -926210 -950129
35234 -950129 -881612 -930320 -1056414 -1007758 -806769 -729485 -811938 -832406 -763838 -790653 -896414
35223 -896414 -882465 -775847 -783173 -873313 -841514 -739944 -795621 -949499 -937267 -786194 -768185
35212 -768185 -895256 -925896 -840926 -849526 -950501 -946935 -866983 -913322 -1031082 -986739 -833969
35201 -833969 -832861 -953834 -942818 -829436 -869718 -1024371 -1009722 -842010 -808942 -915667 -891165
35190 -891165 -742459 -755980 -925938 -931761 -733666 -648150 -760914 -797949 -669499 -619846 -726144
35179 -726144 -750715 -617270 -559893 -671182 -750853 -721897 -763097 -915906 -979591 -901314 -866909
35168 -866909 -918558 -880871 -735614 -672289 -714949 -698607 -643525 -732125 -897261 -879171 -711742
35157 -711742 -689459 -828692 -846669 -710310 -699199 -860376 -909935 -764236 -671011 -715742 -689977
35146 -689977 -554220 -542742 -693673 -750682 -644042 -602969 -691752 -707906 -629324 -670395 -805285
35135 -805285 -748975 -511680 -442130 -606885 -671929 -527712 -464312 -572026 -554037 -328929
35125 -328929 -233197 -395059 -483372 -331236 -232738 -341103 -355262 -128130 -10559 -216854
35115 -216854 -396382 -245740 -27588 -43342 -90351 82270 261939 243249 341337 798351
35105 798351 1047398 311265 -1210664 -2432260 -2662324 -2246041 -1879478 -1793985 -1792322 -1715226
35095 -1715226 -1606253 -1556018 -1563426 -1549408 -1466917 -1371164 -1331925 -1305919 -1209967 -1097964 -1101617
35084 -1101617 -1201085 -1247305 -1216815 -1225590 -1274154 -1224106 -1067748 -970278 -989404 -1001208 -958417
35073 -958417 -964548 -1031915 -1032259 -958343 -968475 -1094221 -1166751 -1112235 -1060920 -1086315 -1093056 -1035211
35061 -1035211 -991225 -962208 -856098 -721343 -724765 -853108 -915903 -877743 -890580 -969823 -962191
35050 -962191 -871271 -874880 -972501 -966084 -842822 -810791 -894006 -877421 -732619 -698096 -832709
35039 -832709 -893106 -781955 -716133 -802074 -841605 -728702 -654670 -736210 -807619 -767643 -771751
35028 -771751 -890420 -933432 -812104 -728534 -802966 -854792 -760777 -693446 -784821 -875454 -820435
35017 -820435 -741732 -762536 -784443 -732162 -727900 -825774 -864335 -772789 -727770 -819855 -870841 -776340
35005 -776340 -718388 -826997 -930631 -862171 -733223 -694640 -692863 -659129 -674461 -766262 -808551
34994 -808551 -782179 -844809 -995132 -992683 -777763 -627738 -704254 -792664 -706290 -603486 -661251
34983 -661251 -760685 -750417 -718640 -757205 -753637 -659925 -667255 -864468 -1019249 -951565 -830840
34972 -830840 -845370 -874235 -764398 -648551 -691990 -776874 -729604 -635463 -652830 -725194 -729951
34961 -729951 -708596 -721925 -690500 -590472 -579769 -724889 -843261 -816073 -796696 -902519 -978793
34950 -978793 -894776 -794193 -810729 -812960 -685874 -591832 -682129 -806493 -781077 -701093 -721335
34939 -721335 -768516 -738079 -734631 -843105 -896906 -755174 -588905 -609575 -720879 -716947 -629950
34928 -629950 -609540 -641478 -645946 -678755 -788644 -847671 -756019 -644576 -659621 -724151 -714068
34917 -714068 -681545 -707104 -724421 -678454 -655789 -687655 -647561 -511021 -467631 -597457 -698385
34906 -698385 -622697 -515372 -525235 -561365 -539341 -576961 -725850 -799732 -696795 -604700 -662055
34895 -662055 -716017 -642820 -592307 -671990 -713645 -610667 -555783 -674175 -761526 -672279 -614725
34884 -614725 -748656 -850545 -724571 -590442 -682032 -800740 -679942 -480475 -490669 -614092
34874 -614092 -596104 -508463 -568194 -699764 -707578 -672369 -756675 -827157 -692641 -512201 -540995
34863 -540995 -671321 -655989 -583331 -676965 -814701 -726371 -514833 -495890 -642551 -666199 -550668
34852 -550668 -531203 -617120 -603696 -511088 -556236 -712241 -734119 -618952 -619415 -782095 -869776
34841 -869776 -780008 -677539 -666341 -659823 -618764 -618133 -643425 -592699 -499334 -501906 -594406 -643648
34829 -643648 -631941 -650281 -690311 -673287 -633782 -651031 -669056 -608730 -565101 -656809 -783782
34818 -783782 -782078 -706067 -697080 -695840 -571737 -424009 -449071 -596008 -652621 -599660 -591573 -653977
34806 -653977 -678398 -655206 -654427 -646575 -580754 -543819 -607130 -642251 -538031 -449422 -551813 -706788
34794 -706788 -682177 -552722 -546854 -633719 -620510 -544377 -593874 -724529 -724768 -608712 -585756
34783 -585756 -678812 -713938 -657138 -633743 -643334 -574385 -475372 -502056 -619745 -652851 -597512
34772 -597512 -594884 -635630 -587018 -476485 -455202 -512923 -511867 -463940 -492935 -565255 -540796 -450099
34760 -450099 -446160 -527600 -577482 -615211 -734349 -857727 -838436 -739003 -728135 -773242 -723931
34749 -723931 -621526 -624801 -703979 -713106 -687505 -755008 -832189 -740378 -555909 -508436 -589745
34738 -589745 -602312 -540153 -568698 -665035 -637177 -490433 -433748 -521143 -604790 -636457 -703601
34727 -703601 -777234 -731354 -603171 -544610 -545725 -493591 -447258 -541699 -681367 -662249 -540438
34716 -540438 -535267 -627033 -617490 -535545 -588818 -741514 -747106 -598483 -538677 -607736 -589710 -448841
34704 -448841 -406208 -514810 -559608 -470824 -450658 -579173 -661754 -594575 -539133 -601508 -658535
34693 -658535 -634579 -646308 -737609 -757322 -638389 -538171 -572632 -648250 -665897 -663657 -666649
34682 -666649 -619095 -541498 -535537 -577497 -533321 -416751 -388260 -463416 -483671 -418150 -423010 -545798
34670 -545798 -639153 -631295 -623068 -656400 -643680 -584432 -594602 -665722 -653573 -555839 -533081 -602727
34658 -602727 -593532 -469734 -414441 -504606 -580167 -537732 -493216 -541680 -594782 -567341 -510899
34647 -510899 -468676 -401616 -332744 -360057 -462695 -498788 -445927 -434546 -504304 -548258 -533428
34636 -533428 -546138 -583982 -541722 -441113 -431754 -525115 -572858 -543079 -561209 -640119 -639763 -543740
34624 -543740 -502317 -544168 -525517 -432633 -443757 -596710 -680327 -577110 -451373 -462630 -528920
34613 -528920 -515485 -452177 -428035 -442560 -471607 -527781 -580038 -564888 -519457 -538314 -583948
34602 -583948 -536645 -440676 -470595 -624180 -689847 -572079 -420757 -378070 -411829 -454466 -501502
34591 -501502 -524931 -482176 -435134 -469275 -508816 -434576 -349228 -449277 -652087 -665977 -452796
34580 -452796 -294337 -341777 -424349 -395505 -354356 -399522 -446030 -425129 -422548 -490647 -539084
34569 -539084 -515572 -490269 -484814 -430005 -350962 -366926 -457404 -469944 -403019 -417844 -523515
34558 -523515 -540128 -440351 -420021 -532957 -568636 -427042 -315123 -400603 -537336 -525261 -419783
34547 -419783 -390426 -450542 -502726 -514242 -508214 -495280 -506217 -579372 -666910 -679654 -636283 -617597
34535 -617597 -593945 -489687 -385105 -418125 -511372 -466161 -315791 -288364 -410354 -467819 -399080
34524 -399080 -392273 -519340 -601897 -544420 -491646 -537910 -570040 -518876 -492081 -540659 -555851
34513 -555851 -501477 -487046 -521676 -472177 -351112 -350225 -490879 -549618 -442881 -369756 -442612
34502 -442612 -496372 -418966 -357385 -417700 -455855 -357990 -257206 -280578 -333009 -313324 -299331
34491 -299331 -345556 -345125 -265077 -268070 -420695 -529155 -452752 -339664 -356727 -417754 -384144
34480 -384144 -319051 -333828 -373711 -353801 -334234 -381496 -422081 -393348 -372536 -413157 -428091
34469 -428091 -367937 -332474 -379009 -411764 -382129 -393066 -479999 -504527 -403871 -331575 -402414
34458 -402414 -500959 -492303 -430714 -416194 -425964 -419278 -435586 -478936 -479572 -450845 -489787 -564328
34446 -564328 -531957 -425116 -446011 -602773 -649916 -496233 -364216 -411855 -502708 -502792 -499947
34435 -499947 -557260 -547678 -420596 -347205 -412368 -446325 -354068 -316680 -450721 -560747 -474316
34424 -474316 -351880 -402955 -536301 -555692 -489061 -468131 -473740 -439381 -427202 -482040 -490299
34413 -490299 -387350 -318496 -396249 -488758 -445103 -340937 -312126 -336089 -355703 -417272 -511831
34402 -511831 -495496 -343733 -258873 -347153 -430501 -367909 -305591 -390697 -490211 -436671 -322512
34391 -322512 -305776 -339667 -333676 -367426 -500964 -583195 -498292 -403869 -476749 -611074 -611435 -504135
34379 -504135 -422686 -364068 -285973 -267402 -353188 -415276 -369355 -338420 -412685 -466808 -413419
34368 -413419 -396840 -516275 -605463 -523668 -413818 -421930 -419901 -279525 -161255 -230131 -331275
34357 -331275 -265807 -158291 -219784 -362031 -386185 -351719 -410707 -467711 -364277 -227433 -267166
34346 -267166 -382817 -343278 -219342 -252450 -402977 -417103 -274194 -199766 -274241 -365989 -420712
34335 -420712 -500219 -557914 -474528 -306163 -233126 -280448 -322076 -318074 -321942 -317059 -273263 -287514
34323 -287514 -436688 -581034 -555523 -457687 -485933 -588801 -557245 -391782 -289084 -308677
34313 -308677 -329182 -308262 -324420 -372121 -355490 -285445 -274626 -340804 -394592 -401315 -394633 -369796
34301 -369796 -312018 -273467 -287668 -290820 -253540 -269496 -374536 -428478 -341829 -257480 -317148
34290 -317148 -412719 -381495 -287589 -280860 -328133 -321848 -310694 -378615 -434090 -368118 -286667 -334002
34278 -334002 -418259 -372263 -258713 -247569 -308216 -294539 -229560 -237656 -291881 -288070 -271049 -331236
34266 -331236 -380207 -290426 -157146 -156841 -240822 -234278 -149680 -138063 -210835 -263050 -290244 -340399
34254 -340399 -346296 -248239 -176876 -264755 -389777 -363829 -255888 -254060 -326561 -312486 -242601
34243 -242601 -266166 -346187 -328612 -240307 -225975 -261156 -217925 -144521 -186177 -291448 -289052
34232 -289052 -200316 -188421 -250687 -246532 -183183 -192341 -263774 -272881 -232870 -260462 -336530 -350141
34220 -350141 -323148 -346222 -365291 -282075 -181042 -197071 -254918 -213283 -158345 -252964 -399220
34209 -399220 -379433 -247092 -233221 -327870 -310872 -165105 -103869 -187404 -245624 -199191 -150754
34198 -150754 -139300 -90259 -21739 -31240 -81554 -62502 -37254 -146178 -299483 -272739 -96149
34187 -96149 -35739 -173576 -306919 -294188 -220145 -181045 -163800 -172001 -238676 -298671 -264916
34176 -264916 -214901 -279451 -390114 -382564 -299064 -318489 -430077 -459973 -389576 -360842 -389745
34165 -389745 -361533 -291406 -304380 -373667 -362533 -303403 -343744 -435439 -380403 -179266 -39456
34154 -39456 -38720 -66736 -88812 -174160 -273686 -265308 -207185 -251258 -333712 -266588 -105536 -82401
34142 -82401 -187736 -185213 -50185 -15651 -140158 -207759 -132557 -99235 -201448 -282002 -246778
34131 -246778 -218434 -257020 -227344 -71509 58401 56241 -1501 -66808 -208421 -397792 -465777
34120 -465777 -370924 -272319 -258940 -249341 -217882 -250374 -305902 -208962 28474 156248 61378
34109 61378 -77262 -117610 -160071 -291676 -391306 -352720 -274710 -267706 -269696 -207425 -161728 -222305
34097 -222305 -324395 -357085 -311914 -235963 -161725 -143077 -224358 -329406 -326328 -231472 -190506
34086 -190506 -238716 -259334 -203419 -160934 -177986 -189213 -169675 -176035 -205704 -189740 -145959 -161146
34074 -161146 -211491 -189046 -112434 -111524 -194104 -235158 -211738 -235273 -325338 -360152 -286671 -188930
34062 -188930 -122288 -61739 -24965 -62916 -127517 -129962 -111292 -164814 -230237 -184520 -94995 -134691
34050 -134691 -272499 -307928 -203795 -120208 -116826 -89872 -21145 -23485 -106977 -149945 -131576
34039 -131576 -151285 -197902 -151725 -41094 -39218 -164340 -230072 -144711 -31222 -800 -19226
34028 -19226 -39813 -74891 -108711 -112271 -133351 -200447 -198018 -43995 94590 16157 -169593
34017 -169593 -197982 -76405 -34776 -104419 -96308 17285 55093 -20751 -44905 23798 40573
34006 40573 -19744 -12499 77448 95499 19981 529 55189 39116 -43458 -14750 134704 196031
33994 196031 100723 24142 62283 105683 105579 164018 277361 283877 159465 89829 156200 211213
33982 211213 158085 103973 142343 206466 223039 218133 216263 208852 238107 341952 439936 447130
33970 447130 434322 492476 559891 595337 732968 972482 938047 356438 -393793 -679726
33960 -679726 -453203 -210984 -202716 -213562 -121216 -109801 -236861 -282798 -164644 -78682 -114908
33949 -114908 -115283 -11688 60654 60965 101740 164334 107735 -19130 -33468 21462 -46239 -168008
33937 -168008 -97919 121235 210155 147707 164808 272783 268937 188831 265488 455068 495981
33926 495981 415186 471058 632324 642763 555209 646583 858253 898760 832325 960367 1211491
33915 1211491 1288725 1295766 1530746 1838496 1929932 2086732 2647350 3139140 3075244 3217399
33905 3217399 4425977 5387929 3559884 -1068004 -5141560 -5945134 -4539573 -3600755 -3716684
33896 -3716684 -3606624 -2869469 -2416441 -2576426 -2624875 -2226959 -1896641 -1890383 -1835415 -1604159
33886 -1604159 -1541628 -1684586 -1642345 -1368122 -1251817 -1363313 -1347073 -1133975 -1052921 -1172328
33876 -1172328 -1192189 -1046324 -992581 -1065886 -1031618 -902723 -930068 -1072058 -1037305 -854382
33866 -854382 -841902 -1012215 -1054113 -911192 -838691 -881708 -828180 -688213 -696889 -827073 -811144
33855 -811144 -660598 -655533 -798120 -786582 -574503 -460927 -561030 -652430 -617703 -602380 -661396
33844 -661396 -656602 -573770 -567208 -640116 -629382 -529101 -492911 -523377 -494238 -445160 -508956 -600620
33832 -600620 -538010 -405959 -428584 -555205 -561702 -482239 -528986 -656402 -633721 -492607 -470400
33821 -470400 -557925 -540546 -444841 -496833 -664329 -689842 -563885 -521177 -578663 -529905 -397738
33810 -397738 -429676 -617964 -679127 -554894 -492418 -573946 -600929 -511035 -486730 -571120 -581451
33799 -581451 -485772 -474287 -576223 -589392 -472835 -433559 -536400 -591621 -516586 -455940 -461250
33788 -461250 -401643 -274399 -257130 -365949 -401012 -315043 -297807 -407891 -459807 -377627 -332676
33777 -332676 -417258 -489105 -453841 -413083 -421215 -369187 -221989 -122408 -155619 -229608 -262116
33766 -262116 -278912 -286099 -254252 -242040 -318202 -377335 -274455 -109772 -108384 -250470 -317898
33755 -317898 -280449 -310800 -421392 -429169 -312201 -267505 -357844 -414206 -356261 -315462 -366936
33744 -366936 -411057 -391198 -379066 -387532 -334134 -229610 -177898 -174391 -130226 -86174 -158789 -293774
33732 -293774 -330176 -286017 -313229 -398673 -392912 -309078 -298659 -350785 -316126 -214500 -214040 -313776
33720 -313776 -350209 -309381 -327398 -394591 -372142 -289660 -305692 -384526 -343361 -214019 -215068
33709 -215068 -357888 -426185 -364424 -339937 -393079 -375569 -277123 -268520 -368078 -398880 -329478
33698 -329478 -325725 -409266 -397761 -252157 -160940 -206348 -254537 -242441 -267376 -329069 -291562
33687 -291562 -170512 -155666 -275617 -333931 -248300 -165819 -174263 -181404 -146585 -157465 -216072
33676 -216072 -213649 -166113 -212006 -340808 -386060 -312283 -246115 -218289 -149824 -84514 -140510
33665 -140510 -243994 -218468 -118595 -150595 -288821 -324064 -266389 -312390 -420175 -337012 -80948
33654 -80948 34520 -75190 -139452 -25767 56330 -28069 -113228 -74663 -37022 -86648 -109679
33643 -109679 -62448 -85100 -207152 -247451 -139963 -61565 -111616 -155830 -104933 -61866 -83427
33632 -83427 -76473 -27259 -55412 -159319 -189331 -135864 -149349 -228291 -208034 -102386 -108129 -216929
33620 -216929 -194704 -21103 35800 -116756 -240869 -193043 -126833 -142117 -108405 15454 50204
33609 50204 -59494 -119127 -53668 -54026 -200584 -289860 -201867 -103246 -120930 -144147 -107690 -136164
33597 -136164 -247910 -253973 -111956 -39436 -118236 -143441 -34868 -23001 -222230 -387002 -325028
33586 -325028 -210159 -241461 -313492 -274484 -211708 -231018 -229409 -123425 -42941 -82742 -121824
33575 -121824 -83745 -96865 -202939 -208008 -37024 66949 -69457 -258627 -292182 -279801 -380272
33564 -380272 -468673 -366013 -172957 -88648 -90805 -60881 -48322 -152161 -287957 -305098 -215550
33553 -215550 -124297 -60193 -21815 -45480 -102148 -84521 3036 21225 -59138 -101041 -62053
33542 -62053 -65910 -134948 -123622 -14286 8553 -109081 -178435 -110293 -68519 -150255 -219117
33531 -219117 -196858 -208825 -291977 -280410 -140915 -92015 -213548 -272499 -131133 5505 -38954
33520 -38954 -121162 -84965 -42723 -111090 -165667 -101227 -52819 -123830 -174387 -107865 -81824 -202869
33508 -202869 -299110 -230319 -136197 -142472 -119571 19495 86844 -45872 -174117 -99291 40445
33497 40445 55522 37858 118444 170214 60379 -59333 -24261 28056 -75746 -204121 -164605
33486 -164605 -61369 -85215 -157695 -110939 -27402 -71146 -153116 -89825 50645 69079 -25836
33475 -25836 -80086 -75773 -93982 -115032 -84305 -51430 -46936 22102 166377 200703 41438 -96463
33463 -96463 -28214 92741 44515 -99496 -147217 -130340 -184380 -255119 -207364 -87806 -23724
33452 -23724 6362 68540 86637 -11765 -109190 -79079 -6208 -19899 -66520 -52604 -44379 -113382
33440 -113382 -152658 -59578 61561 81243 60378 91456 104583 28088 -38624 -4080 47082
33429 47082 41762 70335 174030 204955 88432 -8268 32206 60996 -50504 -161653 -131160
33418 -131160 -82087 -149328 -206933 -110323 20065 23980 -9448 58306 141637 120945 92565
33407 92565 161962 197568 63773 -99068 -97135 3118 41156 50970 128773 201004 174159
33396 174159 134138 166157 170664 77311 25708 111033 182467 123026 79097 167397 217301 75988
33384 75988 -86255 -61082 51553 66921 42335 91530 115676 17411 -53377 34207 116735
33373 116735 26732 -82814 -13289 118591 111392 39198 63284 110871 58907 11860 80802
33362 80802 117244 -13806 -132872 -43933 107052 104197 48260 128228 249659 242945 201902
33351 201902 259452 274046 108784 -30212 75766 238465 180744 30538 68204 211848
33341 211848 206847 121269 184552 310401 254035 97433 109056 241747 229535 84990 54634
33330 54634 158481 197104 146856 148994 180815 123689 74922 206954 398325 386894 212929
33319 212929 135948 189487 191611 125194 137275 218306 231431 202933 257054 335292 298105 217715
33307 217715 254054 338588 298934 192914 201412 297426 332761 334041 401825 446606 340739
33296 340739 198121 192233 244577 202783 155543 244236 345868 288758 197778 268933 392196
33285 392196 367497 296335 369101 464139 371838 224906 273699 413568 379646 241542 247392
33274 247392 335343 272926 141514 197843 368834 368487 224760 212386 336492 352519 241897
33263 241897 212257 269967 230442 115472 124136 248199 308470 315783 412928 534096 506154
33252 506154 400765 404573 448214 356567 240402 319238 478461 440586 265390 234812 342752
33241 342752 348295 244700 229968 296220 282889 244569 334116 428960 317271 138631 179796
33230 179796 352098 351204 220137 250546 422242 457351 357785 372692 487767 458944 312047
33219 312047 304890 424859 418217 289223 281255 388518 372402 243289 248731 397612 458411
33208 458411 410493 447329 561743 568040 489962 495330 521378 405224 279714 370947 526265
33197 526265 448037 267810 341069 585460 607387 405050 342846 475257 506022 401430
33187 401430 432157 590287 567611 359792 312780 503995 626651 554349 494055 520966 476319
33176 476319 380803 448696 644866 708534 636869 664800 772652 715025 525983 483565 588561
33165 588561 594187 521633 610573 794551 783155 633044 665224 846322 842985 664263 637901
33154 637901 765363 735215 577565 646680 920489 983758 773018 675617 798662 804038 598319
33143 598319 536771 768155 974831 947359 872473 887836 864888 773588 774802 844279 777446
33132 777446 629004 665112 850001 880664 738953 692309 760233 719806 611890 677838 833016
33121 833016 789466 648658 755795 1025784 1066380 912967 954081 1176123 1203067 1054487
33111 1054487 1112086 1337863 1297569 988603 871285 1031308 1082476 951904 979255 1175787
33101 1175787 1177195 1001186 1049567 1286632 1241252 912523 828547 1095751 1244929 1147730
33091 1147730 1213608 1521746 1635392 1459643 1409639 1535419 1371357 881803 664161 939877
33081 939877 1197269 1113474 1000253 1064968 1056396 920795 999926 1308643 1406777 1225068 1216775
33070 1216775 1480114 1565637 1361278 1303734 1497291 1510562 1272148 1260453 1566243 1685390
33060 1685390 1485719 1446493 1693647 1755209 1527196 1498989 1756184 1771893 1467452 1434765
33050 1434765 1798231 1931027 1646225 1571354 1946424 2154751 1893653 1723912 1973397 2153094
33040 2153094 1962435 1847333 2062069 2180328 2014245 2020958 2347384 2480470 2263592 2217519
33030 2217519 2462066 2426678 2030985 1982214 2460862 2713821 2424160 2254563 2531281 2654098
33020 2654098 2359457 2289582 2714918 2960176 2707147 2602316 2964923 3171712 2927070 2839089
33010 2839089 3139391 3178993 2790488 2746844 3258395 3475436 3110787 3027354 3553614 3815850
33000 3815850 3458544 3370646 3928109 4216749 3830594 3699345 4249139 4526332 4078104 3879328
32990 3879328 4423376 4764875 4454090 4472793 5209697 5542662 5030901 4897375 5676606 6110995
32980 6110995 5612655 5480527 6348018 6876064 6406237 6335380 7324525 7864139 7269071 7213249
32970 7213249 8479170 9249691 8622935 8555545 10090390 11130257 10453963 10261485 11945850
32961 11945850 13263204 12813768 13098060 15599717 17442752 16976046 17594467 21269613 23984260
32952 23984260 23373334 24454591 30382360 34791206 33429489 35629002 49154056 58620169
32944 58620169 38782036 -8417839 -49052390 -57063691 -43012076 -33051711 -34055088
32937 -34055088 -34330260 -28473483 -23485835 -23303853 -22993562 -19613372 -17008669 -17398881 -17409990
32928 -17409990 -15059208 -13209880 -13597634 -13725829 -12041194 -10734211 -11175283 -11368625 -10047630
32919 -10047630 -9030588 -9502377 -9783919 -8714062 -7802171 -8178791 -8503830 -7673864 -6858686
32910 -6858686 -7191213 -7848485 -7878647 -7740472 -7792335 -7341320 -6295239 -5775603 -6124221 -6214246
32900 -6214246 -5558773 -5159904 -5489479 -5595517 -5024746 -4710161 -5110783 -5313051 -4816783
32891 -4816783 -4446512 -4672399 -4740511 -4275712 -4074946 -4495583 -4675363 -4172661 -3821682 -4140186
32881 -4140186 -4394929 -4069501 -3804754 -4050547 -4177311 -3763955 -3447055 -3665681 -3818897
32872 -3818897 -3473772 -3204993 -3445837 -3656873 -3404238 -3164671 -3324334 -3440450 -3200191
32863 -3200191 -3072411 -3326209 -3425941 -3068643 -2815069 -3031594 -3201700 -2952067 -2779589 -3068767
32853 -3068767 -3323912 -3082774 -2726534 -2703066 -2763804 -2617240 -2550972 -2780294 -2926997 -2728959
32843 -2728959 -2549198 -2654996 -2717709 -2517989 -2405814 -2587769 -2705723 -2571055 -2545134 -2754349
32833 -2754349 -2738097 -2337329 -2106770 -2351895 -2577504 -2406042 -2222271 -2360767 -2463886 -2230896
32823 -2230896 -2028037 -2149121 -2212973 -1915754 -1672903 -1877534 -2183055 -2155221 -2013862 -2105059
32813 -2105059 -2232097 -2129512 -2040032 -2210392 -2339253 -2118075 -1828694 -1841282 -1989845 -1975693
32803 -1975693 -1922010 -2014306 -2051595 -1856056 -1687244 -1782803 -1929019 -1914014 -1928651 -2091195
32793 -2091195 -2086237 -1739207 -1448961 -1566504 -1816933 -1812759 -1674576 -1667223 -1680908 -1558883 -1502031
32782 -1502031 -1667842 -1782750 -1609470 -1387442 -1376565 -1397187 -1259597 -1200434 -1431610 -1691625
32772 -1691625 -1706151 -1658399 -1740377 -1697569 -1331151 -1015362 -1164265 -1562360 -1761498 -1780949
32762 -1780949 -1868894 -1912906 -1669500 -1316951 -1226154 -1379297 -1495030 -1531062 -1619045 -1701055
32752 -1701055 -1649870 -1562134 -1562942 -1531044 -1358284 -1234175 -1332767 -1484296 -1496641 -1508945 -1668507
32741 -1668507 -1766021 -1586781 -1337542 -1317821 -1427209 -1396582 -1259865 -1205932 -1201595 -1141719 -1137318
32730 -1137318 -1284250 -1385725 -1270586 -1140058 -1228253 -1373191 -1313978 -1166739 -1195036 -1327592
32720 -1327592 -1320980 -1214931 -1219534 -1306054 -1291022 -1189492 -1138667 -1111239 -1025894 -988594 -1111125
32709 -1111125 -1248607 -1220361 -1126177 -1148316 -1217683 -1178626 -1108349 -1164666 -1278573 -1294269 -1259381
32698 -1259381 -1296703 -1345661 -1298194 -1230832 -1250554 -1279334 -1226015 -1182539 -1221824 -1214703 -1081857
32687 -1081857 -995856 -1086382 -1186515 -1130130 -1051945 -1120926 -1228916 -1227439 -1217018 -1304309 -1332088
32676 -1332088 -1168856 -1015092 -1087576 -1237154 -1221269 -1124947 -1154870 -1232226 -1164279 -1036566
32666 -1036566 -1061460 -1185024 -1193264 -1080213 -995134 -957529 -918430 -957547 -1129851 -1265233 -1201066
32655 -1201066 -1063897 -1056865 -1131826 -1129158 -1065689 -1029382 -971149 -842979 -747583 -732590 -669568
32644 -669568 -545605 -582837 -834510 -998574 -901862 -795808 -863388 -857199 -608239 -431461
32634 -431461 -543196 -559222 -205240 -86218 -930594 -2317462 -3030765 -2637952 -1905863 -1583944
32624 -1583944 -1561832 -1445659 -1263544 -1228906 -1292949 -1296109 -1248495 -1201756 -1102438 -954981 -886185
32613 -886185 -913773 -892142 -788937 -764996 -885990 -1002604 -1010097 -993080 -1025673 -1046903 -1015855
32602 -1015855 -994005 -1008171 -1005530 -978292 -965818 -933932 -831198 -741381 -782274 -886423 -895015
32591 -895015 -828813 -835008 -906907 -910040 -860111 -908551 -1052569 -1117408 -1043118 -951780 -915753 -885118
32579 -885118 -854123 -878826 -921591 -887947 -815876 -825202 -897716 -916708 -893585 -931531 -997472 -969024
32567 -969024 -882756 -889345 -977438 -991962 -922792 -925694 -1044578 -1147517 -1154617 -1114698 -1054552 -963450
32555 -963450 -915599 -993208 -1107350 -1108568 -1034148 -1015901 -1006302 -872720 -712899 -758148 -970254
32544 -970254 -1063024 -955268 -876036 -955934 -1035351 -983091 -908710 -922874 -944992 -895473 -857242
32533 -857242 -901517 -945921 -922072 -910793 -979394 -1038152 -984828 -863005 -767570 -708182 -661340
32522 -661340 -651484 -692140 -732674 -731740 -712830 -708419 -720177 -749751 -793308 -809906 -776593 -750064
32510 -750064 -780606 -807813 -754192 -671106 -660093 -700443 -700617 -671769 -692734 -745850 -750676 -723453
32498 -723453 -741166 -786142 -787805 -773158 -810307 -856793 -838438 -815772 -882063 -963200 -929126 -840405
32486 -840405 -853134 -930518 -896879 -746826 -647213 -645345 -627853 -568291 -562339 -603370 -571407 -472480
32474 -472480 -454286 -553647 -648385 -678232 -693602 -680852 -577039 -466068 -508240 -655903 -696878
32463 -696878 -605787 -580945 -689906 -760791 -700351 -647715 -709902 -787788 -773817 -709416 -650238
32452 -650238 -572952 -495722 -501479 -579444 -625651 -627456 -646470 -622648 -443844 -209662 -143021
32441 -143021 -228237 -243886 -164164 -171974 -246864 -153192 92263 205508 208232 469972 922702
32430 922702 811340 -302505 -1728646 -2404812 -2180841 -1782796 -1701973 -1744896 -1643873 -1499893
32420 -1499893 -1468816 -1464603 -1381384 -1300702 -1304948 -1321910 -1290318 -1275136 -1304489 -1280350 -1160829
32409 -1160829 -1063396 -1079446 -1131460 -1116672 -1065340 -1054856 -1072580 -1063675 -1036231 -1031379 -1045653 -1050696
32397 -1050696 -1043548 -1026143 -979543 -904783 -853034 -872442 -943736 -995013 -972044 -889171 -821346
32386 -821346 -836739 -921236 -985329 -962586 -878513 -805857 -786263 -818840 -884743 -948883 -971955
32375 -971955 -952503 -926708 -910115 -886039 -864584 -883084 -919295 -886102 -764116 -662347 -680785
32364 -680785 -779526 -854276 -876454 -878390 -859774 -804820 -755147 -772296 -843616 -897066 -891706 -835179
32352 -835179 -743150 -646908 -609752 -664642 -756611 -807124 -808178 -796250 -775096 -736841 -719949 -761521
32340 -761521 -821608 -840956 -843086 -878896 -895931 -791092 -603634 -521794 -640728 -821201 -870756
32329 -870756 -788266 -731215 -783095 -859641 -850269 -765383 -703685 -722153 -784798 -822446 -804695 -753035
32317 -753035 -712125 -717841 -771872 -830124 -829490 -749872 -648897 -613343 -668242 -750984 -787756 -779827
32305 -779827 -789417 -843448 -886472 -854266 -771586 -730869 -771041 -827877 -829907 -794503 -781610 -793777
32293 -793777 -790788 -778549 -800487 -843201 -835999 -761425 -689222 -675876 -700644 -723304 -730828 -705072
32281 -705072 -630066 -560604 -587801 -696564 -761764 -736493 -724765 -794443 -849736 -799864 -729846
32270 -729846 -757798 -824006 -791226 -681974 -634681 -668924 -680289 -648939 -665414 -740675 -769278
32259 -769278 -711163 -647060 -617322 -566027 -493424 -504244 -632532 -759242 -783817 -751313 -729216
32248 -729216 -686950 -598334 -546989 -606067 -696703 -690584 -596248 -527912 -531941 -557806 -576035 -612487
32236 -612487 -664166 -677968 -635042 -583842 -561188 -536586 -472303 -402299 -404108 -496053 -601323
32225 -601323 -636119 -612097 -613537 -675417 -732784 -713024 -633160 -566391 -546439 -550180 -549617 -537109
32213 -537109 -519753 -524921 -583584 -673971 -720865 -690425 -638881 -624475 -633176 -646498 -702309 -802137
32201 -802137 -838660 -734200 -589959 -562303 -634926 -661750 -607504 -580619 -626852 -661636 -643438
32190 -643438 -654680 -744553 -825288 -805941 -727370 -687028 -710258 -762863 -820513 -862377 -851455
32179 -851455 -775944 -675407 -601030 -583051 -628030 -691151 -677481 -559548 -468556 -551768 -750675
32168 -750675 -857074 -794920 -695174 -665508 -653765 -602350 -573437 -620575 -672851 -661076 -646149
32157 -646149 -703525 -776295 -767059 -699478 -664674 -664528 -628662 -550616 -499694 -517032 -581770 -657443
32145 -657443 -706791 -695926 -645543 -633794 -686486 -719370 -661312 -574873 -563882 -609959 -605927 -528025
32133 -528025 -472490 -518749 -636227 -735907 -754994 -687403 -581567 -511709 -513431 -549712 -564848
32122 -564848 -552256 -541199 -544765 -555880 -568604 -571583 -551573 -534470 -581406 -700921 -804287
32111 -804287 -801531 -714654 -644100 -643708 -678571 -692348 -667954 -622998 -581017 -555037 -547117 -561495
32099 -561495 -607016 -667623 -691431 -653338 -611345 -638037 -706003 -719397 -659150 -604942 -601314 -608267
32087 -608267 -613553 -672239 -774323 -795607 -676249 -545101 -549235 -640611 -662702 -589776 -536621
32076 -536621 -559936 -596907 -606440 -636297 -713188 -773060 -752572 -677384 -614711 -589862 -582375 -564193
32064 -564193 -522115 -477452 -484377 -562578 -639564 -626717 -552812 -537331 -609376 -646995 -552203 -403751
32052 -403751 -350588 -410113 -474877 -489797 -502781 -528725 -489364 -354805 -246943 -296627 -450156
32041 -450156 -533702 -493803 -454429 -518598 -632751 -701713 -732483 -777308 -812392 -779273 -702954
32030 -702954 -664093 -673482 -669782 -633396 -610948 -624035 -639196 -639142 -645533 -656635 -635642 -578791 -528989
32017 -528989 -506858 -492432 -485847 -515823 -573451 -609572 -614783 -627320 -643427 -605448 -512180 -454124
32005 -454124 -486663 -542812 -534514 -480254 -464218 -513206 -582723 -638594 -689004 -741597 -773251 -749314
31993 -749314 -660858 -548748 -484388 -500686 -551880 -579495 -600646 -670800 -770823 -812161 -763784
31982 -763784 -692621 -658309 -650183 -654289 -691972 -748125 -748463 -666985 -579981 -551015 -537015 -481832
31970 -481832 -431413 -461542 -539910 -562785 -509896 -469475 -505860 -578062 -608608 -581610 -549294
31959 -549294 -565786 -627652 -675499 -660856 -608039 -582493 -598487 -603074 -562014 -506609 -471118 -443397
31947 -443397 -418027 -439584 -531509 -623698 -623449 -542127 -485177 -515314 -581524 -598751 -555058 -509705
31935 -509705 -503437 -506714 -471982 -416678 -415747 -503882 -624113 -696142 -697473 -648469 -567637 -490167
31923 -490167 -477353 -537299 -581749 -542010 -481125 -494643 -549779 -549046 -515212 -554919 -645620 -634858
31911 -634858 -486226 -356827 -367019 -449302 -503856 -550353 -622370 -651480 -582843 -495824 -485543
31900 -485543 -519750 -529432 -541148 -591575 -608473 -522122 -413115 -397508 -437351 -425888 -395315
31889 -395315 -457473 -578804 -610420 -536969 -503246 -568287 -616241 -565545 -499803 -510186 -547372
31878 -547372 -525890 -466517 -437081 -437303 -437867 -464386 -544334 -619118 -606520 -527246 -483643 -517813
31866 -517813 -562717 -543312 -470304 -412969 -414929 -461493 -513151 -546214 -557681 -548266 -521212 -496420
31854 -496420 -500263 -528368 -540161 -509530 -463418 -451035 -491482 -566812 -641755 -673432 -638515 -579971
31842 -579971 -584840 -671562 -740865 -699234 -596894 -566122 -639897 -717733 -715264 -661506 -622471 -606808
31830 -606808 -592927 -589549 -611679 -630940 -602697 -527014 -446034 -396005 -390801 -431198 -494342 -531973
31818 -531973 -521442 -509198 -557601 -647985 -686875 -626084 -530127 -490817 -512762 -531248 -518063
31807 -518063 -508208 -526765 -554391 -579090 -618407 -660109 -641863 -538766 -422802 -378229 -396234
31796 -396234 -414141 -421685 -452797 -496871 -504106 -474022 -457364 -466815 -465849 -454698 -481416 -544166
31784 -544166 -566683 -510079 -436262 -414253 -426701 -419766 -391732 -377756 -387219 -406307 -432548 -467050
31772 -467050 -500263 -534291 -585052 -637417 -641416 -582546 -510554 -467512 -438450 -410495 -421953 -494957
31760 -494957 -567391 -562375 -497547 -455794 -461983 -459626 -415829 -384062 -427842 -518416 -557378 -504662
31748 -504662 -442110 -469776 -559106 -579645 -489300 -412797 -466837 -584038 -612819 -536072 -461945
31737 -461945 -431736 -390854 -347519 -387607 -491791 -509283 -391098 -291814 -335874 -429403 -435155
31726 -435155 -401645 -453179 -551971 -558246 -473866 -438831 -499560 -553842 -538240 -511464 -517623 -509199
31714 -509199 -458838 -425794 -445791 -455825 -401786 -339796 -350801 -413054 -441291 -418046 -408057 -452319
31702 -452319 -513311 -534931 -510438 -471922 -441857 -419659 -403524 -400251 -411261 -428777 -453211 -492926
31690 -492926 -532254 -525525 -452469 -361085 -321987 -356189 -439025 -542432 -621371 -599135 -455163
31679 -455163 -308565 -305273 -412505 -440168 -301377 -135616 -110369 -207731 -296485 -326669 -342393
31668 -342393 -360480 -354737 -338880 -361106 -413744 -429325 -381272 -331741 -358611 -460645 -545745
31657 -545745 -516905 -389289 -308832 -401097 -603148 -719412 -658429 -528354 -469403 -489744 -518877
31646 -518877 -525565 -509492 -460689 -406330 -420483 -508443 -561869 -513585 -449318 -464610 -500920 -451589
31634 -451589 -354757 -331098 -377792 -381576 -318186 -287504 -344300 -429835 -491137 -546600 -603913 -619734
31622 -619734 -578462 -526403 -496458 -470388 -437267 -421021 -430264 -441297 -446319 -466741 -511070 -562355
31610 -562355 -600676 -600540 -536192 -438240 -398859 -454349 -516556 -504298 -478488 -532096 -605998 -566815
31598 -566815 -438732 -386801 -461260 -530675 -510215 -488359 -548559 -612363 -569624 -455658 -380044
31587 -380044 -354439 -310948 -249816 -255203 -365423 -506620 -570016 -516019 -401127 -326694 -353876
31576 -353876 -452116 -538475 -565958 -551338 -527178 -509936 -513211 -541075 -561107 -534147 -479617 -460192
31564 -460192 -491940 -523247 -513956 -478165 -434483 -376714 -317335 -297899 -323690 -343603 -329068 -317480
31552 -317480 -337328 -347465 -308152 -268398 -311088 -427932 -516811 -510802 -456162 -439106 -473946
31541 -473946 -503303 -493888 -480674 -495565 -498297 -436350 -355251 -368539 -495712 -607177 -583124
31530 -583124 -466020 -387808 -396268 -437274 -474113 -523950 -579521 -589632 -539582 -479023 -446366
31519 -446366 -425916 -401054 -390863 -406410 -422244 -422972 -435916 -483055 -530815 -522824 -452044 -380439
31507 -380439 -386866 -490838 -618337 -659804 -584642 -479744 -445198 -476853 -498064 -485587 -495128
31496 -495128 -555964 -608873 -586473 -514001 -482310 -529375 -586781 -560562 -448562 -347895 -339168
31485 -339168 -398307 -453187 -489555 -538523 -583350 -568377 -505502 -475179 -494917 -486687 -419962 -380766
31473 -380766 -425954 -470163 -418312 -328231 -323653 -404277 -466531 -475696 -492130 -541070 -571984 -549594
31461 -549594 -489958 -406188 -305242 -234574 -245425 -310031 -353567 -361530 -375935 -396558 -376517
31450 -376517 -316626 -276971 -284694 -305778 -317506 -339877 -384915 -432104 -459422 -456474 -421446 -385908
31438 -385908 -406448 -479213 -512273 -450481 -370747 -369457 -416903 -427209 -412658 -441658 -489683 -474755
31426 -474755 -416052 -411873 -468754 -495538 -469512 -467489 -518507 -559829 -557956 -546327 -526274 -459203
31414 -459203 -375983 -363155 -416483 -437873 -402232 -392299 -436702 -453251 -398235 -339140 -327576 -324489
31402 -324489 -301727 -295551 -310972 -297451 -266926 -302763 -396947 -419986 -324207 -238400 -273972 -366067
31390 -366067 -402195 -388763 -387608 -395059 -387924 -393137 -414175 -384851 -293222 -249953 -325965 -421655
31378 -421655 -419078 -374000 -419829 -549392 -635536 -627746 -593372 -582100 -568998 -532078 -492506 -472000
31366 -472000 -474708 -503235 -541806 -546575 -501609 -455092 -454823 -482456 -492009 -472771 -440320 -415240
31354 -415240 -435540 -518827 -584887 -512267 -319651 -183756 -207479 -281659 -268796 -210060 -223776
31343 -223776 -293211 -308762 -264821 -259488 -320462 -370533 -364035 -338318 -325555 -318439 -329689 -390026
31331 -390026 -477247 -530409 -541092 -554681 -579553 -572129 -517929 -456024 -415801 -394680 -402445 -459848
31319 -459848 -540948 -577825 -541920 -475527 -429720 -411766 -406358 -412505 -439090 -479520 -504361 -484610
31307 -484610 -430752 -397029 -418624 -456803 -452420 -422407 -434764 -488463 -504784 -455684 -406203 -396047
31295 -396047 -379801 -334201 -318995 -361030 -380334 -319814 -254957 -274783 -339834 -367899 -378998
31284 -378998 -430611 -480038 -450318 -381143 -371623 -410492 -407496 -366585 -376602 -438670 -454861 -399564
31272 -399564 -358052 -372266 -387722 -386842 -434585 -535408 -573419 -473999 -326725 -267813 -316453
31261 -316453 -398967 -466415 -513618 -533364 -522246 -500228 -476340 -430077 -364166 -330368 -359806
31250 -359806 -410049 -424493 -403906 -377453 -346896 -309943 -299629 -341323 -395647 -401353 -360038 -326699
31238 -326699 -328422 -345864 -370194 -420137 -489184 -526277 -498014 -437345 -398798 -387820 -371167 -345672
$$ [...]
##END NTUPLES=NMR SPECTRUM
##END=
