##TITLE=31Pdec_LR-743-R2-C1
 CDCl3, 24 sc
 14.1.2022
##JCAMPDX= 6.0         $$ Bruker NMR JCAMP-DX V2.0
##DATA TYPE= NMR SPECTRUM
##DATA CLASS= NTUPLES
##ORIGIN= UXNMR, Bruker Analytische Messtechnik GmbH
##OWNER= root
$$ XWIN-NMR		Version 3.5
$$ Fri Jan 14 15:26:58 2022 Russian Standard Time (UT+4h)  she@DPX200
##.OBSERVE FREQUENCY= 81.013821
##.OBSERVE NUCLEUS= ^31P
##.ACQUISITION MODE= SIMULTANEOUS
##.ACQUISITION SCHEME= undefined
##.AVERAGES= 24
##.DIGITISER RES= 16
##SPECTROMETER/DATA SYSTEM= spect
##.PULSE SEQUENCE= zgpg30
##.SOLVENT NAME= CDCl3
##.SHIFT REFERENCE= (INTERNAL, CDCl3, 0, 248.564)
##AUDIT TRAIL= $$ (NUMBER, WHEN, WHO, WHERE, WHAT)
$$ ##TITLE= Audit trail, XWIN-NMR		Version 3.5
$$ ##JCAMPDX= 5.01
$$ ##ORIGIN= Bruker BioSpin GmbH
$$ ##OWNER= she
$$ F:/spectra/data/she/nmr/P31/1/pdata/1/auditp.txt
$$ ##AUDIT TRAIL=  $$ (NUMBER, WHEN, WHO, WHERE, WHAT)
(   1,<2022-01-14 15:25:52.21 +0400>,<she>,<DPX200>,
      <created by zg, POWCHK disabled, PULCHK disabled
       configuration hash MD5:
       00 E9 B6 7A A2 85 ED C7 34 08 36 98 17 FE 4E 26
       data hash MD5: 32K
       81 48 EC 77 2B 81 4B 04 6B 0A 05 48 00 C8 57 BC>)
(   2,<2022-01-14 15:25:55.40 +0400>,<she>,<DPX200>,
      <Start of raw data processing
       efp BC_mod = 2 LB = 1 FT_mod = 6 PKNL = 1 PHC0 = -9359.854 PHC1 = 90.87372 SI = 64K 
       data hash MD5: 64K
       DF 19 FB 83 B2 F6 29 87 FC 2C 0D E2 A8 11 D2 1D>)
(   3,<2022-01-14 15:26:13.87 +0400>,<she>,<DPX200>,
      <pk PHC0 = 21.7241 PHC1 = -2 
       data hash MD5: 64K
       0A 68 C2 0F 66 CB 5D 8E D3 B0 71 89 F4 A6 54 81>)
(   4,<2022-01-14 15:26:16.95 +0400>,<she>,<DPX200>,
      <abs ABSG = 5 
       data hash MD5: 64K
       F0 48 FB 62 F5 BA E5 78 44 3D 7C C5 27 AA 7A 76>)
$$ ##END=
$$ 
$$ hash MD5
$$ 74 91 58 64 3F B2 C2 B4 11 7D 53 EC 14 AC 9B 86
##$RELAX= 
##$RELAX= 
##$RELAX= 
##$RELAX= 
##$RELAX= 
##$RELAX= 
##$RELAX= 
##$RELAX= 
$$ Bruker specific parameters
$$ --------------------------
##$DU= <F:/spectra>
##$EXPNO= 1
##$NAME= <P31>
##$PROCNO= 1
##$TYPE= <nmr>
##$USER= <she>
##$AMP= (0..31)
100 100 100 100 100 100 100 100 100 100 100 100 100 100 100 100 100 100 
100 100 100 100 100 100 100 100 100 100 100 100 100 100 
##$AQSEQ= 0
##$AQ_mod= 1
##$AUNM= <au_zg>
##$AUTOPOS= <>
##$BF1= 81.014009
##$BF2= 200.13
##$BF3= 200.13
##$BF4= 200.13
##$BF5= 200.13
##$BF6= 200.13
##$BF7= 200.13
##$BF8= 200.13
##$BYTORDA= 1
##$CFDGTYP= 0
##$CFRGTYP= 5
##$CHEMSTR= <none>
##$CNST= (0..31)
1 1 145 1 1 1 1 1 1 1 1 1 1 1 1 1 1 1 1 1 1 1 1 1 1 1 1 1 1 1 1 1 
##$CPDPRG= <waltz16>
##$CPDPRG1= <>
##$CPDPRG2= <waltz16>
##$CPDPRG3= <>
##$CPDPRG4= <mlev>
##$CPDPRG5= <mlev>
##$CPDPRG6= <mlev>
##$CPDPRG7= <mlev>
##$CPDPRG8= <mlev>
##$CPDPRGB= <>
##$CPDPRGT= <>
##$D= (0..31)
0 1 0 0 0 0 0 0 0 0 0 0.03 2e-05 3e-06 0 0 0 0 0 0 0 0 0 0 0 0 0 0 0 0 
0 0 
##$DATE= 1642159551
##$DBL= (0..7)
120 120 120 11 120 120 24 19 
##$DBP= (0..7)
150 150 150 150 150 150 150 150 
##$DBP07= 0
##$DBPNAM0= <>
##$DBPNAM1= <>
##$DBPNAM2= <>
$$ [...]
##$SUBNAM3= <"">
##$SUBNAM4= <"">
##$SUBNAM5= <"">
##$SUBNAM6= <"">
##$SUBNAM7= <"">
##$SUBNAM8= <"">
##$SUBNAM9= <"">
##$SW= 501.771253377433
##$SWIBOX= (0..15)
0 1 3 0 0 0 0 0 0 0 0 0 0 0 0 0 
##$SW_h= 40650.406504065
##$TD= 32768
##$TD0= 1
##$TE= 0
##$TE2= 300
##$TE3= 300
##$TEG= 300
##$TL= (0..7)
0 120 53 12 22 120 120 120 
##$TP= (0..7)
150 150 150 150 150 150 150 150 
##$TP07= 0
##$TPNAME0= <>
##$TPNAME1= <>
##$TPNAME2= <>
##$TPNAME3= <>
##$TPNAME4= <>
##$TPNAME5= <>
##$TPNAME6= <>
##$TPNAME7= <>
##$TPOAL= (0..7)
0.5 0.5 0.5 0.5 0.5 0.5 0.5 0.5 
##$TPOFFS= (0..7)
0 0 0 0 0 0 0 0 
##$TUNHIN= 0
##$TUNHOUT= 0
##$TUNXOUT= 0
##$USERA1= <user>
##$USERA2= <user>
##$USERA3= <user>
##$USERA4= <user>
##$USERA5= <user>
##$V9= 5
##$VALIST= <valist>
##$VCLIST= <CCCCCCCCCCCCCCC>
##$VD= 0
##$VDLIST= <DDDDDDDDDDDDDDD>
##$VPLIST= <PPPPPPPPPPPPPPP>
##$VTLIST= <TTTTTTTTTTTTTTT>
##$WBST= 1024
##$WBSW= 4
##$XGAIN= (0..3)
0 0 0 0 
##$XL= 0
##$YL= 0
##$YMAX_a= 2077
##$YMIN_a= -1795
##$ZGOPTNS= <>
##$ZL1= 120
##$ZL2= 120
##$ZL3= 120
##$ZL4= 120
##$ABSF1= 248.5645
##$ABSF2= -253.2056
##$ABSG= 5
##$ABSL= 3
##$ALPHA= 0
##$AQORDER= 0
##$ASSFAC= 0
##$ASSFACI= 0
##$ASSFACX= 0
##$ASSWID= 0
##$AUNMP= <proc_1d>
##$AZFE= 0.1
##$AZFW= 0.5
##$BCFW= 0
##$BC_mod= 2
##$BYTORDP= 0
##$COROFFS= 0
##$CY= -3
##$DATMOD= 1
##$DC= 0
##$DFILT= <>
##$DTYPP= 0
##$F1P= 0
##$F2P= 0
##$FCOR= 1
##$FTSIZE= 65536
##$FT_mod= 6
##$GAMMA= 0
##$GB= 0
##$INTBC= 1
##$INTSCL= 5.30512e-09
##$ISEN= 30
##$LB= 1
##$LEV0= 0
##$LPBIN= 0
##$MAXI= 10000
##$MC2= 0
##$MEAN= 0
##$ME_mod= 0
##$MI= 50
##$NCOEF= 0
##$NC_proc= -6
##$NLEV= 6
##$NOISF1= 182.463
##$NOISF2= 159.3651
##$NSP= 0
##$NTH_PI= 0
##$NZP= 0
##$OFFSET= 248.5645
##$PC= 4
##$PHC0= -9338.13
##$PHC1= 88.87372
##$PH_mod= 1
##$PKNL= yes
##$PPARMOD= 0
##$PSCAL= 0
##$PSIGN= 0
##$REVERSE= no
##$SF= 81.014009
##$SI= 65536
##$SIGF1= 159.3651
##$SIGF2= -187.1042
##$SINO= 113.3802
##$SIOLD= 16384
##$SREGLST= <1H.CDCl3>
##$SSB= 0
##$STSI= 65536
##$STSR= 0
##$SW_p= 40650.406504065
##$SYMM= 0
##$S_DEV= 0
##$TDeff= 32768
##$TDoff= 0
##$TI= <>
##$TILT= no
##$TM1= 0
##$TM2= 0
##$TOPLEV= 0
##$USERP1= <user>
##$USERP2= <user>
##$USERP3= <user>
##$USERP4= <user>
##$USERP5= <user>
##$WDW= 1
##$XDIM= 65536
##$YMAX_p= 343841279
##$YMIN_p= -14521261
$$ End of Bruker specific parameters
$$ ---------------------------------
##NTUPLES= NMR SPECTRUM
##VAR_NAME=  FREQUENCY,     SPECTRUM/REAL,   SPECTRUM/IMAG
##SYMBOL=    X,             R,               I
##VAR_TYPE=  INDEPENDENT,   DEPENDENT,       DEPENDENT
##VAR_FORM=  AFFN,          ASDF,            ASDF
##VAR_DIM=   65536,         65536,           65536
##UNITS=     HZ,            ARBITRARY UNITS, ARBITRARY UNITS
##FACTOR=    0.620285442955139, 1,           1
##FIRST=     20137.2065510759, 0,            0
##LAST=      -20513.1999529892, 0,           0
##MIN=       -20513.1999529892, -14521261,   0
##MAX=       20137.2065510759, 343841279,    0
$$ Real data points
##PAGE= N=1
##DATA TABLE= (X++(R..R)), XYDATA
$$ [...]
42236 -257871 -217592 64708 264563 117381 -227656 -410855 -329000 -203568 -197233 -193422 -49453
42225 -49453 138906 203530 187540 240855 318978 235808 -1457 -160019 -124623 -45085 -65439
42214 -65439 -118865 -103047 -66725 -80610 -88774 -46021 -52206 -168970 -239675 -110726 72216
42203 72216 47104 -134151 -144204 114611 319463 168860 -194865 -378868 -222054 90024
42193 90024 304560 317507 154226 -83169 -231520 -178749 -9916 67484 -11344 -84998 -4518
42182 -4518 157901 233820 194928 134900 84638 7184 -50691 14522 155818 174609 3932
42171 3932 -168044 -168362 -86118 -97796 -167886 -121617 45951 144540 75073 -41366 -58585 16779
42159 16779 86010 76412 -36000 -207402 -301614 -206827 -14120 45240 -104888 -266019 -207379
42148 -207379 60388 311216 335055 115552 -151828 -221327 -69075 29697 -161048 -470304
42138 -470304 -518522 -278844 -135183 -285837 -422860 -228342 100175 148203 -82859 -215945
42128 -215945 -89876 58766 15965 -137216 -243760 -285379 -278017 -186029 -57396 -50784 -203209
42117 -203209 -325098 -244273 -31871 109585 72465 -109793 -317086 -381278 -215794 20754
42107 20754 50769 -142270 -239549 -23607 294584 374548 217654 98918 126315 142579 47620
42096 47620 -52158 -74678 -107240 -204841 -227424 -41157 225077 297198 103225 -135377 -178711
42085 -178711 -33934 102386 104089 44863 75380 232822 403699 443528 301989 66853
42075 66853 -68311 67063 422327 682829 568612 196356 -20754 96804 249635 90130
42065 90130 -272223 -432524 -262755 -42237 -16575 -102622 -119504 -81051 -109527 -209689 -275074
42054 -275074 -228529 -58470 190404 387018 394353 264508 219013 337705 426828 332456 209719
42043 209719 275828 441780 450811 294924 205506 256349 273015 174151 117727 211216 324525
42032 324525 319169 249221 194577 97268 -71603 -174091 -135951 -143798 -364016 -593561 -487718
42021 -487718 -86202 197664 144673 -11764 -2973 78854 13459 -122586 -61871 190074 308108
42010 308108 135177 -47518 79975 386451 460364 203171 -47859 -44812 25493 -91449
42000 -91449 -262975 -199136 8590 -23886 -345217 -537381 -347838 -78152 -90294 -241181
41990 -241181 -171415 53358 32720 -292280 -496061 -295356 51624 156539 24468 -72621
41980 -72621 -44655 -29130 -82752 -94075 -6091 86204 112843 142235 234303 296941 204709 10299
41968 10299 -82208 25321 180081 152284 -84422 -320561 -359692 -229630 -115721 -141973
41958 -141973 -267883 -362680 -325276 -150991 71237 233714 302876 313634 271614 141959
41948 141959 -27169 -81139 36251 142925 33908 -210813 -309562 -171682 -21485 -69615
41938 -69615 -230699 -288051 -218058 -193558 -311624 -465356 -499337 -385818 -210158 -57562
41928 -57562 33260 52383 23140 12668 67855 120172 27268 -225360 -422474 -333416 -19307
41917 -19307 203680 142249 -63253 -171949 -146889 -105956 -84943 -17414 106942 223665 300598
41906 300598 320586 204021 -78225 -345776 -367416 -187866 -81576 -137888 -128675 99950
41896 99950 332306 276965 1514 -164903 -100920 -30106 -163605 -396797 -460349 -273643
41886 -273643 -40291 -7325 -195285 -392808 -400262 -240051 -99672 -95455 -154364 -136125 -8995
41875 -8995 133344 193997 173275 154389 200966 268823 243645 88860 -85508 -155552 -144738
41864 -144738 -168859 -242882 -250599 -126870 20189 13427 -211419 -541859 -769939 -756752 -571298
41853 -571298 -431134 -434919 -417929 -194571 120680 224052 42176 -177808 -246594 -273981
41843 -273981 -412096 -561224 -523811 -325464 -176241 -168075 -192807 -143512 -38748 62867
41833 62867 136373 145507 30791 -199454 -417971 -463971 -276026 50183 315049 350154 149039
41822 149039 -124423 -270483 -203342 7145 201792 248596 150243 48955 83168 237737
41812 237737 377727 412217 360481 276904 196468 143363 99802 -20516 -257031 -472274 -473390
41801 -473390 -270344 -66422 24096 80866 167669 213494 180425 153418 146479 9588 -311855
41790 -311855 -588633 -571110 -325758 -124869 -98413 -175609 -273815 -340909 -286241 -90249 63603
41779 63603 -7613 -173015 -117935 191743 415160 284427 -57137 -274930 -237982 -70542
41769 -70542 59837 67009 -51914 -200057 -210296 -7109 281726 458072 461573 355407 156097
41758 156097 -170186 -524808 -656351 -439551 -83405 80763 -11529 -116598 -28432 181091
41748 181091 304513 232319 -26390 -398961 -702380 -689667 -325793 78515 198677 85537
41738 85537 25780 102572 156717 136635 171058 261030 222133 39462 -22896 166153 347442
41727 347442 237376 -58704 -227099 -182063 -98561 -123416 -252878 -407780 -465187 -310534
41717 -310534 -4374 211779 208266 127040 111436 60351 -149041 -366549 -348433 -114268 119411
41706 119411 265984 389854 482907 460585 330764 168518 -4898 -141817 -97843 142352
41696 142352 322837 262903 180849 347410 576731 477951 119214 -36778 133500 234638
41686 234638 13815 -262202 -292789 -205058 -262948 -425365 -479829 -393273 -269999 -134802
41676 -134802 10195 58913 -56866 -215242 -266944 -236723 -216979 -189758 -100941 12229 100896
41665 100896 183178 228948 129780 -81992 -167685 -7220 187657 182964 68524 52286 68819
41654 68819 -97686 -383083 -470097 -259117 -10868 60910 79513 248897 504234 605243
41644 605243 479283 293228 205216 192785 165116 135468 184225 284640 278310 68454 -238159
41633 -238159 -449900 -492323 -412958 -254744 -56121 62941 -14830 -214178 -318958 -258195
41623 -258195 -188410 -225676 -253666 -110657 155604 349290 357012 199501 -62570 -330694
41613 -330694 -427977 -225950 153026 372800 199158 -246567 -592344 -581389 -316342 -117364
41603 -117364 -156682 -307527 -373729 -346639 -325203 -283997 -107923 165890 333096 286775 141375
41592 141375 42193 -7899 -65350 -108310 -61554 108014 356801 568206 605556 449478 249581
41581 249581 132531 27057 -163088 -305007 -205078 17388 36340 -176495 -284636 -115731
41571 -115731 77588 44644 -92668 -115695 -76907 -130575 -226855 -256926 -313979 -517181 -729188
41560 -729188 -744934 -633769 -590575 -556457 -323216 39767 211669 97739 -27991 64538
41550 64538 256668 295867 135154 -46272 -56091 127310 308219 227522 -139015 -485116
41540 -485116 -502521 -243710 -7901 55380 30587 -9820 -83298 -130696 -26146 187857 291219
41529 291219 190306 45947 18067 60181 66405 59467 103501 150724 112792 13776 -49000
41518 -49000 -59956 -98824 -200461 -272853 -190247 44136 265589 319908 248875 219962 268447
41507 268447 245950 86823 -34833 47339 221184 260311 168693 151073 286119 442548
41497 442548 512916 530765 536728 504118 425046 323948 180419 -16770 -161336 -151307 -97798
41486 -97798 -203218 -429327 -516050 -363713 -156426 -38414 83530 294435 454588 398759
41476 398759 190652 16340 -49387 -25263 104800 339507 558907 619845 509014 310449
41466 310449 90663 -97269 -178372 -128444 -26502 41977 75619 98316 92882 50628 978
41455 978 -52338 -118991 -115135 72787 348371 414120 149906 -181669 -270594 -155853 -95797
41444 -95797 -163920 -205237 -136979 -59924 -61137 -93118 -89216 -68799 -90193 -173743 -266910 -239407
41432 -239407 9480 355813 480384 239192 -104144 -199889 -57161 71858 156044 397501
41422 397501 772729 930841 691462 335115 188837 179141 62404 -102352 -48820 214521
41412 214521 363906 235324 47495 45549 157978 167701 55024 -27985 -36700 -80467 -196809
41401 -196809 -266021 -215232 -161297 -229774 -322054 -228617 33041 168228 -20745 -337826 -414364
41390 -414364 -163906 146417 266831 230040 195160 195424 161713 85527 16069 -46481 -124639
41379 -124639 -167966 -111341 -15260 -30462 -213518 -461563 -622262 -596753 -379542 -102941
41369 -102941 10717 -113659 -253433 -148755 115350 209682 54433 -56413 85128 290682
41359 290682 302018 192324 199018 325258 376871 294368 192138 133965 107031 155210 292211
41348 292211 340427 128935 -177650 -234530 -1901 213624 218034 119316 15988 -155124
41338 -155124 -347603 -328931 -57795 168091 148786 74621 146281 202203 35975 -174909
41328 -174909 -134740 61066 84276 -76662 -138478 -35419 15833 -25916 65167 312952 378569
41317 378569 65106 -329724 -401608 -159872 63868 59393 -121178 -332197 -429819 -285869
41307 -285869 82529 420029 436863 120296 -260294 -454313 -442707 -352865 -264758 -162444
41297 -162444 -41519 17061 -60167 -200511 -243407 -165508 -120412 -176594 -176213 -20063 65247
41286 65247 -178534 -563894 -622267 -274128 25025 -62174 -297361 -287280 -70138 29800
41276 29800 -69260 -178507 -233142 -350627 -505378 -489786 -275283 -121294 -199666 -353096
41266 -353096 -385417 -380230 -511445 -679644 -608721 -283042 -34642 -107296 -316844 -300571 -10695
41255 -10695 227159 155143 -86191 -161456 36495 303269 409781 316454 101169 -155641
41245 -155641 -340572 -306465 -37305 258464 350284 248090 148964 147099 126749 -37737 -287774
41234 -287774 -442320 -396123 -216904 -75596 -89625 -206086 -254430 -152139 -13159 21960
41224 21960 4464 89992 261950 329557 238669 181786 291273 412686 350970 181500 101454
41213 101454 103553 62823 51630 237287 488764 462893 158491 -5482 161555 283613
41203 283613 16370 -366197 -388816 -118591 -6425 -136553 -167130 14138 123832 54962
41193 54962 82637 308429 390794 111133 -218634 -253268 -148728 -213118 -340893 -238589
41183 -238589 17947 112939 18005 -59780 -129340 -339483 -527327 -353975 86564 286563
41173 286563 53508 -228916 -215558 -53877 -19090 -71432 -37114 64931 142659 242898
41163 242898 395090 443880 276287 42873 -71637 -134316 -295102 -485245 -526607 -425545
41153 -425545 -324849 -258156 -177346 -140052 -233907 -364574 -348721 -202247 -127599 -206176 -289831
41142 -289831 -231141 -71305 43906 28220 -89767 -189738 -135006 89999 315982 338476
41132 338476 133581 -128952 -267161 -228766 -90269 16783 2973 -102054 -194920 -241733
41122 -241733 -301905 -369368 -300716 -3055 384004 611372 587078 429207 295092 246594
41112 246594 248269 216146 95735 -52750 -100107 -32641 -6605 -136744 -322308 -397847 -375573
41101 -375573 -389746 -445017 -384242 -123238 208314 404610 391053 264521 169841 156019 149810
41090 149810 84841 29657 101429 252312 276838 91276 -130672 -198593 -150291 -122477 -96939
41079 -96939 41652 260954 383759 323589 165935 23668 -50627 -23619 95744 183674
41069 183674 94808 -142565 -340362 -380352 -318500 -247472 -187351 -156547 -222704 -395096 -545241
41058 -545241 -527504 -351990 -176969 -137874 -217733 -285532 -246617 -143110 -87206 -100173 -70816
41047 -70816 92255 314859 423261 339303 163642 69287 133562 261253 270957 92164 -130575
41036 -130575 -192397 -80396 23415 -1573 -87213 -154195 -265171 -479921 -667074 -618842
41026 -618842 -322331 2638 131975 34661 -133976 -180296 -40838 165429 287592 324674
41016 324674 354717 315760 62998 -314570 -489830 -353914 -234067 -422947 -686533 -552582
41006 -552582 5232 495846 530604 240750 14485 35159 180731 244897 159783 44269
40996 44269 58379 203474 329278 359697 373093 388856 268694 -16927 -221740 -145390 47639
40985 47639 87803 20335 66997 212944 279477 292895 386895 421358 152391 -236914 -274531
40974 -274531 61554 251560 37911 -183843 -30835 279307 344716 178584 530 -222511
40964 -222511 -577483 -818374 -666303 -321442 -195613 -255548 -129720 188583 279728 5670
40954 5670 -225898 -91496 174892 200667 45637 45253 280662 502275 494615 291319 68575
40943 68575 -22243 36247 79535 -88309 -392698 -479499 -176984 179191 144620 -190734 -289675
40932 -289675 64769 438308 361750 -13918 -174765 28995 272591 306883 236397 192976
40922 192976 97807 -85149 -166214 -36670 85498 -8934 -138938 -7524 287985 383764
40912 383764 216845 84011 132525 176815 97926 52305 131064 143306 -54510 -287948 -349726
40901 -349726 -320831 -366112 -417348 -331699 -205393 -238278 -382586 -403618 -242181 -71375 -17417
40890 -17417 -41454 -82541 -115959 -77495 77907 236027 216376 18786 -175686 -254418 -271425
40879 -271425 -288201 -273242 -197888 -107907 -53801 -25878 28054 168224 399229 575258 467249
40868 467249 50675 -373157 -513665 -454436 -458135 -485652 -220059 391585 925918 961575
40858 961575 556979 92561 -187696 -293688 -284219 -173598 -19908 69477 57806 14140
40848 14140 9915 39204 48894 5429 -72418 -125311 -109514 -58520 -66214 -183771 -347240 -430489
40836 -430489 -371977 -243071 -177947 -214573 -221686 -45933 263466 473967 459649 356973 333621
40825 333621 321945 154410 -110147 -220937 -107118 2167 -89171 -269343 -304150 -177181
40815 -177181 -98259 -217707 -445368 -554460 -414962 -131951 38127 -52046 -265077 -329827
40805 -329827 -168260 20175 17367 -174916 -389248 -471530 -349628 -42787 301194 465919
40795 465919 369194 154454 7977 -39784 -51676 -28005 49151 89862 -13338 -190003 -257459
40784 -257459 -196406 -185945 -300175 -338437 -95751 298148 476238 256081 -162341 -431723
40774 -431723 -384318 -101534 228541 445797 479734 373338 237790 134173 22443 -131225
40764 -131225 -248381 -221186 -68316 89857 195223 279990 334968 287719 150126 53870
40754 53870 72875 133313 174203 256501 397889 441154 261485 7764 -63841 49537 104363
40743 104363 -30256 -215273 -272415 -198972 -97385 -32125 -20471 -59434 -110720 -135085 -151292
40732 -151292 -182156 -180241 -130463 -166298 -392025 -628756 -592106 -340766 -258034 -495521 -731360
40721 -731360 -646655 -361312 -159722 -33099 186419 406532 361409 69586 -135561 -65420
40711 -65420 116236 204932 221244 266907 324425 325567 273618 188403 46333 -127169 -204747
40700 -204747 -98047 105718 221330 148226 -49196 -198111 -152925 62612 259652 301454
40690 301454 274844 332869 423048 360432 165276 96430 270760 465440 437553 258455 148544
40679 148544 123893 38074 -95484 -75721 157232 365148 286220 -39464 -319024 -341509
40669 -341509 -188768 -104959 -194380 -297807 -203304 59099 233473 169038 18188 19928 178973
40658 178973 289249 233844 122092 114778 222503 321320 308006 204565 131314 175805 276132
40647 276132 278334 141225 4275 -25487 -58637 -248847 -497847 -542176 -348277 -204363
40637 -204363 -328137 -573166 -672721 -622972 -622167 -714145 -723077 -548612 -320483 -186110 -97965
40626 -97965 77869 335698 529710 559641 460266 317661 180329 72667 37160 112025
40616 112025 263986 370158 310291 109596 -37876 41995 279244 398449 228055 -90398
40606 -90398 -270718 -211432 -64523 534 -16379 -24590 -4447 -14863 -88283 -182801 -215247
40595 -215247 -108022 147140 419016 487047 253216 -114213 -334209 -306019 -169659 -85997
40585 -85997 -70133 -69506 -83076 -121646 -141838 -123663 -150026 -290184 -439505 -406808 -167566
40574 -167566 85149 164988 64062 -120144 -302473 -396777 -315961 -97895 58918 13312
40564 13312 -126151 -157318 -77481 -59303 -161334 -253330 -254807 -250330 -290732 -271161 -134903
40553 -134903 -23416 -42902 -29482 210810 516595 518347 183245 -74528 62745 396110
40543 396110 502232 282494 20251 -29415 83712 138019 22392 -147458 -155633 63308
40533 63308 306645 313486 94628 -78007 -43039 64699 82039 62938 95893 79352 -81348
40522 -81348 -219318 -151181 -62427 -286098 -727183 -897506 -593052 -166678 8728 -7296
40512 -7296 -10014 -45774 -209369 -302601 -78996 295151 396207 132882 -146667 -166418 -45869
40501 -45869 -23366 -105549 -145599 -114167 -122293 -224208 -319368 -272687 -95154 31696 -45847
40490 -45847 -236846 -279654 -74286 171685 219411 110157 65303 158732 249972 206083 49163
40479 49163 -92553 -71261 184058 536008 685476 503430 230702 168902 273811 291923
40469 291923 208713 241438 399672 408875 161801 -78373 -78135 46308 96784 123339 247612
40458 247612 363898 297876 134437 106284 221625 266461 158885 54684 70679 119328
40448 119328 89958 19513 -18499 -66096 -195930 -342387 -347208 -172136 36150 131591 137901
40437 137901 154522 157054 35186 -166037 -221211 -34982 181828 199387 97033 104513 224876
40426 224876 264982 177284 92962 37089 -90501 -235339 -210714 -59781 -58478 -249754 -328478
40415 -328478 -157791 -34279 -186213 -351187 -194214 129419 220262 44211 -111755 -154905
40405 -154905 -233563 -338049 -282569 -98273 -50970 -196466 -265026 -94575 123123 158625
40395 158625 52489 -33943 -67700 -99984 -127151 -120992 -93490 -58120 -21009 -35816 -149804
40384 -149804 -285904 -313948 -246069 -218897 -279718 -338467 -328045 -259914 -136231 30790 143051
40373 143051 143571 176624 404320 701962 785573 618480 416718 270352 86855 -71981
40363 -71981 19830 316490 426162 155771 -192909 -279374 -177519 -138797 -182698 -195983 -200193
40352 -200193 -227518 -133739 157229 389292 274461 -63817 -258277 -215594 -156635 -201245
40342 -201245 -227225 -138951 -1085 119165 218648 255497 177836 46897 -53848 -186293
40332 -186293 -417189 -571058 -404944 -19104 211914 163216 106643 236174 356686 230277
40322 230277 -25121 -130369 -66879 -44051 -143201 -249187 -303136 -377121 -459623 -383056 -78346
40311 -78346 242525 309760 138282 -7100 12046 29889 -136166 -353183 -315096 11934
40301 11934 298502 275921 61860 -73454 -95753 -142951 -186747 -54340 206777 290298 79859
40290 79859 -117284 14315 339128 484274 392867 350688 472422 496747 220934 -139989
40280 -139989 -255733 -154197 -116698 -205809 -212091 -67784 3307 -150364 -360068 -407190 -324654
40269 -324654 -248999 -166637 -24943 69775 20229 -24074 120097 310827 252197 -14997 -134952
40258 -134952 22676 186403 141649 38892 80124 177640 135435 -40762 -221863 -369946
40248 -369946 -476827 -446614 -247785 -58052 -60210 -194966 -285670 -287449 -233009 -71368 205158
40237 205158 374946 195357 -225771 -497197 -396320 -75576 182015 237476 115758 -75843
40227 -75843 -200231 -181874 -88119 -44682 -71371 -81118 -24905 50914 80980 41552 -45489 -111814
40215 -111814 -88217 -9540 -15847 -182486 -407133 -521142 -443688 -191225 151075 416486
40205 416486 458458 339503 267319 273881 160806 -129720 -335274 -243351 -3616 152678
40195 152678 264102 430443 494089 298926 84298 191339 477887 478790 126451 -145618
40185 -145618 -76765 77682 10890 -206936 -345598 -351217 -271949 -94125 161629 364482
40175 364482 431356 404857 307000 113327 -77634 -92659 26466 35249 -131414 -260520 -237032
40164 -237032 -221140 -317976 -370670 -255006 -103599 -54947 -46242 -33455 -127115 -306405 -309911
40153 -309911 -59930 120812 11826 -108882 62295 294395 196367 -87909 -91178 208206
40143 208206 386014 297969 238669 319033 248785 -81207 -303810 -136961 162774 213180
40133 213180 45886 -83655 -145733 -247713 -308870 -188896 -5921 19498 -54680 -2082
40123 -2082 148550 153543 -410 -61051 32345 35425 -127215 -146643 171270 505403 455281
40112 455281 163846 109603 374778 541088 344645 32722 -81980 -81336 -211442 -437539
40102 -437539 -525635 -437116 -354566 -362001 -349274 -235048 -78326 50442 141562 184470 192102
40091 192102 270979 481296 638231 482891 89398 -146170 -25573 176905 120917 -119808
40081 -119808 -203747 -15035 235096 345660 329025 266051 165773 39050 -38279 -28375 -2797
40070 -2797 -27006 -45721 22223 116961 76154 -145667 -388263 -469957 -396826 -309896 -268947
40059 -268947 -206318 -97508 -39002 -90334 -157360 -136945 -83213 -99924 -139231 -62773 132440
40048 132440 309187 401455 466651 508618 420491 175763 -60927 -116241 -18025 72961 92228
40037 92228 138144 305804 519238 588691 446951 259301 209155 230178 125140 -59054
40027 -59054 -38180 231972 387009 184573 -83628 -44820 136894 45206 -245219 -251798 115832
40016 115832 409840 398222 395273 614525 731054 445832 44914 -32146 152506 250669
40006 250669 225631 267740 318071 172937 -44459 -2958 269004 382601 192124 -9050
39996 -9050 17655 130557 107350 -34305 -170418 -281182 -367745 -345663 -176646 17795 90107
39985 90107 22972 -112100 -249485 -329233 -300792 -175467 -3029 207800 453504 636449
39975 636449 627990 439606 217426 64424 -19039 -32641 40901 137599 142266 59307 33603
39964 33603 148638 297820 313009 161656 -27823 -110122 -72868 -39166 -104324 -209148 -262294
39953 -262294 -335780 -544808 -732954 -565358 -56134 305513 192888 -76193 -25976 249160
39943 249160 276969 -18593 -236718 -177078 -93828 -169917 -202413 -13342 212728 252709 198792
39932 198792 228010 274266 201974 100922 130574 221831 195630 65122 -20660 -40198 -77809
39921 -77809 -117136 -82227 -31345 -92232 -232164 -293667 -246107 -210523 -232216 -216308 -117546
39910 -117546 -17984 41804 150890 351977 492122 373943 17812 -323137 -416830 -272545
39900 -272545 -99072 -73296 -168775 -208486 -71313 170596 325454 282016 119910 10810
39890 10810 22323 59585 22453 -34835 20138 188784 322213 325537 255587 169232 19025
39879 19025 -200414 -335735 -252209 -36205 130883 221413 318406 396089 348061 215055 181636
39868 181636 312725 454802 449359 330038 266668 376818 582726 620754 299404 -169926
39858 -169926 -279364 153183 657231 690632 379961 285194 522286 625822 347531 64130
39848 64130 149827 384708 339673 32954 -187009 -207261 -209963 -276729 -293232 -219812 -157921
39837 -157921 -136060 -69675 46352 105787 73359 31342 27923 27255 21655 51141 87192 23042
39825 23042 -176552 -400591 -502864 -435469 -257189 -56304 109496 209621 207920 91292
39815 91292 -43042 -20697 190701 379927 356433 234123 248104 358367 310335 69590
39805 69590 -125974 -184584 -275026 -425045 -395873 -147437 -37313 -265500 -472142 -263964
39795 -263964 139510 219225 -73392 -310448 -253169 -92168 -48761 -121905 -246471 -371663
39785 -371663 -365374 -137839 137329 207147 119339 121721 224944 212058 69202 23187 107447
39774 107447 76857 -147610 -312926 -244089 -85755 9681 107527 233373 208912 -38023
39764 -38023 -270880 -279628 -185257 -187220 -227185 -144150 22329 127230 169021 221117 252104
39753 252104 224219 231969 325068 327678 75384 -269195 -385559 -221169 -19851 40831 26276
39742 26276 63124 166761 273370 310420 220447 12829 -207398 -326640 -310525 -168384
39732 -168384 83360 359276 512052 491860 408431 362991 332237 286346 268611 263778 159890
39721 159890 -39525 -151806 -101682 -57295 -105960 -45623 244474 474148 334217 25108
39711 25108 -20138 183524 232615 37423 -31257 217857 474137 427742 207137 82061
39701 82061 47753 -36165 -140893 -160464 -119616 -65892 67527 277481 356067 186171 10453
39690 10453 126598 421032 495507 219989 -105781 -162516 27236 194981 134756 -132132
39680 -132132 -411641 -530534 -504154 -469478 -446263 -306366 -42357 129771 85565 16950
39670 16950 122850 246759 114283 -183873 -289060 -119779 34096 2292 -28682 110124
39660 110124 266384 222681 24533 -141146 -212191 -209432 -95204 118997 250286 144780
39650 144780 -80192 -190088 -163783 -171108 -261922 -293482 -189936 -87270 -143020 -317273 -420576
39639 -420576 -323931 -78232 141153 192555 93287 -19149 -56297 -53364 -49142 8039 140885
39628 140885 213076 62109 -262576 -526548 -576811 -470601 -347284 -301284 -387865 -600756
39618 -600756 -789930 -745598 -460521 -198268 -187456 -338292 -399037 -322975 -293787 -388182 -422328
39607 -422328 -237341 24760 107199 12399 -28680 44697 302 -302154 -613716 -590772 -268542
39596 -268542 -8115 -21152 -182697 -308107 -361425 -338935 -204397 -53942 -107957 -378335
39586 -378335 -555194 -418095 -163511 -87601 -125231 -10706 224169 273032 58136 -137844
39576 -137844 -107281 20427 61011 50048 86563 121914 73667 -14504 -80276 -166942 -295082
39565 -295082 -344754 -222970 -45322 -4297 -135059 -322711 -444041 -398857 -133485 224195
39555 224195 380249 200729 -74667 -121964 55539 200184 200791 182903 227960 247935 174560
39544 174560 66876 -23761 -117965 -185124 -133949 1881 38515 -102809 -267820 -304765 -281031
39533 -281031 -323402 -366371 -243548 28766 241283 264959 186151 140835 134770 82548 -51559
39522 -51559 -202880 -257655 -144614 68786 173848 11883 -293909 -403266 -145998 234420
39512 234420 350296 140223 -84105 -66778 94048 156151 76044 -15912 -73178 -158643 -246250
39501 -246250 -218566 -109280 -146972 -436937 -737580 -704341 -294240 192637 438048 376760
39491 376760 179950 66853 126138 256434 284450 165527 24157 -27437 -27953 -69115 -150380
39480 -150380 -214816 -247433 -245601 -180011 -91276 -118804 -286158 -365318 -160718 144425 177573
39469 177573 -99472 -324527 -242437 -12606 99469 84048 63874 20645 -119476 -258004
39459 -258004 -229451 -83380 -47806 -217083 -440104 -518198 -387499 -130587 69847 40430
39449 40430 -171390 -254917 9209 402460 506974 270545 52753 65025 90812 -77190
39439 -77190 -232213 -75865 261490 376944 191473 39684 143311 316696 304168 146081
39429 146081 42738 46783 83316 150735 300934 474271 530137 436093 294007 174821 45931
39418 45931 -112310 -218104 -173062 10183 208907 304018 270782 162950 32890 -99715
39408 -99715 -198917 -200953 -114689 -74308 -180448 -322480 -302700 -128328 -1924 1449 28527
39397 28527 141737 170878 36464 -26763 169124 381963 255637 -107098 -274597 -144157
39387 -144157 -52594 -181963 -285533 -167354 -37228 -123203 -250985 -137013 129657 248333
39377 248333 195767 199288 306253 331165 215083 110741 75813 -19915 -208214 -314031 -244839
39366 -244839 -158686 -211360 -328300 -370119 -357607 -372681 -370709 -264283 -100367 11259 76845
39355 76845 164291 224158 141112 -51223 -178981 -169853 -123841 -100702 -9584 187879 317604
39344 317604 206835 -25042 -84586 101555 304383 338632 287577 278610 233303 41744 -149035
39333 -149035 -88547 173843 323612 265080 279775 554816 819305 714149 352785 178103
39323 178103 303310 349105 39512 -347600 -360217 -15143 241215 170645 31369 130208
39313 130208 350928 362031 145312 10623 94343 160670 21801 -127788 -27178 210812
39303 210812 275790 149910 81960 118772 30057 -254005 -489257 -518574 -487725 -492307 -347485
39292 -347485 36671 347845 267270 -44267 -199768 -150260 -122080 -125359 39187 310223
39282 310223 340955 31382 -284089 -318281 -192456 -157963 -223252 -244882 -185119 -94888 7128
39271 7128 85525 57108 -57014 -87068 43835 167025 94209 -128571 -330397 -452968 -523150
39260 -523150 -502964 -351245 -164067 -74195 -50983 31253 149847 137175 -50799 -232991
39250 -232991 -245301 -167712 -199274 -357109 -422802 -222602 123202 320467 246042 62979
39240 62979 -30554 -36819 -56222 -75525 -20408 47409 -25574 -243914 -426117 -423874 -246868
39229 -246868 18026 251036 273423 -17758 -443191 -655812 -525582 -246911 -24872 138664
39219 138664 277757 318660 242918 194480 259754 306669 207485 63776 28618 48445 -18104
39208 -18104 -140675 -181681 -129460 -68090 7432 144751 263367 229896 66870 -90729 -203401
39197 -203401 -315119 -386709 -343474 -260367 -288462 -391999 -360918 -123334 124591 150544 -79256
39186 -79256 -417393 -661808 -661368 -436641 -215016 -219454 -408940 -543060 -489000 -325439 -164055
39175 -164055 -47346 -32450 -175818 -370308 -375823 -117949 167453 191583 -63464 -353667
39165 -353667 -446108 -327983 -180414 -165374 -224473 -144620 124207 332838 256175 39663
39155 39663 -2346 131952 134471 -120359 -382393 -404568 -240234 -46109 144781 294187
39145 294187 255005 7342 -204599 -192383 -106139 -175644 -341941 -401153 -360802 -361024 -358427
39134 -358427 -209688 -2146 31170 -98400 -166585 -158878 -287528 -518066 -485135 -68830
39124 -68830 311979 265427 -11904 -88497 19533 -45199 -302110 -348824 -25805 276529
39114 276529 186944 -108889 -194230 -51691 -12695 -179522 -271856 -98821 128014 107034
39104 107034 -134347 -319195 -304150 -201808 -164339 -196670 -194872 -83489 89653 159736 1999
39093 1999 -261692 -310163 2201 393732 440077 74579 -366031 -575106 -550830 -418688
39083 -418688 -222162 -6686 91587 20162 -56972 21742 160861 152591 -858 -110524 -110540
39072 -110540 -133217 -252495 -344685 -279444 -108992 22591 65297 78022 121950 208849 315813
39061 315813 398866 414934 363944 298052 279619 337736 449300 544126 556335 488827 382246
39050 382246 215445 -59327 -342731 -405322 -198929 567 -52961 -215504 -197696 -62334
39040 -62334 -138856 -453469 -617525 -385020 16949 274360 388386 477777 471761 288378
39030 288378 100488 112352 222754 204428 82491 29387 6730 -147440 -352806 -364349
39020 -364349 -188239 -74571 -96358 -81565 16180 41887 -11524 48762 223808 259381 108132
39009 108132 59068 213188 244037 -29251 -222500 58969 550943 682659 401590 158917
38999 158917 174973 216479 109155 1961 18566 42408 -3101 10013 135753 193004 54570
38988 54570 -141680 -232068 -251275 -254693 -151451 79250 216727 95881 -81554 -4896 278596
38977 278596 435819 342638 226197 288328 438990 489121 410144 288942 174199 92893
38967 92893 111949 250713 395477 422122 362655 332059 319857 201036 -22334 -142497 -10481
38956 -10481 218038 241121 -14310 -311563 -415656 -358482 -326772 -381579 -398139 -261723 -33021
38945 -33021 114607 97619 27282 73767 222059 250123 29342 -246109 -293303 -148130 -104743
38934 -104743 -236992 -273209 -69066 97016 -52895 -319937 -307877 -26977 154491 97191
38924 97191 37727 124991 196184 132984 97672 225255 354254 286657 113081 58446 156926
38913 156926 285557 392814 492225 529983 454246 345569 310781 315718 275175 224245 230916
38902 230916 218846 72883 -127497 -182836 -70047 28770 14787 12778 162538 400650 527233
38891 527233 425690 178268 3339 70216 324149 523416 510404 390696 353976 391634
38881 391634 344616 197125 134859 272808 485968 585881 537393 409241 221065 -31110
38871 -31110 -254666 -304775 -160664 36736 148648 162899 118425 -5377 -222518 -408980
38861 -408980 -389129 -192778 -76479 -179027 -287632 -126730 212013 373365 253185 127543
38851 127543 199910 311707 269194 191993 276743 410580 339678 116442 41249 181920 280463
38840 280463 182166 44629 14146 -14487 -141109 -209201 -51913 169627 137062 -178801
38830 -178801 -474481 -509559 -348401 -182395 -92269 -61777 -88150 -161938 -200573 -108904 99417
38819 99417 303258 400006 390011 332416 256854 146874 734 -122020 -140649 -43732 81813
38808 81813 132167 82951 -22626 -158989 -323399 -447345 -404341 -189947 -16807 -89217
38798 -89217 -307484 -366064 -174801 7491 -45398 -206421 -233883 -167553 -224056 -377647 -352743
38787 -352743 -66313 200021 172577 -87773 -342497 -457961 -405582 -182618 92064 168694
38777 168694 -43399 -290816 -275157 -41455 128042 120634 70046 75673 85407 72981 116464
38766 116464 239347 340361 351478 334215 353320 370717 338178 300911 326461 389276 397726
38755 397726 306451 155604 22666 -29125 24507 151609 260062 240690 63924 -148471
38745 -148471 -202656 -45212 140079 126834 -92344 -327117 -425253 -363394 -163906 86192
38735 86192 170284 -46223 -321741 -258533 101570 245156 -76770 -444991 -399039 -135505
38725 -135505 -156250 -448462 -523831 -200142 158811 235402 144302 92679 33766 -135962 -304363
38714 -304363 -282237 -60149 205593 338575 220070 -113376 -408376 -415801 -212786 -111187
38704 -111187 -225892 -369225 -405696 -428524 -494737 -473474 -308154 -179354 -232951 -360088
38694 -360088 -421712 -491177 -681645 -902814 -986501 -921047 -784699 -570654 -255506 53198
38684 53198 196268 131135 -67278 -280171 -359212 -208676 69059 250439 266360 233457
38674 233457 192641 73192 -30913 115574 450309 555262 258254 -63156 -68278 21449
38664 21449 -120946 -284110 -62605 372262 451500 98286 -157604 -19511 181879 104730
38654 104730 -95027 -137282 -93538 -168375 -304915 -334194 -299802 -322665 -314347 -142426 39017
38643 39017 -39484 -297591 -338286 -9018 344594 332748 42299 -95762 117450 414740
38633 414740 441578 194288 -50454 -132979 -133325 -115134 6420 235054 348864 185681 -68457
38622 -68457 -106301 73926 211942 198796 175878 227697 261535 244599 281044 354458 267838
38611 267838 -8834 -188983 -73814 119945 97924 -29190 70251 372722 472196 169075
38601 169075 -234965 -362877 -232219 -114603 -110203 -96486 -9898 65061 85965 111434 108550
38590 108550 -97160 -537036 -905521 -851050 -417073 -7518 92307 -14696 -80441 -35369
38580 -35369 30832 53653 13222 -122739 -321923 -428823 -337468 -171110 -140620 -265261 -384361
38569 -384361 -408062 -388828 -362098 -293463 -194661 -125856 -63768 69701 228501 267088 173216
38558 173216 87026 45083 -75693 -273206 -318513 -101932 123996 67059 -182323 -290941
38548 -290941 -157033 2723 11320 -60857 -77757 -31184 15432 40472 57906 88184 161629
38537 161629 263457 281626 133784 -50154 -31602 200808 364116 258289 72301 147062
38527 147062 501286 780844 699107 370901 125517 93008 109679 12435 -120765 -109092
38517 -109092 38587 116359 17112 -108079 -73354 69852 126703 65573 52328 169639 285014
38506 285014 273693 211819 219468 237606 135051 -33525 -74449 44881 131302 46698 -116509
38495 -116509 -224483 -311188 -460399 -586211 -508748 -226073 39157 89025 -53856 -220261
38485 -220261 -277347 -211014 -97658 -27592 -13096 35774 195809 399334 490226 416396 289332
38474 289332 235952 268477 324193 355291 346328 315591 330384 443789 585477 607767 485483
38463 485483 367164 359458 367870 253238 53896 -76917 -90957 -62489 -25895 54403 159496
38452 159496 211445 220333 299752 478374 609691 551843 357961 194711 119675 45998 -70755
38441 -70755 -116501 32864 286762 375449 161158 -166263 -303997 -200041 -68233 -54563
38431 -54563 -71670 -27297 -26576 -195855 -440651 -567210 -567053 -588856 -666293 -664578 -500106 -250318
38419 -250318 -30212 104367 130542 72820 38192 99115 161210 98348 -22114 -45945 -23616
38408 -23616 -133235 -304960 -234738 133800 452780 460402 335451 335886 358877 176392 -94196
38397 -94196 -131822 69082 190809 90619 -39644 -57647 -85899 -226957 -343045 -290574
38387 -290574 -168530 -149725 -211129 -212520 -145771 -138292 -264607 -491640 -763307 -1005802 -1079670
38376 -1079670 -868157 -433851 10055 307654 461641 510992 411210 122846 -230044 -413129
38366 -413129 -339055 -191677 -206467 -368739 -448478 -336182 -194703 -201709 -277504 -213298 11012
38355 11012 208587 259874 236995 236550 239718 187382 74121 -81301 -251137 -343666 -256386
38344 -256386 -47117 70542 -6023 -110817 -28123 212844 387111 369821 260024 224017
38334 224017 319509 479981 591432 570279 422002 236042 94438 -3152 -103197 -228789
38324 -228789 -383171 -563766 -705232 -666017 -377601 11854 251327 255332 164921 124992
38314 124992 107915 12009 -159188 -306254 -367119 -344386 -231130 -22239 191820 258871
38304 258871 151666 32471 48775 135013 126218 16948 -38230 26690 101726 97781 68626
38293 68626 66067 39948 -9535 46442 230473 312475 120468 -138041 -140917 54777 106382
38282 106382 -62935 -170628 -75852 10058 -48002 -39509 198915 430754 357246 86267 -37618
38271 -37618 88924 295948 437906 452808 275564 -15705 -112829 140709 416949 316458
38261 316458 -3045 -41662 255721 417410 202646 -56959 -44329 71657 22495 -81188
38251 -81188 -846 168804 154962 -32326 -123877 4280 221887 387725 466751 432670 258843
38240 258843 13761 -173978 -244604 -218754 -131532 -34033 13162 22701 63347 99060 -10512
38229 -10512 -253816 -382468 -231896 25245 119475 39719 -43396 -74282 -99671 -61090 131576
38218 131576 353723 354224 115799 -93656 -84612 23684 10335 -156004 -320080 -334073 -168845
38207 -168845 100278 339388 415341 284641 58271 -51458 79373 323375 411251 265685
38197 265685 111579 132648 167566 -21347 -303699 -341651 -138175 -16945 -33016 120492
38187 120492 480899 601542 249755 -148452 -141280 81883 99992 -35218 -29015 27921 -142571
38176 -142571 -383667 -296692 58471 263064 271552 422000 723798 776970 485213 238664
38166 238664 247521 271326 176957 189887 377890 452597 346907 431110 831432 1072702 797902
38155 797902 361193 257380 382036 340699 133410 16976 -34037 -211645 -420143 -417036
38145 -417036 -252251 -131799 -3077 283237 544066 462397 121767 -109568 -165273 -299417
38135 -299417 -543870 -609302 -384768 -126275 -44153 -44685 9179 81482 127301 219451 388046
38124 388046 527597 559675 530701 485958 388079 205787 -25323 -234023 -318888 -190436
38114 -190436 72853 214452 104047 -64738 -64608 20155 -23429 -150552 -155816 -59416 -67149
38103 -67149 -193682 -255047 -217023 -219444 -247811 -121194 145166 291890 208498 73878 16726
38092 16726 -67436 -244262 -364924 -312767 -198234 -162742 -178106 -163929 -130251 -99796 -52997
38081 -52997 -27082 -92606 -169570 -71051 194605 378442 336795 208650 151380 126635 73890
38070 73890 71865 164250 215738 116387 -23456 -42522 40722 107457 119653 97295 47867 27473
38058 27473 116708 225220 110268 -262333 -575678 -572286 -416162 -405680 -497992 -429719 -211445
38047 -211445 -144562 -323252 -448490 -266558 53370 165813 24063 -94893 12238 241824
38037 241824 380849 385832 348611 262845 5357 -403263 -683738 -598426 -287000 -117147
38027 -117147 -213733 -327386 -211203 61178 250338 262713 169933 37052 -103166 -171468
38017 -171468 -109377 -17361 -79890 -319354 -527807 -489356 -206260 127256 315495 289157
38007 289157 105659 -107322 -233183 -265825 -330246 -529462 -756166 -760973 -477360 -172945
37997 -172945 -144731 -339427 -454928 -375882 -276816 -271882 -227500 -37418 154820 183637 122568
37986 122568 126391 173206 163988 134905 164557 207100 224782 331288 566538 697220 532230
37975 532230 284232 278911 431379 401240 186990 130124 332980 513883 500727 440403 414636
37964 414636 274560 18978 -66606 138514 356165 349823 257382 238774 138319 -180450
37954 -180450 -451620 -333875 57555 292151 191330 -30101 -104876 39622 290947 416739
37944 416739 226635 -168445 -406406 -340120 -247489 -375432 -518924 -346666 59056 330796
37934 330796 338990 239330 111316 -85719 -262945 -271590 -196237 -238388 -329684 -218139 58188
37923 58188 168388 20596 -86184 33952 159923 61038 -126624 -154712 -41243 54619
37913 54619 129866 239310 254560 15672 -346776 -512757 -391896 -222244 -233476 -401482
37903 -401482 -570959 -644527 -584606 -379068 -102895 90488 137256 144266 206941 223144 24921
37892 24921 -330524 -548728 -417075 -37229 300676 386967 202559 -117858 -347899 -303388
37882 -303388 -40561 150256 78974 -82709 -33426 214762 336665 159669 -85832 -87511
37872 -87511 135165 282924 160747 -121381 -303593 -236888 9914 246707 349730 356659
37862 356659 373746 425581 441487 354817 153411 -130219 -404062 -534905 -467252 -279140
37852 -279140 -43229 273876 651474 875212 764353 466479 295513 315983 327051 228856
37842 228856 134614 117981 130773 190960 351369 446803 217252 -226705 -424723 -208021
37832 -208021 35519 -49240 -273196 -269038 -78008 -18810 -156414 -247660 -127196 126210
37822 126210 348248 411925 271062 40945 -68112 -16401 23567 -12832 29039 170132
37812 170132 150797 -123552 -311535 -133044 156939 173828 18805 47880 243076 307014
37802 307014 235607 274790 384317 279034 4767 -47241 227963 476719 449089 296974
37792 296974 194573 83617 -60845 -109928 -83857 -198374 -450528 -538597 -369607 -254180
37782 -254180 -380618 -486923 -326399 -91914 -55791 -114749 -54314 15866 -107668 -274776
37772 -274776 -192332 52121 97988 -116162 -280209 -213563 -85954 -88076 -183913 -270240 -331389
37761 -331389 -341401 -215908 37434 266482 347323 301185 213112 151349 168120 239048 207765
37750 207765 -34527 -304815 -277466 55305 290056 114106 -281843 -473031 -339765 -113484
37740 -113484 29164 148660 303621 389095 330018 243926 249205 245112 71162 -197427 -323805
37729 -323805 -252186 -160778 -152595 -122747 -18764 -1710 -170010 -299686 -106862 310287 542359
37718 542359 377913 19510 -241777 -348607 -385543 -365502 -272216 -198279 -262786 -431009
37708 -431009 -554381 -564869 -500328 -360384 -105167 165984 211899 -49522 -359163 -403594
37698 -403594 -218777 -116758 -233043 -376636 -378202 -333799 -358167 -333086 -141804 26296
37688 26296 -83127 -343153 -388423 -185456 -93337 -285337 -471849 -364962 -107564 -9579
37678 -9579 -95768 -169827 -155495 -123171 -98071 -70367 -104208 -231765 -317488 -214916 8903
37667 8903 164575 177107 92296 -42392 -149994 -106284 69711 135100 -66147 -333797 -370842
37656 -370842 -194144 -42234 18573 110795 229789 213081 34824 -129890 -172403 -167049 -187066
37645 -187066 -195869 -158438 -102904 -48995 10 14511 8135 82417 256159 349553 228348
37634 228348 56808 73991 219326 262623 229031 357599 648340 812272 757957 807844
37624 807844 1266511 1983331 2489098 2435590 1835067 1017912 413561 231179 300303 315464
37614 315464 200030 90671 50030 26691 50961 197570 350724 279393 -10626 -246581
37604 -246581 -258135 -146974 -51896 14452 47962 11610 -31637 35497 169599 221713 217311
37593 217311 317548 485656 495836 324447 213412 262347 282913 169860 84515 117897
37583 117897 95360 -91512 -254487 -224930 -137799 -178495 -282813 -308824 -286606 -278549 -205662
37572 -205662 -39627 33983 -121169 -345003 -417862 -365075 -309971 -223854 -72385 -17237 -178945
37561 -178945 -350824 -259505 -5456 65847 -128826 -328575 -332891 -216440 -125828 -97154 -113730
37550 -113730 -158297 -169576 -88812 36592 113487 143757 176867 165104 29739 -145774 -165930
37539 -165930 2678 157210 120606 -29058 -67271 95307 312276 377553 250662 64626
37529 64626 -72316 -191181 -330187 -400035 -314997 -182703 -180525 -271049 -239729 -22621 207451
37518 207451 310169 321620 282539 151880 -19246 -45741 135934 348770 420015 370860
37508 370860 270857 109597 -68871 -119979 -38267 -36762 -212427 -330218 -149571 200457
37498 200457 400764 371480 291660 274734 249759 141893 -2769 -81945 -39179 74320 107813
37487 107813 -31032 -207481 -199730 -43617 -30411 -267990 -465605 -312513 108279 448959
37477 448959 490740 265943 -59563 -282786 -285043 -174445 -157905 -209488 -106082 125683
37467 125683 139064 -166208 -370527 -139052 219901 205417 -106658 -208950 57626 349230
37457 349230 417562 405154 463008 461984 250265 -64045 -254940 -251451 -158436 -102280 -114915
37446 -114915 -115305 -11018 146423 192562 97935 45944 157335 301448 327128 301670 334456
37435 334456 346900 241043 121157 101437 70771 -77118 -164202 -923 228602 214517
37425 214517 12930 -96126 -110729 -230156 -375734 -283762 -43463 -10346 -143821 -779
37415 -779 463797 670331 280725 -218642 -207046 186561 355863 116432 -148183 -120155
37405 -120155 109694 317832 408258 353866 156084 -68533 -157958 -104927 -30353 44296 206239
37394 206239 403933 405821 124451 -174707 -160843 128670 316415 166340 -115591 -160818
37384 -160818 82357 309396 281478 103143 4965 10890 -24945 -141506 -207925 -119339 83614
37373 83614 289536 400495 359648 211254 114466 175032 285986 273658 174828 187053 331572
37362 331572 372008 150493 -169213 -313627 -227844 -73855 -7486 -79844 -264760 -440022
37352 -440022 -412223 -122919 205801 301340 207092 224202 442834 552814 274738 -194538
37342 -194538 -405514 -240472 -1625 78559 108769 219748 275381 123029 -96462 -169281
37332 -169281 -175933 -320870 -507108 -450978 -196973 -128467 -389083 -654114 -625632 -436157
37322 -436157 -357360 -372798 -285275 -67030 126758 171740 32471 -255214 -507584 -470036
37312 -470036 -160646 26104 -211308 -630013 -709767 -309535 178906 327419 122023 -123949
37302 -123949 -166502 -57306 -2854 -58677 -57504 101618 228076 94353 -178282 -262635 -113965
37291 -113965 13224 43779 183045 445288 504912 217559 -103331 -184314 -193129 -344010
37281 -344010 -469049 -353582 -176187 -193840 -255610 -76527 222345 311461 218802 227704 340718
37270 340718 324701 200578 199407 268572 109067 -271577 -500419 -400797 -202865 -109012 -29877
37259 -29877 136558 297709 359978 360831 323151 214599 89705 40231 12734 -75084 -95161
37248 -95161 99294 303903 171683 -213731 -385977 -172677 78521 48417 -162340 -317550
37238 -317550 -361836 -306876 -137628 9707 -109720 -463110 -684393 -561006 -300153 -172439
37228 -172439 -188832 -281160 -476506 -687645 -641938 -274465 67286 74138 -97044 -115458 13773
37217 13773 38264 -95351 -210172 -247439 -342413 -534500 -639381 -486840 -153714 105636
37207 105636 108455 -91781 -261590 -221878 -36921 66664 -34222 -237825 -363835 -347499
37197 -347499 -271160 -254129 -319248 -354549 -251791 -83579 -18309 -27279 117866 438994 588416
37186 588416 320647 -92841 -229680 -120008 -112675 -265806 -307677 -172688 -120946 -253494
37176 -253494 -325821 -180070 1382 44793 73021 246789 465066 520476 381513 174004
37166 174004 17539 -36881 -37857 -119323 -298573 -342235 -75900 240154 184681 -191871 -404247
37155 -404247 -249620 -57937 -98357 -174292 -38360 173978 215429 127741 77490 40829 -58808
37144 -58808 -106504 28462 234126 318634 284615 229234 134621 -25921 -139053 -138369 -185636
37133 -185636 -421378 -665604 -625431 -318621 -51692 -23664 -156543 -286800 -342697 -337689
37123 -337689 -322102 -339645 -360045 -302937 -182403 -131697 -208975 -288668 -242285 -120840 -46083
37112 -46083 -11367 87269 275647 457525 522665 450502 335389 312407 403164 462986 370583
37101 370583 218638 173834 194007 78986 -200124 -426922 -429988 -267240 -84946 37887
37091 37887 76247 55758 79207 196853 270200 157338 -5479 42434 265106 347649 163339
37080 163339 -64890 -123830 -44231 91805 279290 428547 369787 146196 28979 110028
37070 110028 152389 -13246 -223960 -283928 -251568 -226597 -113023 157228 376477 310684
37060 310684 59879 -78188 -11791 96740 126410 142199 248922 434210 578657 574215
37050 574215 435986 289022 210153 138619 21309 -47188 30345 163955 212052 210451 254492
37039 254492 263520 131464 13026 137117 396444 470783 327110 230829 269055 256534 147060
37028 147060 135177 270903 352482 289532 207719 121753 -99555 -356116 -332475 -23248 181670
37017 181670 97298 1176 98586 168794 7248 -176715 -114111 94761 206338 212172 212174 165664
37005 165664 46034 23372 225821 487454 552910 394668 176859 51449 87086 235491
36995 235491 323465 263960 242491 434090 623222 484735 163940 89141 239927 182345
36985 182345 -127028 -228212 6490 114646 -118936 -253558 12530 291445 206947 47641
36975 47641 187458 382302 238460 -49538 -42670 198822 308178 275803 351360 497662
36965 497662 473706 295185 145216 -2423 -240524 -402066 -304940 -131153 -141710 -213039
36955 -213039 -88154 107850 60171 -185809 -315308 -261314 -208337 -185783 -61356 138797
36945 138797 262803 309334 364217 373258 267822 170468 183747 147297 -87242 -327062 -314584
36934 -314584 -149978 -93844 -124890 -56245 63993 43979 -76812 -101347 -35535 -44843 -119385
36923 -119385 -82911 106275 305447 396485 373338 297917 284658 399309 503105 404025 208990
36912 208990 219434 408773 403803 121433 -31427 188329 471476 503095 437109 488728 497697
36901 497697 282598 26365 -83349 -209795 -471916 -592440 -361101 -65774 -28459 -84333
36891 -84333 39551 207023 195454 163603 318426 468633 386622 256646 282124 232705 -89883
36880 -89883 -317841 -36733 486219 686376 533541 406584 405524 359670 275666 228126 53580
36869 53580 -310794 -461580 -68950 486966 605627 342962 208113 325306 415244 411868
36859 411868 478988 557911 469275 331506 359327 411472 243361 12962 19522 147163 96157
36848 96157 -41925 21422 204070 219939 128807 197085 385236 466263 468337 536719 572034
36837 572034 451429 352847 419753 410344 136985 -99110 -9037 125165 -65410 -365976
36827 -365976 -361024 -134903 -25719 -32596 -11612 -73138 -242694 -171970 239660 431330 17150
36816 17150 -479352 -405221 33952 279835 355397 510034 503948 121428 -134050 219711
36806 219711 708217 649915 332710 428017 722289 547763 82266 67065 513680 801443
36796 801443 819530 936451 1075117 905052 743697 1178494 1953839 2272917 2041497 1807918
36786 1807918 1676473 1320182 881920 815090 979429 879660 610237 604984 715356 533134
36776 533134 321651 581522 1010219 971928 668277 732355 1015570 936708 672154 792061
36766 792061 1074884 926500 610271 776733 1145519 987808 544044 579861 903992 760301
36756 760301 334320 396843 796086 799357 569092 764174 1074143 764575 267847 527359
36746 527359 1163283 1078099 491633 490952 932703 792552 283362 519767 1291728 1332196
36736 1332196 680460 604609 1225886 1399653 954752 879988 1266512 1216705 787772 869819
36726 869819 1214645 806465 42686 219308 1042888 1098712 546402 743909 1463818 1283860
36716 1283860 500702 687027 1571197 1493288 749745 1137078 2347060 2381644 1427253 1535531
36706 1535531 2548916 2393622 1378796 1850321 3529465 3856793 3070818 3895132 5987550
36697 5987550 6229246 4905677 5588241 8298804 9337838 8668010 10254150 14099504 16053461
36688 16053461 16809256 21825312 30600237 36941014 42380785 56089217 77610376 97093567
36680 97093567 121170024 176540096 266917990 342758950 343841279 269158265 178322947
36673 178322947 122272955 98352874 79283082 57702196 43871372 38827501 33062730
36666 33062730 24516525 19573219 19015622 17012759 12553642 10317090 10922788 10104447
36658 10104447 7214599 6027669 7157295 7169348 5312738 4440768 5083583 4681447 2952748
36649 2952748 2469221 3569767 3762645 2512722 1964355 2610395 2604873 1664489 1535044
36640 1535044 2290613 2072372 806708 474341 1380685 1704226 1046884 986234 1757279
36631 1757279 1742514 707833 339731 1039430 1226737 413596 71918 784857 1246935
36622 1246935 810720 534717 990791 1307896 1038476 881588 1032484 802025 268841
36613 268841 361959 1003528 1100969 593938 540703 1005489 903901 161570 -40880 538897
36603 538897 793753 370129 196844 559220 597161 126333 66325 618062 830850 412800
36593 412800 210717 488019 475816 32140 -6244 461576 486139 -91677 -224419 431782
36583 431782 894839 659894 454785 657787 616939 133918 10008 484744 689988 295218
36573 295218 160672 691004 1055764 756736 496131 747013 910941 688165 856761 1788487
36563 1788487 2504933 2173943 1394223 1071317 1079542 932804 790990 905578 927964 578490
36553 578490 231508 174279 85662 -171262 -115185 409639 753502 528255 267470 419766
36543 419766 576997 334327 43317 54585 47524 -229839 -362713 -72566 152868 -110362
36533 -110362 -486899 -519994 -411778 -439565 -347600 53868 361484 269186 143172 318607
36523 318607 461410 220541 -103301 -128189 -39942 -102953 -96890 196046 483451 476864 394100
36512 394100 458000 427610 109030 -199300 -236661 -224535 -346829 -346333 -78516 111328 16534
36501 16534 -14352 245528 413094 186354 -74169 6745 167617 75652 -14344 213574
36491 213574 451129 264644 -125210 -205419 8676 112682 12357 -63555 -44084 -33020
36481 -33020 -9654 104555 235616 289236 297273 245944 40826 -206894 -230265 -90898 -160463
36470 -160463 -443259 -452994 -26141 302908 98221 -320904 -424902 -217284 -15962 93341
36460 93341 159607 81369 -174158 -367663 -341984 -279465 -324866 -298334 -69219 147561 166229
36449 166229 144958 231876 251461 49709 -173679 -171818 -4075 150319 241060 228759 42854
36438 42854 -186593 -200394 -32474 21949 -63083 -9038 188686 186823 -69519 -209987 -109729
36427 -109729 -101092 -308172 -385786 -172234 14438 4327 70041 297822 317568 1317 -228086
36416 -228086 -161334 -195513 -531379 -676489 -284268 158966 89736 -259734 -367462 -280747
36406 -280747 -315944 -354890 -123226 177408 156447 -119685 -322790 -425362 -553606 -573794
36396 -573794 -344390 -113601 -172301 -356837 -341919 -166579 -54055 3680 81326 56197
36386 56197 -98697 -105067 140517 261496 -2642 -309948 -286788 -151417 -249760 -398210
36376 -398210 -270052 -44614 -51721 -121800 65829 309476 237416 52555 209741 561790
36366 561790 563548 202753 4133 150121 285284 217745 168255 229891 161061 -131258 -378292
36355 -378292 -377253 -251309 -156561 -60765 67346 117855 1503 -216421 -381254 -341689 -50082
36344 -50082 309882 432804 270514 126449 222544 396125 406099 285466 178085 89209
36334 89209 24058 98367 278782 306385 111238 -20645 71873 152923 59983 19959 178630
36323 178630 271771 144010 119099 407035 630265 467286 284510 502897 779341 543900
36313 543900 4818 -156994 142808 396334 408212 432031 497798 347893 24518 -157711
36303 -157711 -212114 -402695 -595708 -373195 182397 499038 385327 235037 266105 220638
36293 220638 -13047 -123710 36380 156706 31132 -81977 59194 272610 300131 192844
36283 192844 106464 41213 -11039 28016 108396 63091 -35930 98680 435908 519956 128057
36272 128057 -337372 -400592 -144796 20996 -26949 -96960 -102587 -159423 -294585 -345785 -214474
36261 -214474 -48152 -68874 -276192 -418101 -303773 -76812 -35505 -188943 -214576 46735
36251 46735 303339 227916 -50324 -143922 51368 307001 445244 471163 396957 240408
36241 240408 164321 332941 638905 819527 822454 820931 902395 992660 1084938 1325164 1847459
36230 1847459 2634531 3455597 3850961 3414276 2319122 1331560 994769 1014906 798100
36221 798100 350882 173864 421678 716162 772597 698022 612737 445565 213750 98047
36211 98047 116345 76404 -47829 -43745 134433 239034 137914 25410 78139 190595 205896
36200 205896 158150 143067 161617 202391 282682 337292 270819 162740 199658 383372 552084
36189 552084 689894 913668 1137254 1104437 832759 666569 771071 926933 968300 1048965
36179 1048965 1278431 1484995 1620205 2022052 2905676 3953863 4942423 6498019 9442902
36170 9442902 13235207 15771576 15295589 12239890 8712815 6321850 5011272 3970302
36162 3970302 2935631 2170508 1677074 1149560 612120 460253 754161 1002394 858619
36153 858619 576498 497567 499215 310395 47357 21213 222256 378671 379587 304702 176749
36142 176749 5614 -62032 47484 119978 -35576 -223793 -161502 21519 -11170 -206467
36132 -206467 -175145 183468 528059 585689 458190 357102 330625 315889 231710 6307
36122 6307 -285899 -372052 -97289 287496 409114 248845 67146 -24121 -97671 -137035 -78732
36111 -78732 -32749 -106003 -116028 128077 377898 239416 -164377 -335196 -181905 -110218
36101 -110218 -271973 -300122 28381 392447 455645 351677 335325 319919 109323 -178019
36091 -178019 -263615 -131870 -19990 -81816 -265148 -444526 -524607 -476803 -371773 -315282
36081 -315282 -313240 -283605 -200885 -115076 -48069 -6358 -59172 -248252 -465254 -578925 -612761
36070 -612761 -622043 -507901 -187052 159463 277156 195530 129472 125232 96485 97942 224588
36059 224588 336573 245092 78501 78713 138484 -15116 -266459 -254860 -36037 -29864 -258746
36048 -258746 -241338 185042 509944 297015 -190680 -433000 -337748 -163364 -66343 -36943
36038 -36943 -61751 -94361 -31132 120609 222313 236000 258243 286806 237500 213408 395457
36027 395457 618929 486113 9502 -310611 -220741 -64905 -164980 -303617 -149107 183156
36017 183156 351903 282867 117119 -78133 -251162 -257820 -89902 11407 -88676 -194069
36007 -194069 -138014 -78378 -158373 -167544 114807 472732 517455 239837 -37542 -140918 -163458
35996 -163458 -180383 -131245 24856 223566 355515 334600 188078 102136 207497 312146
35986 312146 117624 -257094 -326680 52569 410274 326958 15330 -61179 150160 346113
35976 346113 351620 219056 20291 -159355 -161974 48398 260760 290233 216062 170997 106872
35965 106872 -28903 -112166 -59736 -5642 -45512 -46798 69434 131587 42545 513 118031
35954 118031 145974 -83316 -264506 -84661 211152 195629 -33283 -45899 171382 215878
35944 215878 -26798 -205554 -89507 116130 149727 35890 -65207 -79302 -2494 122540
35934 122540 170521 47321 -165154 -318304 -367442 -289149 -10176 357160 437612 86300
35924 86300 -245109 -53387 459212 651205 369576 72831 34764 15837 -135400 -132791
35914 -132791 196289 479661 319996 -72391 -186626 40360 197621 54275 -144136 -100112
35904 -100112 101065 142270 -78047 -320150 -317260 -95059 95722 106333 24482 -28262 -81063
35893 -81063 -201995 -330694 -369863 -355836 -369835 -339435 -125108 200841 358971 207382
35883 207382 -65869 -187277 -142526 -164393 -387520 -613083 -512083 -67874 316585 283925
35873 283925 -387 -61037 218309 430723 242277 -142198 -311810 -212202 -108229 -137208
35863 -137208 -184605 -142378 -51175 -4334 -77448 -303212 -571260 -643362 -432451 -165831 -95371
35852 -95371 -163687 -160259 -73521 -25288 36103 259692 545807 596460 345174 59079 -41712
35841 -41712 -12500 30886 98657 191663 205430 110018 49889 120364 188248 88381 -108785
35830 -108785 -189380 -99799 -3164 -35296 -135320 -167039 -120148 -102889 -162770 -214389 -170650
35819 -170650 -46139 133936 409386 733749 858186 594043 150053 -60935 26375 67033
35809 67033 -123442 -270940 -113226 137715 111046 -148459 -257466 -37238 329631 621093
35799 621093 760911 711206 461829 150001 -35173 -90406 -156174 -254064 -274896 -221162 -232767
35788 -232767 -336578 -376789 -252188 -50867 105373 198145 247502 255339 261663 322573 384340
35777 384340 308656 80863 -120139 -125368 33865 191750 238050 198248 167138 189810 196467
35766 196467 82577 -121357 -232995 -146018 -1377 -14266 -177590 -276041 -184639 -12958
35756 -12958 78404 85670 118554 219906 310053 305743 239743 218984 269855 291349 208492 101551
35744 101551 83373 106140 38186 -94016 -124846 -25849 40652 6777 26904 200383 357301
35733 357301 295148 95003 10601 114897 231185 190475 20417 -123396 -123006 11389 164744
35722 164744 227471 196643 161362 206007 338939 455752 358614 -49405 -523444 -630839
35712 -630839 -290511 76290 147657 159649 428865 748200 777233 757017 1165214 1869166
35702 1869166 2464850 3340659 5269983 7689038 8600164 6944223 4153226 2422981 2140177
35693 2140177 2047060 1407037 753629 626773 762269 770331 722653 739716 661429 437887
35683 437887 328198 446778 537342 403012 179534 20126 -125787 -276996 -308777 -206829
35673 -206829 -124115 -95418 256 141122 156009 62491 68562 189202 214453 109070 75227
35662 75227 155468 153753 29781 -22740 3509 -159103 -555719 -805420 -620027 -227234 -56760
35651 -56760 -233578 -551135 -735363 -602686 -171173 263146 356696 113552 -137449 -190436
35641 -190436 -145912 -120603 -68392 29080 69508 26472 -1955 -9862 -98635 -220466 -181633
35630 -181633 26102 174569 165315 175546 338603 530504 582135 492673 356023 262198 288999
35619 288999 389722 329900 -9972 -343697 -319663 -76383 -47487 -247788 -240799 122268
35609 122268 434217 362351 97521 -32622 -9805 26617 34869 -19234 -196201 -374065 -319743
35598 -319743 -79080 58247 67135 225988 531380 584644 276029 58650 229232 428637
35588 428637 252421 -72312 -74391 231129 456420 437466 304507 161219 58973 98556
35578 98556 236969 210570 -42503 -145660 179928 606822 634801 310573 78853 85064
35568 85064 83683 -49576 -155690 -136733 -100070 -131909 -198341 -268673 -311004 -206342 112241
35557 112241 479792 654554 600376 460063 344242 297505 347253 428726 396706 248246
35547 248246 164899 213821 236465 168736 177606 295554 261251 -15533 -186135 616 233545
35536 233545 121517 -158826 -164544 106975 307925 340282 344432 239899 -155838 -609717
35526 -609717 -639776 -236434 89367 56001 -58766 47735 268784 355248 269624 104350
35516 104350 -82932 -217964 -214723 -116586 -41864 19731 132851 178270 -10769 -281747 -269711
35505 -269711 77271 397565 421475 286524 257154 398114 621972 813412 810848 495788
35495 495788 4009 -340790 -378345 -239250 -113528 -84655 -181156 -363948 -463912 -361178
35485 -361178 -202831 -191524 -213789 -3450 355485 477895 272369 91823 186365 383786
35475 383786 456577 441287 411453 277202 30179 -115717 -59957 -25083 -207555 -469028
35465 -469028 -588337 -564208 -450015 -170273 229934 423902 212967 -122278 -207752 -111424
35455 -111424 -141791 -295666 -313292 -168020 -78480 -84843 -34186 17726 -167889 -510944 -575263
35444 -575263 -213098 131493 16834 -393799 -610988 -480606 -259393 -174433 -219427 -324278
35434 -324278 -437977 -447786 -268340 -42048 -33157 -270110 -479866 -435479 -198370 40935
35424 40935 181365 191036 56250 -124903 -158038 -5931 109421 7427 -181854 -219721
35414 -219721 -102926 -4515 20031 35967 18366 -109534 -270164 -313885 -274318 -280122 -251268
35403 -251268 -4927 329863 375738 79616 -147263 -30857 170582 105851 -145039 -276537
35393 -276537 -234853 -166095 -78552 103348 269560 230265 21051 -168445 -290974 -406229
35383 -406229 -448773 -328749 -189458 -242733 -381852 -290462 51629 302932 262354 122683
35373 122683 110674 160167 114975 35027 87738 252692 323689 175112 -89206 -257476 -234716
35362 -234716 -130753 -100163 -109591 14770 257172 320048 36158 -299397 -283911 15667
35352 15667 179079 92469 95233 373480 598604 412809 -13511 -223454 -103457 56027
35342 56027 58204 23185 66908 59561 -121585 -300715 -218356 35703 85686 -175762 -367647
35331 -367647 -150714 231697 261863 -88771 -288112 -1087 452969 591388 402712 212360
35321 212360 147986 70285 -93144 -264422 -406203 -524938 -532052 -351805 -119281 -28486
35311 -28486 -39928 8779 72670 -20500 -202549 -213656 -35672 59126 -44320 -136288 -70177
35300 -70177 1077 -56521 -85733 91999 343047 401655 256554 132177 146417 181013 90916
35289 90916 -92993 -208297 -155008 -10762 70548 76120 168017 430908 683534 678447 423255
35278 423255 147129 2742 -26740 19057 105542 110009 -71329 -310081 -353084 -168107 21627
35267 21627 70227 61263 93043 134954 156051 185055 176475 25237 -208735 -293557 -134895
35256 -134895 87007 173048 127832 58290 31677 108777 331976 589448 661263 492619 274558
35245 274558 187968 219746 281305 340860 385594 409215 460471 542247 495926 218536 -45972
35234 -45972 53018 435788 653230 535605 384901 413154 422080 238497 42358 -14104 -118049
35223 -118049 -394786 -562836 -384674 -140577 -202768 -398978 -297662 58970 234440 112386
35213 112386 3228 51767 55733 -50847 -16102 265863 511516 471202 276393 165455
35203 165455 144455 132678 192437 358349 421483 163967 -273597 -504908 -367617 -89289
35193 -89289 43881 28774 69675 245796 385024 303044 70640 -78323 -78546 -109255 -290972
35182 -290972 -483335 -510247 -429706 -395634 -374641 -235178 -48813 -33228 -187598 -245756 -64975
35171 -64975 165469 215714 121824 54249 31003 -58859 -229688 -372579 -425506 -418097 -346063
35160 -346063 -151385 117405 252579 114379 -143997 -213998 -3563 253936 308951 182538
35150 182538 46463 -50382 -160299 -227837 -130905 82427 227792 279335 390775 564116
35140 564116 564071 290592 -15192 -114860 -94839 -134881 -172454 -63458 96424 109747 17145
35129 17145 1746 46002 -11895 -148109 -195441 -168950 -218714 -282813 -151336 101501 140392
35118 140392 -80598 -178310 76166 389182 396661 182153 60494 86528 94065 51927 54500
35107 54500 55045 -81794 -293111 -344873 -145694 168434 439573 585950 539111 305360 73384
35096 73384 39274 126528 101990 -36554 -56313 90752 151968 8989 -64915 184312 540898
35085 540898 572232 218694 -159277 -279537 -201556 -75843 89177 300715 434977 372497
35075 372497 161079 -69848 -247169 -309033 -166264 131330 302519 118378 -261218 -440935
35065 -440935 -285227 -53925 9964 12554 181885 461075 544263 292620 -66379 -204216
35055 -204216 -42523 225353 389570 415531 397915 401755 397187 337837 250628 203209 192873
35044 192873 126609 -52601 -253826 -309265 -161477 64663 196150 178341 70219 -86460
35034 -86460 -304946 -544542 -664229 -573888 -379089 -265190 -256149 -209729 -57082 95712
35024 95712 152789 170588 225093 267685 235313 191926 212964 223490 122224 -8915 -18756
35013 -18756 33684 -63211 -331745 -542685 -540194 -418202 -301366 -166356 -5057 34520 -136288
35002 -136288 -316477 -217983 135140 393472 297141 -19344 -195226 -59286 181899 181234
34992 181234 -153083 -560380 -744817 -689916 -563526 -419594 -190486 65087 151984 29501
34982 29501 -106426 -120777 -109212 -150227 -107138 127732 363117 327781 70275 -94509 -4877
34971 -4877 185943 259833 162081 -31396 -204621 -220086 7326 383017 664728 678694 461566
34960 461566 178411 -37354 -143727 -147845 -53296 133443 338096 408109 262528 53890
34950 53890 48469 282861 468569 346817 31724 -138878 -19442 229171 394532 412867
34940 412867 310457 104830 -161708 -369997 -384423 -175405 120862 286443 225364 88310
34930 88310 107491 286341 372877 196223 -109159 -309667 -355810 -318604 -191511 26773
34920 26773 143573 -64155 -481127 -686191 -445306 -8908 190742 31532 -219415 -262804
34910 -262804 -95445 37787 -34599 -210185 -275659 -206972 -173578 -241438 -253996 -100611 70994
34899 70994 70359 -49429 -122498 -172937 -333424 -518250 -468590 -161166 96781 87805 -22383
34888 -22383 33809 217464 252499 30567 -237851 -292881 -127130 35299 11953 -145916
34878 -145916 -249813 -221297 -167838 -194915 -234775 -144928 76485 270319 291799 134090 -92096
34867 -92096 -227345 -154915 76636 244327 164794 -83496 -229515 -95709 243012 554787
34857 554787 638670 460729 184623 33691 57645 90728 843 -122871 -137157 -84556 -103639
34846 -103639 -184897 -209769 -186300 -240566 -377432 -442785 -352075 -196849 -95207 -73141 -108077
34835 -108077 -155924 -129787 13375 167904 197030 135062 118386 146063 99995 -10847 -47707
34824 -47707 -8174 -69220 -296370 -508871 -518981 -337041 -69910 208103 402435 392223
34814 392223 188347 -26423 -95651 -25417 98499 184858 122728 -113586 -320977 -248747
34804 -248747 34780 201428 145400 116111 262657 373658 272690 163914 292726 501587
34794 501587 463882 206569 51039 104317 133309 -54178 -364541 -580683 -578918 -383341
34784 -383341 -161747 -131385 -308821 -413523 -199002 188070 381947 270485 70742 -25266
34774 -25266 -37738 -36865 -29537 -38765 -99012 -150273 -113900 -62892 -114284 -173104 -32146 262462
34762 262462 417785 318183 165489 108162 22443 -181901 -307723 -148304 170376 353990
34752 353990 315281 183959 60428 -36957 -74135 -53402 -96638 -291194 -507393 -542067 -392189
34741 -392189 -218459 -92012 41202 182187 252087 234103 183044 111328 16666 -16323 82082
34730 82082 200353 175873 56305 8006 -4710 -168421 -432172 -492280 -264230 -52385
34720 -52385 -81602 -160647 -46443 127048 87987 -110780 -208150 -173964 -178872 -217463 -138900
34709 -138900 -24646 -142395 -469582 -634418 -449719 -169817 -58476 -19941 120616 247478
34699 247478 151894 -84511 -196479 -124034 -34810 -16852 11126 94709 151235 110223 14642
34688 14642 -35985 32068 212838 384948 392531 226679 37437 -93864 -250435 -452233
34678 -452233 -517374 -327521 -71599 -3294 -81387 -94005 -32234 -58690 -170496 -199997 -142089
34667 -142089 -176128 -321510 -364764 -219787 -97263 -184579 -371850 -442935 -372699 -289949 -266603
34656 -266603 -271256 -253028 -188771 -110683 -112751 -238523 -367970 -349648 -237012 -221787 -326315
34645 -326315 -363360 -237630 -77853 -10712 -12441 -51194 -152410 -236913 -132930 134964 309739
34634 309739 287620 277471 401656 429676 178750 -80856 15384 329305 387712 87080
34624 87080 -173705 -106754 90120 107969 -25775 -81700 -12356 29668 -28882 -86955 -52611
34613 -52611 21798 36682 -161 11699 107061 183927 142836 50832 65053 192653 251778
34602 251778 127458 -50888 -88383 5875 53950 -33901 -169447 -249809 -291541 -358818 -431888
34591 -431888 -418088 -293766 -183873 -236913 -417610 -520727 -455311 -397495 -514036 -641117
34581 -641117 -484226 -107780 76062 -113750 -349002 -257081 78771 300300 268335 133329
34571 133329 40415 10177 42701 120444 142731 34210 -116005 -166506 -116802 -54958 1510
34560 1510 61123 48941 -88358 -253988 -345682 -426894 -566543 -625928 -444906 -155385 -46001
34549 -46001 -156093 -258467 -222534 -142094 -107461 -98325 -114792 -181401 -209582 -86422 92851
34538 92851 120247 9647 -17466 107995 234095 304141 429207 576305 519300 240471
34528 240471 67161 213014 451654 467102 297145 189575 213724 267986 317695 369953
34518 369953 332578 151417 -1972 68237 247826 224635 -75391 -379774 -418034 -207247
34508 -207247 35481 124559 24780 -146461 -210684 -99660 64605 116853 35480 -81246
34498 -81246 -155555 -155673 -61006 75625 99801 -67634 -274843 -307288 -170695 -49427 -20017
34487 -20017 6916 64920 60475 -26247 -61580 30927 145891 194145 272048 481010 698263
34476 698263 715993 542950 368643 252893 75007 -165990 -237260 -5665 293957 343203
34466 343203 198887 216636 520289 801223 739025 417037 170559 167152 307687 442617
34456 442617 495406 414462 191028 -52301 -126119 29441 281148 435589 379953 133240
34446 133240 -155952 -301187 -259305 -182534 -211708 -290519 -288675 -214348 -156923 -108745 -25887
34435 -25887 10548 -93600 -226082 -189179 -3845 144227 221108 326905 386501 200466
34425 200466 -146824 -286510 -90929 137589 158675 133010 254631 373371 275270 71671
34415 71671 -16194 -48844 -206547 -406952 -442342 -378473 -446553 -598647 -540406 -215796 78168
34404 78168 124955 54762 84441 211719 270289 144875 -124832 -347329 -300930 12277 277441
34393 277441 204631 -84505 -202107 6264 319363 475074 414368 190928 -111984 -329996
34383 -329996 -314034 -142034 -33510 -16747 83212 272272 289195 23705 -226082 -140464
34373 -140464 147784 215097 -93991 -494394 -641953 -507161 -316030 -237297 -231297 -195134
34363 -195134 -155976 -214248 -314999 -250058 11416 160811 -75282 -496074 -620453 -304191
34353 -304191 96216 220155 112301 30717 60337 78593 -18911 -201781 -355810 -373230
34343 -373230 -241577 -68292 41616 103891 153461 100676 -121509 -316998 -195385 188111
34333 188111 423698 264766 -78196 -264912 -224593 -103300 -16431 732 -44039 -65746
34323 -65746 26133 152280 144675 57404 146105 439608 613244 446924 141179 -9407 3172
34312 3172 49255 121347 209688 185736 71394 147762 497035 732915 558734 299444 407653
34301 407653 689508 600193 171303 -1661 286823 545141 386480 67888 -32558 2889
34291 2889 -93275 -281043 -348652 -291891 -242000 -196315 -87409 29541 80974 119232 170148
34280 170148 103643 -140626 -363081 -356024 -200327 -100447 -71816 -17754 29273 2235 15260
34269 15260 199976 405006 359540 109039 -16363 103688 212123 91320 -119368 -178015
34259 -178015 -102037 -71499 -101937 -44036 122799 208603 82158 -126338 -194666 -95080 7856
34248 7856 7353 -32851 -29497 -6476 -5904 5716 43360 24753 -84120 -143828 -28553 140449
34236 140449 146938 9057 -72967 -64234 -113203 -205801 -119628 171361 355969 230951 17560
34225 17560 7185 127329 129090 10578 -50562 -36478 -33095 54844 369364 723586 743212
34214 743212 427934 213645 368778 664099 812984 927386 1261772 1708108 1866485 1564563
34204 1564563 1054632 683541 552335 536151 495212 399097 315244 321488 403797 447032 373157
34193 373157 272595 323016 558490 792098 838060 791278 992659 1640491 2460772 2870351
34183 2870351 2531235 1692238 920989 551848 482482 452500 357615 252506 187127 151482
34173 151482 129162 117793 108008 86539 48095 -8194 -57923 -27312 133333 326095 351924
34162 351924 150225 -89589 -148375 -40465 55430 67007 75400 109642 72675 -79301 -239651
34151 -239651 -315055 -349892 -383588 -316493 -65988 243014 413592 432066 408403 331553 118151
34140 118151 -121428 -148058 20699 76273 -106220 -241880 -86411 146579 108722 -130673
34130 -130673 -198783 13903 257045 365661 445607 561787 571101 390751 173542 81966
34120 81966 99748 178968 353154 571448 631845 440446 167920 7616 -53597 -95508 -93142
34109 -93142 -45250 -79523 -240457 -349385 -274971 -164685 -183003 -200975 -24359 215225 217825
34098 217825 -12825 -168791 -84416 101729 224191 259787 215090 108415 79489 253769
34088 253769 469662 412897 77424 -179220 -123496 76205 167479 144594 106194 24967 -133556
34077 -133556 -243478 -190409 -88685 -121111 -249342 -281917 -179618 -104632 -168209 -279998
34067 -279998 -279975 -129976 53752 117380 17529 -132840 -192967 -162379 -150316 -179104 -136325
34056 -136325 29088 181653 161794 -6210 -158531 -185254 -101261 21011 108793 115778 58226
34045 58226 1383 -22587 -41276 -71075 -92379 -117454 -186297 -255208 -202707 -14523 149776
34034 149776 165168 109212 113659 153335 122547 36335 -11255 -37955 -141909 -293394 -341881
34023 -341881 -260290 -209587 -289866 -374606 -297983 -103601 9106 -73166 -286325 -489920 -564807
34012 -564807 -453639 -212289 -3325 62636 68692 173391 366963 481341 452439 401461
34002 401461 391301 290994 24226 -217093 -223479 -113726 -161739 -331106 -290300 73839
33992 73839 465158 607124 573665 531060 434388 226166 99440 244750 480809 463157
33982 463157 176942 -94458 -230923 -358045 -473889 -368234 -9903 317982 422367 454502
33972 454502 579378 658177 504434 248743 157991 215188 177638 2895 -83084 21528
33962 21528 105499 -30092 -260222 -325130 -209249 -129828 -188313 -243527 -180349 -114810 -199654
33951 -199654 -361987 -421116 -390787 -440189 -568889 -573907 -404052 -290857 -380441 -459411 -260501
33940 -260501 121429 356311 313930 138461 -31301 -171452 -239527 -165389 15788 197086
33930 197086 352110 498919 568771 497816 393016 399794 453546 380607 200070 91316 95694
33919 95694 87800 12681 -83726 -211359 -370036 -400435 -202295 -25531 -181908 -518243 -594316
33908 -594316 -371608 -248914 -363466 -386764 -167728 -37616 -209507 -374294 -243009 -53823
33898 -53823 -141127 -378776 -479312 -510322 -650684 -727140 -502358 -201368 -221787 -471489
33888 -471489 -524523 -337782 -268853 -410634 -461241 -318939 -276761 -465638 -569276 -326260
33878 -326260 52396 218275 148875 34654 -50413 -109946 -50286 181498 394202 338757
33868 338757 59462 -144740 -108982 16493 9353 -137362 -255142 -250208 -196346 -176353 -149526
33857 -149526 -55528 37846 20891 -73502 -126456 -140281 -193127 -201104 11065 345695 436791
33846 436791 166172 -112586 -85584 52602 -61949 -367606 -484012 -300583 -93207 -76201
33836 -76201 -155474 -150813 -5623 245405 493383 541308 299711 -9330 -78933 54386 65203
33825 65203 -155377 -327447 -205075 79327 241005 227323 200335 237729 223322 35945
33815 35945 -249395 -402990 -291578 -53366 50868 -42605 -144138 -94149 57942 221985
33805 221985 417053 621582 668061 478905 251953 206655 283444 301832 268712 289700 310304
33794 310304 214805 77076 39611 32890 -105738 -308758 -355248 -211353 -27611 131151
33784 131151 278460 316559 161464 -17478 -4998 87999 9003 -155170 -90058 182563
33774 182563 297245 142398 20153 106550 183552 75575 -39005 29809 151975 115960
33764 115960 -51134 -193692 -241404 -167127 48560 289436 368249 314825 345610 468397
33754 468397 430500 172282 -20114 12344 34198 -141762 -285554 -135238 125471 127499
33744 127499 -134231 -354081 -394287 -390338 -442515 -479682 -418732 -267378 -93511 -21698 -172391
33733 -172391 -461842 -573490 -304928 141528 388539 335948 210548 205324 244309 139950
33723 139950 -116355 -292984 -176676 119422 225841 -9604 -271507 -212283 7414 -45223
33713 -45223 -367634 -487471 -199304 118430 109859 -53355 -51865 56450 40749 -46297 5869
33702 5869 164112 231936 205569 220418 238882 114567 -85065 -124565 35387 177927 154664
33691 154664 57646 30156 70126 73299 -20039 -152555 -203754 -144033 -108078 -205819 -303654
33680 -303654 -198921 4024 -12369 -251564 -318737 -18485 320157 360873 264073 341276
33670 341276 488409 366988 -32594 -410486 -620168 -728740 -705086 -446316 -96515 27983
33660 27983 -131696 -315963 -333840 -238032 -111031 34769 115147 15040 -166952 -165113 88832
33649 88832 363736 455389 408597 346273 279410 182026 88766 13299 -109877 -310935 -494953
33638 -494953 -535311 -411964 -234047 -155888 -241495 -366144 -317108 -66997 133402 42348
33628 42348 -260601 -464401 -374712 -72872 208037 270470 89711 -148866 -234258 -207283
33618 -207283 -305926 -565056 -695459 -510978 -232486 -137526 -138245 -9355 160569 116817 -85574
33607 -85574 -153729 -61122 -86458 -330215 -564016 -624763 -609323 -582527 -435756 -187675 -110124
33596 -110124 -335159 -573147 -465336 -67394 242324 247144 86462 3180 63564 153674
33586 153674 160615 105032 94023 160245 204183 135563 4328 -86169 -126223 -152684 -124966
33575 -124966 5198 141187 120510 -58224 -230195 -283931 -247470 -161664 -27798 91124
33565 91124 70628 -104903 -274971 -271388 -93387 118816 228542 193702 59663 -99090
33555 -99090 -216305 -211820 -2129 355631 566287 337844 -220142 -625426 -557762 -200790
33545 -200790 60802 93864 8322 -108494 -221839 -247412 -150043 -56842 -76071 -97901 37216
33534 37216 278111 456856 519416 472608 261047 -69105 -254494 -149618 -21062 -174353
33524 -174353 -422377 -318622 148722 511909 480296 249197 100323 64732 78151 138307
33514 138307 187332 116260 -17654 -41647 3508 -114320 -391318 -516233 -354625 -173189
33504 -173189 -200528 -277824 -185373 -48795 -127830 -378221 -513921 -409061 -190706 9265
33494 9265 172696 284688 296443 229105 186270 217168 241114 159317 18996 8231 236229
33483 236229 543704 637399 436813 153686 -30042 -183310 -402453 -571553 -560974 -494363
33473 -494363 -549884 -629668 -529074 -329175 -279226 -347760 -253905 58697 330101 384780 286101
33462 286101 81196 -233024 -455804 -316544 34934 99700 -244260 -510192 -327660 9466
33452 9466 39883 -168481 -215694 -27040 109590 58786 9576 122800 280546 251876 -24520
33441 -24520 -346566 -402804 -94209 281478 320081 18786 -217987 -143395 32336 40589 -45448
33430 -45448 -42193 -27780 -170650 -353336 -295185 19636 310791 362380 195000 -72286 -312465
33419 -312465 -375841 -197860 70248 194903 122062 -6410 -49233 42346 256707 496713
33409 496713 579262 412792 138593 -32223 -67873 -72654 -68970 9635 146554 228912 201255
33398 201255 103498 -28923 -181200 -294711 -307973 -253106 -208852 -176745 -103668 -1136 62682
33387 62682 68632 47412 4947 -51100 -46612 74426 217153 214824 48292 -128267 -199369
33376 -199369 -215952 -272289 -349761 -348292 -227115 -67123 -10840 -144050 -393885 -543477 -418287
33365 -418287 -91093 162645 167929 49983 48103 180143 232887 96739 -62500 -66567 -5903
33354 -5903 -77640 -240535 -261894 -80457 119468 214764 271874 310592 213133 -10541 -134552
33343 -134552 -65176 -22117 -161813 -275537 -138381 69405 28408 -201688 -298698 -202064
33333 -202064 -137180 -170559 -129288 25482 109360 55642 20533 69832 51997 -122701 -324865
33322 -324865 -411679 -378624 -261781 -103609 -32068 -133666 -235956 -80323 268861 470269
33312 470269 393125 258831 241957 249127 195495 192054 309340 412256 382134 294208 255816
33301 255816 263799 305786 392779 424798 256781 -33964 -188946 -139623 -76321 -86623 -25868
33290 -25868 153776 258329 183096 104400 176577 294674 322145 310718 328626 304010 210775
33279 210775 196428 354292 550131 612305 517833 295806 -35932 -336545 -382110 -163058
33269 -163058 73269 170937 220205 288553 285662 209675 226140 354066 369637 190179 57784
33258 57784 145273 265852 201836 61834 56581 133729 100138 -41849 -115218 -30718 139372
33247 139372 272976 287711 209822 187669 314043 456873 439969 326848 286375 275666 183551
33236 183551 179456 478296 819202 710209 217532 -63256 76932 184887 -27881 -216652
33226 -216652 -68585 159660 167501 145684 333452 497376 338708 44547 -48636 -17991
33216 -17991 -111196 -233335 -158418 -17935 -101236 -331809 -375791 -160273 85575 214470
33206 214470 276138 326892 361115 352492 225597 -65842 -354865 -397618 -259463 -240598 -348385
33195 -348385 -266051 35244 158118 -31368 -99902 251605 666335 683955 395449 171320
33185 171320 112599 130180 220886 335951 305203 157422 157842 326816 365553 241562 294414
33174 294414 540285 521471 150532 -6753 301699 494818 124367 -339694 -299649 25752
33164 25752 101476 -37250 -54474 28570 65186 195208 450208 447135 32678 -293901 -143336
33153 -143336 147185 190956 204907 416339 499725 225782 -9881 81753 149870 -1315
33143 -1315 87909 596298 895124 654982 486961 730863 723010 140987 -144981 407395
33133 407395 911687 630409 323697 727559 1093263 716326 455868 1076216 1604574 1184932
33123 1184932 942548 1928331 2960819 2882017 3035382 4734268 6431432 6787627 8125473
33114 8125473 12488154 16955307 19028193 24517939 41252480 63946315 74727525 63482426
33106 63482426 40641249 23987550 18597066 16703489 12588043 8495948 7039820 6342010
33098 6342010 4541957 3095983 3227498 3372974 2280638 1295651 1666289 2315452 1979187
33089 1979187 1265309 1098066 1091976 771101 653615 988113 996486 352763 -70170 229184
33079 229184 514049 267987 80971 348392 499627 248961 233655 680195 792675 220593
33069 220593 -177392 193192 683273 664410 542008 704145 657333 82844 -348578 -115050
33059 -115050 202529 -22875 -391513 -319779 -66193 -50790 19501 473606 877350 762338
33049 762338 472739 485000 542959 257086 -72228 -26491 120142 -56172 -311366 -222503
33039 -222503 -1062 -68049 -258971 -179544 33691 -1209 -200862 -220996 -73945 4780
33029 4780 5818 -6646 -149757 -399010 -417349 -123538 36751 -173204 -301687 24618 395971
33018 395971 284326 -75747 -123472 127801 286121 310047 378266 350119 27846 -297118
33008 -297118 -209717 122862 226721 116714 197957 499859 612383 353921 -5063 -184210
32998 -184210 -161054 -31447 68298 -22765 -274385 -400555 -257984 -97236 -154787 -268053
32988 -268053 -205779 -82184 -81559 -68821 122697 295320 208767 42064 91346 241410 189503
32977 189503 -23212 -160548 -254317 -435479 -503488 -191101 280338 441621 288723 241146
32967 241146 432315 552192 417698 225446 156643 131451 54405 -23297 -67309 -111517 -101213
32956 -101213 61011 288523 368534 258132 107446 6086 -77842 -141192 -150223 -165798 -254155
32945 -254155 -324158 -261620 -154871 -164510 -248755 -259928 -231537 -294589 -367505 -235336 62754
32934 62754 224640 125269 9297 139565 448433 664319 655355 517964 388965 300154
32924 300154 242990 278261 457604 643375 583920 266246 7698 21074 101367 25592 23693
32913 23693 386304 763766 496009 -314228 -742034 -300540 370239 463405 95513 -80614
32903 -80614 86283 210687 117850 19951 32258 20325 -67572 -97564 2809 161386 294352
32892 294352 326039 185033 -34982 -81311 96768 215779 102899 -5916 113896 267551
32882 267551 205324 93820 197195 345909 200755 -146962 -325393 -281427 -247481 -244275
32872 -244275 -125856 -24740 -216982 -570431 -646268 -373324 -137332 -161775 -274262 -340750
32862 -340750 -446235 -548248 -433960 -174296 -164147 -505106 -757953 -557723 -130664 68388
32852 68388 -43358 -207377 -247342 -205912 -180372 -212707 -274589 -271874 -152414 -28290 -46744
32841 -46744 -145564 -135584 -26874 -32497 -221043 -422088 -520555 -568814 -545616 -320884 12875
32830 12875 93832 -217521 -564920 -559218 -301866 -174551 -268188 -331221 -218448 -83465 -83582
32819 -83582 -136828 -83016 70555 200917 283167 399459 538359 539227 326489 87423 57874
32808 57874 182174 187201 2513 -132007 -63896 18597 -89586 -253297 -219029 -35649 46102
32797 46102 8571 81770 323860 486373 376862 128380 4888 95145 283049 402167
32787 402167 356851 182939 30760 25156 142453 278084 377365 413389 325752 122047 -34396
32776 -34396 -2419 128450 175646 147581 190244 291613 271651 87812 -59481 9981 239228
32765 239228 430876 440969 254095 -12815 -162495 -84248 118889 257355 277938 251901
32755 251901 201448 100565 16552 64751 206939 258668 133277 -52262 -141722 -95078 29797
32744 29797 130134 81445 -168099 -493266 -673396 -601713 -353583 -73777 113845 119166
32734 119166 -62613 -297884 -412373 -370881 -300838 -324995 -411945 -401109 -172614 187672
32724 187672 419620 351080 90930 -141866 -313201 -513451 -663531 -569315 -293076 -145148
32714 -145148 -205914 -193643 32758 198578 85842 -64970 41109 240506 194720 -38059
32704 -38059 -141464 -99020 -175576 -412056 -549103 -445044 -219498 16628 253805 404108
32694 404108 326699 55628 -230547 -442905 -573823 -541045 -295154 -992 140303 150229
32684 150229 116523 -40310 -329063 -427113 -82898 380270 448102 197797 161208 443936
32674 443936 568892 285750 -31464 -440 229164 302818 156075 -56809 -224415 -259373
32664 -259373 -79058 222850 411575 422823 395629 346105 132249 -177982 -274113 -88532
32654 -88532 33791 -157280 -448987 -515029 -361954 -201197 -91402 66299 308585 546654
32644 546654 644083 510096 219712 9663 4756 43210 -20852 -13135 241180 487015 380052
32633 380052 100765 76965 213251 73476 -203107 17478 711320 977011 341081 -486567
32623 -486567 -666648 -362245 -219131 -308723 -298007 -232561 -396678 -656725 -635586 -377197
32613 -377197 -232153 -234424 -173252 -135789 -359335 -625136 -437198 161852 535244 321514
32603 321514 -141956 -403755 -447068 -449835 -379433 -107172 289409 585234 685406 691024 706744
32592 706744 675576 490793 316749 637605 1689481 2876482 3190280 2379164 1283804
32583 1283804 760047 715889 591203 320129 223572 265756 115329 -174031 -205358 49268
32573 49268 187177 75177 26023 165268 193928 -14590 -98487 222380 665818 783162
32563 783162 533082 190798 -55428 -163152 -114905 13918 35115 -102004 -197455 -108283
32553 -108283 6981 -57734 -219395 -242225 -102254 2261 -41651 -127955 -107760 28192
32543 28192 166383 202318 137866 67941 69743 117146 130112 81336 9536 -39729 -34139 44633
32531 44633 167635 275103 366702 491786 604858 563815 363374 222425 301353 466661
32521 466661 493940 375660 255675 191057 173464 254585 427903 502837 331508 54436
32511 54436 -112497 -205876 -358571 -454036 -278657 60882 236801 195142 199586 367864 502881
32500 502881 430252 198863 -92438 -370025 -462968 -227603 155255 320044 202087 66961
32490 66961 24636 -106200 -363471 -475895 -298073 -48599 78766 198092 405397 500886
32480 500886 311366 24815 -72711 20803 150306 298618 497092 623891 539327 280213
32470 280213 -58315 -436414 -693602 -539367 12901 461987 393864 24386 -170439 -141748
32460 -141748 -172768 -281505 -220277 -9108 39394 -128130 -201574 -60582 21790 -97005
32450 -97005 -137175 103683 339701 241140 887 40554 325418 414369 140891 -179331
32440 -179331 -268146 -222723 -202676 -133174 49710 131341 -104231 -492645 -685270 -627816 -540135
32429 -540135 -479737 -275031 72818 274562 176827 5149 -439 65633 9977 -108080 -128258
32418 -128258 -102774 -156050 -179706 -2857 231778 221916 -7031 -138585 -93775 -135511 -373430
32407 -373430 -553942 -495013 -374058 -375338 -372074 -221895 -103664 -242249 -493543 -539487 -378112
32396 -378112 -291950 -383897 -455921 -356221 -171556 -21410 106821 227426 237459 42143
32386 42143 -291767 -582107 -683021 -575539 -367738 -204276 -119539 -12294 162404 245906
32376 245906 61275 -291971 -512757 -493421 -449837 -565047 -675507 -490050 -39962 288475
32366 288475 192009 -221810 -593800 -684787 -517445 -253980 -59030 -37148 -165437 -272307
32356 -272307 -193184 20824 140934 33405 -205540 -412581 -520457 -499156 -298815 11400
32346 11400 178894 28503 -281431 -440631 -372359 -257298 -222395 -223545 -230205 -290436 -361646
32335 -361646 -297270 -94988 34135 -38759 -163014 -141005 -9371 71739 87850 135761 191238
32324 191238 122768 -59412 -161110 -80905 17639 -71228 -285332 -354833 -163307 97556
32314 97556 193263 139381 109298 143521 129215 37355 -21010 774 23914 40203 155482
32303 155482 348434 413051 276314 148377 189866 261192 203525 119932 123756 70017 -137344
32292 -137344 -232167 4862 252520 71008 -344185 -412704 -99114 55128 -127842 -179184
32282 -179184 159117 454602 309523 -1637 -54004 36515 -66992 -276910 -274462 -97509
32272 -97509 -35226 -99713 -62519 88455 148203 88475 83262 178184 250292 259662 264812 239497
32260 239497 127201 11346 -3492 10093 -49874 -92008 -4659 85713 6139 -144258 -161638
32249 -161638 -98275 -143090 -256274 -257332 -186699 -235007 -375925 -410987 -334765 -319738 -369630
32238 -369630 -316526 -142413 8840 109713 229737 289893 174654 42869 158994 432984
32228 432984 504447 287869 55833 -33814 -99247 -185740 -159323 -27917 10804 -65982 -47725
32217 -47725 128344 290051 373582 470627 497075 260896 -73379 -87599 201068 286075 -13742
32206 -13742 -252137 -130552 16396 -108423 -180328 146464 536806 481091 146656 84672
32196 84672 332369 448978 299799 178983 210393 214623 175767 287195 476757 404618 39989
32185 39989 -230972 -206267 -138001 -236463 -318517 -176659 45844 107729 44659 49422 161050
32174 161050 275006 317624 248705 22693 -308918 -559022 -575413 -372676 -62683 223177
32164 223177 335363 209440 7036 -25011 122274 216166 122589 -62886 -247579 -441719
32154 -441719 -559088 -407758 -14968 301002 342043 267202 259613 237987 122763 103482 321956
32143 321956 511954 333860 -64934 -219346 -22395 162399 87376 -64336 -65716 -14352
32133 -14352 -114735 -320359 -411687 -309270 -138377 -53933 -115500 -265722 -348451 -229679
32123 -229679 24542 182008 128731 10058 -5513 19959 -73876 -243844 -263229 -42746
32113 -42746 230326 325951 230756 100556 27728 -45786 -190166 -351067 -416897 -392809 -404039
32102 -404039 -477072 -423557 -87275 332743 407484 1677 -489026 -559688 -155689 327328
32092 327328 525692 429287 258315 192171 252477 335756 319405 200826 126777 207272 329891
32081 329891 276865 19628 -233681 -304455 -236052 -187000 -240008 -355133 -424184 -352985 -177112
32070 -177112 -82351 -187882 -335383 -270366 -27117 97300 -773 -65596 104480 334940
32060 334940 360569 212447 83386 -4846 -123681 -179117 -50833 100492 4437 -266210
32050 -266210 -353649 -160873 -7254 -135090 -357974 -369980 -182559 -60359 -155320 -361056
32040 -361056 -450936 -271966 110442 412665 393900 148612 -8279 30425 51320 -110389
32030 -110389 -328354 -433329 -472052 -537857 -538754 -355895 -96787 30521 6172 -28256 2393
32019 2393 85457 229425 395955 411228 167456 -141098 -203115 18769 285599 433120
32009 433120 498840 518423 451562 347778 342315 410655 351705 121899 -24272 120355 394685
31998 394685 470526 265500 -18331 -195949 -263579 -288260 -301376 -331842 -418171 -525051 -524500
31987 -524500 -331612 -31948 182731 208663 122968 66894 71707 51580 -37539 -109603 -69878
31976 -69878 29119 38969 -84042 -212158 -212301 -124019 -116176 -274685 -481352 -541686 -424507
31965 -424507 -311777 -360755 -472456 -408485 -133661 97532 59547 -158044 -285236 -207721
31955 -207721 -52559 6904 -82712 -252561 -381616 -398485 -377686 -460119 -600123 -525806 -115880
31944 -115880 311359 343521 52911 -76290 170998 464152 467588 337305 408969 618021
31934 618021 588130 221473 -148161 -235373 -144561 -117089 -171831 -170937 -84749 9613 108945
31923 108945 259421 374695 281105 -5430 -215841 -144149 89224 213994 166998 119618
31913 119618 181236 249643 204061 105843 105407 223565 324610 276487 62857 -243169 -544151
31902 -544151 -750899 -800475 -674388 -413413 -124142 62453 98286 73111 93625 123530
31892 123530 46346 -116270 -192884 -109877 4490 43158 84277 204924 287493 193729 10236
31881 10236 -90938 -139792 -264140 -355594 -150310 306035 572461 351440 -95968 -269426
31871 -269426 -37017 271980 321307 128744 -40421 -3704 178716 310934 255820 20502
31861 20502 -290740 -537794 -573092 -327013 67181 332196 336201 245617 272241 362607 310705
31850 310705 104594 -64040 -114100 -155604 -228901 -210820 -59284 78170 109828 143190 257214
31839 257214 338167 297776 259941 345258 446324 428543 395410 508481 669006 652731 482326
31828 482326 378246 372364 268802 14117 -185457 -204333 -195617 -308466 -415381 -300031
31818 -300031 14091 289794 355069 230209 45939 -53731 6229 136304 128290 -95445
31808 -95445 -338250 -355404 -171755 -30679 -55032 -125508 -114059 -65186 -65054 -73565 -13222 65616
31796 65616 48870 -56761 -137152 -148252 -146710 -145385 -84984 16924 37975 -54036 -114595 -37320
31784 -37320 67986 56483 4824 91350 264968 260634 -8427 -274260 -248974 -2107 146530
31773 146530 45939 -131972 -167345 -84391 -78203 -215682 -346557 -347523 -323145 -429276 -576773
31762 -576773 -524838 -280109 -151829 -292264 -423328 -237324 120520 257238 103857 -36832
31752 -36832 29913 186254 287940 335326 301624 103085 -158860 -219515 -39928 107718
31742 107718 76663 58820 180060 212875 -27494 -285911 -220241 52878 145755 -1478
31732 -1478 -104912 -52383 -29045 -110869 -120662 8948 66072 -82279 -228712 -124564 143443
31721 143443 282821 190000 23576 -60235 -64466 -34339 64133 260096 445144 453651 303003
31710 303003 233610 396325 585812 475249 99533 -130348 34631 359416 472327 317445
31700 317445 74561 -171986 -428199 -585357 -501170 -244090 -32852 38517 35542 6861
31690 6861 -37125 -40251 8371 -20751 -198417 -346192 -280920 -133944 -142148 -232295 -158823 24497
31678 24497 36074 -110104 -100914 91597 90643 -247396 -513950 -342600 34089 153585 -15089
31667 -15089 -133358 -48414 61157 32005 -74338 -114381 -38818 76801 91251 -60351 -243387
31656 -243387 -264547 -164727 -169663 -287784 -234371 92662 357302 257565 -2715 -38282 116595
31645 116595 113070 -108912 -225157 -49380 201199 251807 108960 -59347 -173833 -251019
31635 -251019 -296544 -292717 -223600 -83766 74452 136646 68634 1090 32684 27543 -188086
31624 -188086 -481369 -526050 -274632 -43577 -45556 -105125 3276 168173 125697 -111785
31614 -111785 -266702 -189118 -17976 55914 3393 -103406 -209068 -266900 -230613 -128125
31604 -128125 -56652 -39909 19502 165898 264975 178254 -14 -38243 109430 232831 152505
31593 152505 -62135 -217329 -216811 -100295 23716 31128 -100701 -185910 -21979 248816 231409
31582 231409 -114486 -267407 152727 744633 825567 401955 113786 252299 420280 293995
31572 293995 136638 248121 396955 231980 -91050 -169294 -9687 54272 -30252 7333
31562 7333 228014 365293 304593 267929 367579 323230 -129280 -762278 -1058029 -813251 -335306
31551 -335306 -38406 -6737 -23394 76118 223639 297131 323435 381406 410857 305760 141543
31540 141543 80830 69033 -99531 -369760 -395757 -54214 312880 358777 158833 -40741
31530 -40741 -212773 -400226 -444334 -225857 13791 -26493 -225479 -236348 -39938 106037
31520 106037 171412 348242 570681 526431 212679 12983 80847 90760 -176178 -398072
31510 -398072 -181561 312268 558711 347691 -22835 -176730 -52142 145058 231531 230253
31500 230253 278093 374637 328445 47851 -243590 -280872 -144749 -108531 -172167 -94188 119067
31489 119067 163682 -19168 -63331 239018 533692 396557 -29163 -230944 -5076 383957
31479 383957 623127 624542 422364 84356 -234794 -358809 -273161 -130999 -62811 -75606
31469 -75606 -128868 -203946 -283190 -325832 -278837 -103085 169259 391776 391792 140214 -215363
31458 -215363 -494832 -609285 -578780 -526727 -604606 -782466 -787019 -453827 -63332 -21941 -235544
31447 -235544 -196830 223725 522831 325116 -32578 -47894 166066 131534 -179140 -324487
31437 -324487 -133479 65333 35358 -18388 117844 265921 160697 -101681 -211425 -96479
31427 -96479 37589 46526 -11017 -58089 -116656 -192159 -201902 -109362 -25278 -63956 -155711 -128066
31415 -128066 36599 161027 132376 65013 106193 200391 201879 138073 162987 278032 313703
31404 313703 213848 128814 157082 184509 82036 -92236 -194939 -177275 -83252 2684 -52288
31393 -52288 -323674 -640145 -688264 -409546 -94771 37379 118831 303485 407071 173137
31383 173137 -253316 -446776 -248270 87213 271796 256884 120570 -66835 -208604 -208950
31373 -208950 -103646 -28626 -29832 -33793 -9854 -6431 -7496 80110 239210 288716 111883 -153494
31361 -153494 -252715 -109975 90329 134163 42730 31301 180600 268475 72695 -245550
31351 -245550 -306324 -54998 160615 147093 161106 430381 689649 537760 56367 -307376
31341 -307376 -367450 -335645 -383376 -438986 -437250 -427713 -374718 -155096 162978 311809 187236
31330 187236 -20019 -134568 -196547 -267337 -285242 -235443 -241358 -350856 -420293 -340579 -210031
31319 -210031 -165737 -201618 -251517 -281260 -205061 89205 505768 731774 620159 402319
31309 402319 348039 390641 301054 85448 -46310 -33040 -29985 -128077 -218713 -186781 -88337
31298 -88337 -66622 -166747 -280965 -257328 -65015 146720 203109 118149 61150 94756 92656
31287 92656 -11102 -60284 82111 260348 204449 -70129 -253833 -148495 99373 222814
31277 222814 144424 -16103 -133736 -178476 -178992 -169681 -159522 -113471 10064 173226 251432
31266 251432 163892 -16043 -144239 -188050 -246015 -364632 -425909 -300153 -61380 61483
31256 61483 -45197 -253154 -359232 -288075 -93041 142359 330560 390759 330159 269378
31246 269378 308121 403916 445539 391127 267291 101825 -56859 -122514 -73006 -10211 -22843
31235 -22843 -59783 -42554 -14611 -46591 -84919 -58953 -53260 -172836 -301291 -228856 997
31224 997 121699 39657 -48573 7160 100181 93934 41493 45576 77187 71381 53005 33138
31212 33138 -78304 -309374 -492587 -447431 -217496 -1802 72551 1768 -171290 -348927
31202 -348927 -372139 -174113 92414 203010 114032 -28804 -96227 -81657 -25247 53338 130477
31191 130477 169462 167050 166939 205112 260083 270150 202827 105529 64728 101892 150143 161222
31179 161222 170106 193490 142437 -58555 -321059 -476177 -461602 -317318 -76243 189362
31169 189362 304707 190505 63680 187935 451024 478163 186748 -83718 -74982 70381
31159 70381 130825 147477 241908 339574 306964 181951 57734 -98027 -309002 -434908 -354149
31148 -354149 -166591 -39811 -2756 -47284 -232303 -493780 -578960 -414879 -309265 -485577
31138 -485577 -654433 -432476 6364 163276 -9329 -73846 151594 336456 234673 57145
31128 57145 42580 75242 3271 -9942 221148 514277 560536 385342 249086 210405 111854
$$ [...]
##END NTUPLES=NMR SPECTRUM
##END=
