##TITLE=31Pdec_LR-743-R2-B
 , 24 sc
 14.1.2022
##JCAMPDX= 6.0         $$ Bruker NMR JCAMP-DX V2.0
##DATA TYPE= NMR SPECTRUM
##DATA CLASS= NTUPLES
##ORIGIN= UXNMR, Bruker Analytische Messtechnik GmbH
##OWNER= root
$$ XWIN-NMR		Version 3.5
$$ Fri Jan 14 15:18:04 2022 Russian Standard Time (UT+4h)  she@DPX200
##.OBSERVE FREQUENCY= 81.013821
##.OBSERVE NUCLEUS= ^31P
##.ACQUISITION MODE= SIMULTANEOUS
##.ACQUISITION SCHEME= undefined
##.AVERAGES= 24
##.DIGITISER RES= 16
##SPECTROMETER/DATA SYSTEM= spect
##.PULSE SEQUENCE= zgpg30
##.SOLVENT NAME= CDCl3
##.SHIFT REFERENCE= (INTERNAL, CDCl3, 0, 248.564)
##AUDIT TRAIL= $$ (NUMBER, WHEN, WHO, WHERE, WHAT)
$$ ##TITLE= Audit trail, XWIN-NMR		Version 3.5
$$ ##JCAMPDX= 5.01
$$ ##ORIGIN= Bruker BioSpin GmbH
$$ ##OWNER= she
$$ F:/spectra/data/she/nmr/P31/1/pdata/1/auditp.txt
$$ ##AUDIT TRAIL=  $$ (NUMBER, WHEN, WHO, WHERE, WHAT)
(   1,<2022-01-14 15:16:53.45 +0400>,<she>,<DPX200>,
      <created by zg, POWCHK disabled, PULCHK disabled
       configuration hash MD5:
       00 E9 B6 7A A2 85 ED C7 34 08 36 98 17 FE 4E 26
       data hash MD5: 32K
       C8 C3 13 3A E4 2C A1 87 87 7F BB 95 73 90 C2 7B>)
(   2,<2022-01-14 15:16:56.57 +0400>,<she>,<DPX200>,
      <Start of raw data processing
       efp BC_mod = 2 LB = 1 FT_mod = 6 PKNL = 1 PHC0 = -9417.729 PHC1 = 291.8737 SI = 64K 
       data hash MD5: 64K
       84 CE B0 75 21 46 08 38 16 A7 15 C3 D7 A4 64 C1>)
(   3,<2022-01-14 15:17:28.14 +0400>,<she>,<DPX200>,
      <pk PHC0 = 57.87515 PHC1 = -201 
       data hash MD5: 64K
       A8 ED 76 93 AC 26 09 D3 B0 54 5C 1C 1C DA 77 90>)
(   4,<2022-01-14 15:17:31.15 +0400>,<she>,<DPX200>,
      <abs ABSG = 5 
       data hash MD5: 64K
       E5 61 48 64 E5 FF 68 E7 D2 40 BE 2A B4 58 B8 1D>)
$$ ##END=
$$ 
$$ hash MD5
$$ E9 EC BC E5 29 62 78 85 84 B5 AC 29 DD F0 6D FA
##$RELAX= 
##$RELAX= 
##$RELAX= 
##$RELAX= 
##$RELAX= 
##$RELAX= 
##$RELAX= 
##$RELAX= 
$$ Bruker specific parameters
$$ --------------------------
##$DU= <F:/spectra>
##$EXPNO= 1
##$NAME= <P31>
##$PROCNO= 1
##$TYPE= <nmr>
##$USER= <she>
##$AMP= (0..31)
100 100 100 100 100 100 100 100 100 100 100 100 100 100 100 100 100 100 
100 100 100 100 100 100 100 100 100 100 100 100 100 100 
##$AQSEQ= 0
##$AQ_mod= 1
##$AUNM= <au_zg>
##$AUTOPOS= <>
##$BF1= 81.014009
##$BF2= 200.13
##$BF3= 200.13
##$BF4= 200.13
##$BF5= 200.13
##$BF6= 200.13
##$BF7= 200.13
##$BF8= 200.13
##$BYTORDA= 1
##$CFDGTYP= 0
##$CFRGTYP= 5
##$CHEMSTR= <none>
##$CNST= (0..31)
1 1 145 1 1 1 1 1 1 1 1 1 1 1 1 1 1 1 1 1 1 1 1 1 1 1 1 1 1 1 1 1 
##$CPDPRG= <waltz16>
##$CPDPRG1= <>
##$CPDPRG2= <waltz16>
##$CPDPRG3= <>
##$CPDPRG4= <mlev>
##$CPDPRG5= <mlev>
##$CPDPRG6= <mlev>
##$CPDPRG7= <mlev>
##$CPDPRG8= <mlev>
##$CPDPRGB= <>
##$CPDPRGT= <>
##$D= (0..31)
0 1 0 0 0 0 0 0 0 0 0 0.03 2e-05 3e-06 0 0 0 0 0 0 0 0 0 0 0 0 0 0 0 0 
0 0 
##$DATE= 1642159013
##$DBL= (0..7)
120 120 120 11 120 120 24 19 
##$DBP= (0..7)
150 150 150 150 150 150 150 150 
##$DBP07= 0
##$DBPNAM0= <>
##$DBPNAM1= <>
##$DBPNAM2= <>
$$ [...]
##$SUBNAM3= <"">
##$SUBNAM4= <"">
##$SUBNAM5= <"">
##$SUBNAM6= <"">
##$SUBNAM7= <"">
##$SUBNAM8= <"">
##$SUBNAM9= <"">
##$SW= 501.771253377433
##$SWIBOX= (0..15)
0 1 3 0 0 0 0 0 0 0 0 0 0 0 0 0 
##$SW_h= 40650.406504065
##$TD= 32768
##$TD0= 1
##$TE= 0
##$TE2= 300
##$TE3= 300
##$TEG= 300
##$TL= (0..7)
0 120 53 12 22 120 120 120 
##$TP= (0..7)
150 150 150 150 150 150 150 150 
##$TP07= 0
##$TPNAME0= <>
##$TPNAME1= <>
##$TPNAME2= <>
##$TPNAME3= <>
##$TPNAME4= <>
##$TPNAME5= <>
##$TPNAME6= <>
##$TPNAME7= <>
##$TPOAL= (0..7)
0.5 0.5 0.5 0.5 0.5 0.5 0.5 0.5 
##$TPOFFS= (0..7)
0 0 0 0 0 0 0 0 
##$TUNHIN= 0
##$TUNHOUT= 0
##$TUNXOUT= 0
##$USERA1= <user>
##$USERA2= <user>
##$USERA3= <user>
##$USERA4= <user>
##$USERA5= <user>
##$V9= 5
##$VALIST= <valist>
##$VCLIST= <CCCCCCCCCCCCCCC>
##$VD= 0
##$VDLIST= <DDDDDDDDDDDDDDD>
##$VPLIST= <PPPPPPPPPPPPPPP>
##$VTLIST= <TTTTTTTTTTTTTTT>
##$WBST= 1024
##$WBSW= 4
##$XGAIN= (0..3)
0 0 0 0 
##$XL= 0
##$YL= 0
##$YMAX_a= 2509
##$YMIN_a= -2257
##$ZGOPTNS= <>
##$ZL1= 120
##$ZL2= 120
##$ZL3= 120
##$ZL4= 120
##$ABSF1= 248.5645
##$ABSF2= -253.2056
##$ABSG= 5
##$ABSL= 3
##$ALPHA= 0
##$AQORDER= 0
##$ASSFAC= 0
##$ASSFACI= 0
##$ASSFACX= 0
##$ASSWID= 0
##$AUNMP= <proc_1d>
##$AZFE= 0.1
##$AZFW= 0.5
##$BCFW= 0
##$BC_mod= 2
##$BYTORDP= 0
##$COROFFS= 0
##$CY= -3
##$DATMOD= 1
##$DC= 0
##$DFILT= <>
##$DTYPP= 0
##$F1P= 0
##$F2P= 0
##$FCOR= 1
##$FTSIZE= 65536
##$FT_mod= 6
##$GAMMA= 0
##$GB= 0
##$INTBC= 1
##$INTSCL= 5.30512e-09
##$ISEN= 30
##$LB= 1
##$LEV0= 0
##$LPBIN= 0
##$MAXI= 10000
##$MC2= 0
##$MEAN= 0
##$ME_mod= 0
##$MI= 50
##$NCOEF= 0
##$NC_proc= -5
##$NLEV= 6
##$NOISF1= 182.463
##$NOISF2= 159.3651
##$NSP= 0
##$NTH_PI= 0
##$NZP= 0
##$OFFSET= 248.5645
##$PC= 4
##$PHC0= -9359.854
##$PHC1= 90.87369
##$PH_mod= 1
##$PKNL= yes
##$PPARMOD= 0
##$PSCAL= 0
##$PSIGN= 0
##$REVERSE= no
##$SF= 81.014009
##$SI= 65536
##$SIGF1= 159.3651
##$SIGF2= -187.1042
##$SINO= 113.3802
##$SIOLD= 16384
##$SREGLST= <1H.CDCl3>
##$SSB= 0
##$STSI= 65536
##$STSR= 0
##$SW_p= 40650.406504065
##$SYMM= 0
##$S_DEV= 0
##$TDeff= 32768
##$TDoff= 0
##$TI= <>
##$TILT= no
##$TM1= 0
##$TM2= 0
##$TOPLEV= 0
##$USERP1= <user>
##$USERP2= <user>
##$USERP3= <user>
##$USERP4= <user>
##$USERP5= <user>
##$WDW= 1
##$XDIM= 65536
##$YMAX_p= 298713347
##$YMIN_p= -3738012
$$ End of Bruker specific parameters
$$ ---------------------------------
##NTUPLES= NMR SPECTRUM
##VAR_NAME=  FREQUENCY,     SPECTRUM/REAL,   SPECTRUM/IMAG
##SYMBOL=    X,             R,               I
##VAR_TYPE=  INDEPENDENT,   DEPENDENT,       DEPENDENT
##VAR_FORM=  AFFN,          ASDF,            ASDF
##VAR_DIM=   65536,         65536,           65536
##UNITS=     HZ,            ARBITRARY UNITS, ARBITRARY UNITS
##FACTOR=    0.620285442955139, 1,           1
##FIRST=     20137.2065510759, 0,            0
##LAST=      -20513.1999529892, 0,           0
##MIN=       -20513.1999529892, -3738012,    0
##MAX=       20137.2065510759, 298713347,    0
$$ Real data points
##PAGE= N=1
##DATA TABLE= (X++(R..R)), XYDATA
$$ [...]
39913h03M2475p7861n4402P0808J00654J4887k3851M0237Q3081K2971o7171r4415
39901E6610n6802k272K2928j0530p1102o9107K0485R3871O1663j3914k4041J7526
39889B5315K2573j8255m4730l7234j5206K1032N6588L5496m4064q4296k7673M2746
39877f7708L6884k576L386L1932K8542J9081L6352L1479k3851m7511J6943P6808
39865A39761L3075n3824p3618l9452j7636P109N4039M6931n3640j28626p1224
39854a57105L1330N0410K8893N9178P6312j2735j06048n1266P4348P6256l1442
39843C8131o7995q325M75p1412r1535k1791K5143J1957K5572O7207K8540p2147
39831a36180o4833Q2991J72553P2596q3838j18111m8314J2714M7227Q1466P2533
$$ y = [-803, 41672, -36189, -90591, -19783, 80871, 95758, 71907, 112144, 195225, 218196, 151025, 56610, -192, -2464, 20464, 9934, -61168, -130275, -109790, -15919, 45744, 31830, 7789, 25315, 47888, 29633, -15097, -52331, -67537, -46505, 10083, 45579, 1515, -82781, -110454, -67708, -30824, -33400, -30014, 1918, 30460, 49541, 85893, 117372, 93521, 46010, 62953, 139761, 172836, 119012, 45394, 5942, -11694, -4585, 49454, 96385, 42745, -85881, -157105, -125775, -75365, -46472, 12706, 89018, 76283, -29765, -81031, -6683, 69573, 38131, -29864, -38189, -37714, -109126, -200661, -222452, -197309, -185352, -159780, -92573, -64033, -136180, -201013, -118022, 54531, 127127, 43289, -74822, -123136, -110422, -63195, 18271, 90804]
39820I0804p228o9819l6057J9089j3835q1197m6444O7901R1515k3606j10898l9864
39808a59639Q1275P6892k1152l7345M9638P0898l7717j07824j7050Q4321M633
39797a3070j62973j70325J988J32127J08792N1697N3528L7244n5174j32923j09742
39786b58831k9703L6819Q1660R1509L8743k4060j5451J6776k7878p5722K9629
39775a36509J99825J64021q0670k05175n2481J22145Q2621l6839k9560L0655q883
39764D9150p9053n7579j9435o0919p9790J9216J07382O8247L0241J04272J26790
39753B08522m2661k04493j28241M1775M2453n3040j6408Q7214M3493p1244k4539
39742a17169J12375P6829r2001j10084M5744J18361L8424o836K7219j3028j17553
$$ y = [90804, 83576, 13757, -22300, -3211, -17046, -98243, -144687, -76786, 14729, -8877, -119775, -159639, -78364, -1472, -22624, -59969, -10331, 60567, 22850, -84974, -102024, -17703, -13070, -176043, -346368, -344380, -212253, -103461, -51764, 1764, 39008, -16166, -149089, -258831, -288534, -251715, -170055, -78546, -39803, -63863, -79314, -62538, -90416, -166138, -136509, 63316, 227337, 146667, -58508, -110989, 11156, 93777, 56938, 27378, 58033, 49150, -29903, -87482, -106917, -167836, -247626, -228410, -121028, -52781, -22540, 81732, 208522, 165861, -38632, -166873, -125098, -82645, -135685, -152093, -64879, -21386, -92630, -117169, -4794, 72035, -19966, -130050, -84306, 34055, 72479, 65643, 92862, 79834, -37719]
39731c7719r9755K0442J8509j03689q8846J06122K09608J01830j955M1981P7640
39720B44168k5642j43648j43439p7287p571R2702J68697R2051p5334j12528m181
39709G988L4940l9756k9834R5848J06401m6547r2949O6719J41919m0010j95418
39698I301n4350J75184J58157l6720j23143q6627j09317j70234r7112P6243J45416
39687a13202Q0707M1613P4017N8960l9704j07523p7056j2756J6078Q325j8756
39676h9297l8769k29R8040J57050R7599k2025r4608j03078q4928l8832L4667P4646
39664i764L9685k0777n3938p9492j03265o0673N8436J34977Q4226J088K0967J13069
39652A24539J35427M0735q2227j33173q3437K3857R6288O7789p715j4600M3180
$$ y = [-37719, -137474, -117032, -98523, -202212, -291058, -184936, 24672, 126502, 124547, 166528, 244168, 218526, 74878, -68561, -145848, -153419, -60717, 107980, 200031, 124697, 12169, 7988, 42928, 3172, -26662, 69186, 175587, 129040, 36091, 102810, 244729, 204719, 9301, -45049, 130135, 288292, 251572, 128429, 41802, -67515, -237749, -334861, -258618, -113202, -32495, 9118, 83135, 142095, 102391, -5132, -82188, -94944, -78866, -70541, -89297, -128066, -128295, -30255, 126795, 224394, 202369, 107761, 4683, -80245, -119077, -84410, -9764, 29921, 9144, -44794, -124286, -227551, -288224, -229788, -94811, -10585, -9497, 11470, 124539, 259966, 300701, 218474, 85301, 1864, 25721, 122009, 189798, 182083, 167483, 210663]
39641B10663L4046q0060j56405r2242P770N624n2161l6214M2687P2658M0041K8757
39629B5164N0098K5928n5343r9326n2191J6608K2700j5940k3494J7097N1765M6750
39617I816L2433L6282K8603j1358k5213L5206Q3082k59j40630j30288M2276J33618
39605I3568K3327p9244J2571J29892L3198j55800j41491M4766J03189k0440o7932
39594b4396N3334J07312m6305k01647j42761M0341J41162J22567N6770k8753j00804
39583b3180q3584M666L3487k8859n7436l045J6324m9387o7101M1071J47764J37860
39571F8580Q0522N3104m411j11491j26795J8155J46430Q6250o2287j00803l2303
39560A4951O474j0008j5615j8636n6758o2314M3782J74321J58362k2514k07513
$$ y = [210663, 244709, 164649, 8244, -83998, -76228, -70604, -122765, -158979, -116292, -43634, -3593, 25164, 75262, 101190, 45847, -53479, -105670, -89062, -66362, -82302, -105796, -88699, -36934, 9816, 42249, 78531, 107134, 95776, 70563, 105769, 188851, 188592, 47962, -82326, -40050, 93568, 116895, 37651, 50222, 180114, 213312, 57512, -83979, -39213, 63976, 43536, -24396, 28938, 136250, 89945, -111702, -254463, -214122, -72960, 49607, 106377, 77624, -23180, -106764, -102098, -68611, -97470, -154906, -157951, -141627, -191014, -258115, -217044, -69280, 68580, 149102, 202206, 197795, 86304, -40491, -22336, 124094, 210344, 148057, 47254, 14951, 21425, 11417, -4198, -22834, -79592, -141906, -98124, 76197, 234559, 212045, 4532]
39549D532k43830j10887R6703K27872J72337j9534j62177j39034k3493M5553K9193
39538a22765j6079k6299K9258J19510J44456M4630q3530r2561P533P9544P4965
39527A58662N3754J3449r5112j88279j21257M3201Q9028L097j21J29066J64745
39516B50233K442j37111p1295N0723K0010r8938j20201l1834N8474J09561J11082
39505A43146K5777q8188p6338O0099J15465J0324o9092p789L5985m6540q0836
39494B2013N8167J60050K0887j76705j54860j187J4456q6922p5042N3066Q8829
39483g7248L83l9814J4571L8842R325L0982R1781N5294q3504j64712j05509J2720
39471b16889R6010J11528M2589p1257j06480k2189L6748l1319q4182K5428J55982
$$ y = [4532, -239298, -350185, -253482, -25610, 146727, 127193, -34984, -174018, -197511, -151958, -122765, -138844, -165143, -135885, -16375, 128081, 172711, 89181, -3380, 4153, 83697, 158662, 212416, 225865, 130753, -57526, -178783, -135582, -46554, -43457, -43578, 85488, 250233, 252675, 115564, 44269, 94992, 115002, 16064, -104137, -135971, -77497, 32064, 143146, 168923, 80735, 4397, 64496, 179961, 190285, 121193, 113404, 149389, 102849, 22013, 80180, 240230, 261117, 84412, -70448, -71635, -57179, -144101, -219143, -166077, -77248, -76865, -116679, -102108, -63266, -53941, -22959, 68822, 124116, 40612, -124100, -229609, -216889, -120879, -9351, 33238, -38019, -144499, -166688, -129940, -161259, -245441, -220013, -64031]
39460f4031R1882p0510o7199Q0931J01913o0116j54897m5112R8569J07019M4988
39449F3437K3373O464o6539j37231j22197l7540M5416Q0111N2430j835M852R3718
39437D459J37544K8622j18879j03225N6582J34318K3078j31247j53277m0839R3133
39426f9731J53358J03269k2711j24863j32177q1750l9919L220P3243J16573P9863
39415E8375J8627R308K2412J522j5287J5592K4979n0640j22638p9413K4970O8418
39403b3775N3024M1347J3191m0741j3932J25162J80842J0537j84302j34649N3299
39392H0003O5152j00104j50137j2261O7138k0545p2049L4973J19687K8362j02257
39381f2038r5300j4454o431m4885j3941P9674J29893Q3166k7234j21125j04647
$$ y = [-64031, 27851, -42659, -109858, -28927, 72986, 12870, -142027, -187139, -88570, 18449, 63437, 86810, 93274, 26735, -110496, -232693, -270233, -224817, -144706, -92276, -94111, -89259, 4459, 142003, 170625, 51746, -51479, 5103, 139421, 162499, 31252, -122025, -162864, -69731, 83627, 186896, 164185, 39322, -92855, -174605, -214524, -211304, -138061, -21488, 58375, 77002, 86310, 108722, 110244, 94957, 110549, 135528, 84888, -37750, -117163, -92193, -23775, 29249, 70596, 83787, 43046, 29114, 154276, 335118, 345655, 161353, 26704, 80003, 145155, 45051, -105086, -117347, -50209, -70754, -142803, -107830, 11857, 40219, -62038, -157338, -171792, -178223, -223108, -237049, -157375, -27482, 55684, 28450, -92675, -197322]
39370a97322L4185J51223R9890m4441q1475J67J9482o9275r5463J3040Q8136J3171
39358f8682p7824m4985K2083p306o0513p652Q8085Q1780J2612L9203J55033J77282
39346C09116K9282j38556j58464n3397K8955J4436l5699l4026K2932P0638O7382
39335A22599K5376l8145j15065j53626p4403J01908K17256J53772o174r0219n7537
39324H5742o704l540j9074k2509k4369k4579m552K8664N2952O3479M3560l8904
39312A30166j40307j32022K0023J55756J25171O245k8009J9808J0412p5816j13197
39301b1770m8840K7618M0223P957l3095o2021m0033L3900O4992j2973j01032o5361
39289b10435M7372Q5790L6585J4161M4275M4888L045j1363M236o319k0086K1221
$$ y = [-197322, -163137, -11914, 87976, 43535, -37940, -37773, -18291, -87566, -183029, -169989, -81853, -68682, -146506, -191491, -169408, -176714, -237227, -244879, -156794, -75014, -62402, -23199, 131834, 309116, 338398, 199842, 41378, -12019, 16936, 31372, -4327, -38353, -15421, 55217, 122599, 147975, 109830, -5235, -158861, -233264, -131356, 85900, 239672, 233498, 143279, 85742, 79038, 75498, 56424, 33915, 9546, -15033, -19585, 9079, 62031, 125510, 169070, 130166, -10141, -142163, -122140, 33616, 158787, 165032, 137023, 156831, 167243, 91427, -21770, -70610, -42992, -2769, 5188, -27907, -89928, -129961, -96061, -31069, -44042, -145074, -210435, -163063, -77273, -40688, -26527, 17748, 62636, 65681, 54318, 58554, 52235, 32149, 53370]
39277E3370O3197J9993l9527M051P5353P070j38135j25479N6756J48397K7782
39266A52828j06921p2886L2467M1023k2347m1424j4455j2687m7014q3215r4017
39255b68648l5520J11272K34901J76673k8289j48986o3285Q5756J09752P866r4942
39244H6550j12641l2938R4661J55082O9151p1081r6860m698N0491J2939j0414
39233A40242K6022K3545n6773j03055m9260J2881J586l8462n9813q6091r4867
39222b84045l988J49829J97898Q5942m2577q3573j00823j35338r6619M2464J41869
39211a28961J12765N4367N0106K3128o8205r5878Q445Q3256q584j26772p0430
39200a66763R2038J37930L4687n4208m5596j4038k2184m3908m5602k0619L4659
$$ y = [53370, 116567, 136560, 97033, 101084, 176437, 183507, 45372, -80107, -23351, 125046, 152828, 45907, -26979, 5488, 46511, 24164, -17260, -31715, -44402, -91416, -174631, -268648, -304168, -192896, 42005, 218678, 190389, 41403, -21882, 63874, 173626, 181492, 86550, -26091, -59029, 35632, 190714, 259865, 188784, 91924, 87226, 137717, 150656, 140242, 166264, 189809, 133036, 29981, -19279, -6398, -4812, -43274, -103087, -189178, -284045, -288033, -138204, 59694, 145636, 103059, 19486, -81337, -216675, -313294, -270830, -128961, -16196, 38171, 88277, 111405, 43200, -52678, -44233, 39023, 30439, -96333, -166763, -74725, 63205, 97892, 43684, -1912, -15950, -38134, -82042, -127644, -148263, -113604]
39189a13604R0400Q1789J5527n123N5113P9969j5026j29707j32818n9758k1512
39178a54750j7042J7320N9042M9018J7523K2034L1314L516j956O7609J21667N3974
39166B69269o5957r2236l1993q378m5575o2347m2060l7042l1251K8034Q1685K4351
39154a3500q5929p6390N9286J24315K1776r3737o5057L3559M8117j11J5486P6375
39142D4190L2945j28941k16691j00356Q2375J11886l081n0788O4803J87185J39496
39131A63023l4338j52175j29469k9798N9049R4132O3442J588j2710M0370O8647
39120A31761O839o1736m0492K605m6717j19607n5960J04509J51955M3459k5190
39109I1426N3064J25248M2228j06415j57934j12491n9059n459O5442Q4905N25
$$ y = [-113604, -23204, 58585, 74112, 68989, 124102, 204071, 189045, 59338, -73480, -133238, -154750, -171792, -154472, -95430, -46412, -28889, -6855, 24459, 27975, 26019, 93628, 215295, 269269, 203312, 111076, 79083, 70705, 25130, -37217, -79277, -116319, -147570, -119536, -37851, -13500, -99429, -175819, -116533, 7782, 29558, -64179, -129236, -95677, -47560, -47671, -32185, 44190, 77135, -51806, -268497, -368853, -286478, -174592, -177673, -228461, -163658, 23527, 163023, 128685, -23490, -152959, -182757, -123708, -29576, 33866, 35454, 22744, 63114, 131761, 138600, 76864, 36372, 38977, -7740, -127347, -183307, -78798, 73157, 116616, 91426, 144490, 269738, 311966, 205551, 47617, -64874, -123933, -129392, -63950, 20955, 21480]
39098B1480r5972q8046j2305J7001k919J1966O4876P3314J3544m8975p0805p4017
39086a90858p3950m5845J9499Q2848R8948O4906J7550q228j5674k9162l6822O674
39074a10114Q8262J10543K6600o3595m9422K0639L0612l038J6411O0865J9293
39063A47056p2883o2989M4251O9377l4977r3349q256P7774L9611k8260j3500J1334
39051G5189l9967p3425J3164J15291Q3373k4383n6794l0270n9030j09803n4237
39040a60892Q0065J30853O0810j542J5697M2933K2285j3843l8722o5345o9475
39029B824j4299L8019j5823j31260j38404L311J26167J01095J8710J7618N5531
39018F3489l76j26339j52712j8331J33059J54790Q0161L1612L5760K7651j2507
$$ y = [21480, -74492, -162538, -174843, -157842, -160761, -148795, -83919, -10605, 2939, -46036, -116841, -190858, -264808, -310653, -291154, -208306, -109358, -44452, -26902, -35130, -50804, -79966, -116788, -110114, -21852, 88691, 115291, 51696, 2274, 22913, 53525, 50487, 66898, 127763, 147056, 74173, 11184, 55435, 124812, 89835, -3514, -11770, 66004, 105615, 77355, 63855, 75189, 35222, -38203, -25039, 90252, 173625, 149242, 92448, 62178, 3148, -106655, -160892, -80827, 50026, 110836, 109294, 124991, 167924, 190209, 176366, 137644, 72299, 2824, -11475, 26544, 10721, -120539, -258943, -255632, -129465, -28370, -9660, 7958, 63489, 63113, -63226, -215938, -234269, -101210, 53580, 133741, 165353, 201113, 228764, 216257]
39007B16257l8912m2221o3061r1794n9338L8352J02647O8453o127l8669k8084
38996E7503m823L6806Q7315Q8146K4861k7915k7733l5390q4376r2594j0675N7198
38984F8323J0683p6146q3957m1838l6151l2637L4810R6673N7807j7463k4337k0162
38972f4395r3102j39163k5957J19922Q4577m7860j3287J62407J73735n4066k26811
38961a24000j45376K4471P7900O6832J03969J24008K8535j12244j63714j02863
38951b22482R535J05544J08714L207p8569j1021R5616M2566j05887j00561O3241
38940i0097J23378J499p5917L874O0357q904l4975P0661J14081k1899j33423m0894
38928c2259J08698J18578N1289K8158j4751j27415j58785k0858J00787M7020m4983
$$ y = [216257, 177345, 135124, 72063, -19731, -79069, -40717, 61930, 130383, 124256, 85587, 57503, 52680, 89486, 176801, 264947, 289808, 261893, 234160, 198770, 114394, 21800, 11125, 68323, 79006, 2860, -81097, -122935, -159086, -191723, -156913, -60240, -2433, -19896, -44233, -64395, -157497, -296660, -322617, -202695, -118118, -165978, -179265, -16858, 156877, 102811, -124000, -269376, -244905, -167005, -100173, 3796, 127804, 156339, 44095, -119619, -222482, -212947, -107403, 1311, 4518, -74051, -85072, 10544, 53110, -52777, -153338, -90097, 33281, 34780, -41137, -37263, 23094, 14190, -20785, 49876, 163957, 142058, 8635, -32259, 76439, 195017, 246306, 274464, 259713, 132298, -26487, -47345, 53442, 100462, 55479]
38917E5479j7091K0657n6880j07812P591J21138M1066q5323l2033R2422N1934
38906I1148p9689o4794N9722O9446k9948m1555M2739N2624k3107l7152J6958Q231
38894F4623o3795q0976m5067m8254o4246j5958K8382k2867o7083K4660J39122
38883a51459J05887K0095N9407J14628k1198k05173j16388J71737K43884m104
38873B17316k05581j09992P9498J02929J8167q141J0943Q26J163M2406L3160p2033
38861A10661j50968r5916J8299O2546L0093r396k6419k4305k443K2196K9042M0628
38849D018P7611R0556L5412k4906j3567J7524k3606r3607q2670p113K9479J7350
38837B6481J7883J6563k9728o0446m955O1633M1279M749N4166R4280j5433j72736
$$ y = [55479, 38388, 59045, 2165, -105647, -98056, 23082, 64148, -21175, -53208, 39214, 91148, 11459, -53335, 6387, 75833, 45885, 4330, 47069, 99693, 76586, 39434, 56392, 64623, 828, -80148, -125215, -173469, -237715, -253673, -225291, -248158, -315241, -290581, -151459, -45572, -25477, 33930, 148558, 127360, -77813, -194201, -22464, 221420, 217316, 11735, -98257, -18759, 84170, 102337, 94196, 105139, 105965, 107128, 149534, 182694, 110661, -40307, -136223, -117924, -55378, -25285, -34681, -61100, -85405, -87848, -65652, -36610, 4018, 81629, 172185, 207597, 182691, 169124, 186648, 163042, 69435, -13235, -20348, 9131, 26481, 44364, 60927, 31199, -29247, -34202, 27431, 68710, 73459, 127625, 221905, 206472, 33736]
38825C3736j70773m8068m746l3561L6972J67491J35616m7097j10145K2823J08518
38814I0766R366r5141n6841j025n0807r2074p811R0381O4384j2576r191L9046
38802c1523L3632j888K66J6758J3801L7068R3423P3920o9929j93261j42568K2329
38790a47972J21110Q9310O827m2390l6129R178M7679L2035k1678m9796m2368m9788
38778h3982p1202l7681O1031J34388J17016M7434j1718m4235m6223j3342J3966
38767F5452j7832p9735q5763k5854K0959J7062J2822M5707Q0079O5671p791j08343
38755a7566j60521q9778O2419J34711M7313p3510q0642j6447Q08q153L7652Q1481
38743h2233J9865p8708o6734K4851M8191Q513K9751Q7440M0872p7420p9704M6457
$$ y = [33736, -137037, -185105, -189851, -223412, -186440, -18949, 116667, 69570, -40575, -17752, 90766, 100132, 4991, -51850, -52875, -103682, -195756, -203567, -113186, -48802, -61378, -70569, -31523, 2109, 221, 487, 17245, 31046, 68114, 161537, 235457, 165528, -27733, -170301, -147972, -26862, 62448, 69275, 26885, -9244, -66, 47613, 79648, 57970, 8174, -34194, -83982, -155184, -192865, -131834, 2554, 119570, 167004, 155286, 111051, 64828, 51486, 65452, 47620, -32115, -117878, -143732, -122773, -105711, -92889, -47182, 32897, 98568, 90777, -17566, -178087, -267865, -205446, -70735, -23422, -96932, -177574, -194021, -193213, -201366, -163714, -82233, -62368, -141076, -207810, -182959, -134768, -126255, -96504, -9064, 31808, -45612, -125316, -78859]
38731g8859R7566m557r1156m0593M7702O2706M3907L8147j324p2043o6011M0035
38719b4480J05098L6189o6171o8990J0669O3862L1150o2573j30167p7285P0805
38708a11893J40303L1894j02288p4850L4828K1007q6918q0931N2683J19094O3956
38697F885K8784M6360l112j02308q7374K6228L9735n3188l9557R3414R6603p2988
38685b0518j30135K9541J15377l8319j50809R042J87179P3116j55190j31876Q9880
38674a22712J64697L1234o1861k0369J1o2886q5546k4091J5304p077j4600J1700
38662a76196J7891K3911Q6284J40460Q2202k5067l4655K0821k2392j56885j86721
38651b30347m3067J04397J14550N9303N6182Q0081M8436k2219n2719k7497J62
$$ y = [-78859, 18707, 14150, -77006, -117599, -69897, -7191, 36716, 74863, 73539, 1496, -64515, -24480, 80618, 116807, 50636, -18354, -7685, 56177, 87327, 24754, -105413, -182698, -111893, 28410, 60304, -41984, -116834, -82006, -60999, -147917, -228848, -176165, -57071, 6885, 35669, 82029, 78917, -23391, -110765, -84537, -44802, -97990, -137547, -44133, 52470, -20518, -150653, -121112, -5735, -44054, -194863, -185821, 1358, 74474, -80716, -212592, -122712, 41985, 73219, 11358, -9011, -9000, -71886, -157432, -181523, -166219, -173296, -187896, -176196, -158305, -134394, -48110, 92350, 174552, 149485, 114830, 135651, 113259, -43626, -230347, -273414, -169017, -54467, 4836, 61018, 141099, 189535, 167316, 114597, 87100, 87262]
38640H7262o718l4730n2084m1983j1161K4964O2400R5275Q6527K504j07914j34724
38628c0382m6439N2216N0756l3242r9486q9173j3184Q6307J43431R2231m8076
38617F4959j49830j06599L5256J28567R4177m078m5886J0823Q3641N7961o8316
38606A00675j65557j30388j6695N0467M2611K3550J8871k325l3892k7475K2859
38595a17299P6927J10241J01087Q451j35568j83582n9324Q7269P6097k7851l6310
38584i9862L5982J6514r1499j05728m587K6899n5852o6275O0465J22680L712j10901
38572b68452m9185O4342M8646l0928k6347J5505k0218o6161L197J16368J16304
38561i6929L5195K2091O7121L4522p1247j03864l1340J8750j2141l0796K1732
$$ y = [87262, 80544, 45814, -6270, -48253, -59414, -34450, 27950, 123225, 209752, 212256, 104342, -30382, -76821, -24605, 26151, -7091, -106577, -195750, -208934, -122627, 20804, 113035, 64959, -84871, -191470, -156214, -27647, 66530, 62452, 16566, 27389, 111030, 168991, 100675, -64882, -195270, -211965, -161498, -118887, -95337, -76466, -78791, -112683, -140158, -117299, -40372, 69869, 170956, 179407, 43839, -139743, -199067, -111798, -35701, -63552, -99862, -63880, -47366, -138865, -244593, -249180, -222281, -278133, -344408, -283943, -161263, -157551, -268452, -317637, -253295, -204649, -235577, -261924, -246419, -266637, -332798, -329601, -213233, -96929, -61734, -39643, 27478, 62000, -9247, -113111, -144451, -125701, -137842, -168638, -146906]
38550a46906O7583L8111q283J2046P8429J06428O0396k7548j10011j49073j14791
38539a93619r675R9618J15187J0028j15282j28426k4422P1819P8947N0250M8674
38528C099L6424k6021p3409m3425J846p368p797O5459J10136J5799j00258n2850
38516g8365Q0842O2313j02252j51980M314J46617J05331l757j7258L6328N8206
38505A40339M2857P483o5368j24747p0363N1811P0357k5582m7322N8751R1454
38494A29670n4440j69620n5122J43840J53507k6362j57809j12460Q088N6554N963
38483g8191n0576k365J38615K02166O4468j36478j54736P078J07746M6073j9907
38472A23893J6506M8573P87k4737K7061L6036n7543j18972o2856o597l7673n4716
$$ y = [-146906, -79323, -41212, -49495, -37449, 40980, 147408, 207804, 180256, 70245, -78828, -193619, -203294, -103676, 11511, 21539, -93743, -222169, -246591, -174772, -95825, -45575, 3099, 39523, 13502, -59907, -103332, -101486, -108854, -116651, -51192, 58944, 74743, -25515, -78365, 2477, 64790, -37462, -189442, -185128, -38511, 66820, 63063, 45805, 82133, 140339, 183196, 190679, 125311, 564, -69799, -17988, 52369, 26787, -20535, 38216, 129670, 75230, -94390, -149512, -5672, 147835, 121473, -36336, -148796, -140708, -84154, -78191, -128767, -131132, 7483, 209649, 274117, 137639, -17097, -10019, 97727, 143800, 123893, 140399, 188972, 189759, 165022, 192083, 228119, 170576, 51604, -11252, -17849, -55522, -110238]
38460a10238J2220N6104K1434L4896J40617J60465J0694j02457k6395N5997n2646
38449B00691k01523j47411K7293O9872k0112l7817O3495J47041J51914J18964
38439C72407L2057j24591k21649j28552N8167J36608Q2525K1440J384j5468j8696
38428A95632Q479J657o1147o2425N2363J14432j8443j90212j62506J5025J01729
38417e416L9813k3249j7015n557q151J4746L6027J6027J9600R1232J04652m8173
38405B14536k13677j69450J5547Q0777j2748n1397N0800J20200L0579r2830p5186
38394a02849O3784J63413J25087j764r0168p4954l1278o5535j30220p7512P1929
38383a50067J07460k8841j00471N2821K21108J42397o8061j04034L7237P5227
$$ y = [-110238, -98018, -41914, -20480, 14416, 155033, 315498, 326192, 223735, 197340, 253337, 200691, -832, -148243, -120950, -51078, -71190, -109007, -45512, 101529, 253443, 372407, 404464, 279873, 58224, -70328, -12161, 124447, 206972, 228412, 229796, 214328, 195632, 204111, 205768, 144621, 82196, 134559, 248991, 230548, 40336, -122170, -107145, -5416, 34397, 11148, -5867, -11424, -19575, -4829, 31198, 47225, 66825, 158057, 262709, 214536, 859, -168591, -153044, -72267, -85015, -136412, -85612, 34588, 65167, -27663, -102849, -39065, 124348, 249435, 247671, 157503, 82549, 51271, -14264, -144484, -221996, -150067, -42607, -71448, -171919, -119098, 102010, 244407, 176346, 72312, 109549, 184776]
38373A84776q0170j94787r0156J05499J71192P2070o0825j07735n4839J8594K7712
38362h669r344N427Q0696Q9785l0607j52264j34610k3236M8186M9853L1794J3437
38350c9552J0576O1303J22236P3988o6294j06501J8397R8045l0647k03954j83170
38339b45573j7135P6394M9733R635j7536o8045q3945N35R3188O7200k5213m4877
38327b05639J2701N8043P6903R7722Q9345L4969m709j8662q0562j51409o6389
38316a57687J46010J99543q416j81209q4470Q1109N7257l3883J6693P2302o8660
38305C8589k19424j00384J24368J05206o8571l4678J70963J74817m7175j19110
38295B4601N8695J38271n4376k32830j58954K756L8719J5201M7058O2141k93k9173
$$ y = [184776, 104606, -90181, -180337, -74838, 96354, 168424, 107599, -136, -54975, -36381, -8669, -18013, -12586, 68110, 157895, 127288, -24976, -159586, -182822, -134636, -84783, -52989, -39552, -28976, 32327, 154563, 228551, 162257, 55756, 74153, 172198, 141551, -62403, -245573, -262708, -186314, -136581, -126946, -144482, -212527, -296472, -295937, -202749, -135549, -160762, -205639, -192938, -134895, -57992, 39730, 129075, 164044, 159335, 140673, 60111, -91298, -157687, -11677, 187866, 179450, -1759, -86229, -5120, 52137, 18254, 34947, 107249, 38589, -180835, -281219, -156851, -51645, -120216, -154894, 16069, 190886, 143711, 24601, 83296, 221567, 167191, -65639, -224593, -221837, -183118, -167917, -120859, -58718, -59011, -88184]
38283h8184L8657P7536P877n1276o376M1512j3734j05215j19823m9451O1123J67610
38271c9744J86100O4088q3488q3822L5731Q3879J233p9273p0811k7777J248J8016
38259E380j6842j18345j51645M096K03344J94647N382r9178k6332N1889K1883
38248G4279l4023m9426o3357o9248j5903K8018m7958j56754j08050O3797J35891
38237b42734O0356J1661O0666Q5951L6015O270K5163J8879j014L2749M7393n9757
38225H1598j58004n0209J36715R5851j35709k01225r734J23977J9741j00004l3043
38214b30046Q8051R0358M4343N8874O8704O727m9062m5877m9359o1785J1979J30550
38202F3457J12749m4436j22901m6764N783n0262o1065M4873J05271L4402k0990
$$ y = [-88184, -49527, 28009, 35886, -15390, -21766, 19746, 6012, -99203, -219026, -268477, -207354, -39744, 146356, 210444, 126956, 43134, 78865, 162744, 163977, 84704, 13893, -13884, -12636, 5380, -11462, -129807, -281452, -277356, -74012, 120635, 126017, 26839, 507, 52396, 74279, 40256, -9170, -72527, -141775, -157678, -129660, -177618, -334372, -442422, -378625, -242734, -182378, -170717, -110051, -24100, 11915, 18185, 43348, 62227, 61213, 93962, 141355, 81598, -76406, -126615, 10100, 105951, -29758, -230983, -240717, -116740, -96999, -197003, -230046, -141995, -51637, -7294, 51580, 120284, 127011, 77949, 32072, -17287, -79072, -67093, 63457, 176206, 131770, 8869, -37895, -32112, -82374, -143439, -98566, 6705, 41107, 20117]
38191B0117J7157P834j01254j27003J1141J13041N1069k223Q6267J44356J8495
38180B38997j15569n1457P5417K1081j42921j50721K7802J64626J24620M802n4467
38169A42210k4276L5694M5469k5798j04571q5745J6830Q5903P1657K5034k8120
38158A54287r0899r3588K1129J28540N8027j12303j45504k8415J6471p4248j00924
38147b67427M2481J97711K14134J27474j639j59242k35116j00466J15663J37267
38137G0840j9136n8881P7967J13726m9155j33584R445J19665j0191j70552j12281
38126a62137M7076Q7730O0002R2544R6045l5947j60925j16857j4355k4907p1825
38115b03556j206J18691J30165N8510J4877j7223q1628r7451j2425N6980K8694
$$ y = [20117, 37274, 45108, -56146, -183149, -172008, -58967, -7898, -10121, 76146, 220502, 238997, 123428, 71971, 147388, 168469, 25548, -125173, -97371, 67255, 191875, 196677, 142210, 117934, 153628, 199097, 173299, 68728, -17017, -187, 85716, 157373, 182407, 154287, 63388, -30200, -9071, 119469, 177496, 65193, -80311, -108726, -92255, -166503, -267427, -224946, -27235, 186899, 314373, 312734, 153492, -81624, -182090, -66427, 70840, 51704, -7177, 70790, 184516, 135361, 1777, 11222, 130887, 120696, -49856, -162137, -115061, -27331, 32671, 125215, 221260, 185313, 24388, -92469, -106824, -131731, -203556, -204762, -86071, 44094, 102604, 117481, 100258, 18630, -78821, -91246, -34266, -5572]
38104e572J6846J02893J45016K0967j34956j50009q2038o4365o7680j8943K7833
38093b10008L2534Q4273J89921J69162l6557j86074r7540N0354K5890q0076o3970
38082a22091K1923J4428l1371K9162J21819Q1571l1035l5283M6004M6636l6772
38071A04991n8511J0959N9329L0100l3624q9818j03406l3576P0792P7826k7183
38060G879r8166p0194m6989n5879L0514J97697K02108l4554k28136j49470L3027
38049b12163O4642j3607n0149p7128j39031r4641J07685K17949O9049q6750K4282
38038a89862K18665J67609m1740q8603K0221K4658p9984o5470O4943P2235p0565
38027C2107j21924J2113J42903J15653j4172j33499j71343p6024R6923J50286
$$ y = [-5572, 11274, 114167, 259183, 280150, 145194, -4815, -86853, -151218, -218898, -237841, -210008, -177474, -93201, 96720, 265882, 229325, 43251, -54289, -3935, 21955, -58121, -122091, -100168, -85740, -117111, -87949, 33870, 115441, 84406, 49123, 95127, 141763, 104991, 46480, 57439, 116768, 146868, 113244, 23426, -79980, -113556, -42764, 35062, 7879, -90287, -160481, -207470, -263349, -232835, -35138, 166970, 132416, -95720, -245190, -212163, -147521, -161128, -211277, -288405, -427436, -522077, -414392, -196443, -127394, -214144, -189862, 28803, 196412, 154672, 66069, 86290, 110948, 30964, -34506, 30437, 102672, 32107, -89817, -77704, 65199, 180852, 166680, 33181, -138162, -214186, -117263, 33023]
38017C3023R779j00759J3302J75334J14675p5353j02727K8183O3237m1552q6047
38006C1095j3353K9241N018K9600R6549O8415n0495j06644n8726k867K7876N6008
37994A11717K4541q8766j27043J2988J35945L3407j33355q2023J00024J04898
37984I2333o6836j43621p1364l7759o1310J0653J23642P1519q2056p1845Q4602
37973a52042J11865j4849m6610M1784J6490j16772q6869J00004J17795p0512j04666
37962b04382J13659K06256j4228k01367q2536R7815P1160P750J14682J99607M2923
37951C51339j61167j45181k7715l5475p1849L3657J32126K7754j15824n9480O3668
37940h147R211j00944r699J68247J34285n7847j09023J0107Q3047O4142N9458
$$ y = [33023, 42802, -57957, -44655, 130679, 245354, 170001, 67274, 95457, 158694, 117142, 31095, 17742, 46983, 52001, 81601, 178150, 246565, 196070, 89426, 30700, 27833, 55709, 111717, 136258, 47492, -79551, -66563, 69382, 102789, -30566, -112589, -12565, 92333, 25497, -118124, -189488, -227247, -288557, -277904, -154262, -82743, -164799, -236644, -152042, -40177, -55026, -101636, -59852, -43362, -160134, -247003, -146999, -29204, -99716, -204382, -90723, 115533, 101305, -100062, -182598, -84783, -13623, -5873, 108809, 308416, 351339, 190172, 44991, 17276, -18199, -90048, -56391, 75735, 103489, -12335, -71815, -8147, 1064, -99880, -109579, 58668, 192953, 135106, 26083, 36190, 119237, 183379, 242837]
37929B42837L0760p5849q2629J15897K32602M5578j17736P1490K67838O7974q7370
37918G11392L68894Q56613M62524q7967R31528L159858L654787P91057k934545
37909G914141l849408j832266J3408j12508q61212o09640J31738J75605k49397
37900G20461k39236R7267O6695k21338j61852J26368N0871k91947k79434Q9212
37890d2933K07090m9191j71387J9442J25030k1130q3363Q1470J64389K7350n1165
37879B05602M6562M7194j48634k26144k6127J49324N9525r7955q9487j4534k4019
37868a18693m2545l976j9087j01028o1882J26693K10677P5796m9753K892Q2665
37857A01759M4456p089J3322l461q5398o8953O2319Q4767m8209p9807P0629J15004
$$ y = [242837, 273597, 197748, 115119, 231016, 463618, 509196, 391460, 462950, 730788, 798762, 711392, 1080286, 1936899, 2399423, 2311456, 3242984, 6402842, 10057629, 10848686, 7914141, 4064733, 2232467, 2245875, 2133367, 1272155, 662515, 794253, 969858, 720461, 481225, 578492, 645187, 423849, 261997, 388365, 439236, 147289, -132145, -42933, 164157, 114966, -56421, -36979, 88051, 66921, -16442, 65028, 229417, 256767, 205602, 252164, 299358, 150724, -75420, -101547, 47777, 107302, 9347, -80140, -94674, -118693, -161238, -165214, -184301, -285329, -347211, -220518, -9841, 65955, 16202, 19094, 101759, 146215, 139126, 152448, 148987, 63589, -5364, 56955, 141722, 93513, 13706, 84335, 199339]
37845A99339q3917k19225n0141J87839J94823O3830M514l8604j51512j68421J4574
37834d6901J46774J0681j75439j10506R3051J39297M1238Q643M5341J8877m0762
37823A30294l9544m6661j27551j40671Q290J19271Q723j45399q6422R7617J56021
37812f6032Q6652M1876Q227r6315j73407j02171J1925K4288Q969O6486Q7109j7847
37800a20240q2396K0855J00960k0061j51930n9033J13286J07840R112L4354J02405
37789E5152K7129p2374Q722J23433R541j97846j57171R6456K17933J15856J0231
37778B37062q426n5123j27360r9638j2675j5399o0836R386J39523J43061L8354
37767A87929j3077j4210o8638j17043n1493K6742k2007q6087n343R8305L7606
$$ y = [199339, 115422, -103803, -153944, 33895, 228718, 292548, 297062, 258458, 106946, -61475, -46901, 99873, 110554, -64885, -175391, -82340, 56957, 98195, 106838, 152179, 171056, 130294, 90750, 44089, -83462, -224133, -215843, -96572, -87849, -233248, -319670, -222053, -66032, 20620, 62496, 70723, -25592, -198999, -301170, -289245, -264957, -255988, -189502, -102393, -120240, -202636, -181781, -80821, -100882, -252812, -311845, -198559, -90719, -81607, -47253, 55152, 82281, 9907, 18629, 142062, 151603, -46243, -203414, -106958, 110975, 226831, 237062, 228636, 173513, 46153, -53485, -66160, -81559, -142395, -133009, 6514, 149575, 187929, 174852, 160642, 92004, -25039, -76532, -49790, -71797, -157884, -163227, -64922, -27316]
37756b7316o6581q96J24774P2987p5475q2539J786k1239p8564R112J04426k5317
37744f4842k12614j24209J33699J77026J1514k0777R8211M3826k02416k67613
37734d28195l0836J81183J56175P2726Q9621J00108K9952j0828P155l3882j19755
37723A3424r6329J2468K2599n0491j1317J20240J12851m8987j22206k6407O2118
37712a2037O7020R3267J28791L9729j10202j07121K5166N3176m3827n9659L0092
37701A04395M0642l8164l5120K6507l2284j35962l6659J79258J50979j34875k73449
37690a84732r2742J03499P9200n573K1514N4291p055m7550K581J9873m8694p0192
37678a75580Q506O5144N4750P0450J02495L9274o5720n0044K9734k4847j58658
$$ y = [-27316, -93897, -94793, 29981, 102968, 27493, -55046, -53260, -74499, -153063, -143951, -39525, -64842, -277456, -401665, -267966, -90940, -79426, -100203, -1992, 41834, -160582, -428195, -459031, -277848, -121673, -48947, 40674, 140782, 170734, 159906, 167061, 133179, 13424, -82905, -70437, -47838, -98329, -109646, 10594, 123445, 74458, -47748, -74155, -12037, 54983, 148250, 277041, 316770, 206568, 99447, 124613, 177789, 133962, 74303, 104395, 145037, 106873, 71753, 98260, 65976, -69986, -106645, 72613, 223592, 88717, -184732, -277474, -173975, -94775, -100348, -78834, -24543, -31598, -79148, -76567, -56694, -105388, -175580, -167074, -101930, -47180, 23270, 125765, 165039, 99319, 49275, 79009, 54162, -104496]
37667a04496j30964K8150N2473n8740k7965J69273K29438N9223p1364k0274K7009
37656A51763l4813n8094m12l1326j56876j52899R432Q8841L0311N6789J92116
37645I4832J60233q8872k21552p5964P3341J2156q2474l1831L0646k5774o8906
37634b24165Q465P3680L4300J5895Q0902Q5691k4609r6913p7209j02331j71788
37623c98082r2340J30977K28773J16352K0372L9165n453j44495j35701O7706J65154
37612g572K5186p7661L9388J53420N9970q4150r0724m7764n9968k9830P8463R3966
37600E2724l5920j06282k0900M3770j550k377Q5245P7995m3601m6747R1492Q5706
37588A79555j15210j73433L0132J42251l3922j68526k915J71601L7975j75767
$$ y = [-104496, -235460, -207310, -154837, -213577, -241542, -72269, 157169, 216392, 145028, 124754, 151763, 116950, 58856, 58444, 27118, -129758, -282657, -273225, -184384, -154073, -97284, 94832, 255065, 166193, -55359, -131323, -57982, -45826, -128300, -160131, -129485, -155259, -224165, -215700, -142020, -107720, -91825, -10923, 74768, 50159, -46754, -123963, -226294, -398082, -490422, -359445, -130672, -14320, 6052, 45217, 39764, -104731, -240432, -172726, -7572, 17614, -60047, -20659, 132761, 192731, 108581, 17857, -29907, -89875, -119705, -41242, 52724, 16804, -89478, -110378, -66608, -68158, -70535, 14710, 92705, 49104, 2357, 93849, 179555, 64345, -109088, -78956, 63295, 29373, -139153, -142068, 29533, 67508, -108259]
37578a08259r9759J51095K06697L6771r7930r1682l9308K468K2328k1248q6494
37567a25321m7105O4729O4934l5888j8664J16123J06313o4363p9849J16261J54731
37556B51901r2219k15984K8220K53764Q7115k00628j78665M3604J06883M0683
37546A24674Q6618J62613L2104j87512j81201K7416J31854M1292n5908n4274l0897
37535I6779l6498m2266m0096k2404L9679Q6520Q837j17279p8463J00189J33950
37524A28948m8229j62196n5665M6922j5716n7238N7067J23936l357j14804l8984
37513a39316L2441o6773j32443J9900J69720O8612j12979r4544M3222O7125R798
37502a35237J8614K9987n9080j23030l4904O6003L3879o1J00816J81602P5536
$$ y = [-108259, -208018, -56923, 149774, 186545, 88615, -3067, -42375, -39907, -17579, -38827, -125321, -172426, -107697, -42763, -78651, -97315, 18808, 125121, 60758, -19091, 97170, 251901, 159682, -56302, -28082, 225682, 312797, 112169, -66496, -22892, 83991, 124674, 211292, 373905, 406009, 218497, 37296, 64712, 196566, 237858, 181950, 127676, 96779, 60281, 18015, -22081, -44485, -4806, 81714, 90551, -26728, -105191, -5002, 128948, 80719, -81477, -137142, -90220, -105936, -163174, -106107, 17829, 14472, -100332, -139316, -106875, -173648, -306091, -286191, -116471, -47859, -160838, -255382, -212160, -145035, -135237, -116623, -86636, -145716, -268746, -303650, -237647, -203768, -203829, -103013, 78589, 154125]
37491A54125p4648p8432k4879n0549m9488P4796J40674N11j40003n4046J01765
37480a74O3819q2643q0847N0980R4551J0450n9344n1700n002N9448R9521M1980
37468A41039o1109n5227M5622N6267m0062n6948K0199q109j37579j19917N0443
37457a65381P4273q9843j09097J00722J81628j0651j25041L2702J45999J1261
37447D6572p2434Q6145J60483o1609k16196j7691J85427M1697j53287k1501J82098
37436A59704N3385j99090j40722J02801J10765p1718p8681J00257J77304J05015
37426C19020L5895m9495j98294k11916J8437J76457o111k37052j22933J59658
37416a16334J84294j0859q0280m889k0715j08757p1574M6142O8801M1662O9537
$$ y = [154125, 79477, 1045, -23834, -74383, -123871, -49075, 91599, 92110, -47893, -101939, -174, 63645, -18998, -99845, -48865, 45686, 56136, -3208, -54908, -59910, -462, 99059, 141039, 79930, 24703, 70325, 126592, 86530, 29582, 49781, 41672, -95907, -215824, -165381, -91108, -180951, -290048, -189326, -7698, -18349, -143390, -110688, 35311, 46572, -25862, 60283, 220766, 159157, -57039, -74730, 110697, 152394, -893, -22394, 159704, 213089, 13999, -126723, -23922, 86843, 15125, -63556, 36701, 214005, 319020, 354915, 305420, 107126, -104790, -86353, 90104, 83993, -153059, -275992, -116334, 67960, 57101, -23179, -28068, -48783, -157540, -229114, -182972, -114171, -72509, -2972]
37405b972L6136j28189j84837O543J48821Q16j56340j7582J66744M0798j97245
37394b87307j60613L7232N2488l8376L9992J74012R8197m5016K1109J36297O227
37383C4242j83845p6174J80929J86822l08k8358P9553M1576q7467m9265O6314
37372A64019j832j36177n3770J16068N4135j35798j24233K2260O537j00513k0845
37361b10149J54275J37669J1705M0293J17462q051j72584o8401J41860R8760q7548
37350A55291p3314N0804j5763j29646K9921K61829J37729j93426k35077j2153
37340b3805L7987j02080p0674J12948R5557q2432n7359J25470R1694j10042q1891
37329f4627J43538J46688q3043j41510J2093J8080j38085r2144J54724J96805
$$ y = [-2972, 33164, -95025, -279862, -273319, -124498, -123682, -280022, -297604, -130860, -90062, -287307, -447920, -410688, -358200, -396576, -356584, -182572, -84375, -129391, -108282, 28015, 34242, -149603, -225777, -44848, 141974, 141666, 113308, 192861, 234437, 146970, 97705, 164019, 162187, 26010, -27760, 88308, 142443, 6645, -117588, -95328, -88791, -189304, -210149, -55874, 81795, 93500, 133793, 251255, 243204, 70620, 2219, 144079, 242839, 155291, 81977, 132781, 117018, -12628, 17293, 279122, 416851, 223425, -11652, -23805, 14182, -87898, -158572, -45624, 49933, -32499, -89858, 35612, 127306, 17264, -64627, 78911, 225599, 142556, 1046, 13139, 31219, -106866, -199010, -44286, 152519]
37319A52519j4782r0391N3448P6202q3235q8195J10804J56170l3776j15998K0032
37308A42798P5677n2225r6665K4066N4048p8091j30214l6697n610o2653j4010
37297a79576J01214M3105j29542j15059P9624J63493J00196R0592R2132p5448
37287A70731k37849r1498J72501J16898j58440j67736R8597J85281Q199o1491
37277C5193N0983L0512j38056j18816Q3570R5209j08227j57027o416J1513j07047
37266c28609j7480K35881K19449p3093j65854L7341J02997r6034j65588L1927
37256b19063J42196L9662M1019K08156J74402j20541k42689l9976R1416m8936
37246B5646j39037L581R7474j0834o3738N2517P8771o4187r1443O9371J13069
$$ y = [152519, 137737, 47346, 100794, 176996, 93761, 5566, 116370, 272540, 238764, 122766, 142798, 218475, 166250, 69585, 93651, 147699, 69608, -60606, -97303, -102913, -165566, -179576, -78362, -35257, -164799, -279858, -200234, -36741, 63455, 154047, 246179, 170731, -67118, -158616, 13885, 130783, -27657, -195393, -96796, 88485, 96684, 35193, 86176, 116688, -21368, -140184, -56614, 38595, -69632, -226659, -233075, -221562, -328609, -346089, -110208, 109241, 36148, -129706, -92365, 10632, -85402, -250990, -219063, -76867, -37205, 3814, 211970, 386372, 265831, 23142, -16834, 74582, 25646, -113391, -109810, -12336, -23170, -86908, -34391, 44380, -19807, -111250, -41879, 71190]
37235G1190m0377p9892P9701J25794l1682q8095L6142L6741j40556j56414M6937
37224a40511Q9550j21628j79897P4978K55132J28983o092P0378J27636n323j20513
37213A72693q6321q6150j72771j15274J04641J75811J9507o6174K2379L4222q4795
37202h2232o3105J25692J54161m1036j20345K8466J07673j865n8022Q898k5638
37191C2647j55753j03214J03867J27646l3025l8851R9118K2773k26463k10691
37181c81946P7422J65605k3525n3134J55598J71325p4194j24931R3603R1290k21989
37170a24876k86680Q4347L18245Q5750j53007j9084J63158N6305j04972n9587
37160d0401P785n8625n5674Q8341R7966q4483j32698K8498P1768n3856l540K18424
$$ y = [71190, 30813, -49079, 30622, 156416, 124734, 36639, 72781, 109522, -31034, -187448, -140511, -50961, -172589, -352486, -277508, -22376, 106607, 100515, 170893, 298529, 293206, 172693, 86372, 222, -172549, -287823, -183182, -7371, 12136, -54038, -31659, 2563, -82232, -145337, -19645, 134516, 93480, -26865, 1601, 109274, 107409, 49387, 58285, 32647, -123106, -226320, -122453, 5193, -27832, -66683, 32435, 55208, -171255, -381946, -304524, -138919, -162444, -215578, -59980, 111345, 37151, -87780, 5823, 97113, -124876, -411556, -327209, -8964, 76786, -76221, -95305, 67853, 124158, 19186, -40401, -32616, -91241, -146915, -58574, 39392, -45091, -177789, -149291, -77523, -131379, -134919, 83505]
37148H3505J70763j59727k31349O8899J77754j12924k61099K8235K78445J25719
37138A68221r6017p7952n2372j68190j26324J49688K40009J4392p6938J35320
37128A09837J93323r4805k51211k8000J29643m7117j57973M0189J54732k9749
37118A8869r9421J50320K64169P55j86815l4264L4947j98181k49893J18733L51407
37107A70626R0842j61634o382J23672j32341l09752j3990K65266L1676k90730
37097b32747j28599K31439K24512j3699m3110N1836k5994j40420o1719J9955q7640
37086b06186j38726M7216J76996O1252R184J82178K07570q5306k45616j9540J45854
37075A34876n5375k06509O504J71465l7249k05409R473J86269m9560k75512n5629
$$ y = [83505, 254268, 94541, -136808, -67909, 109845, -3079, -264178, -235943, 42502, 168221, 72204, -5748, -58120, -226310, -352634, -202946, 37063, 51455, -25483, 109837, 303160, 208355, -42856, -70856, 58787, 11670, -146303, -106114, 48618, 18869, -80552, 69768, 333937, 334692, 147877, 113613, 148560, -49621, -299514, -180781, 170626, 261468, 99834, 93452, 217124, 84783, -224969, -238959, 26307, 57983, -232747, -361346, -129907, 94605, 80906, 37796, 89632, 63638, -76782, -138501, -118546, -206186, -344912, -297696, -120700, -59448, -50264, 131914, 339484, 254178, 8562, -10978, 134876, 79501, -127008, -120504, 50961, 13712, -191697, -182224, 4045, -45515, -321027, -376656]
37064c76656K39876J38136q7632j1537J41297J2347j69614q0033O6312J1865m704
37053a20343J94154K58214j4894k01310k4429J00542j19932k54866J5928K38076
37043G1140K2422k17142n5314J71171P6452m6965Q7499J23414j76468l19505K4522
37032b38774L13484P8447k19224o5969J72150K4147j70544J2352K00348m4486
37022F1931l30536j55215J67130J50950K7795J50945K13490r1463l27956q0925
37012b13854K32248J40354j6756J63011K88693n0282m02130k46379N5361n320
37002e5054j34175P7440K62290M732k73459q6798J79548L2078j77255P363K09137
36991D5847k0373k63470l0621K66012J09011j25931M4053K18146p3133l61787
$$ y = [-376656, -136780, 1356, -86276, -97813, 43484, 55831, -113783, -193816, -127504, -115639, -120343, 73811, 332025, 317131, 115821, 91392, 191934, 72002, -182864, -166936, 71140, 93562, -123580, -178894, -7723, 68729, 21764, 109263, 232677, 56209, -263296, -238774, 74710, 153157, -66067, -132036, 40114, 64261, -106283, -93931, 106417, 61931, -268605, -423820, -256690, -105740, -77945, 73000, 286490, 195027, -132929, -213854, 18394, 158748, 141992, 305003, 593696, 543414, 141284, -105095, -49734, -55054, -189229, -111789, 150501, 155233, -118226, -205024, -25476, 6602, -170653, -163290, 45847, 25474, -237996, -268617, -2605, 106406, -19525, 24528, 242674, 169541, -192246]
36981a92246j05488K36413O5598k11244m963K84417O1228k74821r8105K31400
36971g811R8602j64954R101K54328P038l18691j09272K26791M9436k38751J7549
36960a76634L89219J37655l55308k76036J34815J23166j51215n8445K01646N7685
36950B6548k21359n4444K55319J01857k10553o7453K35019R6708j84269m6572
36940f9199J64600q3735l35773P371M04212J04036l79256j59801L73389K95378
36930C21222j50168j19691J93255N0967k86529q6225L31269J59121l04883j93146
36920h4808K80526K50046j69229j95730R6766N3795j93989p7659J58644m1524
36910G6838l15025m9529L07325M6965l48799o5778M23314J98091l33823j83352
$$ y = [-192246, -297734, -61321, 4277, -206967, -211930, 72487, 133715, -141106, -239211, -7811, 90791, -74163, -65062, 189266, 196304, -122387, -231659, -4868, 44568, -194183, -176634, 212585, 350240, -5068, -281104, -146289, -23123, -174338, -232783, -31137, 26548, -194811, -249255, 6064, 107921, -102632, -170085, 64934, 161642, -22627, -69199, 95401, 11666, -324107, -316736, 87476, 191512, -187744, -347545, 25844, 321222, 171054, 51363, 244618, 295585, 9056, -77169, 254100, 413221, 108338, -84808, 195718, 445764, 276535, 80805, 177571, 231366, 37377, -40282, 118362, 76838, -238187, -287716, 19609, 66574, -282225, -348003, 75311, 273402, -60421, -243773]
36900b43773L42580K53456k26792j53749K79636J70353k90752k19217K08687J52589
36890B73018j91235k4677L78955J80270l17591k12744K29110J08600l20079j80166
36880g6539K44472P9647l37170r3810M19950J97623l83051k29419L43747K09697
36870C75147l70631k52750L53508K95815k80615k62075K33071J46493l65092k35143
36860c62272L61535L25092k01027j38770L53220J98303m09140l36407K54916K22583
36850B68033l01931k06099L53208K53875l31049k60406K91013J86138l62981j98825
36840c09024M10542K36078m23236k32224N27115M00092m22664m16075L62031M07307
36830E39942l11597l51211L40042L48648l83245m44865K54116L36914k94366l06661
$$ y = [-243773, 98807, 352263, 125471, -28278, 251358, 421711, 130959, -88258, 120429, 273018, 81783, 57106, 436061, 616331, 298740, 85996, 315106, 423706, 103627, -76539, 167933, 247580, -89590, -183400, 236550, 434173, 51122, -178297, 165450, 375147, 4516, -248234, 105274, 401089, 120474, -141601, 91470, 237963, -127129, -362272, -737, 324355, 123328, -15442, 337778, 536081, 126941, -209466, 45450, 268033, -33898, -239997, 113211, 367086, 36037, -224369, 66644, 252782, -110199, -309024, 101518, 337596, -85640, -317864, 209251, 609343, 186679, -229396, 132635, 539942, 228345, -122866, 217176, 565824, 182579, -262286, -8170, 328744, 34378, -272283]
36820b72283L59409L71369k98254l01902L56212K92367m66724m70809K90148L53536
36810B13069l07758k48966M98500M22611m24492m26391M19023M36003m41565n02655
36800c62621L93103N38843k62762l49588M53943M71313m44615n31539M15013N85826
36790I06916l06698m49752N24346Q21599m7537m59829L9789K6110o56737m72194
36780g3987N17140M50886o73349p54453M28109P12536l34014o39505L15640N73170
36770E22173l51664n35831M38175N94601m66119o90372L69137O36156l68329n71026
36760d23099M89224P00254l89516o06531N16405P46416m24848p39515L43964N90371
36750H03125m90439o36792N49400O91548n53873o53408P20691Q35217p08448j000185
$$ y = [-272283, 87126, 458495, 160241, -141661, 214551, 506918, 40194, -430615, -140467, 213069, -94689, -343655, 154845, 577456, 152964, -273427, 145596, 581599, 140034, -362621, 30482, 569325, 306563, -43025, 410918, 882231, 437616, -93923, 321090, 906916, 600218, 150466, 674812, 1496411, 1448874, 989045, 1028834, 1054944, 398207, -73987, 443153, 894039, 220690, -533763, -105654, 606882, 272868, -366637, -50997, 522173, 170509, -365322, 72853, 667454, 201335, -489037, -119900, 516256, 147927, -423099, 66125, 766379, 376863, -229668, 286737, 1033153, 608305, -131210, 212754, 803125, 312686, -324106, 225294, 916842, 362969, -290439, 430252, 1265469, 557021, -443164]
36740d43164N12028Q61861n92676q59732P01269R87488o68444j020994O80358
36731A57994J102427n41173q21286R96630J214341r77750j555283N84351J294840
36722A455091p73879j453279P25504J505676o96360j508095P78331J669070o62920
36713A039139j590868Q17062J765717p86028j833180Q07829J916080q38184j997961
36704g00394R08352K153119q60633k060227J274619K599526j011706k469024J431914
36695A265546K991983j291395k927427K028077M141879j161525l391054K839134
36687D495218N871862n23719l095970N416636R435230L03327k489092J2792813
36679C2206305K1224861O065510M059769N1730829J04650726P8775347k4435173
$$ y = [-443164, 68864, 930725, 338049, -521683, 179586, 1167074, 498630, -522364, 157994, 1260421, 719248, -102038, 894592, 2108933, 1131183, -424100, 160251, 1455091, 681212, -772067, -46563, 1459113, 762753, -745342, 32989, 1702059, 1039139, -551729, 265333, 2031050, 1245022, -588158, 219671, 2135751, 1297567, -700394, 207958, 2361077, 1500444, -559783, 714836, 3314362, 2302656, -166368, 1265546, 4257529, 2966134, 38707, 2066784, 6208663, 5047138, 1656084, 4495218, 10367080, 9843361, 6747391, 12164027, 21599257, 21902584, 19413492, 32206305, 53431166, 59496676, 63556445, 115287274, 219938000, 298713347, 274278174]
36672B74278174j03222274q7798020k5419767J449225j3538756k0875997n482080
36665A9390505L688974m604436r144894p75136L910743k486488n941948Q2125
36657D119445L575721j343469m243174K28175K941925r21125l235378L40059K449252
36648C911431q39923k751467L51505K189470o40898k304265L81478J944742o02556
36639A639517k064260M29422J924187m13282j909931K47501J715901k49420j640906
36630c21271J43853J379958l31998j426983L32214J456543k34103j356542K41940
36621a16389J313854k48447j307693K28544J339496q8072j216269L7971J037434
36612I80429j80608j090234J55707J063042j78926j115594P6277J020985j24637
$$ y = [274278174, 171055900, 83257880, 57838113, 59287338, 45748582, 24872585, 19390505, 23079479, 18475043, 9330149, 8555013, 12465756, 9979268, 4037320, 4119445, 7695166, 6351697, 2108523, 2336698, 5278623, 4357498, 1122120, 1462179, 3911431, 3071508, 320041, 671546, 2861016, 2220118, -84147, 297331, 2242073, 1639517, -424743, 4679, 1928866, 1515584, -394347, -146846, 1569055, 1319635, -321271, -177418, 1202540, 870542, -556441, -224227, 1232316, 998213, -358329, -116389, 1197465, 949018, -358675, -130131, 1209365, 1121293, -94976, -57005, 980429, 799821, -290413, -134706, 928336, 749410, -366184, -289907, 731078, 606441]
36603F06441j091315j3212R88036N3017q75083q145Q64621O4577p34610K0703
36593a24970P35382j5498o71104J11823Q59930L79214N2113P29808P91301m67217
36583B380782j032732M1217O38348m34815j125676q5050P37085j27671q91263
36574A00225n6784P30694p932p46477n4735O32566l5441o54753P5329P71015J73989
36563I27696l48756L75024Q61693j28834j022572l37613N29964J9556o92101j27136
36553E6921O28649J43219n87296j87255M37081J4846n64273r7907N15484Q8094
36543D47563n09974j06215M85983J40644l84316m6086M14719M2461l99996j6746
36533F8037M01404R141l66000O8139M03509j48805n87840m5208M66526J1659m36656
$$ y = [606441, -484874, -498086, 489950, 542967, -332116, -340261, 524360, 588937, -145673, -124970, 610412, 594914, -76190, 35633, 895563, 1274777, 1326890, 2056698, 2847999, 2380782, 1348050, 1389267, 2027615, 1592800, 467124, 382074, 1119159, 991488, 100225, 43441, 774135, 766203, 19726, -35009, 597557, 562116, -92637, -17308, 753707, 927696, 578940, 953964, 1815657, 1686823, 664251, 326638, 856602, 876158, 184057, 56921, 685570, 828789, 241493, 54238, 491319, 506165, -58108, -156015, 359469, 447563, -62411, -168626, 317357, 458001, 73685, 27599, 442318, 484779, 84783, 68037, 469441, 478582, 112582, 180721, 584230, 435425, -152415, -197623, 268903, 280562, -156094]
36522a56094O2413N33737J1260n27710o7789M47761j9513n47544o1751N44327
36512B19097J31908m98766j87169M00200J78185k71200k986L65742j8653m32470
36502a16112l840M66841J9664n45559j73378M19601J49688l64816r2102L70781
36492A30768K2973n11436j67074M91186L36486k32806j71168K36221J03383k80994
36482d2461j50307J68283J2397k10174Q1083L30708n6602l82614O1945N12147
36472C24405R4448m77502k03079L51508J84498k61111p3446L22541P9537l43098
36462a299j05500L03580J8467m53571j74119L99487K71485k15917r8505L61685
36452C05793K58316k00473j78876J53353O3787k50241j22542K10030J27983r5749
$$ y = [-156094, -93681, 440056, 451316, -76394, -144183, 303578, 284065, -263479, -325230, 219097, 351005, -147761, -334930, 65270, 243455, -27745, -30731, 335011, 316358, -116112, -119952, 346889, 366553, -179006, -352384, 67217, 216905, -147911, -240013, 130768, 153741, -357695, -524769, -33583, 302903, 70097, -101071, 135150, 238533, -42461, -192768, -24485, -12088, -222262, -141179, 189529, 132927, -249687, -187742, 324405, 418853, -58649, -261728, 89780, 274278, 13167, -60279, 262262, 341799, -1299, -106799, 196781, 215248, -238323, -412442, -12955, 258530, 42613, -55892, 305793, 564109, 363636, 184760, 338113, 401900, 151659, 29117, 239147, 367130, 271381]
36442B71381Q1923K59378j24953n22775j99323L19479J64677k62364q6725L56514
36432B57212J86420l24266k79972J61154J70966j73087j67163J06419N3735j65140
36422a73722P004L19913J65888j89126q3535K61728J74455j89851k01834L5329
36412A26249k528j73112j9001K30885R7645j63625o1238J42223l6369k97906j17769
36401b74546K24315J79305m8137N485J16283j01523l13332q0300K34983J27215
36391F9748r9613L2446K27861L2738k43957j31200J15760P7831k9778R6972K02060
36380C50868P0282K0669J94857K18068O2087K00223N24290M58391M73117J633253
36370D206105L074105K270075j004372l422146k568084l68328J16718q15591q97582
$$ y = [271381, 353304, 612682, 487729, -35046, -234369, 85110, 249787, -12577, -99302, 257212, 443632, 119366, -160606, 548, 171514, -1573, -168736, -62317, -8582, -173722, -166718, 153195, 319083, 129957, 46422, 308150, 482605, 292754, 90920, 126249, 123721, -49391, -68392, 162493, 260138, 96513, 35275, 177498, 141129, -156777, -274546, -50231, 129074, 80937, 86422, 202705, 101182, -212150, -292450, -57467, 69748, -29865, 2581, 230442, 263180, 19223, -111977, 3783, 81614, 51836, 148808, 350868, 421150, 441819, 636676, 854744, 916831, 1117054, 1641344, 2099735, 2572852, 4206105, 7280210, 9550285, 8545913, 5123767, 2555683, 2187355, 2304073, 1488482, 590900]
36361E90900n545J93829l94488l60710L38327L91924k53222l54710J94001K60956
36351F01262k66127l42196J35885J94264k46783k65509J82784K02054k16044j70304
36341a90714L26585L35034j74110k67661J30762J46409k75113k66891K12795K75283
36331B52379j54122k02727K16092K37467k34136l21473J18560K38731j29711j81529
36321a60469K36950L09591j46208l14397N3951K13052r6735j99990J21939K04325
36311B22009j56879k90025L9273J94616q0082k16325K2508J32524o5787j05639
36301c03807J13476J20852j03599l7504K86636K52413j34807k07165Q2541P9459
36291A48495k50151k12956K31623L15988r4541k40284R2161K04628j27196k33392
$$ y = [590900, 585355, 779184, 384696, 23986, 362313, 754237, 501015, 146305, 340306, 601262, 335135, -7061, 128824, 323088, 76305, -189204, -6420, 195634, -20410, -190714, 135871, 470905, 296795, 29134, 159896, 306305, 31192, -235699, -22904, 252379, 98257, -104470, 111622, 349089, 114953, -206520, -87960, 150771, 21060, -160469, 76481, 386072, 239864, -74533, -20582, 192470, 95735, -104255, 17684, 222009, 65130, -224895, -185622, 8994, -71088, -287413, -264905, -132381, -198168, -303807, -190331, -69479, -173078, -210582, 76054, 328467, 193660, -13505, 69036, 148495, -101656, -314612, -82989, 232999, 138458, -101826, -9665, 194963, 67767, -165625]
36281a65625J16222K56494p8077k54542J9166J64194r8373k13884Q9014K65531
36271A00120K3930j38231N9924J66173n9116j73487L6336J37751n1622j06722
36261d944R7079R1154k10642k37185J58107L36620N786k64131q4940J30668L6560
36250E4132o3609N8150R9078q6594j52463K4301Q3408o4871m4158J76483J42555
36239B26412j71296k21270P7536J41968j74185k59833J22419L77044J52127q4777
36229A86145J4288Q9540j08077j95583N2530K15482J2583j83704p2049O7379j404
36218G7130m3465P1736O7246j27926j57546O7114J56725o249m3032J46682J56316
36207C64731j20950k41073l6705Q2854p3080j56927j2178N5981k7830N8237K95447
$$ y = [-165625, -49403, 207091, 129014, -125528, -106362, 57832, -40541, -254425, -165411, 100120, 124050, -14181, 45743, 211916, 152800, -20687, 15649, 153400, 101778, -4944, 92135, 183289, -27353, -264538, -106431, 230189, 235975, -28156, -113096, 17572, 54132, -9477, 48673, 147751, 61157, -91306, -67005, 16403, -48468, -92626, 83857, 226412, 55116, -166154, -88618, 53350, -120835, -380668, -258249, 118795, 270922, 186145, 200433, 289973, 181896, -13687, 38843, 254325, 266908, 83204, 11155, 78534, 77130, 33665, 105401, 172647, 44721, -112825, -45711, 111014, 104765, 61733, 208415, 364731, 243781, 2708, -33997, 48857, -24223, -181150, -193328, -137347, -165177, -106940, 188507]
36196A88507K42367j03715k15040L09L5924k08243k12483J28257K43069m5945
36186E3007j84545N3383J64158o3550j33133J46032K36037q6027k56579J2869
36176e8348J84485o7233k32474M2344K72813O3225j67349k3577J34363n2424k32678
36165a36853m4447J93883J14057n1594j9444Q988j14297q9318J80736K44153q8987
36154A96877l06013p0124J88359Q1090p7332L3339J17532p6003j83155P6614K96194
36143B77378Q7352k27182k14792l6834M72J7548J58108J88291p802j05829M1551
36132A78261P8915j41799k02667Q6323K51413j243k30632p0377J26709K999j51218
36121g3316k8642R6049l0219j07212Q2907J82067m0731j80044M3212K12308j787
$$ y = [188507, 430874, 327159, 112119, 112428, 148352, -59891, -272374, -144117, 98952, 53007, -131538, -78155, 86003, 22453, -110680, 35352, 271389, 185362, -71217, -58348, 126137, 58904, -173570, -131226, 141587, 204812, 37463, 13886, 148249, 95825, -136853, -181300, 12583, 126640, 75046, 55602, 64590, -49707, -139025, 41711, 285864, 196877, -109136, -179260, 9099, 90189, 12857, 46196, 163728, 87725, -95430, -18816, 277378, 364730, 137548, -77244, -114078, -113606, -96058, 62050, 250341, 242539, 136710, 178261, 257176, 115377, -87290, -967, 250446, 249203, 18571, -51806, 74903, 77902, -73316, -101958, -5909, -36128, -143340, -60433, 121634, 80903, -99141, -55929, 156379, 154592]
36110A54592j99389j2624K03001P8999p1697O5908J46600j19572k96750j1643
36100f2575K71684M8625l02166k05236J05363R9241q4583k2645J44908P3226m5514
36089B0328J05069K61435O5234j95709j01540R6662l0905k47140j04146J76759
36079D6047J11129j39750r7200J32035J02387j14341j18381L2255o654j48218
36069b00691o7114J16375N2728j54292j52843k664J3634j5523J34044K65944R3076
36058H2674j51458q7054J14336O4873r7158o14K01832J01252j77327j86928L0042
36047a05530O1431j04359j25721J2502L9014j2119R8942K50456J31331j33605
36037A12342j55285L1071O1648p7155p6583P4378R6680j2579O194J41687J30502
$$ y = [154592, -44797, -57421, 145580, 224579, 152882, 218790, 365390, 245818, -50932, -62575, 209109, 257734, -44432, -249668, -144305, -45064, -129647, -152292, -7384, 65842, 20328, 125397, 386832, 452066, 256357, 154817, 251479, 220574, -26566, -130712, 46047, 157176, 17426, -79774, 52261, 154648, 40307, -78074, -45819, -52473, -200691, -267805, -151430, -98702, -252994, -405837, -408501, -394867, -410390, -276346, -10402, 82674, -68784, -155838, -41502, 23371, -73787, -74401, 127431, 228683, 51356, -135572, -105530, -44099, -148458, -274179, -261677, -222663, -234782, -135840, 114616, 245947, 112342, -42943, -11872, 49776, -27379, -103962, -29584, 67096, 54517, 60711, 202398, 332900]
36026C32900k9328q2947M755L3481l2145o2937o8400j10553o4914J42349K56092
36015C18353O3462j84162j56816J397k0804j13339P030K08271J68319j9853l7160
36004B34698N5771k4095j90502j39713M7813M3503j06770p7713J06689J16995
35994F6676o2044j13755K5811Q7810j7450q3690k1511L2247K4545L6938N2661
35983B8238M506j7873P3801J22842k8542k04282j51172L4152R2035L7500M3918
35972C5123P2235o497r6511n3714J0269m4868p4745P1935K05065J10046l9715
35961A88623M748J01132n559j87311j66946j9865M384n4051j1841O4016K5779
35950e6891j6722P6781J59435Q2808R067O9822O8678q5359p5910K32512L79709
$$ y = [332900, 303572, 220625, 225380, 258861, 226716, 163779, 95379, -15174, -80088, 62261, 318353, 381815, 197653, 40837, 42234, 21430, -91909, -84879, 123392, 291711, 271858, 234698, 290469, 266374, 75872, -63841, -16028, 27475, -79295, -157008, -50319, 66676, 4632, -109123, -83312, 4498, -12952, -96642, -118153, -85906, -61361, -24423, 28238, 32744, 14871, 88672, 211514, 182972, -21310, -172482, -138330, -46295, -8795, 35123, 107358, 100861, 4350, -49364, -39095, -83963, -158708, -86773, 118292, 228338, 188623, 193371, 294503, 288944, 101633, -65313, -85178, -80794, -134845, -146686, -82670, -56891, -73613, 3168, 162603, 245411, 254478, 324300, 392978, 307619, 231709, 464221, 843930]
35939H43930L3190l54795k51888N6839Q95k69097k17057P6799J07962r9959r3174
35928a66355J22131J21688j03538j48539L4464J09020L5334O4638J33893k0983
35918A81753k37339j35245J38501J16687j32162j28334J16204J32878r9319j20039
35908a66415J20953J71814n2302j25894N7042J10230n8423p5850J27187J52989
35898B61331q1625j66975L157K3109k15440k71665K1938K28681R6678l6206N9082
35887g7935R7327q8322j82140j3127R6989k9022p5582J13367J82121m1535j51333
35876a69192R4504K76515N7338j92347o3231J66646P5461j41851q7651J06113
35866A22305R7405o416N6768J21581l9212j33444J54285M41872K57418P2229O98772
$$ y = [843930, 877120, 522325, 270437, 327276, 328171, 59074, -157983, -81184, 26778, -73181, -166355, -44224, 77464, -26074, -174613, -140149, -31129, 4205, 68843, 202736, 181753, -55586, -190831, -52330, 64357, -67805, -196139, -79935, 52943, -46376, -166415, -45462, 126352, 74050, -51844, 5198, 115428, 57005, -18845, 108342, 261331, 179706, 12731, 15888, 38997, -176443, -448108, -426170, -197489, -100811, -137017, -77935, 19392, -68930, -251070, -264197, -167208, -196230, -271812, -158445, 23676, -17859, -169192, -74688, 201827, 259165, 66818, 3587, 170233, 245694, 103843, 16192, 122305, 219710, 213294, 270062, 391643, 352431, 218987, 373272, 815144, 1072562, 1144791, 1843563]
35855A843563J717196J653754O3954j583084j738864p23963l3926k27576m98789
35846D72265k04684K06802J01482k95057l34348K0217K32866Q3974q9630m7180
35836A46707J0517j02431k08854j15135M3350O5491J5641L3875N9943N769k2871
35825f7998N9186R9173k2468j21555o510J66879J56962M7265M6583P3552o5973
35814C65096k45907j88840L6942J12747l693o1085J3740L7511l9141n5329K1269
35803f690M0362j4100Q763J09787J11734j6822j09007r5159o6387m0352M6847
35792c1024J22817N2114q2664p6961L4588L2311q5252r1648O0381J58970R6229
35781A89861n369o3282j21884j41885k2136J30651P9558j37710k02173Q151K35908
$$ y = [1843563, 3560759, 5214513, 5278467, 3695383, 1956519, 1232556, 1198630, 971054, 472265, 267581, 474383, 575865, 280808, -53540, -33323, 199543, 283517, 193887, 146707, 157224, 54793, -154061, -269196, -225846, -160355, -144714, -110839, -50896, -45127, -67998, -8812, 90361, 67893, -53662, -60172, 106707, 263669, 310934, 357517, 431069, 365096, 119189, -69651, -32709, 80038, 76345, 15260, 29000, 66511, 27370, -27959, -6690, 33672, 19572, 28335, 138122, 249856, 233034, 124027, 28868, -37519, -77871, -31024, 91793, 143907, 61243, -15718, 18870, 51181, -34071, -125719, -65338, 93632, 189861, 184492, 121210, -674, -142559, -164695, -34044, 45514, -92196, -294369, -286218, -50310]
35770e0310K37352Q1400m6854r1518o9892J0956Q4853N5670l8649n7146J8062
35759A33924N9330J4761k3429J0388P1364R4351M2115r4736k26107j86103K7505
35748g6637J68033O9229r4305q5180K8392L5214n0651o9715k6663k9387m3362
35737a75032J2745N9185J6116J0480J34312J90036M927k04825j55630J9227J7434
35726g1025r3181m0209J12630Q4973p6000p4891Q2555J14540j1960o4998j5290
35715e2856l8753q8709M1611K50230K19944k1413j31307m5975l2847j33690r2376
35704a26141J01234J34365n4040j38572J3880J22871J8854p3189K9169J54631
35694A83062J08699k7560j02505j03980m9330N6824J01953q006j08537O424J77635
$$ y = [-50310, 187042, 268442, 221588, 130070, 60178, 71134, 155987, 211657, 173008, 115862, 133924, 193254, 208015, 184586, 194974, 266338, 360689, 402804, 308068, 81961, -104142, -76637, 91396, 160625, 66320, -18860, 9532, 44746, -5905, -75620, -102283, -131670, -175032, -162287, -103102, -86986, -76506, 57806, 247842, 252769, 47944, -107686, -88459, -71025, -164206, -204415, -91785, -6812, -82812, -157703, -75148, 39392, 27432, -37566, -52856, -91609, -180318, -138707, 111523, 331467, 310054, 178747, 132772, 99925, -33765, -126141, -24907, 109458, 55418, -83154, -69274, 53597, 72451, -738, 28431, 183062, 291761, 264201, 161696, 57716, 8386, 65210, 167163, 159157, 50620, 57044, 234679]
35683B34679R0839j60387j90283K6076J30256K4172j1472R8475Q9336q1799j11146
35672A38746N7756Q2315j36392k22649O923J87472K9606j94845j43312N2243R8711
35661d3426L2524L1569M5217l9987j17441n1966N9248P1100L1131K6596O031o1074
35649a0478o6258K9061Q4241K0536m8669l8456p241K9141J29927K09492R2026
35638D23322j38687j77863J9761J45388K9500j26293j34696q2221o4001r985P7588
35627c8187N3673o2584n1217J07108J48274k0051j46075o6660N0922N4025L1041
35616F0269M3199l781p7562O038J83139J34107j56960k78775m2973J87605Q5927
35605A40233j43959j63665j8014O4763O7980P3918L7834n3507o3327K8257K7281
$$ y = [234679, 325518, 165131, -25152, 924, 131180, 155352, 143880, 242355, 331691, 249892, 138746, 196502, 278817, 142425, -80224, -73301, 114171, 143777, -51068, -194380, -142137, -43426, -10902, 20667, 65884, 25897, -91544, -143510, -84262, -13162, 17969, 44565, 50596, -10478, -76736, -47675, 36566, 57102, 8433, -30023, -37264, -8123, 121804, 331296, 423322, 284635, 106772, 126533, 271921, 301421, 175128, 40432, -41789, -105790, -115775, -38187, 15486, -47098, -98315, 8793, 157067, 137016, -9059, -75719, -24797, 29228, 60269, 103468, 99687, 22125, 28163, 211302, 345409, 188449, -90326, -133299, 54306, 140233, -3726, -167391, -185405, -120642, -52662, 21256, 59090, 5583, -57744, -29487, -2206]
35594b206j01955j04354J02271K01991n3j96951n8685K23601K47258J0513j56723
35583A64707j07566R860N0144J5239l1135k3907N1837R5241J1212r0445l6401
35572A08786Q2221L0930j21734p1483J63681K05409n1079k40118j39928n340n3566
35561i2221r1281N0557J53728K6874j11226k3405J19104O5015p3355o4732K9117
35550a1825L2707J598O3440J37706J04171L5330J3438m4384j54469j40049L3024
35539G0687J02454n6991j72360k7680J49433P8360j03946j11354J8622O9206L3370
35528D9801K9980L4514j0887j6764O3210P7571m5651j11594P821J18650M0778
35517B37429p4645l5642N4614L3423j5739K2683L7419p0168j42826m3084P7767
$$ y = [-2206, -104161, -208515, -106244, 95747, 95694, -101257, -159942, 63659, 310917, 321430, 164707, 57141, 67001, 117145, 132384, 101249, 77342, 129179, 224420, 235632, 145187, 108786, 191007, 221937, 100203, 28720, 192401, 397810, 346731, 106613, -33315, -38655, -92221, -183502, -132945, 20783, 47657, -63569, -86974, 32130, 97145, 23790, -40942, -11825, 20882, 22480, 85920, 223626, 327797, 363127, 376565, 332181, 177712, 37663, 70687, 173141, 116150, -56210, -83890, 65543, 143903, 39957, -71397, -52775, 16431, 49801, 79781, 114295, 103408, 86644, 149854, 227425, 181774, 70180, 78001, 196651, 237429, 162784, 127142, 181756, 215179, 199440, 222123, 259542, 189374, 46548, 3464, 81231]
35506H1231N0673k8528l5068n0643j15659o0045J50458K30393L1072j55129o2814
35495C5941J13062R2448j7770K416N6439l4475j49254j00038J2399K5767K5023
35484F1958R3681O7718j18873j86612J7033J64231j6811k30044j10133J35334
35474a22518J12902o5542n6556M8825m4919j86002j3196L19776L23636o607j91650
35463A18149o3839M7261m2744j16495l0783N1344K2164L859N5501O3367K535q086
35451A02233M1546L4249k5617j8278M8899O3069K7580J6056j2554j03389j32209
35440D1585j0603Q9007P965q1187L1898J82689J05639o4963j5587J70806J42558
35429E99807j04953k28756j19985j9194m7823o3636j0066m272m4428j993P7919
$$ y = [81231, 131904, 103376, 68308, 17665, -97994, -158039, -7581, 222812, 253884, 98755, 35941, 149003, 241451, 223681, 226097, 282536, 248061, 98807, -1231, 11168, 36935, 61958, 155639, 223357, 104484, -82128, -65095, 99136, 82325, -147719, -257852, -122518, -9616, -75158, -131714, -82889, -127808, -313810, -327006, -7230, 316406, 309799, 118149, 54310, 101571, 58827, -57668, -88451, -37107, -14943, -11084, 44417, 107784, 110319, 102233, 143779, 178028, 152411, 134133, 183032, 246101, 273681, 289737, 277183, 173794, 41585, 30982, 119989, 127954, 46767, 78665, 261354, 366993, 302030, 286443, 457249, 599807, 494854, 266098, 146113, 126919, 79096, 15460, 5394, 1122, -43306, -45299, 32620]
35418C2620L1130p4567k0840J31881R8129j23700k05893k4728J51562J15875Q202
35407A19671J1897O8218M5730l9142r9182r9203l0557Q1699J25712J7083j43500
35396E8426j87016j08953k0219N5707J43039J64451N2355p6371p8270k1939m5777
35385f4567r2673l3360O3821N3283q144K4406R7150O4062k6221l1999J546m7419
35373a15r8918m875J40806J30730p512q1755n7012k7825J1347Q4746O7968r7299
35361F0286j85794j6781J77046Q2442j60217j72232M7693J62000N9305n1782n6185
35350e4219l1194J6941J27747J63257o398j79980q7137J28373J20057o8545r8577
35339C0325N2160Q2584n5351r4277J8313M0867o0649l6077J41480J82617J1112
$$ y = [32620, 63750, -10817, -31657, 100224, 198353, 74653, -131240, -155968, -4406, 111469, 119671, 131568, 199786, 245516, 206374, 107192, 7989, -22568, 59131, 184843, 201926, 58426, -128590, -237543, -257762, -202055, -59016, 105435, 157790, 81419, 3149, -18790, -64567, -157240, -190600, -126779, -73496, -81640, -57234, 39916, 103978, 77757, 45758, 47304, -115, -99033, -103908, 36898, 167628, 160116, 78361, 21349, -6476, 4871, 89617, 157585, 60286, -125508, -142289, 34757, 117199, -43018, -215250, -167557, -5557, 53748, 1966, -54219, -85413, -68472, 59275, 222532, 216134, 36154, -50983, 77390, 197447, 128902, 30325, 82485, 165069, 109718, 15441, 33754, 74621, 13972, -22105, 119375, 301992, 313104]
35328C13104q2990L7101J24155M485j36318j09176j1570J3229P65K094k8278p1771
35316E4830l4650L7466L187r0847o7224L7712K1891q8139o2592R3868J26441n134
35304B6809n5052M8216Q4339k4073p1295K2251O4697j3269j8632J02504J19585
35293B86080n3459j64979n8029O0232m217j10942o6419N6453R7615O4884K1301
35282A28520n7071j50145j38892j7635N3274J4043l767N6749P0943j3316o7593
35271a24890k4412K0268K5406O9644J31780Q2445l9685l7824Q6070R6556o8737
35260B16621j81589j15170k6730k9795j3352P2329P4991n1062j02606K9581J57280
35249C0498J09924j0028n4124n6333p0638k5083R8153J60712R1899M201k6388
$$ y = [313104, 230114, 267215, 391370, 395855, 259537, 150361, 138791, 152020, 152785, 154879, 126601, 54830, 20180, 57646, 60833, -30014, -97238, -59526, -37635, -125774, -188366, -94498, 31943, 26809, -28243, 19973, 104312, 80239, 8944, 31195, 95892, 82623, 63991, 166495, 286080, 232621, 67642, 9613, 69845, 65628, -45314, -111733, -55280, 42335, 107219, 128520, 71449, -78696, -217588, -235223, -181949, -167906, -171673, -114924, -43981, -57297, -124890, -149302, -129034, -103628, -33984, 97796, 180241, 140556, 102732, 188802, 285358, 216621, 35032, -80138, -106868, -136663, -150015, -77686, -2695, -53757, -156363, -126782, 30498, 140422, 130394, 76270, 19937, -50701, -75784, 22369, 183081, 274980, 279181, 252793]
35238B52793o7760j24649p9753N4253Q8894k2443q8447j2611N5291J6501j5929
35227E6140J8195n141j16731j37583K340J12733P1453J9874O3408P1511l3978
35216A22221q4966J8698Q0571n6852j97930r3322J44148K07559M4517j20820j27277
35205f3453k1173Q4299J24154Q4329l051q5763j41567j53388p2896P8515J39609
35194c0385J5745j15175k9800J73034K05140L9341q4887p6910p0753q9470r347
35183g3467J09231M9240j37647j37555R1578K03965K8438j58671j09648K9224
35173a05312M8709K2264P6853J22128N1640m0857n3561m5793m9811K7675J64619
35162B18554J63055j6629j45185r5793k8497o1146p7209j5410j3036r2643n6789
$$ y = [252793, 185033, 60384, -19369, 34884, 123778, 101335, 12888, 277, 55568, 72069, 56140, 74335, 69194, -47537, -185120, -182780, -70047, 1406, 21280, 84688, 156199, 122221, 37255, 55953, 136524, 79672, -118258, -211580, -67432, 140127, 184644, 63824, -63453, -84626, -327, 123827, 208156, 205105, 119342, -22225, -175613, -248509, -169994, -30385, -14640, -129815, -159615, 13419, 218559, 257900, 173013, 96103, 25350, -64120, -73467, 35764, 85004, -52643, -190198, -98620, 105345, 133783, -24888, -134536, -105312, -56603, -34339, 42514, 164642, 216282, 175425, 121864, 76071, 26260, 53935, 218554, 381609, 364980, 219795, 124002, 95505, 34359, -42850, -58260, -71296, -163939, -220728]
35151b20728J23205J80917J9068q3629L7399J29878j0402j57844o3867J06213
35141F0210R0575k8498n1761m0498j13333j36136K4815J81293J06707p7189j25179
35130a08994o0363k6198J8289J31283J54776j4440j52842n0149J14704Q7455k1366
35119G2155O803N2258r7242k69316j50279J46716K34423P2152l1162K7514M3405
35108A07427n6956j04118m0915r668m5639k1140P1249R1314L0884K6426P9568
35097A28432N4223m1263n9587n768k4049q5132n477J81854K03766j5807k01512
35086A29680j40745J8060M5084k2767j4272N9294M2161q2219j44305l7778J21776
35075b6031J47793K2145r7559r7006l8137k7822m7571j8195L8278M4143K2070
$$ y = [-220728, -97523, 83394, 102462, 18833, 56232, 186110, 175708, 17864, -46003, 60210, 150785, 122287, 70526, 30028, -83305, -219441, -194626, -13333, 93374, 16185, -108994, -169357, -195555, -177266, -45983, 108793, 94353, -58489, -108638, 6066, 93521, 72155, 78958, 131216, 33974, -235342, -385621, -238905, -4482, 67670, 36508, 64022, 107427, 50471, -53647, -94562, -104230, -149869, -171009, -99760, -8446, 22438, 48864, 128432, 182655, 141392, 81805, 76037, 51988, -33144, -38621, 143233, 346999, 331192, 129680, -11065, 6995, 52079, 29312, 15040, 74334, 116495, 34276, -110029, -147807, -26031, 121762, 143907, 46348, -50658, -88795, -116617, -164188, -182383, -144105, -99962, -77892]
35064g7892L8732L7244p0704j77019q9258J27370J97238O2474l3873L1408P5439
35053A21159k9339j23572o5399K6319L0056M4966J42941J69042K6145r7915l9981
35042B04422M6849k3613j35231j05025k8376p5739j43022l5543J58827K06893
35032G0442J09595L5826J180q0839j40474n4665Q0383P2448m7619r9510n9885
35021a13118l2492q970P1494J22141M3627m0756L0396J38414N9604j26644j37563
35010F133M9282J63622P2431o4129r2147m6843J057M4927N3240j5366r0325o4320
34998A7562J6911J6872o6584j18202j06741q3435l0722Q7504J74377J08587l4772
34987a8643p6964r240L1074J4170K9134P0989L7256o6860j18397p3849n065M9065
$$ y = [-77892, -39160, -1916, -72620, -249639, -338897, -211527, -14289, 48185, 14312, 45720, 121159, 91820, -31752, -97151, -70832, -40776, 4190, 147131, 316173, 342318, 244403, 204422, 251271, 227658, 92427, -12598, -40974, -116713, -259735, -295278, -136451, 70442, 180037, 215863, 217043, 136204, -4270, -58935, 21448, 93896, 46277, -53233, -113118, -145610, -154580, -83086, 39055, 82682, 41926, 72322, 210736, 270340, 143696, 6133, 55415, 219037, 291468, 227339, 135192, 88349, 89406, 134333, 187573, 172207, 81882, 17562, 34473, 51345, -15239, -133441, -240182, -323617, -354339, -266835, -92458, 16129, -18643, -95607, -104847, -73773, -59603, -30469, 40520, 77776, 10916, -107481, -181330, -186395, -137330]
34975a37330J03785J25309O6976j7315m2196l1956n2935o9170j6926M9286M5014
34964B2542J3857L3848N1210j7078r9302p2778K3934O2244L1225L108j9586n0128
34952a6904j6266J02891J55132L1960j14004q8973K7096L0389n5963n2728L9730
34941D2360N9186j6022n1584j4055L050j8482k0917l1386r9061j26263Q84J67600
34929a04690J65837K9309k2847N6385J01176L3846m7790q3065j09186j07376j7658
34918a06059Q8132O7831n0269r3720j2660P6169J01490R8837P6555J2703l6519
34907B22490j0565J2617o3036j47719r4378L1033M4242m1820m8028N2972J05002
34896F2810M9249o053m077k464j1095K0594N2327n524j01714r4242J6842R6159
$$ y = [-137330, -33545, 91764, 158740, 141425, 99229, 67273, 14338, -54832, -71758, -22472, 22542, 36399, 70247, 121457, 104379, 5077, -67701, -43767, 18477, 49702, 52810, 33224, -16904, -33170, 69721, 224853, 256813, 142809, 53836, 80932, 111321, 55358, 2630, 42360, 101546, 85524, 33940, 19885, 22935, 4453, -16464, -47850, -146911, -273174, -272290, -104690, 61147, 90456, 67609, 123994, 225170, 259016, 211226, 128161, 18975, -88401, -106059, -17927, 49904, -365, -94085, -106745, -30576, 70914, 169751, 246306, 259009, 222490, 211925, 224542, 161506, 13787, -80591, -49558, -5316, -47136, -95164, -42192, 62810, 112059, 106006, 101929, 99465, 88370, 108964, 161291, 155767, 54053, -40189, -23347, 72812]
34884G2812R2300O4732K8261l8031p2678j6116M6433J9278j6940L2263M6815j05333
34872A53796k55308j46636J19570K03229M7508p7086l9107J1811p652M430M6510
34861F1065l2871j99387j96826K8024J85015P5216j21498j54570m2318O2428J18976
34850b16746J42721R4379j6632p4698k9521J9597L220j2369J8988K9968j2017
34839e3110k7774J9423N1601L1060K4462M4368R82j10693j51454n8068M0147K4771
34827a64285l8090l0729L3004N7058N296p7110j14966n1028P8545J31361L0122
34816a40822q8856m5418J03716J40338K3919n8120l74P5442M4880l9562p1555
34805e6412m1754M613L7685K6667l4531p2795k4749L8091J6269k3407N0942J66887
$$ y = [72812, 165112, 229844, 258105, 220074, 147396, 131280, 177713, 196991, 180051, 212314, 259129, 153796, -101512, -248148, -128578, 74651, 122159, 45073, 5966, 17777, 10125, 14555, 61065, 28194, -171193, -368019, -339995, -154980, -79764, -201262, -355832, -398150, -335722, -216746, -74025, 20354, 3722, -70976, -100497, -80900, -77680, -90049, -71061, -41093, -53110, -80884, -61461, -9860, 21200, 45662, 90030, 91012, -19681, -171135, -229203, -189056, -164285, -202375, -233104, -200100, -143042, -137746, -214856, -329822, -380850, -302305, -170944, -140822, -229678, -275096, -171380, -31042, -7123, -65243, -65617, 9825, 54705, 15143, -56412, -98166, -93553, -55868, -29201, -63732, -136527, -161276, -123185, -106916, -130323, -79381, 87506]
34793H7506J11719j11420k31035q8692J36742J94383Q0808k8859m3082j8875l0743
34782E8452p6666j02937p9686m0765k7942o020Q3783J75965J24775n1714j43051
34771h5806n6718L4942r298p1188k1787K7606m0287q4974L3427J38321J5454j71375
34759b91683j20115R6750J63041N4302J5134P3356K7768j01383p0094J10717J43546
34748A01339l4953j32541q781J05116L3358p5613o8280l3467o2045o1366K8869
34737b08364J00760Q8871O6339M1724o7377j86904j19451R2868J64041J9866q1141
34726h8768J935P5260n679q4512k3930M4559n418o1235j1670M6298K7470K5178
34714f0512Q5926Q2946j8812m8150N4064R4509j5152p0637M6233J18803k1813
$$ y = [87506, 199225, 87805, -143230, -231922, -95180, 99203, 180011, 151152, 108070, 89195, 58452, -18214, -121151, -200837, -241602, -269544, -275564, -191781, -15816, 108959, 57245, -85806, -142524, -107582, -116880, -188068, -209855, -182249, -222536, -307510, -274083, -135762, -120308, -291683, -411798, -315048, -152007, -97705, -82571, -9215, 18553, -82830, -152924, -42207, 101339, 66386, -66155, -74936, 30180, 63538, -12075, -80355, -113822, -175867, -237233, -208364, -107604, -18733, 47606, 89330, 21953, -164951, -284402, -191534, -27493, -7627, -88768, -86833, -11573, -17252, -101764, -125694, -81135, -86553, -147788, -159458, -113160, -85690, -60512, 25414, 108360, 89548, 41398, 95462, 189971, 174819, 104182, 150415, 269218, 247405]
34703B47405j66508p4355J12626J17642k2015p6025k4230k4356r3181j05763l8268
34692a47028K2005M4547M9678J5166n5864p0968J1376Q9700Q4622N8079N8764
34681A60077J7044q3888j16924k9726L3411k3030p0557J0543J12920R5028J8077
34670A22975Q042L7694K2014j1768r600r356l6650k6406L2342L6018l8564o1315
34658F5426K0250P8804M5080K3736N5427J4215j20527j59433l3884M7455l9201
34647b652j03176P854J18797N2736l6179M2908J47686O3386q7679n9055P2082
34636B16708M4134j23446j72346m4934N9788M2022R907L2632M3184L479l5251
34625G5877m3177l3258j131L6069J1470p2286j04711n1769k3262m3669L1706K12615
$$ y = [247405, 80897, 6542, 119168, 236810, 214795, 138770, 114540, 90184, -2997, -108760, -147028, -125023, -80476, -30798, -15632, -71496, -142464, -131088, -41388, 43234, 101313, 160077, 177121, 93233, -23691, -53417, -20006, -43036, -113593, -103050, 9870, 104898, 122975, 131017, 168711, 190725, 178957, 169357, 160001, 123351, 96945, 129287, 165305, 126741, 65426, 85676, 164480, 209560, 233296, 288723, 302938, 182411, 22978, -10906, 36549, -2652, -105828, -97974, 20823, 73559, 37380, 80288, 227974, 291360, 203681, 144626, 216708, 260842, 137396, -34950, -79884, -20096, 21926, 31833, 64465, 107649, 111128, 75877, 32700, -558, -1689, 34380, 45850, -26436, -131147, -182916, -206178, -249847, -218141, -5526]
34613e526K37347k2841k64019j59421J29042J96399N471j23818n5359J7254l3426
34602g8897p8625r399P7498O7637j020m2214m5113l0014O308N6372Q9283Q8005
34590I9821N5151N410k0754K933K0325l4659r3767l5962P6038M9489j06518j52544
34578a35037o909J10559N1521k8036J8552O4676k2451j12969n7216L9059L2407
34567d5844Q693P7533J24580L6086m9634Q645P5857j440q5009m582R6388J3271
34555B54544j31143j08471J71j5783q6373k5364O6868j4415j40039l8023J84152
34544e3876J70548q5467k28284j13782L3256N4408M8143Q0840P0598J4168J5951
34533F503N9063L0677l5027k2901M766p6140j53387m3871J24619R0269n4905L415
$$ y = [-5526, 231821, 208980, -55039, -214460, -85418, 110981, 116452, -7366, -62725, -45471, -78897, -157522, -166921, -89423, -21786, -22806, -65020, -110133, -140147, -133839, -77467, 11816, 99821, 154972, 160382, 139628, 142561, 162886, 128227, 34460, -1502, 74536, 124025, 17507, -135037, -141946, -31387, 20134, -7902, 10650, 75326, 52875, -60094, -117310, -78251, -45844, -37151, 40382, 164962, 201048, 151414, 160059, 235916, 234476, 149467, 144885, 241273, 254544, 123401, 14930, 15101, -682, -87055, -112419, -45551, -59966, -200005, -238028, -53876, 116672, 31205, -197079, -310861, -277605, -223197, -175054, -94214, -23616, -9448, 6503, 65566, 96243, 61216, 38315, 43081, -33059, -186446, -230317, -105698, -15429, -70334, -66919]
34521f6919K18168K15464n7225k15569p2011R2397M4818n5243k6898J7484m3192
34510E1274q5559o590N6889m563n5459K3577J06241N8041k6085k2842o577p1565
34498A6782j19788l4449Q8384Q2074k8233q0978k1112N2127L9102m6473r8388
34487a50952l3741Q7439J09891P858m8044M0663J15903K6990q5501k1940J09185
34476A57751O7423r0660j08444J7721N2279m5223p3570J9980O6325J4888R29M4941
34464A24340K0473n4864k9156O6928M6377q4030j33570p5830m5615k9383P1572
34453a22758J36004m901j71328p4768J36900R8949r9512o8358J33097Q7372j62700
34442a12003j47925J33094J72343q6830j22276J50721J70714j82299k73938J13673
$$ y = [-66919, 151249, 366713, 309488, 93919, 21908, 114305, 159123, 103880, 76982, 94466, 51274, -34285, -40875, 16014, 11451, -44008, -20431, 85810, 143851, 117766, 94924, 88347, 16782, -103006, -137455, -49071, 33003, 4770, -76208, -97320, -45193, -6091, -52564, -150952, -184693, -97254, 12637, 20495, -27549, 13114, 129017, 156007, 70506, 48566, 157751, 225174, 134514, 26070, 43791, 96070, 50847, -22723, -2743, 63582, 78470, 79399, 124340, 144813, 89949, 60793, 127721, 174098, 90068, -43502, -119332, -164947, -194330, -122758, 13246, 8345, -162983, -237751, -100851, -1902, -101414, -169772, -36675, 50697, -112003, -259928, -126834, 45509, -41321, -163597, -12876, 157838, -24461, -298399, -184726]
34432a84726L07682l9282k74686O7502M04922J88543j23644j7497J16656r9804
34422C45666j52422K93502M99381L7918r6684P41971J261280M39815R7815K411139
34412E879381N455222M701162m72620n105847n000143j882264j17634o79319j210095
34403A567843n41684N7936k29837m90514p8350K79168K9275k28501L89K19188
34393E84913j0551k52056q5941J22327k2252k26561j38271J5680k7682l6611J65976
34382H8971K37030m9768k71255m2561K72794J58179j87244k24400K2060R9738
34372A03544o2638j26489n86O0839k5270o6379l334J6194k0400L1189J41929J20134
34360A68733k9765r3241j1182N1767K2350J325J1718l6726j02863l3843J23415
$$ y = [-184726, 122956, 83674, -191012, -123510, 281412, 469955, 346311, 328814, 445470, 345666, 193244, 486746, 986127, 1024045, 927361, 1669332, 2930612, 3370427, 3468242, 5879381, 11334603, 16035765, 15563145, 10457298, 5457155, 3574891, 3457257, 2777938, 1567843, 1026159, 1084095, 854258, 363744, 285394, 564562, 593837, 365336, 365725, 584913, 574362, 322306, 236365, 358692, 336440, 109879, -28392, -12712, -40394, -77005, 88971, 326001, 276233, 4978, -37583, 235211, 393390, 206146, -18254, 3806, 103544, 40906, -85583, -86169, -25330, -50600, -116979, -120313, -104119, -124519, -93330, 48599, 168733, 138968, 45727, 34545, 86312, 108662, 109987, 121705, 84979, -17884, -51727, 71688]
34349G1688J29113n6163j72835o0846J10347J37695O7123L0616J5437l3810n6655
34338A81710L959N6992K454r0702r7195l6114j3060l4610k4857K1455L7640J2155
34326A9827j334O828j5391p9816j16317n8066P1063J70650J55475M1652n7281
34315A37290m7930K9644N1919k0377r0537o8956K235K3757j3233k7463K5514R8044
34303I9907J27850J12327P9657K9483n0245j23411j21937m0760L4212L2614j1165
34292A68532l0243l6295p0744q7511j0426J05040J15092J0884o0170l7334l2176
34281C4649r5790r7634L3158J35880O7304m4983j4078Q5371N9432n3077n3810
34270E6422N5224Q2001o585m6063n34k3444j33587j32462M3898J69662Q1215n6901
$$ y = [71688, 200801, 144638, -28197, -89043, 21304, 158999, 226122, 256738, 272175, 238365, 181710, 185669, 242661, 245115, 154413, 57218, 21104, 8044, -26566, -51423, -29968, 7672, 19827, 18493, 25321, 9930, -69886, -186203, -244269, -173206, -2556, 152919, 194571, 137290, 89360, 119004, 170923, 150546, 60009, -8947, -6712, 17045, 3812, -23651, 1863, 99907, 227757, 340084, 419741, 449224, 398979, 275568, 153631, 112871, 147083, 179697, 168532, 138289, 101994, 31250, -56261, -66687, 38353, 153445, 164329, 104159, 66825, 34649, -61141, -158775, -125617, 10263, 77567, 32584, 18506, 103877, 163309, 110232, 56422, 111646, 193647, 187062, 140999, 140465, 117021, -16566, -149028, -105130, 64532, 145747, 88846]
34258H8846k4196J13589J40843L2027m6906K487J14302J72121J07911n9109k04606
34247D37309j91955m2111Q0426R3082P7161Q4611L5241r3850j51684l5972J10534
34236D02792R7432k9026p9171j9554O953p2176j61574j55745o8870J5067L8880
34225b4992J780n6596r1185q5009l9022M9605J47076J55923K7651j19462j21946
34214a56177j55Q1100P2393P5658J08544N5852q3625j33978k9330N9774J6958
34203F7014k6777M6644J09340K3372q4353k7688J09178J08094k4109r2205l8356
34192A70154J6107J2600P714O498m2921r9428p1275m5j2290r2942r8887o725M5474
34179a65966m625m7065J636O1534L2122m7833p2410k4916J7606J127m0543l6383
$$ y = [88846, 64650, 178239, 319082, 351109, 304203, 306690, 420992, 593113, 701024, 641915, 437309, 245354, 203243, 283669, 376751, 453912, 538523, 573764, 479914, 328230, 292258, 402792, 500224, 471198, 392027, 372473, 379426, 307250, 145676, -10069, -78939, -63872, -24992, -23212, -79808, -170993, -256002, -295024, -245419, -98343, 57580, 85231, -34231, -156177, -156332, -75232, -2839, 72819, 181363, 237215, 153590, 19612, -9718, 50056, 67014, 40237, 86881, 196221, 219593, 135240, 107552, 216730, 324824, 300715, 208510, 170154, 186261, 198861, 206575, 213073, 170152, 70724, -551, -596, -12886, -105828, -204715, -211440, -165966, -170591, -217656, -216020, -154486, -122364, -170197, -242607, -267523, -249917, -248790, -289333, -325716]
34167c25716K6475P6167M7990j5488j6767N0010R0979O0925J8313J0976K0103
34156D3967M3822J04783J42071N3084j06474j44961l2573K4238q1894j63461m2485
34145a59883J46595J66587L2029o8781q0751q4531q8649m2212J1492n698n0864
34134b24666l7672m6j0649j9182N3057J40831J32383N5414k91m4520j00514q0609
34122a36464N8256J62431R5488k8259m7685l8662j28690j87124k8242J99196J93850
34111A14095N31n8910P3516J20969k6963j39222o4971L2531K770m8429l958M7338
34099D9297Q816l5749M495N6424L0105k9190n5520p0591q0688l1183M7660K5723
34087h0401j02195j54643k9868J35758J80538J23515N1180l4524j29599j40465
$$ y = [-325716, -299241, -223074, -175084, -190572, -207339, -157329, -66350, -5425, 12888, 23864, 43967, 87789, 192572, 334643, 387727, 281253, 136292, 103719, 127957, 46063, -117398, -159883, -13288, 153299, 185328, 116547, 35796, -48735, -137384, -179596, -168104, -173802, -224666, -262338, -262384, -273033, -292215, -239158, -98327, 34056, 89470, 89179, 44659, -55855, -136464, -78208, 84223, 179711, 151452, 103767, 65105, -63585, -250709, -278951, -79755, 114095, 114626, 55716, 129232, 250201, 223238, 84016, 19045, 51576, 54346, 5917, 1959, 49297, 58113, 22364, 26859, 83283, 113388, 84198, 28678, -41913, -122601, -153784, -106124, -80401, -182596, -337239, -367107, -231349, -50811, 72704, 123884, 89360, -40239, -180704]
34077a80704k3757J00254J01033J3725m2402l5135j3928p320q674j0103J071K9997
34065g5943M3730J8750O475N8390J11015O8450k3162k8805N9070J10397N8010
34054D06377m4634j49615k30940k02691k1497J47275R4537r9136j43199K6586
34044b16937J61483J05636L452j505O814n7127q4273R492Q4174M298j08962o8465
34032a61920P3258J19700L2226n8293p1347l7867P595N2172O2002K5203p104m644
34020C0981j4220n6650n9806J5031P6033L5033m8003o4750k5051r311j9610K642
34008a37681N1467N8264K619o1015p9213m8039J621L1784K5589L495o650m204
33996a61963J0859N9972J22334J06566j7380j17157o2140N9579N4252p3214j19640
$$ y = [-180704, -204461, -104207, -3174, 10551, -31851, -66986, -80914, -88234, -96908, -107011, -105940, -75943, -32213, -13463, -6988, 51402, 162417, 230867, 207705, 178900, 237970, 348367, 406377, 361743, 212128, -18812, -221503, -243000, -95725, -1188, -100324, -243523, -216937, -55454, 50182, 53634, 52129, 58943, 1816, -82457, -72965, 11209, 15507, -93455, -161920, -88662, 31038, 63264, 4971, -66376, -104243, -96648, -44476, 17526, 42729, 35625, 30981, 16761, -39889, -99695, -84664, -8631, 26402, -21601, -86351, -111402, -120713, -140323, -137681, -86214, -27950, -25331, -86346, -165559, -213598, -211977, -180193, -154604, -151109, -157759, -161963, -151104, -91132, 31202, 137768, 120388, 3231, -58909, 670, 54922, -18292, -137932]
33985a37932N71J36841J46732P5540K2184j0378m8273o8284o4074p4049q8262
33974a09384m7561K5156L0343l1064l7131M6952R8474M2475k7102j2206M7011
33963B5963P9712R8602J16139P2153n5786j69394j66514o6722L6736P7545M0377
33952H8811l2245m9104K0173O4944j5465j20665p5845Q4206J60437J02160M4012
33941B71419K8625m7273j72127j80760n4986P186p2077j12059l115Q9858K1596
33930b23713p8603m0803O5913Q9743N1554M5418M3725q486n0987l4962m2573j12199
33918b95973j09404M3118J74572J12864l1284m8243M3021Q5612P5647J07561J28624
33907B86115J9563j38185j45510j6005L4258o0053j17553k2261R0026N8184o1403
$$ y = [-137932, -137361, -520, 146212, 221752, 243936, 233558, 185285, 117001, 52927, -21122, -109384, -156945, -131789, -101446, -132510, -169641, -122689, -24215, 18260, -8842, -21048, 25963, 105675, 204277, 320416, 392569, 336783, 167389, 875, -65847, -29111, 48434, 88811, 56566, 7462, 27635, 92579, 77114, -43551, -119396, -35190, 125247, 227407, 271419, 300044, 252771, 80644, -100116, -155102, -147916, -219993, -332052, -335167, -245309, -223713, -302316, -343119, -277206, -187463, -135909, -90491, -46766, -55252, -106239, -141201, -183774, -295973, -405377, -362259, -187687, -74823, -106107, -154350, -111329, -25717, 49930, 157491, 286115, 305678, 167493, 21983, 5978, 40236, -19817, -137370, -159631, -69605, -11421, -72824]
33896g2824j04915m5473M609j0739j6552N2701J25978Q5406m5544j08224l5568
33885a71145M0649k34o1673J2623J56001J56095j2948j48567j22563k0819M7917
33874a24664P6689N3306n7831j68402j14952P2450J63563O9231l2153j109O2796
33863a076M4602P667K3370K2793l3203m2422L0872M5734o1972j30286m4458N6989
33851h1390L2579k4552J450K2769m3531o3544O2336J48765J3834j71382j37478
33840b40144L8710Q3729k251J1055J39095J52533o845j23090p3094r04l9127j00700
33828a61033n5653O3180J27900P2146o9484j86423j56619J4859J51566J11902
33818h7659j2555l9297K8639L9725l6386o9985j541O8975N4682Q2j3378K4385
$$ y = [-72824, -177739, -223212, -218603, -229342, -245894, -193193, -67215, 18191, -27353, -135577, -171145, -130496, -130730, -192403, -179780, -23779, 132316, 119368, -29199, -151762, -172581, -124664, -47975, 5331, -52500, -220902, -335854, -263404, -99841, -30610, -62763, -63872, -1076, 43526, 51193, 74563, 97356, 64153, 21731, 52603, 98337, 36365, -93921, -138379, -81390, -48811, -73363, -71913, -49144, -92675, -156219, -93883, 54882, 68716, -102666, -240144, -201434, -117705, -119956, -108901, 30194, 182727, 175882, 52792, -20302, -21206, -60333, -161033, -216686, -153506, -25606, 46540, -22944, -209367, -365986, -351127, -199561, -87659, -100214, -139511, -110872, -71147, -107533, -177518, -179059, -110084, -55402, -55320, -68698, -44313]
33806d4313O6819O3062l560p5487n7449M7581J04401K3593j03527j37134p3009
33795a89023L922N9511R2193O5837j6657n7257k337M8482m671r5105j05833n3248
33783b54186j5704J8451Q2569J16119P5799N3763J14034J28219k3824j98138j67866
33772g0764J5831R6731Q089o3468r994N2909K1424l5563l0568J082K170K316L8183
33759B8378O1456Q771r0693j38838q3137J8159N3323m561m1140M8540J74968J47608
33747A82834l3716j46156o3913O4272O1686k2539m5750p135R398L174R619k973
33735H801m2752j9904R0636J46422N7385l8274j883N5122k9609j57895j18459
33724e0410N0045J14772J8475o2936j8008P1054R8629M8277n4902j45260j11500
$$ y = [-44313, 22506, 85568, 82008, 6521, -50928, -3347, 101054, 124647, 21120, -116014, -189023, -185101, -125590, -33397, 32440, 15783, -41474, -43811, 4671, 0, -95105, -200938, -254186, -269890, -251439, -168870, -52751, 23048, 76811, 190845, 319064, 295240, 97102, -70764, -54933, 41798, 49887, -13581, -23575, 29334, 50758, 15195, -15373, -14291, -12121, -9805, 28378, 89834, 98605, 7912, -130926, -214063, -195904, -142581, -147142, -188282, -139742, 35226, 182834, 149118, 2962, -60951, 3321, 65007, 42468, -3282, -10417, -1019, 2155, 11774, 8801, -33951, -53855, 36781, 183203, 240588, 202314, 200431, 255553, 225944, 68049, -50410, -365, 114407, 132882, 69946, 51938, 122992, 221621, 269898, 214996, 69736, -41764]
33713d1764N0248J49207M5334j07385p8829O4590O7462q8967j62538n6028M4318
33702a14352o14p3100k6071Q6166J27695Q2282K2883j4066l3855l6621k5467j0751
33690a5871J3377M4666L7074l9737j23684j23163m2224L0640M0915J1019j0242
33679a77230J0887O6383Q6711J0541r8258r9117K2432J18993R6264K6033j3228
33668E0411m7445q2506m6315M6869N8332l8738q0719Q045P5014J8909k8357K8525
33656c7975N0907m8642q5827O8767J95144O6380j39991j19732O0483J14959L2142
33645A56615K3526R1509M8382r4843j40183p1694n6213r7453l6448J09843J45426
33634G8467L9203l8553k8398l3529o3077j9449O0996M3630l6291k4097N8198N4944
$$ y = [-41764, 8484, 157691, 203025, 95640, 16811, 81401, 148863, 59896, -102642, -158670, -114352, -114966, -188066, -214137, -127971, -276, 82006, 104889, 90823, 56968, 20347, -5120, -15871, -2494, 42172, 79246, 39509, -84175, -207338, -249562, -218922, -178007, -166988, -177230, -166343, -99960, -13249, -2708, -100966, -200083, -177651, -58658, 37606, 63639, 50411, 2966, -79540, -125855, -78986, -20654, -59392, -140111, -132066, -57052, -38143, -66500, -37975, 12932, -35710, -121537, -52770, 142374, 208754, 68763, -50969, 9514, 124473, 156615, 180141, 271650, 320032, 225189, 85006, 13312, -42901, -140354, -176802, -66959, 78467, 117670, 79117, 50719, 17190, -45887, -65336, -4340, 39290, 2999, -21098, 37100, 92044]
33622I2044j8686j7361L2729o571p5228j3971P8128k3400k09793j48392J35475
33611a75026K46360N8911r5986j2133Q4631j528r9049l6751L4450l6138q8169
33600a20428M1270J80747J06153o8275q9907J7266L9653m7399p5182P505O6739
33589E8142J5185p2265q6688j5289O3568O2507j9345p4497j6451Q5047R2213N73
33577I2700p1889p6750o9966o5983j6716O0436Q6260N4138K2461m017m0899k5402
33565e5627P6885J34175K2112j34937j30038j1181J5256m3551k148J24539J16703
33554A12188n1632j40905l6668R1251R5097L3724k0186q6021j22567l5598J04044
33543e7273J14239J2056j1551M8738L368j39536j33709O3798J75268N6178q3945
$$ y = [92044, 73358, 55997, 88726, 82155, 6927, -7044, 71084, 47684, -162109, -310501, -175026, 71334, 130245, 34259, 22126, 106757, 105229, 6180, -30571, 3879, -32259, -120428, -79158, 101589, 207742, 139467, 49560, 66826, 106479, 59080, -16102, -8597, 58142, 73327, 1062, -85626, -100915, -37347, 25160, 5815, -68682, -85133, -86, 92127, 92700, 20811, -55939, -125905, -191888, -208604, -148168, -61908, -7770, 14691, 10674, -30225, -55627, 21258, 155433, 177545, 42608, -87430, -98611, -83355, -126906, -129054, -4515, 112188, 60556, -80349, -117017, -25766, 69331, 103055, 82869, -3152, -125719, -161317, -57273, 56966, 69022, 57471, 106209, 109577, -29959, -163668, -99870, 75398, 131576, 47631]
33532D7631o8287k0573o5874q5585K1457J17920P8341Q566K1164L1993l4825p2965
33520b1037m695N6694K0858k1823l447r286o6289m7612O8716J02727j7115j09865
33508e2174n8674M066j7623q436P6221O7389p8870j23564M2173J53002J1697j43856
33496a28649l7893J67748J57546j7333q3788k4813k7884r1252n6863M9598N8877
33485c4706j4616j382R9511J14423L937p6294l2065N8302R5234N8121l1858j18613
33473A19994j18797k8684M2977L3144N871l797o5319j65030j39316N2505J87539
33462g8913R7449o2984p1635K3518N4007L9787Q5321J17013Q315j42149j38059
33451f8330j3381L3164k8893n0846J5236O9493P1375O9621M7087n1189j51484
$$ y = [47631, -20656, -41229, -107103, -192688, -171231, -53311, 25030, 33596, 54760, 86753, 51928, -21037, -25732, 30962, 51820, 29997, 26550, 17264, -49025, -96637, -27921, 74806, 57691, -52174, -110848, -106782, -124405, -132841, -56620, 10769, -68101, -191665, -149492, 3510, 15207, -128649, -166542, 1206, 158752, 141419, 57631, 32818, 4934, -86318, -143181, -93583, -34706, -49322, -50704, 48807, 163230, 167167, 90873, 58808, 117110, 212344, 270465, 238607, 119994, 1197, -27487, 15490, 48634, 54505, 50708, -14611, -179641, -318957, -266452, -78913, 18536, -44448, -116083, -92565, -38558, 1229, 86550, 203563, 211878, 69729, -68330, -81711, -48547, -77440, -128286, -113050, -43557, 27818, 97439, 144526, 93337, -58147]
33440e8147j19611R534O5254P833k3218N1944J34391J08722n237j09093j45209
33429h2837j23062p8114k4669N5773J54378J84737Q1228o0469p1293M7266J18825
$$ y = [-58147, -177758, -168224, -102970, -95137, -118355, -66411, 67980, 176702, 171465, 62372, -82837, -205899, -284013, -308682, -252909, -98531, 86206, 167434, 106965, 35672, 82938, 201763]
$$ [...]
##END NTUPLES=NMR SPECTRUM
##END=
