##TITLE=31Pdec_LR-743-R2-B-O
 CDCl3, 24 sc
 18.1.2022
##JCAMPDX= 6.0         $$ Bruker NMR JCAMP-DX V2.0
##DATA TYPE= NMR SPECTRUM
##DATA CLASS= NTUPLES
##ORIGIN= UXNMR, Bruker Analytische Messtechnik GmbH
##OWNER= root
$$ XWIN-NMR		Version 3.5
$$ Tue Jan 18 11:10:10 2022 Russian Standard Time (UT+4h)  she@DPX200
##.OBSERVE FREQUENCY= 81.013821
##.OBSERVE NUCLEUS= ^31P
##.ACQUISITION MODE= SIMULTANEOUS
##.ACQUISITION SCHEME= undefined
##.AVERAGES= 24
##.DIGITISER RES= 16
##SPECTROMETER/DATA SYSTEM= spect
##.PULSE SEQUENCE= zgpg30
##.SOLVENT NAME= CDCl3
##.SHIFT REFERENCE= (INTERNAL, CDCl3, 0, 248.564)
##AUDIT TRAIL= $$ (NUMBER, WHEN, WHO, WHERE, WHAT)
$$ ##TITLE= Audit trail, XWIN-NMR		Version 3.5
$$ ##JCAMPDX= 5.01
$$ ##ORIGIN= Bruker BioSpin GmbH
$$ ##OWNER= she
$$ F:/spectra/data/she/nmr/P31/1/pdata/1/auditp.txt
$$ ##AUDIT TRAIL=  $$ (NUMBER, WHEN, WHO, WHERE, WHAT)
(   1,<2022-01-18 11:09:04.64 +0400>,<she>,<DPX200>,
      <created by zg, POWCHK disabled, PULCHK disabled
       configuration hash MD5:
       00 E9 B6 7A A2 85 ED C7 34 08 36 98 17 FE 4E 26
       data hash MD5: 32K
       96 1D 2A A7 07 70 3E 2E F2 81 44 4F AC BF B7 21>)
(   2,<2022-01-18 11:09:08.92 +0400>,<she>,<DPX200>,
      <Start of raw data processing
       efp BC_mod = 2 LB = 1 FT_mod = 6 PKNL = 1 PHC0 = -9338.13 PHC1 = 88.87372 SI = 64K 
       data hash MD5: 64K
       8A DE 39 C7 45 6A 63 7E 84 79 D2 77 1E EC 8D 38>)
(   3,<2022-01-18 11:09:30.35 +0400>,<she>,<DPX200>,
      <pk PHC0 = -5.578243 PHC1 = 13.4 
       data hash MD5: 64K
       60 04 1B 7C 3A 47 0A F2 66 0F 7A E1 C8 05 09 9E>)
$$ ##END=
$$ 
$$ hash MD5
$$ 76 BF 8C B0 56 92 E9 EB 00 80 C3 6B 7A 2D D4 2E
##$RELAX= 
##$RELAX= 
##$RELAX= 
##$RELAX= 
##$RELAX= 
##$RELAX= 
##$RELAX= 
##$RELAX= 
$$ Bruker specific parameters
$$ --------------------------
##$DU= <F:/spectra>
##$EXPNO= 1
##$NAME= <P31>
##$PROCNO= 1
##$TYPE= <nmr>
##$USER= <she>
##$AMP= (0..31)
100 100 100 100 100 100 100 100 100 100 100 100 100 100 100 100 100 100 
100 100 100 100 100 100 100 100 100 100 100 100 100 100 
##$AQSEQ= 0
##$AQ_mod= 1
##$AUNM= <au_zg>
##$AUTOPOS= <>
##$BF1= 81.014009
##$BF2= 200.13
##$BF3= 200.13
##$BF4= 200.13
##$BF5= 200.13
##$BF6= 200.13
##$BF7= 200.13
##$BF8= 200.13
##$BYTORDA= 1
##$CFDGTYP= 0
##$CFRGTYP= 5
##$CHEMSTR= <none>
##$CNST= (0..31)
1 1 145 1 1 1 1 1 1 1 1 1 1 1 1 1 1 1 1 1 1 1 1 1 1 1 1 1 1 1 1 1 
##$CPDPRG= <waltz16>
##$CPDPRG1= <>
##$CPDPRG2= <waltz16>
##$CPDPRG3= <>
##$CPDPRG4= <mlev>
##$CPDPRG5= <mlev>
##$CPDPRG6= <mlev>
##$CPDPRG7= <mlev>
##$CPDPRG8= <mlev>
##$CPDPRGB= <>
##$CPDPRGT= <>
##$D= (0..31)
0 1 0 0 0 0 0 0 0 0 0 0.03 2e-05 3e-06 0 0 0 0 0 0 0 0 0 0 0 0 0 0 0 0 
0 0 
##$DATE= 1642489744
##$DBL= (0..7)
120 120 120 11 120 120 24 19 
##$DBP= (0..7)
150 150 150 150 150 150 150 150 
##$DBP07= 0
##$DBPNAM0= <>
##$DBPNAM1= <>
##$DBPNAM2= <>
##$DBPNAM3= <>
##$DBPNAM4= <>
##$DBPNAM5= <>
##$DBPNAM6= <>
##$DBPNAM7= <>
##$DBPOAL= (0..7)
0.5 0.5 0.5 0.5 0.5 0.5 0.5 0.5 
##$DBPOFFS= (0..7)
$$ [...]
##$SUBNAM2= <"">
##$SUBNAM3= <"">
##$SUBNAM4= <"">
##$SUBNAM5= <"">
##$SUBNAM6= <"">
##$SUBNAM7= <"">
##$SUBNAM8= <"">
##$SUBNAM9= <"">
##$SW= 501.771253377433
##$SWIBOX= (0..15)
0 1 3 0 0 0 0 0 0 0 0 0 0 0 0 0 
##$SW_h= 40650.406504065
##$TD= 32768
##$TD0= 1
##$TE= 0
##$TE2= 300
##$TE3= 300
##$TEG= 300
##$TL= (0..7)
0 120 53 12 22 120 120 120 
##$TP= (0..7)
150 150 150 150 150 150 150 150 
##$TP07= 0
##$TPNAME0= <>
##$TPNAME1= <>
##$TPNAME2= <>
##$TPNAME3= <>
##$TPNAME4= <>
##$TPNAME5= <>
##$TPNAME6= <>
##$TPNAME7= <>
##$TPOAL= (0..7)
0.5 0.5 0.5 0.5 0.5 0.5 0.5 0.5 
##$TPOFFS= (0..7)
0 0 0 0 0 0 0 0 
##$TUNHIN= 0
##$TUNHOUT= 0
##$TUNXOUT= 0
##$USERA1= <user>
##$USERA2= <user>
##$USERA3= <user>
##$USERA4= <user>
##$USERA5= <user>
##$V9= 5
##$VALIST= <valist>
##$VCLIST= <CCCCCCCCCCCCCCC>
##$VD= 0
##$VDLIST= <DDDDDDDDDDDDDDD>
##$VPLIST= <PPPPPPPPPPPPPPP>
##$VTLIST= <TTTTTTTTTTTTTTT>
##$WBST= 1024
##$WBSW= 4
##$XGAIN= (0..3)
0 0 0 0 
##$XL= 0
##$YL= 0
##$YMAX_a= 2448
##$YMIN_a= -1928
##$ZGOPTNS= <>
##$ZL1= 120
##$ZL2= 120
##$ZL3= 120
##$ZL4= 120
##$ABSF1= 0
##$ABSF2= 0
##$ABSG= 0
##$ABSL= 0
##$ALPHA= 0
##$AQORDER= 0
##$ASSFAC= 0
##$ASSFACI= 0
##$ASSFACX= 0
##$ASSWID= 0
##$AUNMP= <proc_1d>
##$AZFE= 0.1
##$AZFW= 0.5
##$BCFW= 0
##$BC_mod= 2
##$BYTORDP= 0
##$COROFFS= 0
##$CY= -3
##$DATMOD= 1
##$DC= 0
##$DFILT= <>
##$DTYPP= 0
##$F1P= 0
##$F2P= 0
##$FCOR= 1
##$FTSIZE= 65536
##$FT_mod= 6
##$GAMMA= 0
##$GB= 0
##$INTBC= 1
##$INTSCL= 5.30512e-09
##$ISEN= 30
##$LB= 1
##$LEV0= 0
##$LPBIN= 0
##$MAXI= 10000
##$MC2= 0
##$MEAN= 0
##$ME_mod= 0
##$MI= 50
##$NCOEF= 0
##$NC_proc= -7
##$NLEV= 6
##$NOISF1= 182.463
##$NOISF2= 159.3651
##$NSP= 0
##$NTH_PI= 0
##$NZP= 0
##$OFFSET= 248.5645
##$PC= 4
##$PHC0= -9343.708
##$PHC1= 102.2737
##$PH_mod= 1
##$PKNL= yes
##$PPARMOD= 0
##$PSCAL= 0
##$PSIGN= 0
##$REVERSE= no
##$SF= 81.014009
##$SI= 65536
##$SIGF1= 159.3651
##$SIGF2= -187.1042
##$SINO= 113.3802
##$SIOLD= 16384
##$SREGLST= <1H.CDCl3>
##$SSB= 0
##$STSI= 65536
##$STSR= 0
##$SW_p= 40650.406504065
##$SYMM= 0
##$S_DEV= 0
##$TDeff= 32768
##$TDoff= 0
##$TI= <>
##$TILT= no
##$TM1= 0
##$TM2= 0
##$TOPLEV= 0
##$USERP1= <user>
##$USERP2= <user>
##$USERP3= <user>
##$USERP4= <user>
##$USERP5= <user>
##$WDW= 1
##$XDIM= 65536
##$YMAX_p= 313091634
##$YMIN_p= -7250996
$$ End of Bruker specific parameters
$$ ---------------------------------
##NTUPLES= NMR SPECTRUM
##VAR_NAME=  FREQUENCY,     SPECTRUM/REAL,   SPECTRUM/IMAG
##SYMBOL=    X,             R,               I
##VAR_TYPE=  INDEPENDENT,   DEPENDENT,       DEPENDENT
##VAR_FORM=  AFFN,          ASDF,            ASDF
##VAR_DIM=   65536,         65536,           65536
##UNITS=     HZ,            ARBITRARY UNITS, ARBITRARY UNITS
##FACTOR=    0.620285442955139, 1,           1
##FIRST=     20137.2065510759, 0,            0
##LAST=      -20513.1999529892, 0,           0
##MIN=       -20513.1999529892, -7250996,    0
##MAX=       20137.2065510759, 313091634,    0
$$ Real data points
##PAGE= N=1
##DATA TABLE= (X++(R..R)), XYDATA
$$ [...]
39668a0906k37425m49497n12498j01876N00229O97146L91919R1141J70470M01315
39658I40018L25156j40814n93880n49923L8181O21083N74197j8621l89977j18128
39648F87292K55721O9574l86249l27054K13521L94727n4339l73244k4868M00783
39638H55864J19951o10032q91849m58415J48206M54443M46967J89185k89350o70615
39628g05645n13075R2470N15163M25217K01300K59918M14314K69533q1767k24438
39618F52990r7407k0172r8562r0843O3544N6778k36840m38624k18914J55911K35153
39607c6986Q9820J12438K65495J22962l20830m99728j31317L24654L71146J56551
39597D54205O8679P5909n2804k10840j59917k5221o2959j41390N987J96538O5966
$$ y = [-10906, -248331, -697828, -1210326, -1312202, -811973, -114827, 277092, 368233, 538703, 940018, 1265174, 1124360, 530480, -19443, 18738, 639821, 1214018, 1195397, 805420, 687292, 943013, 1012587, 626338, 299284, 512805, 907532, 853193, 479949, 455081, 855864, 975815, 365783, -526066, -984481, -836275, -381832, 65135, 254320, -35030, -705645, -1218720, -1126250, -611087, -185870, 15430, 275348, 689662, 959195, 877428, 652990, 555583, 535411, 436849, 346006, 409550, 466328, 229488, -209136, -428050, -272139, -36986, 52834, 165272, 430767, 553729, 232899, -266829, -398146, -73492, 297654, 454205, 522884, 598793, 545989, 335149, 175232, 150011, 87052, -54338, -48351, 148187, 214153]
39586B14153k15590j55143J84430K21561j63893l99966j60803J35991O4503j68590
39576d43347j81624k8535K6929l5867r5597j16069l3290K29919M56242K73400
39566E2161k15922m45272k27903o581j3618J21648N42376O95602K60469j69282
39556E93678l1225K39782J1442l90726k93244O4794k6431m00832k91030K37261
39546b86531L51403o0899k08028J47727K79514j23491l51854L1289L81484J24629
39536B85243k38893o1477L25628K62602j10877k43708j64792k16295k26658J48810
39526b40417N69743M08487j57166l28148P8651L99816J95927k02036l71990l54317
39516a450k97969j33803J12170J55117q2967k20308M1960M10217L84047j5837
$$ y = [214153, -1437, -156580, 27850, 249411, 85518, -314448, -475251, -339260, -274757, -443347, -624971, -653506, -626577, -662444, -758041, -874110, -907400, -677481, -221239, 52161, -163761, -609033, -836936, -843517, -857135, -735487, -193111, 502491, 762960, 593678, 562453, 802235, 813677, 422951, 129707, 194501, 168070, -232762, -523792, -286531, 64872, 3973, -204055, -56328, 223186, 99695, -252159, -220870, 160614, 285243, 46350, -15127, 310501, 573103, 462226, 218518, 53726, -162569, -389227, -240417, 329326, 737813, 580647, 252499, 331150, 730966, 926893, 724857, 352867, -1450, -299419, -433222, -321052, -165935, -248902, -469210, -427250, -17033, 367014, 351177]
39506C51177k61730n0772K72008J75957l10751n77448k34978L03621L46473j02058
39496h8501l41296l600M25274L68178k8552k48452k00612j57278j47571L6260
39486c86150L42070M79230L97112K90257J64435j39780m90577n07168j41020J99030
39476B07439K12046L8409p2570r4176j08286j42652k09536k68884j49898K08339
39466c79769M80688K93994j68513l33778n7877J91294R2002q0463P594J99877
39456B45049J60094r7982l05281l14057j19710K47682O05004O35257K83362r0150
39446A249268j88548j66735k82880m29751l48444j06128j036j11130k48744k65127
39436h99255j32460J49554M53591M77369J08153k96066l24333q8924p342j15646
$$ y = [351177, 89447, 38675, 310683, 486640, 175889, -401559, -636537, -332916, 13557, -88501, -429797, -433397, -8123, 360055, 331503, 83051, -117561, -274839, -422410, -386150, -44080, 435150, 832262, 1122519, 1286954, 1147174, 656597, 149429, 8409, 207439, 419485, 457894, 385324, 291148, 182862, 40210, -169326, -438210, -588108, -379769, 100919, 394913, 226400, -107378, -165255, 26039, 118041, 37578, 45172, 245049, 405143, 307161, 1880, -312177, -431887, -184205, 420799, 1056056, 1339418, 1249268, 1060720, 893985, 611105, 181354, -167090, -273218, -274254, -385384, -634128, -899255, -1031715, -882161, -428570, 48799, 156952, -139114, -463447, -552371, -559713, -675359]
39426f75359o4903K01551K80002k5657l19520j83695J95458L16778Q2963j30499
39416c22881o4591R3598N0833j41422j47203J84752N53739N14869L8158l89873
39406C69979l33397M9570K39330O3464j20913p864K11549J84731o2349k07422
39396C86678j25635n311j5407j25476k46241k97475j50930K00681M12641J06294
39386A39819m74757n64252R8059P53836N85971j36857m70089j61430J16547o5625
39376a78778k75119o7818K48936K25784P7666K06004L28298r1796p34607o56417
39366i17847K61195R44807N68681l33978p06165l76502o189K8603m571J32313
39356d09653K57491J70448k8590j87638l12843l70412k07831J31929L11157J49615
$$ y = [-675359, -740262, -538711, -258709, -284366, -603886, -787581, -592123, -275345, -192382, -322881, -387472, -293874, -243041, -384463, -531666, -346914, 206825, 721694, 759852, 369979, 36582, 86152, 325482, 388946, 268033, 260169, 471718, 656449, 594100, 386678, 261043, 255732, 240325, 114849, -131392, -428867, -579797, -379116, 33525, 139819, -334938, -899190, -801131, -47295, 538676, 401819, -68270, -229700, -113153, -178778, -453897, -521715, -272779, -46995, 30671, 236675, 564973, 473177, -261430, -917847, -656652, 288155, 856836, 522858, -183307, -559809, -565998, -537395, -541966, -409653, -152162, 18286, -10304, -197942, -510785, -881197, -1089028, -957099, -645942, -496327]
39346d96327p5926n3427Q3671N0053j8356K25206O06131M86043k58518q43700
39336b95150n59709K34926N96810K34014k95821m99218m37621k70973M6135L92945
39326h53662L81887k6100k83950l6323K93385J62702k26657k88638J8821K59121
39316e99414L16631M38412N46944K45937l87730p11260m46875r0820q2449j38893
39306i09517J44153N02129L83806j31349l76778l3426M35386M04939j29434n69779
39296b79870m40492M8332K75275K1060k49173r5884K10142J40068j83192j66655
39286g20389K02862K54107k26631n32287j48720L79108L27166m4254J693M12599
39276i4746M87274J00493j30670N8106J81453p7012l13498j40154J50551J17579
$$ y = [-496327, -572253, -625680, -542009, -491956, -510312, -285106, 321025, 807068, 548550, -295150, -854859, -619933, -23123, 210891, -84930, -584148, -1021769, -1292742, -1246607, -853662, -471775, -497875, -781825, -818148, -524763, -362061, -588718, -877356, -858535, -599414, -282783, 155629, 702573, 948510, 560780, -150480, -597355, -688175, -770624, -909517, -765364, -263235, 120571, -10778, -387556, -420982, 14404, 419343, 289909, -279870, -720362, -672030, -396755, -375695, -624868, -720752, -510610, -370542, -553734, -720389, -517527, -263420, -490051, -1022338, -1171058, -791950, -464784, -509038, -507345, -94746, 392528, 493021, 362351, 420457, 601910, 524898, 211400, 71246, 221797, 339376]
39266C39376j05304j22669J8375l2471k63632k94872k2102J76945J3082k53545
39256e46817j54080L19272O32187L65674k02025l87409J2106L95780J36415n29642
39246D1461p67455k55910L94314M74666N4013k56798j53538J03476J76529N8992
39236a30250l8970J1063J41296J58891p1299m15518n04780j51786L13139L70351
39226c17863M317k28544J7667L31015J23753m22262n02163J51871P85443O31911
39216E75145n111k24040J35926L24242p9259m74756k04657L54805L24237l23576
39206D02956o82919k34172M31889N03713N2163k17571k8441J89368M9227k46466
39196B19747l00311j30877p3546k04522k17346N9434L22481K03200j56750k63242
$$ y = [339376, 234072, 111403, 129778, 97307, -166325, -461197, -483299, -306354, -293272, -546817, -700897, -381625, 250562, 616236, 414211, 26802, 38908, 434688, 571103, 41461, -725994, -981904, -587590, -112924, -58911, -315709, -469247, -365771, -189242, -130250, -169220, -158157, -16861, 142030, 70731, -344787, -849567, -1001353, -688214, -317863, -313546, -542090, -524423, -193408, -69655, -491917, -994080, -842209, -56766, 575145, 570034, 345994, 481920, 806162, 726903, 252147, 47490, 402295, 726532, 402956, -279963, -514135, -82246, 421467, 473630, 256059, 227618, 416986, 466213, 219747, -80564, -211441, -284987, -489509, -706855, -647421, -324940, -121740, -278490, -541732]
39186e41732J9114K61834J08936j93008j68559J88473M33825L19826Q1314K7793
39176E37816J34768J61383k0501l32287n80244n55393j89151K96805N34435M03275
39166C90906J52655L8018k305j53117l50655l37914n3951K49605L27108K21576
39156D81926J49863J92759J95009j4873l42162m44727j31284L01079L31382j13469
39146F05503m94541l66227n983J5299k70663k82906J25687L40571m6328m67093
39136h46681j44605O73152R41385K59732n85662p29633l10041n3328j83643k71352
39126a250676k3890K89262L10536J38743J46900L87791M66325J12376l20094k44799
39116A2474K65727M18967j91869q44860o06719K79608O81931K09941l05250j77532
$$ y = [-541732, -522618, -260784, -151848, -344856, -513415, -324942, 108883, 428709, 510023, 537816, 672584, 833967, 813466, 481179, -99065, -654458, -843609, -546804, -12369, 390906, 543561, 581579, 579274, 426157, 75502, -262412, -316363, -66758, 260350, 481926, 631789, 824548, 1019557, 1004684, 662522, 217795, 86511, 387590, 718972, 605503, 110962, -255265, -261248, -245949, -516612, -799518, -673831, -333260, -379588, -846681, -991286, -318134, 623251, 882983, 297321, -432312, -742353, -795681, -979324, -1250676, -1274566, -985304, -674768, -536025, -389125, -1334, 464991, 577367, 257273, 12474, 278201, 697168, 505299, -339561, -946280, -666672, 15259, 225200, -80050, -257582]
39106b57582J71524J01486j87596j84818k6631j01219j70553K04218O83020N57368
39096G89217k1217k06506J56416K91646j98000p02218o02772j16142K50184M20397
39086F1005N12549M22449O7024l40288n53095n16853k33715J76849K94613j25844
39076b35306n12838r5921P71409Q76947j6237o88353l12795L23509K26625k10638
39066A26402q0478L93127L33815j75160k59413J90910L74544o125l09904j23814
39056D63904J06913o1552l58029l33185n7770Q1738n9263k79335k83082L6081
39046g43580M14355M26983O2505j73988m863J54122j00641m09202k06731L09078
39036b71962M66544J39638k11821l19263k44290K9331M20414M26051k14024p88425
$$ y = [-257582, -86058, 15428, -172168, -356986, -383617, -484836, -655389, -451171, 231849, 789217, 768000, 561494, 717910, 1009556, 811556, 109338, -493434, -609576, -359392, 61005, 573554, 996003, 1063027, 722739, 169644, -347209, -580924, -404075, -109462, -235306, -748144, -844065, -72656, 804291, 788054, 99701, -213094, 110415, 337040, 126402, 45924, 439051, 772866, 597706, 338293, 529203, 903747, 897622, 587718, 463904, 570817, 509265, 151236, -181949, -239719, -157981, -217244, -496579, -779661, -743580, -329225, 97758, 160263, -13725, -18588, 135534, 34893, -374309, -581040, -271962, 194582, 334220, 122399, -196864, -441154, -411823, 8591, 434642, 220618, -567807]
39026e67807m86195K25857J96898n39135p45332K9655P49987N94686J33852J51619
39016b55915L65878J68377j90695j01637K69582K51249k29954n81193m36541k8727
39006g69576K56807K75272J24970K3167J04095K33978J89729J0436j15748k28107
38996A05023m23050m27584M8831O09339N63919L6409j71781R4256J33722k76822
38986B92262m29372l61K72136j24011n23048k25717K97231K56690j59807k94262
38976f38259j56564r0677Q4423N78314Q22194K57645n00338m27877K88436N47352
38966G64649O2887l53346k10076N3144l459k08762k79586j93579L2006L07289
38956b8833K77112j89802n10942j52806L72321K08528l72448l32578L74658O68366
$$ y = [-567807, -1054002, -828145, -631247, -1170382, -1915714, -1886059, -1136072, -541386, -407534, -255915, 109963, 278340, 87645, -13992, 255590, 506839, 276885, -304308, -740849, -769576, -512769, -237497, -112527, -89360, 14735, 248713, 438442, 448878, 333130, 105023, -318027, -745611, -696780, -87441, 476478, 512887, 341106, 435362, 569084, 292262, -137110, -137471, 134665, 10654, -512394, -738111, -440880, -184190, -343997, -638259, -794823, -885500, -801077, -222763, 599431, 857076, 356738, -71139, 217297, 764649, 827536, 474190, 264114, 317258, 313799, 105037, -174549, -368128, -336122, -28833, 248279, 58477, -452465, -605271, -232950, -24422, -396870, -729448, -354790, 313576]
38946C13576J25002l69695j50650K23938Q5153k54377k23592K0588N5929j4289
38936a88417Q6211K03476J02746o0727j23710k54229m43734k55018L80813P23875
38926A71286K37213m88388n32475O3980N27721N12010K85631L9483k46874m03127
38916A66460k16464J03811J88444J16346K04700L47522J76661k27820m26904l69563
38906F3193m01098n17568k93484L06469O80385M24999q4409k64654r1205L7057
38896a40315o1221j71445n3670K18777L11082J1509m21822m59229J1500M29548
38886c25286K87394j31899j91693J12687K01770j02383l12448j27478J14529J11515
38876c63292J11347L53164N30762L08380n8773j54359q8598j77142k46747O0265
$$ y = [313576, 438578, 68883, -81767, 142171, 227324, -27053, -250645, -230057, -174128, -188417, -102206, 101270, 204016, 143289, 19579, -234650, -678384, -933402, -552589, 171286, 408499, -79889, -612364, -548384, -20663, 491347, 776978, 816461, 569587, 166460, -50004, 53807, 242251, 358597, 563297, 910819, 1087480, 859660, 432756, 63193, -337905, -855473, -1148957, -842488, -162103, 262896, 178487, -86167, -177372, -140315, -201536, -372981, -426651, -207874, 103208, 114717, -307105, -766334, -754834, -325286, -37892, -169791, -361484, -248797, -47027, -149410, -461858, -589336, -474807, -363292, -251945, 101219, 631981, 940361, 881588, 727229, 638631, 461489, 214742, 275007]
38866B75007M79383L66305k68371o83023m81823j04412k3587p6705O4165K80694
38856a72367K90089J53689Q9778P0082k9376j39917j94261l15031m65778k65789
38846i78881L92150Q74082N44710k41063n35209r6749L67186K91573o8245k18442
38836C31112j17679k0894n5702j97490l44013k74167J23051N01615L70585j55371
38826A61047m21644j89057N1522n4410j80054j1566J39444n6298k69896p9146
38816i10058K27847J13766k64161l02099O4970L46228L36632K65870J75853j23743
38806f8895m59748l76350P6403L13925J39479K2388K15972K76058j49442o29929
38796f40139n52839p300M29354M94596L58372J58578j00993k87399k01369Q6395
$$ y = [275007, 754390, 1120695, 852324, 169301, -312522, -416934, -440521, -517226, -453061, -172367, 117722, 271411, 361189, 431271, 401895, 261978, 67717, -247314, -713092, -978881, -586731, 287351, 832061, 590998, 55789, -40960, 326226, 617799, 549554, 331112, 213433, 192539, 136837, -60653, -404666, -678833, -555782, -54167, 316418, 161047, -260597, -449654, -398132, -452542, -632596, -644162, -504718, -561016, -830912, -910058, -682211, -568445, -832606, -1134705, -1069735, -723507, -386875, -121005, 54848, -68895, -528643, -904993, -828590, -514665, -375186, -352798, -136826, 139232, -10210, -640139, -1192978, -1200278, -770924, -276328, 82044, 240622, 139629, -147770, -349139, -262744]
38786b62744K65389J73006o2156k48274l03994k17005j0654K23460L64618L37752
38776B59398J19488k29716m78857l45082J34716M92898L28731j51439l53374n5171
38766b78408L32336L58473J04442o1388p9397j89578l96506l72831j9299K76876
38756c25280K09250L7488J28117K98288J31274k31946k39846J50260L58323J13573
38746F29501j54264j02965j3828j68327k88991q5867J60127J05293j9753J35014
38736A95940L52638K38666o2454j83043k19636m15294m90872p8591M41089L86354
38726A64797j12289l11022n3472J23022K8309K8708J84005J27804q5972J8732
38716A12622L38195J96454l98068n64582n648M18719J16854k72846n8232L27525
$$ y = [-262744, 2645, 175651, 113495, -134779, -438773, -655778, -666432, -442972, -78354, 259398, 378886, 149170, -329687, -674769, -540053, -47155, 281576, 130137, -223237, -278408, 53928, 412401, 516843, 455455, 376058, 186480, -210026, -582857, -602156, -325280, -116030, -78542, 49575, 347863, 479137, 247191, 7345, 157605, 515928, 629501, 475237, 372272, 358444, 190117, -98874, -184741, -24614, 80679, 60926, 195940, 548578, 787244, 724790, 541747, 322111, -93183, -584055, -662646, -221557, 164797, 52508, -258514, -311986, -188964, -160655, -131947, 52058, 179862, 93890, 112622, 450817, 647271, 249203, -315379, -321027, 97692, 214546, -58300, -116532, 210993]
38706B10993K09304p0239K02484P67524P42448J4410o47995p27713m37995j58614
38696A04607k1824l114K5252K03667L58534J04447m34580n45710J930M47914J93545
38685D34668k21466p5030K78780J05859l16071j91444K72628J51113n10490o41461
38675g12914O3643N81907J95099m34603m03400J25018M16456K90891P8093p3010
38665A27180k25906l02155j86411J1124J23566J59677J54444L8724j61388k58839
38655e19984j88216r4417n1042J7955R2175O8943L4742J29865J66167j25591m76026
38644i45429l17240K76789N73564L00648N6579K67706M64197J23256l91392m05256
38634C422m282J88671L9510j1393K03654L07398L9148l21039l77370j44078N0921
$$ y = [210993, 420297, 350058, 552542, 1320066, 2062514, 2076924, 1428929, 701216, 263221, 104607, 82783, 79669, 104921, 308588, 667122, 771569, 336989, -208721, -206791, 241123, 434668, 213202, 138172, 416952, 522811, 206740, 15296, 287924, 439037, -71453, -712914, -649271, -67364, 127735, -306868, -710268, -585250, -168794, 122097, 200190, 127180, -98726, -400881, -587292, -576168, -452602, -292925, -138481, -99757, -261145, -519984, -708200, -802617, -853659, -835704, -743529, -674586, -639844, -509979, -343812, -469403, -945429, -1262669, -985880, -412316, -111668, -55089, 212617, 676814, 800070, 408678, 3422, -860, 187811, 227321, 215928, 419582, 726980, 766128, 445089, 67719, -76359, -25438]
38623b5438K1396q8416m9704J19599J82041N4224m9083m07l1623k95831m23758
38612e87000l7510M84758M40672o9651k53057P2354K06275j34674k53688K48125
38602A16604O01199Q9893o67787o57683n7978K14710Q2115K04639N56903M08148
38592H90763k44402m90454k6863K99246p9422n26046l28199J46322J85339p7606
38582b51322n6342J91611J33034k40703l94639j49406R8174P8624j0049M6046
38572e54972J62799K16271K36606K29209J11944o9701j29472k6875O1091J1830
38562B48730j16571k61958m19378m84369l01755M2782K38638J77110J08556K15301
38552e52914K90312R2326j88110j54728J92945M36798L37753J23339O9198R9595
$$ y = [-25438, -4042, -92458, -142162, -22563, 159478, 213702, 164619, 164212, 132589, -163242, -587000, -624510, -139752, 300920, 231269, -21788, 50566, 256841, 122167, -131521, 116604, 717803, 807696, 139909, -517774, -575752, -361042, -278927, -74288, 482615, 890763, 646361, 155907, 129044, 428290, 348868, -177178, -505377, -359055, -173716, -251322, -307664, -116053, 16981, -223722, -618361, -767767, -669593, -590969, -601018, -554972, -392173, -175902, 60704, 289913, 401857, 332156, 202684, 175809, 236900, 248730, 132159, -129799, -549177, -1033546, -1335301, -1292519, -1053881, -876771, -768215, -552914, -262602, -170276, -358386, -513114, -320169, 116629, 454382, 577721, 646919, 746514]
38542G46514J5684j17368j02560J1222J0597p7479j7556J58987R5013k99625n57601
38531a34172k86534J67557J36448l90065o96164l34298K80946N17380L70503K71166
38521i7233L07380J55670k42005m50284j83472K14776K51709p235r2258J32618
38511a0334L09695J96807K1372M1259J00039o8481l25952l07670j9867J40020
38501G6888j4709k08555j69541j8222j735j02736j43095q1887J7090J48631K70452
38490b27419K10214p3054k86989j67533Q4166Q3707r9808k5600L63610N35236
38480C96530J23202m87765o45176k48911K38168M38887L77315K10013j1382k37193
38470A53688l33012k33896n4635O0860J14823J89465K71832K57961J26021k004
$$ y = [746514, 762198, 644830, 542270, 553492, 564089, 486610, 469054, 628041, 723054, 423429, -134172, -420706, -253149, -116701, -506766, -1202930, -1537228, -1256282, -738902, -368399, -97233, 210147, 365817, 123812, -326472, -509944, -295168, -43459, -50694, -142952, -10334, 299361, 496168, 517540, 558799, 658838, 590357, 264405, -43265, -63132, 76888, 62179, -146376, -315917, -334139, -335874, -438610, -581705, -663592, -646502, -497871, -227419, -17205, -90259, -377248, -544781, -460615, -376908, -476716, -502316, -138706, 396530, 519732, 31967, -613209, -862120, -623952, -185065, 192250, 402263, 390881, 153688, -179324, -413220, -467855, -406995, -292172, -102707, 169125, 427086, 553107, 551103]
38460E51103l0193m1992j64626l10121k37025N8194K19790M494k82829j38358
38450c71563L98623P13461M18058j50210m23910l13312j39844p0166K6835K11443
38440B99415K86221O1578l64634o66184n68283r7893L87057N10434K96081J29063
38430B72855K01880K41260O181k21487n1897K89198J96470l55267o68502l30202
38420d19511J75149K12552q3748j28082J67453L40048J83784L1089J19064J75068
38410G72866r6465m72381n13555k09440N9404J31450K36725M74435N05711O0233
38400I48983m98581n46639r5209J57673j64659n10819j95802N17291P05182Q1287
38390C98707o03167o14033j51678J22431N6677K4780J85512K48113J834l14010
$$ y = [551103, 520910, 478918, 314292, 4171, -232854, -174660, 45130, 49624, -233205, -371563, 27060, 740521, 1158579, 1008369, 584459, 271147, 131303, 61137, 87972, 299415, 585636, 647214, 282580, -383604, -951887, -1049780, -662723, -152289, 143792, 272855, 474735, 715995, 722176, 500689, 448792, 737990, 934460, 579193, -89309, -419511, -244362, -31810, -115558, -243640, -76187, 263861, 447645, 478734, 597798, 772866, 676401, 204020, -309535, -518975, -459571, -328121, -91396, 383039, 888750, 948983, 450402, -96237, -191446, -33773, -198432, -709251, -905053, -387762, 317420, 398707, -204460, -818493, -970171, -847740, -791063, -766283, -580771, -332658, -330824, -644834]
38380f44834l19624K8948L98698M36533J24512j95392j90459O4067J87674K0259
38370h9618j84784j92809j17706j07520j5515K70649M43184J73864k81236l89901
38360d91392j53416m2596j50035n0478L65711N79348K64728j57002j98939m1125
38350g5196q1594j80769L3622L88588L64766k9063k21397M4627L65200L26330
38340I35114Q776l16112n45044n93776l11136J81149M13166J50600k17722j97908
38330d92893J37455L41870K55085O5327j50118m67913p06988m75871J96158O96861
38320f01027N86756J95417J02252K64660J44401l64761o76768l63086J82351K93491
38310b36314l1524k12104j1371J37990j20854m46720k79496L12312O93530N12627
$$ y = [-644834, -964458, -935510, -536812, -100279, 24233, -171159, -361618, -297551, -109877, -89618, -274402, -467211, -584917, -692437, -707952, -437303, 5881, 179745, -101491, -491392, -644808, -687404, -837439, -887917, -522206, 57142, 321870, 164868, -34071, -75196, -156790, -337559, -303937, 84651, 449417, 420354, 198957, 243584, 608784, 935114, 943890, 627778, 82734, -511042, -822178, -641029, -227863, -77263, -294985, -492893, -355438, -13568, 241517, 306844, 156726, -311187, -1018175, -1494046, -1297888, -601027, -14271, 181146, 283398, 548058, 692459, 327698, -349070, -712156, -529805, -236314, -267838, -479942, -491313, -353323, -474177, -920897, -1200393, -888081, -194551, 318076]
38300C18076Q3957j54915j98489k79060l97695l55777j23071J20511K64589L32479
38290c89395K95626R9839j13382j09953N1566N4052j49170k00618O0759K57125
38280a43551P9473j32260O8831L97519K16581l59311n30293r3385J69457k45541
38270e72480o82089l33522M50764O66111J26810l92223l69601r6400L0066M9030
38260a123534R3204J08541J36589L49427N85820L80769k69721o87768m08007J68284
38250f66396M11231L21179K68984K55826K7325k96716l24508n3577J28295R9663
38240A71306J25963K64962K00852j48511l66900j74830R9832N9555j14412k2298
38230I5519K07121J10646k61062l28327P3066L56755R9907k68355j68300K08796
$$ y = [318076, 402033, 247118, 48629, -230431, -628126, -983903, -1106974, -986463, -721874, -389395, -93769, 6070, -107312, -217265, -165699, -111647, -260817, -461435, -400676, -143551, -64078, -196338, -127507, 270012, 486593, 127282, -403011, -496396, -326939, -572480, -1254569, -1588091, -1137327, -471216, -344406, -736629, -1106230, -1202630, -1172564, -1123534, -1030330, -921789, -785200, -435773, 150047, 530816, 261095, -426673, -834680, -666396, -255165, 66014, 334998, 590824, 618149, 321433, -3075, -56652, 71643, 171306, 297269, 562231, 763083, 614572, 247672, 72842, 172674, 232229, 117817, 95519, 302640, 413286, 152224, -176103, -103037, 253718, 353625, 85270, -83030, 125766]
38220A25766L09364J87285K74441L93890l1602p51064p42904J47076O93921Q0654
38210F86827p73799o15197K19561M67324j4271k24797J74135M27949J52014q4167
38200D15579O0774J20183j47442k30157J13702L03408j5246l11727j81856q4819
38190D2399l66626m68196O2061O15248M99189R2039M8620J09737k17626n07080
38180i0235j61425L07009Q7834l58951l8029O63049M67485n07034p51616J37693
38170b44220P53428K11342m84986k59974L36440L31144m044O8666K62568j07779
38160H62585o73396n27347J90977M92109J34400j46141J9948J55503n2381k38374
38150B17883j53035j47977m59658o60141l10237K89802N02228K43567J4149J36825
$$ y = [125766, 435130, 622415, 896856, 1290746, 1259144, 508080, -234824, -87748, 606173, 686827, -86972, -702169, -482608, -15284, -29555, -254352, -80217, 347732, 499746, 415579, 476353, 596536, 449094, 218937, 332639, 636047, 620801, 309074, 127218, 42399, -324227, -792423, -730362, -115114, 384075, 476114, 524734, 634471, 416845, -90235, -251660, 55349, 143183, -215768, -253797, 409252, 876737, 369703, -381913, -244220, 509208, 720550, 235564, -24410, 312030, 643174, 639130, 707796, 970364, 862585, 189189, -338158, -147181, 344928, 479328, 333187, 353135, 508638, 456257, 217883, 64848, -83129, -542787, -1202928, -1513165, -1223363, -721135, -477568, -463419, -326594]
38140c26594L67196L24612L0098j65596p8353R5887J03380j6382n9632j4204m8930
38129B11482j87489k55970j86027j15069j12630n2560J31275K77879K22334K5699
38119d1076j27523j37819l9020M4816q582j44100j24994J14342K66720R7160j00541
38108b00617O0911L26946J17744m40174n31613R9419O44197L80880k76604m33061
38098b51972J4641L66997J64590l05804n01003k34488K15936M15730K13498q3622
38088A4503j15729Q771p4682l08837k60539R7484K61334M4154r3405J33582L32149
38077C8785J64183n6384j799N4541j44678k10900J88431N33478J84905m95955
38067B54607o35803j74416J73325Q8966p8902j01712r0150J1848L36333N35478
$$ y = [-326594, 40602, 365214, 395312, 229716, 151363, 247250, 350630, 334248, 274616, 260412, 211482, 23993, -231977, -418004, -533073, -645703, -698263, -566988, -289109, -66775, -41076, -168599, -306418, -345438, -300622, -309204, -453304, -578298, -463956, -197236, -100076, -200617, -139706, 187240, 304984, -135190, -666803, -567384, 76813, 457693, 181089, -251972, -237331, 129666, 294256, -11548, -512551, -747039, -531103, -115373, 98125, 14503, -101226, -92455, -167137, -475974, -736513, -639029, -377695, -333541, -426946, -293364, 38785, 202968, 146584, 144785, 199326, 54648, -156252, 32179, 565657, 750562, 254607, -381196, -555612, -382287, -293321, -372223, -473935, -564085, -552237, -215904, 319574]
38057C19574J52098m55295m36449K19123N79688J93292k96342k88567j10773k63325
38047c86976n10902l45354J53483N03781N14019L08501k7549l92759n26494l12968
38037a023218p251J48337K65265M66897N26441K33846j42806k00410k7653m3423
38027A96025k99498l93324j15046K07606J76115j20517k45362k5831K02972N6683
38017c60177l39234m69231j15850L27067L80500J00608p3785N5013K64955K96884
38007F6750J43758m0692j24686r3989o9392j39264j33391J72306N32084L55018
37997F68502l70584p98981l68479K86137K68249j71294r8908M72454N39824k15091
37987B11829q13422m47012L52409N89655J84337j51460K791L56487L69557j68297
$$ y = [319574, 471672, 16377, -420072, -200949, 378739, 572031, 275689, -12878, -123651, -386976, -897878, -1243232, -1089749, -585968, -71949, 236552, 209003, -183756, -710250, -1023218, -1030469, -882132, -616867, -149970, 376471, 610317, 467511, 267101, 239448, 196025, -103473, -496797, -611843, -404237, -228122, -348639, -594001, -619832, -416860, -360177, -699411, -1168642, -1284492, -957425, -576925, -476317, -550102, -495089, -230134, 66750, 210508, 169816, 45130, -48859, -118251, -257515, -390906, -218600, 313484, 668502, 297918, -501063, -869542, -583405, -315156, -486450, -585358, -112904, 426920, 211829, -601593, -1048605, -696196, -106541, 77796, -73664, -70873, 285614, 655171, 486874]
37977D86874q50884r09951r7453P65163O86305j12110m80987l8630L87041K30155
37967F5523Q869J81342K65892j37716m23572k9596M16458J01918m84679l00418
37957c35979M74344P07961J54646k77746j15320N9648j90224m32270k47985N0245
37947a52680O0587n1193N23P9500k7860j69238j16773M1606J08801Q9505P3638
37936f3584P9747J55321L37074M23492J42188l56735n55786k50383J80832L05112
37926C97278Q9902k54321n00444l94532J34443O19759L91408m97674j111921p11826
37916a837928L34517J023702Q48898J81833k82354k08972J49845K73870k6378
37907D57033l78539l73765j48456q8162j31188P3494L80628K26891l74152o47401
$$ y = [486874, -364010, -1273961, -1371414, -606251, 80054, -32056, -513043, -551673, -164632, 65523, 74392, 255734, 521626, 383910, -39662, -69258, 347200, 449118, -35561, -335979, 138365, 846326, 1000972, 723226, 607906, 667554, 477330, 45060, -202925, -152680, -92093, -143286, -142763, -63263, -91123, -260361, -377134, -335528, -226727, -137222, -63584, 16163, 171484, 508558, 932050, 1074238, 717503, 161717, -88666, 92166, 397278, 487180, 232859, -267585, -662117, -527674, 92085, 483493, -14181, -1126102, -1837928, -1503411, -479709, 369189, 551022, 268668, 59696, 209541, 483411, 457033, 78494, -295271, -443727, -531889, -663077, -589583, -208955, 17936, -356216, -1003617]
37897a003617j86110M04771M41597J39701R8881L03338K86708k6337k82542l17158
37887a40768k53690j31591O7594J60907L776j54631k9357J45603m9375m47056
37877h28588m42242Q5890N59124N00246P2447k89428l60605j29672K72845N14494
37867d5489K95364k13375m78419k60242J42147L68736L72836K35638r431k25840
37857A81925k06311j1738O0651k5653K1465K36597K20853j61938l91962l5196
37847a11307N02648M99027m8310m59995l33569O3126L23363L28447J06879k66642
37837F03667n26433l83086K3143K06137K5000q7203J88417N04069L35974k09308
37827F80377m98056k22455K23998L13195N1663j15174M3393K27675N0567l51412
$$ y = [-1003617, -1189727, -784956, -343359, -203658, -104777, 198561, 485269, 458932, 176390, -140768, -394458, -526049, -458455, -297548, -293772, -448403, -477760, -332157, -381532, -828588, -1270830, -1184940, -625816, -125570, -53123, -342551, -703156, -832828, -559983, -45489, 249875, 36500, -441919, -702161, -560014, -191278, 181558, 417196, 407765, 181925, -24386, -36124, 24527, -1126, 20339, 256936, 477789, 315851, -76111, -111307, 391341, 890368, 842058, 382063, 48494, 111620, 434983, 763430, 870309, 603667, 77234, -305852, -282709, -76572, -51572, -138775, 49642, 553711, 889685, 680377, 182321, -40134, 183864, 497059, 548722, 433548, 476941, 704616, 755183, 403771]
37817D03771m25071J7122M27303K18773l77282n83906j52083L39097L65531J25516
37807C58771L8150M0050j54178m03897l12179P7028K85045J21491o4570L5695
37797B1406K49617K36025l7166l01449l02285j3439L11905K92694j70834o40937
37787c54463n58195N0312N55934M93759P0875j91467p1433K20986L28716Q3823
37777F28847k75808k57927K65179O91641L70116m05978o73351j66453K81984K3613
37767D81863m25429k57340L44391N49881J69001k09814k33390j65873k19556j91384
37757a57650N6017K87552K86664J58477O6547j4595j51256l13714m51761m81769
37747g15488k43597K44717N89190M47702N6924j00024m2660j69482m45635l74281
$$ y = [403771, -21300, -4178, 423125, 641898, 264616, -319290, -471373, -132276, 233255, 358771, 396921, 436971, 282793, -121104, -433283, -356255, -71210, 50281, -14289, 21406, 271023, 507048, 469882, 168433, -133852, -147291, 164614, 457308, 286474, -354463, -912658, -862346, -306412, 187347, 258222, 66755, -4678, 216308, 545024, 628847, 353039, 95112, 360291, 1051932, 1422048, 1016070, 342719, 176266, 458250, 481863, 56434, -200906, 143485, 693366, 862367, 652553, 419163, 253290, 33734, -157650, -101633, 185919, 472583, 631060, 697607, 683012, 531756, 218042, -233719, -715488, -959085, -714368, -125178, 322524, 379448, 279424, 236764, 67282, -378353, -752634]
37737g52634J22908M62507K79089l9372p992K69161M09428L18635J19404j16412
37727A064722k81960k36856j10694k02368m02353k35210K92773N06190P8996l93523
37717G9717l19251J0389N5328l7005J50842M27120L25672k0415j31301m2625j32768
37706C65703l15779k19189M030j11871m16341k93480K60562N66812L50021P6435
37696B66903P4279J10507K4120J6946R6156m3500l56595l86724r3173P230k29496
37685e13347k89343N3103L20248K33370J85829L66198K86320k41357n28957j25762
37675b53698L20460J37230k19553l9979L29187J61098k47602r6326L96801L23416
37665H11034k57931l60663K10719N29827J61435j91324n9874M015l79354n67698
$$ y = [-752634, -629726, -167219, 111870, 72498, 64506, 333667, 743095, 1061730, 1181134, 1064722, 782762, 545906, 435212, 232844, -169509, -404719, -111946, 394244, 473240, 79717, -239534, -229145, -173817, -210822, -59980, 367140, 692812, 672397, 541096, 498471, 365703, 49924, -169265, -165235, -277106, -693447, -986927, -726365, -159553, 190468, 266903, 341182, 451689, 475809, 492755, 588911, 545411, 188816, -197908, -291081, -283851, -513347, -802690, -749587, -429339, -195969, -10140, 356058, 642378, 401021, -127936, -253698, 66762, 203992, -15561, -55540, 273647, 434745, 187143, 90817, 487618, 811034, 553103, 192440, 403159, 932986, 1094421, 903097, 843223, 847238, 467884, -99814]
37655i9814n0927M88504K38202l34735k09790M98046O93842J9633o22932m39054
37645A80975K01020M43237J27832j80491p4305K27917L10086J63291J52157M34642
37635A986361O84816N64692K54724J83895L60226M16987L08309M15684Q07276
37626E982970R48943M93922j04967k22204M8718J27994j68738n06780o59003p31698
37616E209157p80126o81534m74884m17886n57467n74441k51155J54590K38744
37607A864998J1441j27295L7650K20454M0790l82649n16330j43538K80832K34790
37597A521143j55066l60758k43876j27574j45851p8509R4215N9701k05707k65515
37587I2203K1421J51823j86751m79368j54846M54650N98347K38292j6811P8234
$$ y = [-99814, -150741, 337763, 575965, 241230, 31440, 529486, 1223328, 1242961, 620029, 180975, 381995, 825232, 953064, 772573, 698268, 926185, 1236271, 1399562, 1551719, 1986361, 2671177, 3235869, 3490593, 3674488, 4034714, 4451701, 4760010, 5175694, 5982970, 6931913, 7425835, 7320868, 7098664, 7147382, 7275376, 7106638, 6599858, 5940855, 5209157, 4429031, 3747497, 3272613, 2854727, 2297260, 1722819, 1471664, 1626254, 1864998, 1876439, 1749144, 1786794, 2007248, 2048038, 1665389, 1149059, 1005521, 1286353, 1521143, 1366077, 1005319, 761443, 633869, 488018, 409509, 503724, 563425, 357718, 92203, 113624, 265447, 78696, -400672, -555518, -100868, 497479, 735771, 718960, 797194]
37577G97194J79415P0661p3886j61465k91198l46603q3475K94562K58072k07489
37567D35788m78427k18883J41854J41496l8057k085J84490J93654R987j07139
37557B62678o1202K2872N7157M0404m4144j61581j60027L1934K26777J67325j48157
37546B34036m34867l91633Q878M40387M94119J47337j54247p2735J33116J7031
37536D21422l12656l29352O8940L80427K65626o506p2671N348j3845j38593k21408
37525D6732j85548k8298J37357K0437m75486q25351l97729N18209Q92858L95856
37515I9037j04796J05419N20651L46501j84279k77578J02104K87934M0965k33691
37505G02267k83412k35575q8318K73182N52898K68771m18698p68946m73711j3022
$$ y = [797194, 976609, 1047270, 973384, 811919, 520721, 174118, 90643, 385205, 643277, 435788, -42639, -261522, -119668, 21828, -16229, -18314, 166176, 359830, 369817, 262678, 201476, 224348, 281505, 321909, 277765, 116184, -43843, -11909, 214868, 382193, 234036, -200831, -592464, -583586, -143199, 350920, 498257, 344010, 271275, 404391, 421422, 108766, -220586, -151646, 228781, 494407, 487901, 415230, 420578, 406733, 268140, 46732, -138816, -167114, -29757, -9320, -484806, -1310157, -1707886, -1189677, -296819, 99037, -5759, 99660, 620311, 966812, 782533, 504955, 607059, 894993, 935958, 702267, 418855, 183280, 94962, 368144, 921042, 1189813, 771115, 2169, -471542, -484564]
37495d84564J15231m1399k09564k33599K801M72275P52385M38899j37432k41565
37485D33468J42896K60887j66375m67223j64122K16893N4358l39846l15502J0077
37475c34489L4648k59323l11281O3782M31462M52817K63645Q3682o9091j85786
37465A70066j75193n7069L2654N5648N6408q201j64422k45144j19417J5830p6239
37454e15079k12705n0175K72244K66622q8410k19967J57614N46720L95720p2237
37444D80347k05626J29371M21828K80298j00217l22725l10812k57863k51613j85289
37434c22301K70J78477J97478P2723n1170o5829L9648K12475L32016K35482j03046
37423G26223m39440m71883k02161P9254J83868J96784K14731J63632l229j62913
$$ y = [-484564, -369333, -410732, -620296, -853895, -851094, -378819, 373566, 812465, 675033, 433468, 576364, 837251, 670876, 203653, 39531, 256424, 310782, -29064, -344566, -334489, -299841, -559164, -870445, -806663, -375201, 77616, 341261, 424943, 355852, 170066, -5127, -62196, -29542, 26106, 82514, 74313, -90109, -335253, -454670, -438840, -515079, -727784, -777959, -505715, -239093, -327503, -547470, -389856, 156864, 552584, 480347, 274721, 404092, 825920, 1106218, 1006001, 683276, 372464, 114601, -137012, -322301, -322031, -143554, 53924, 126647, 75477, 9648, 49296, 261771, 593787, 829269, 726223, 286783, -185100, -387261, -308007, -124139, 72645, 287376, 451008, 447779, 284866]
37413B84866k32463k87359l07991r9189K92862M10060J0385m17873k75004K15863
37403d05843L08464j00333l08841M9754M13902K02231k74058l30185O2592L41523
37393d0794K21647n0490k14464k65581k09370J9247L21767M48948L12263M1417
37383E84590k47410m74217m55016r0801L27342L87485J45047K6209J07524M815
37373C15568l57314m34914R9239O87304N95718j2667l29405r3391J13494j52957
37363D30675n17200l93540J17792L68154N9305l74988l57627J05435M80300M08950
37353C27256J08958l6142l8130j40288k42853j702M36251M01435k64461p15776
37343a65452k22599O53298P62052M695n92326m15130J9549Q1470q5493r0660J183
$$ y = [284866, 52403, -234956, -542947, -642136, -349274, 60786, 71171, -346702, -621706, -405843, -97379, -197712, -506553, -456799, -42897, 159334, -114724, -444909, -382317, -40794, 180853, 130363, -84101, -349682, -559052, -539805, -218038, 230910, 543173, 584590, 337180, -137037, -592053, -682854, -355512, 31973, 177020, 203229, 310753, 315568, -41746, -476660, -377421, 309883, 905601, 892934, 563529, 470138, 583632, 430675, -86525, -480065, -362273, 5881, 65186, -309802, -667429, -561994, -81694, 327256, 436214, 400072, 361942, 221654, -21199, -22901, 413350, 814785, 550324, -165452, -388051, 265247, 1027299, 1031994, 439668, 24538, 44087, 125557, 40064, -50596, -49413]
37332d9413j212M7997K48068K91839P355k02888j5080J72512j24387n94532n87322
37321h07063j41249J76173K11899K40441K21803j06659m61107k17124N16479Q57257
37311D90850L91928k78578m82395k73213p664K01008K74629M2474l13889k74895
37301b29745J90253M12359N3724k76680J9429N33288M84458p4357m12287k29289
37291D71153O6429P2239j85030m78519n87620l53591J10407M04065L45180K44856
37281A09569L38312K99557j80263o68692m91340K32851P07081N27581L8967l28430
37271E85193m73472l67269K6554M63459N28377J59879k77776m57557l11210Q9303
37261c4519M78240M10163j73313n91127k43194M08263M17267k12982n56693k47440
$$ y = [-49413, -50625, -2628, 245440, 537279, 544634, 341746, 326666, 499178, 374791, -219741, -807063, -948312, -772139, -560240, -319799, -97996, -204655, -665762, -882886, -366407, 490850, 882778, 604200, 121805, -151408, -159072, 41936, 316565, 359039, 45150, -229745, -39492, 372867, 426591, 149911, 169340, 702628, 1187086, 1112729, 700442, 471153, 537582, 609821, 424791, -53728, -641348, -994939, -884532, -480467, -135287, 109569, 447881, 747438, 567175, -101517, -592857, -360006, 347075, 874656, 913623, 585193, 111721, -255548, -228994, 234465, 762842, 922721, 644945, 187388, -123822, -34519, 443721, 853884, 680571, 89444, -153750, 254513, 671780, 458798, -97895, -345335]
37251c45335M0214j68186l83837r3280L67601M63948L18604K98223K92973M7414
37241H38339k28743k07761n7399j20769k72700j58100J60446L21642K51556J63712
37231F90223J36295J00761Q8108J29458J02349j9941l3189Q7984J7739l16932
37221I82855m08684M8457M94442K71599l03474l95234N3686K94885k3879m22552
37211E92101m36354j99420j2113Q9450J33175N7253o2497j8668J72439K60155
37201E75521J48772l8650k52675m83789n04450j09294M28578O27822M79735L40923
37191A212493K28901j29387n62057n19815j7741K44277m0832l20839j53566P2044
37181A3478j09074l81988j89808L07508M83990K12376l7538L1452J87270R6424
$$ y = [-345335, -305121, -473307, -857144, -950424, -582823, -118875, 199729, 497952, 790925, 838339, 609596, 401835, 344436, 223667, -49033, -207133, -46687, 274955, 526511, 690223, 826518, 927279, 1015387, 1144845, 1247194, 1227253, 1194064, 1282048, 1299787, 982855, 574171, 622628, 1117070, 1388669, 1085195, 689961, 743647, 1038532, 1014653, 592101, 155747, -43673, -55786, 33664, 166839, 224092, 161595, 142927, 315366, 575521, 724293, 685643, 432968, -50821, -555271, -664565, -235987, 391835, 871570, 1212493, 1441394, 1312007, 749950, 230135, 212394, 456671, 415839, 95000, -58566, 13478, -95596, -477584, -667392, -359884, 124106, 336482, 298944, 330396, 517666, 614090]
37171F14090k39526n14322m13011O7070N04167M32779p6201m59447l81551r5578
37161e61530N5486J22172K91623M81349M81866K64618p2837m21616n65659l01127
37151b25655J69372L32768N9855j95191j03143R2993J03937N8209R8312M2035
37141D33492j39342o0107L49912M26503k50358r61767p36406K24317Q52089P03870
37131H42203K82665N468k37808m58164l68382j6665R3895k22593n17403l97957
37121i94741m1548J94149K37748J90482J22984J32749K74396L59710J60656j76287
37111D60298k86786j39609k6609m1463j9323L5891m9568k00924j58428N5054K02346
37100a69121K91445M44057M46098P4663k75112q2865K81175o225p48286q15608
$$ y = [614090, 374564, -139758, -552769, -485699, 18468, 451247, 375046, -84401, -465952, -561530, -506044, -383872, -92249, 389100, 870966, 1135584, 1062747, 641131, 75472, -225655, -56283, 276485, 336340, 141149, 38006, 130999, 234936, 293145, 391457, 433492, 294150, 234043, 583955, 1010458, 760100, -201667, -938073, -713756, 138333, 842203, 1124868, 1130336, 892528, 434364, 65982, 49317, 143212, -79381, -596784, -994741, -1036289, -842140, -604392, -413910, -290926, -158177, 116219, 475929, 636585, 460298, 173512, 33903, 7294, -34169, -53492, -17601, -67169, -268093, -426521, -371467, -169121, 122324, 566381, 1012479, 1087142, 812030, 729165, 1010340, 1004115, 255829, -559779]
37090e59779L7164O28227J62656n35299m02267K23611L51096q982p0030K83246
37080A09643L91283P703l71246l65345j28075J18478L19511L43700P5938k32862
37070B68728k06285Q5273K43657J66451R2551J04840O4807q498M2652J44384O5277
37059A063837j62469k77563k02661p9282K2061R4750M0771j31239j44273J29036
37049C52968L25426J14434k04339j64425O8336K276k81392k71761L6607J38108
37039A16238m9624n2344K36808K99931q2620l87810j90327J84355K57975J11575
37029D44157O3833R1001J8983o3902j5658K2000j19465k85028k50665j04577m9378
37018b48699l7827O6520J52263K4132k16552k67470m5861K27836L30109K37056
$$ y = [-559779, -522615, 105612, 268268, -267031, -669298, -445687, -94591, -103573, -173603, 109643, 500926, 508629, 137383, -227962, -356037, -237559, 81952, 425652, 501590, 268728, 62443, 147716, 391373, 557824, 650375, 755215, 820022, 811524, 854176, 998560, 1063837, 901368, 623805, 421144, 341862, 363923, 458673, 499444, 368205, 223932, 352968, 678394, 792828, 588489, 424064, 492400, 494676, 213284, -58477, -21870, 116238, 66614, 14270, 251078, 551009, 468389, 80579, -109748, 74607, 332582, 444157, 507990, 598991, 617974, 554072, 538414, 560414, 440949, 155921, -94744, -199321, -248699, -286526, -220006, -67743, -43611, -260163, -527633, -573494, -345658, -15549, 221507]
37008B21507O3059o5469r8603r5542j27585j42337k1146K30418M58017M97937
36998I20256K48763k68707p59744p65300k13496L33621L56362Q8693P2078K33208
36988B45734R4317k27786j07802M19348N34550K469l06348J65068O34183K18678
36978A672411n48062n25474J79998L88882k48914p46953l98864J88575J94587
36969A56186j40266o5178L93274N07137K6135m51720l84295k477J47590J1641
36959A98027j6100K00909L21313J15072j11310J6134K99828K36615j77345m11918
36949F71225k31706l6685j60161l20977j41027J92412K43602L0463p6432J9021
36939A89735Q8490N2554N1561R9277Q6775Q8015K44918L89775K33532q1120j17076
$$ y = [221507, 284566, 219097, 120494, 24952, -102633, -244970, -266116, -35698, 422319, 920256, 1169019, 900312, 140568, -624732, -838228, -504607, -148245, -59552, 12526, 245734, 340051, 112265, 4463, 423811, 958361, 960830, 654482, 819550, 1453733, 1672411, 1124349, 598875, 778873, 1167755, 918841, 171888, -226976, -38401, 156186, 15920, -49258, 344016, 851153, 877288, 425568, 41273, 38796, 186386, 198027, 181927, 382836, 704149, 819221, 707911, 724045, 1023873, 1260488, 1083143, 671225, 439519, 402834, 242673, -78304, -219331, -26919, 216683, 247146, 170714, 189735, 278225, 330779, 382340, 481617, 568392, 656407, 901325, 1291100, 1524632, 1443512, 1326436]
36928A326436J02302J8038n77831j077699q26656k969O47649P28249M73511K51933
36918A062963J46199L8144j32809k74574k41204l7626R1439p2844l48911k91184
36908f0407J78147N47409L69928q9362k13683Q7250K83965M5346k65092j20380
36898G63121M23054P90365N79528m0761n67725o23560k25307K50426M13829K88512
36888B051482K85442O02138Q45004N68300K7442j05150K26431L19023j81952o58709
36878C979451m68846J9477J5695m31663n76791k37509m4295l40021o57603n61556
36868F96339k71989q1234J67895N43878N87464J8290n98928n51466O134L76109
36858H92492L63440L20171L58471K41530j5695j17102p1287j95504m87971n65158
$$ y = [1326436, 1428738, 1446776, 868945, -208754, -1035410, -1038379, -390730, 337519, 811030, 1062963, 1209162, 1247306, 1114497, 839923, 598719, 561093, 652532, 579688, 230777, -60407, 117740, 665149, 1035077, 945715, 732032, 819282, 1103247, 1148593, 883501, 763121, 1186175, 1976540, 2556068, 2515307, 1947582, 1324022, 1098715, 1349141, 1762970, 2051482, 2336924, 2939062, 3784066, 4352366, 4379808, 4274658, 4501089, 4820112, 4638160, 3979451, 3510605, 3530082, 3545777, 3114114, 2537323, 2299814, 2255519, 1915498, 1257895, 696339, 424350, 343116, 511011, 1054889, 1642353, 1660643, 1061715, 510249, 516383, 892492, 1255932, 1576103, 1934574, 2176104, 2160409, 2043307, 1972020, 1776516, 1288545, 723387]
36848G23387k89667P3204L65516O34085O70403J14397p96927j222036p56730M6861
36838d37507M89827N23342M16983J95860j34408k73144n7686J44247k4992l00555
36828E41967k32955O7340J90184J71444L35352N50622L44464k40908n74414l43836
36818H09260N1693J97096J94067K40492J91146r1830l40572k42096O5603K27488
36808A302347J90796J42233J16763L8166L181J34561K39215J8462l96052n16481
36798A273191j72731K46085L38320J64711L3776Q6822K58637M20067M13329J71431
36788C233638p6658l710K64237J64722m55444r08215n46630K20462M16201j21472
36778B187131n37150k36376L05177L32190j22786m26062k70708O4277K38158K16523
$$ y = [723387, 433720, 506924, 872440, 1506525, 2176928, 2291325, 1494398, 272362, -484368, -437507, 52320, 575662, 992645, 1188505, 1054097, 780953, 723267, 867514, 842522, 541967, 309012, 376352, 566536, 737980, 1073332, 1623954, 1968418, 1727510, 1153096, 809260, 860953, 1058049, 1252116, 1492608, 1683754, 1591924, 1251352, 1009256, 1074859, 1302347, 1493143, 1635376, 1752139, 1790305, 1793486, 1928047, 2167262, 2185724, 1789672, 1273191, 1100460, 1346545, 1684865, 1849576, 1883352, 1970174, 2228811, 2648878, 3062207, 3233638, 3156980, 3153270, 3417507, 3582229, 3126785, 2218570, 1671940, 1892402, 2308603, 2187131, 1649981, 1413605, 1718782, 2050972, 1928186, 1502124, 1231416, 1295693, 1533851, 1750374]
36768A750374J33573Q3299Q3831R5399P8062Q2543J74094K42574J12869r5632
36758B740986m0579K67047L38487p4300n14462m52466m7758J74748J15168M2134
36748B549005P43j16119r9743K76422O02990K68850m35623n22446J87734O69622
36738C381435K26582m41880l59489K64828N32735K93764J42368K70816K95669
36729D606828J51021K21880M94993M43755k4354l09285j11995Q8743l3313j4850
36719E513423N03786R38674O22385L293M7014P13247J029543O41877K79511M75591
36709A0768344P85955P15684N89851Q79765J305823J328875J078358J057587J259847
36700A9770089J333331J394215J880131K688388L243990L439965L758861M391913
$$ y = [1750374, 1883947, 1967246, 2051077, 2146476, 2224538, 2307081, 2481175, 2723749, 2836618, 2740986, 2700407, 2967454, 3305941, 3231641, 2717179, 2264713, 2216955, 2391703, 2506871, 2549005, 2549748, 2433629, 2333886, 2610308, 3213298, 3482148, 3046525, 2524079, 2711813, 3381435, 3608017, 3166137, 2806648, 3071476, 3604211, 3897975, 4040343, 4311159, 4606828, 4757849, 4979729, 5474722, 5918477, 5894123, 5584838, 5472843, 5561586, 5528273, 5513423, 6017209, 6955883, 7578268, 7581561, 7628575, 8341822, 9371365, 10013242, 10292753, 10768344, 11554299, 12269983, 12859834, 13739599, 15045422, 16374297, 17452655, 18510242, 19770089, 21103420, 22497635, 24377766, 27066154, 30310144, 33750109, 37508970, 41900883]
36692D1900883N016565N611041O686898Q419730J0325285J2185631J4513166J7571051
36684A22230250K0712113K3404062K6159321K9358282L1462004K9507408K1619977
36677C04453417Q638217o428041j9851250k8559113l1466516l0031109k6921667
36670A69833938k3803596k0730078j7471311j4464675j2160964j0306745q485204
36663F2411365o853498n797462n225027m702613m049516l401707k886805k545413
36655B6949324k381995k261882j976324j572757j329468j269775j099451p95639
36647A4262033p53869j065721j197298q10720l82477m56162p44550o38424k43996
36638G968816j60375m47448n98753m56595l82879m86984m23146r6258J06774l885
$$ y = [41900883, 46917448, 52528489, 59215387, 67635117, 77960402, 90146033, 104659199, 122230250, 142942363, 166346425, 192505746, 221864028, 253326032, 282833440, 304453417, 313091634, 306663593, 286812343, 258253230, 226786714, 196755605, 169833938, 146030342, 125300264, 107828953, 93364278, 81203314, 70896569, 62411365, 55557867, 49760405, 44535378, 39832765, 35783249, 32381542, 29494737, 26949324, 24567329, 22305447, 20329123, 18756366, 17426898, 16157123, 15057672, 14262033, 13508164, 12442443, 11245145, 10434425, 10051948, 9595786, 8851236, 8212812, 7968816, 7808441, 7360993, 6762240, 6305645, 5922766, 5435782, 5012636, 4916378, 5023152, 5019267]
36628E019267j27095r3247j75198m64884n23431q5394L73217K78553j85403l87288
36618C629097j66906P1883L4336j87736m33157o09530n37158r1824M48082N85746
36608B742833K34726j63029k45713j36233j01789j28948p0693J2103o9057l10745
36598A763455m93402m34212j41678K04100L39546J34444j61908r6351L71055O63886
36588B148935L26721k49072l21369Q0614J63984l69534p61312l20538M62718N99583
36578A760730M7988l23344j15746J08675j03652l40713q8530L70668M44024K12252
36568A972352K37027N66705O35915J98424k62962k76402m9851p7987l94372n73930
36558A974919l48346P2929K80450R5628k73827m39194k38848M5118J2871k90693
$$ y = [5019267, 4892172, 4798925, 4623727, 4158843, 3635412, 3550018, 3923235, 4201788, 4016385, 3629097, 3462191, 3534074, 3568410, 3380674, 2947517, 2337987, 1800829, 1709005, 2157087, 2742833, 2977559, 2814530, 2568817, 2432584, 2330795, 2201847, 2131154, 2143257, 2074200, 1763455, 1270053, 835841, 694163, 898263, 1237809, 1372253, 1210345, 1113994, 1485049, 2148935, 2475656, 2226584, 1905215, 1985829, 2149813, 1780279, 1018967, 698429, 1161147, 1760730, 1808718, 1485374, 1369628, 1478303, 1374651, 1033938, 945408, 1316076, 1760100, 1972352, 2209379, 2776084, 3411999, 3610423, 3347461, 3071059, 3021208, 2943221, 2548849, 1974919, 1626573, 1699502, 1979952, 2075580, 1801753, 1362559, 1123711, 1168829, 1181700, 891007]
36548H91007l82937m0398L06660J82247j65939q7185M28869O04695l349p45215
36538I88455p08529K369M19593P2576m33082l74760R6423L10954O7950k14214
36528B27735j92895l099N2602j05326l12166l22429N712N08655P63756N57100
36518A179645K08770J45946K62576J10123l14082m85676j89642Q3214j16502m78071
36508D06301l88388J58685N65896M33434l1818l74439l51954n1889K10055J31169
36498G07052k47151n12788l62262J1454K11796J59986O2000J8046r884K3633J38727
36487B00609J21064j70366m02007j68543K73675K78717j48894k83650J45436M51751
36477B97792R8257l82420k36608K79604L49091n5415k00211J18515K72700m6917
$$ y = [891007, 508070, 467672, 774332, 956579, 790640, 703455, 1132324, 1737019, 1733670, 988455, 279926, 282295, 701888, 774464, 341382, -33378, 63045, 373999, 441949, 227735, 34840, 31741, 84343, -20983, -333149, -655578, -649866, -141211, 622545, 1179645, 1388415, 1534361, 1796937, 1907060, 1592978, 1107302, 917660, 1000874, 884372, 406301, 17913, 176598, 742494, 1175928, 1144110, 769671, 417717, 365828, 575883, 707052, 459901, -52887, -415149, -403695, -191899, -31913, 30087, 48133, 38249, 61882, 200609, 321673, 151307, -250700, -419243, -145568, 133149, -15745, -299395, -153959, 297792, 396049, 13629, -222979, 56625, 405716, 350301, 150090, 268605, 541305, 494388]
36467D94388k89088m6141J94900j00145n33160l84468J89463L77420k2898l57759
36457d77488j92398R7277O5347p4036J16371N17701O04061K25094j80805j77504
36447E23620J51341L72029K32100r3867k57244j48635J5959K1147o5439m7501
36437G03510P5480J31575P0277R823l507n3008j41603j58163j05880j26517k21108
36426A80879j91917K7139K19798K04113Q0731J8504O943j4136J4250J19983J56246
36415H22533n20k41538l59493k63334J3972L24265L74894j565m54386l86238J96561
36404B5151N51484K16932l06954l37092k6792m18k85662l30242L0258L26620K29347
36393I2632l7423j81903k31248k66644j95731K4183K36396K81377J34831j27354
$$ y = [494388, 205300, 159159, 354059, 253914, -279246, -663714, -474251, -96831, -119729, -477488, -669886, -572609, -507262, -581298, -464927, 52774, 656835, 881929, 701124, 523620, 674961, 1046990, 1279090, 1185223, 927979, 779344, 795303, 816450, 751011, 703510, 778990, 910565, 980842, 990665, 987158, 934150, 792547, 634384, 528504, 401987, 180879, -11038, 16101, 235899, 440012, 520743, 539247, 546190, 532054, 546304, 666287, 822533, 822013, 580475, 220982, -42352, -28380, 295885, 670779, 669214, 214828, -171410, 25151, 576635, 793567, 486613, 149521, 122729, 122311, -163351, -493593, -463335, -136715, 92632, 55209, -126694, -357942, -624586, -820317, -796134, -559738, -278361, -143530, -270884]
36383b70884k74416M751O18474Q83314L30977m80941o07645n2998K94852O1036
36373E06520j67588j40P3781l56947p68215m85166K25231N68041L72699J33203
36363A01419J05652M4388j91105l45127k02237P3996J90731R1215m5178n1135
36353b27381O2098J59439J51625M3305j63119m13419m15330J14556Q03932P43991
36343H59697k44320r98492m77698O01897P04162j87806n53257K15260Q59328L41472
36333A120243n33056n52936J786J01283k52935k87009O2042J85104l809n0116
36323b09403Q7435R1574P7154L36273N23924J25416m68989m41655N4566J33967
36313C10262k55460k59373K82503M63825j11094n94789k92141K66374L13328K1786
$$ y = [-270884, -545300, -540549, 77925, 961239, 1292216, 811275, 203630, 150632, 445484, 506520, 338932, 338792, 412573, 55626, -712589, -1197755, -972524, -404483, -31784, 101419, 207071, 251459, 60354, -284773, -487010, -413014, -222283, -131068, -176246, -227381, -165283, -5844, 145781, 189086, 25967, -387452, -802782, -688226, 115706, 859697, 615377, -383115, -860813, -258916, 445246, 257440, -295817, -80557, 778771, 1120243, 587187, 34251, 36037, 137320, -115615, -402624, -340582, -155478, -159287, -209403, -121968, -30394, 46760, 383033, 906957, 1032373, 563384, 121729, 176295, 310262, 54802, -204571, 77932, 541757, 430663, -164126, -456267, -189893, 123435, 145221]
36303A45221l6069J08135J10299N8987K00055L20255Q1005l13783l78831r1288
36293B03986J17787o984k93829m17325j83888L01835O07007L53484k41188n29354
36283h8469k79442L7691m58j76559r5518J62222K36064O1001j08132o9691J78613
36272a42678M83839N54351J73275m36307p25467m65062n490K41949K52894J67696
36262I9000N861j66268j35065J25115L08330K08644K1586O848J27665K08701J67106
36251I77523n0165m16611n99029k22742M61583O80276J76410l63546k81134J52527
36241E15092K65839j2584k26424j64775j2330J08769K72437M98046O98511P90781
36231B733362O58835K20552k82894l90194n7516J80733j7589k96637k41197o2375
$$ y = [145221, 109152, 217287, 327586, 386573, 586628, 906883, 987888, 674105, 295274, 203986, 321773, 314789, 20960, -396365, -580253, -278418, 328589, 682073, 440885, -88469, -367911, -330220, -330678, -507237, -602755, -440533, -204469, -143468, -251600, -321291, -142678, 341161, 895512, 1068787, 632480, -92987, -558049, -563539, -321590, -68696, 99000, 104861, -61407, -196472, -71357, 236973, 445617, 467203, 474051, 601716, 810417, 977523, 927358, 510747, -88282, -311024, 150559, 830835, 1007245, 643699, 362565, 515092, 780931, 768347, 541923, 377148, 364818, 473587, 746024, 1244070, 1942581, 2733362, 3392197, 3612749, 3329855, 2939661, 2882145, 3062878, 3045289, 2748652, 2507455, 2445080]
36221B445080j48058l48606l09255j70192k65860l84610o6292M84503N42599l0074
36211A749235n05171l00335K77683N51099L30009j6316j13456J4186L6142k44682
36201A778394n73405n24829j21647J57969J12224R8864L19989L74648M109k66541
36191A359775P4755N52380L94364j31720r2584N42508Q28037M32911J53681M80141
36181D594248P50318L68556p5649K40484R87509J206214Q01073N47635P74837
36172A0195225R47754O28163Q7281k49601l77690m66786n01367m68582n70113
36163I224284r30093j300072j333307j023071o40347l53207j53350q0305k18304
36154C192228m34805m15354j14638O5497j97401o02452n52819R205M79532M03236
$$ y = [2445080, 2297022, 1948416, 1639161, 1468969, 1203109, 818499, 752207, 1236710, 1779309, 1749235, 1244064, 943729, 1221412, 1772511, 2102520, 2086204, 1972748, 1986934, 2023076, 1778394, 1204989, 680160, 558513, 716482, 828706, 927570, 1247559, 1622207, 1626316, 1359775, 1434530, 1986910, 2381274, 2249554, 2156970, 2699478, 3527515, 3960426, 4114107, 4594248, 5344566, 5713122, 5637473, 5877957, 6865466, 8071680, 8872753, 9420388, 10195225, 11142979, 11771142, 11858423, 11608822, 11231132, 10764346, 10262979, 9794397, 9224284, 8294191, 6994119, 5660812, 4637741, 3997394, 3644187, 3490837, 3410532, 3192228, 2757423, 2342069, 2227431, 2292928, 2095527, 1493075, 940256, 949461, 1428993, 1832229]
36144A832229L3744j34633n2996l950n6967m7790L6949O4944P4293J79910K16430
36133B142163p1968m77526m78149o4270J19749k62925o40553l43190L57953O03747
36123H85031J78240k29941o9628L15972K64410k28669n16442j97477L51872M62567
36113A215935j5m94001m73157k5224K90804J68073r9142p1282K13172K98243l6645
36102I86761m40773m45239q5006J61573J8448k53081k61706k4231J08702l1712
36092b66264k33384k40568q4877J8136k4406r2836k5667J81428L38402K50696
36082a79340l629q2466J82897M58704K89132k19532m52734j28128K94820K81605
36072D41329m4325j95920q5853k4449p9096L3659L54944M76906J56445k42200
$$ y = [1832229, 1865973, 1731340, 1678344, 1674394, 1617427, 1569637, 1606586, 1671530, 1745823, 1925733, 2142163, 2070195, 1592669, 1114520, 1050250, 1169999, 907074, 266521, -76669, 281284, 885031, 1063271, 833330, 763702, 1079674, 1344084, 1115415, 598973, 401496, 753368, 1215935, 1215920, 721919, 248762, 223538, 514342, 682415, 583273, 511991, 725163, 1023406, 986761, 545988, 100749, 15743, 177316, 195764, -57317, -319023, -343254, -234552, -266264, -499648, -740216, -825093, -806957, -831363, -924199, -949866, -768438, -430036, -179340, -182969, -265435, -82538, 376166, 665298, 445766, -6968, -135096, 159724, 441329, 397004, 201084, 115231, 90782, 11686, 45345, 400289, 877195, 1033640, 791440]
36062G91440k42478M8831J13318k07216m87450l32337R2660L32081K45593Q3055
36052D37497K7415l4213k00094k91141j26513J13873J07434r6156j16717J57639
36042b0976L56369J68992j94889l33492k15748j08422q0101N7362L10299L62058
36032C01452L8951l20147k34251K36971M71167P9933m92265m81443J37671N37514
36022B75553J67108m36407m04308K01904N20782K01775j34846O6640M65960M31763
36012A355924k1673l97337m82078m47978l90433k35272j7260J18595J32163M5138
36002c40211j70989m03284l10430K27537P57675P31823J99086l33564n68170n46851
35992g57378k87156K16041O75547O83024K49708j90216l33150k37433n3905J01471
$$ y = [791440, 548962, 597793, 711111, 503895, 16445, -315892, -223232, 108849, 354442, 437497, 464912, 430699, 230605, -60536, -187049, -73176, 34258, -61898, -178615, -20976, 335393, 504385, 309496, -23996, -239744, -348166, -428267, -370905, -60606, 301452, 340403, 20256, -213995, 22976, 494143, 574076, 81811, -399632, -261961, 275553, 442661, 6254, -398054, -196150, 324632, 526407, 391561, 458201, 924161, 1355924, 1334251, 936914, 454836, 6858, -383575, -618847, -636107, -517512, -385349, -340211, -511200, -914484, -1224914, -997377, -239702, 492121, 691207, 357643, -210527, -757378, -1044534, -828493, -152946, 530078, 779786, 589570, 256420, 18987, -34918, 66553]
35982F6553O2339j91844l07529K5989M82627M48777l4936k87517m5147J58529
35972C77841o8915l18289j14265K36313J45596k61351l37975M0708L03165J11608
35962A14436j44285m2224J63260l9915n40842o51692o1592O81152Q53001M28076
35952G59375l6087j88054j58408j11857J7373K33896L28672K11409N8885n2280
35942A062924k85190n88282n47085n2695L19171R5827l02636j74342L47562N03093
35932C78347R7777k59348j42997J54013K22940Q5818n5056j30307r7531N8722
35922C12378J26689r9879l55535j84086K75018L82825j3028l43012k50075o9014
35912b17719q8599l9635K65153M33175J52377k06320j96238p598l664k7302J81941
$$ y = [66553, 128892, -62952, -370481, -344492, 138135, 586912, 551976, 264459, 219312, 377841, 308926, -9363, -123628, 112685, 258281, -3070, -341045, -300337, 2828, 114436, -29849, -72073, 91187, 51272, -489570, -1141262, -1202854, -521702, 331299, 759375, 723288, 535234, 376826, 264969, 282342, 516238, 844910, 1056319, 1115204, 1062924, 777734, 189452, -357633, -410328, -91157, 4670, -297966, -472308, -124746, 378347, 476124, 216776, 73779, 227792, 450732, 536550, 481494, 351187, 253656, 312378, 439067, 339188, -16347, -200433, 74585, 457410, 444382, 101370, -148705, -217719, -306318, -345953, -80800, 352375, 504752, 298432, 102194, 94596, 90932, 63630, 245571]
35901B45571L10246m2335n05470l75196K43087N20474J29797l47498l54996n8263
35891b34583J02160L6138p3321r9773n324J84566K96427J45899j53562k76394
35881g7767j46839l9398j34952k55511j66351R1628L05933L45775J99518p6969
35871D5067l37758l99664k20638M4592K09034K07568R0657m3686j07410p9309
35861e91547O298J43293L27482M18681K23794j63771l27265m0354L68548M22769
35851G87928J11097j90821k71072k22141j34849j7372K7054r4256j99793m5242
35841b49467K12896J81925j05490j68959J45932L65773J30854k11318j53989J69567
35831C17724K26435o4482k41267m4548K13342J60980q7570j17711K14777N78106
$$ y = [245571, 555817, 513482, 8012, -367184, -124097, 396377, 526174, 178676, -176320, -234583, -132423, -96285, -169606, -269379, -274703, -90137, 206290, 352189, 198627, -77767, -224606, -264004, -398956, -654467, -820818, -729190, -423257, -77482, 122036, 45067, -292691, -692355, -912993, -868401, -659367, -451799, -361142, -404828, -512238, -591547, -585249, -441956, -114474, 304207, 528001, 364230, 36965, -3389, 365159, 787928, 899025, 708204, 437132, 214991, 80142, 62770, 89824, -4432, -204225, -249467, -36571, 145354, 39864, -129095, 16837, 382610, 513464, 302146, 148157, 317724, 544159, 479677, 238410, 193862, 407204, 568184, 480614, 362903, 577680, 1155786]
35821A155786N20391M35m52004k42492N18735R60049M35660n85432j024303n39943
35811G46882J25291K44694j6724j41954j37325l03762m91749k86271J90044L60410
35801B89536J10033o4102M2624k541m05380o22372k04527L99904N07787K31826
35791B82788J48286K55461O7451l87837n05511j17662J99247N7731j73756o4039
35781b37841K00314K40794J32797J63442K73680K05461o467j14658r8884j46850
35771F11788k66288k50938k9821K00016K12600j7291k91924l10583O5282N47193
35761D70034N94001M9535n46763n45940K996M16285K34259k67492n08421l00904
35751d02410O2714K74512L14280K86434J92546J3567j31580j23255o2130j10549
$$ y = [1155786, 1676177, 1676612, 1224608, 982116, 1500851, 2460900, 2896560, 2311128, 1286825, 746882, 872173, 1116867, 1100143, 958189, 820864, 517102, 25353, -260918, -70874, 289536, 399569, 335467, 378091, 375550, -29830, -652202, -856729, -456825, 50962, 282788, 431074, 686535, 753986, 366149, -139362, -257024, -57777, -46, -173802, -237841, -37527, 203267, 336064, 499506, 773186, 978647, 972180, 857522, 758638, 611788, 345500, 94562, 64741, 264757, 477357, 460066, 168142, -142441, -77159, 470034, 1064035, 1113570, 566807, 20867, 23863, 440148, 674407, 406915, -101506, -402410, -339696, -65184, 249096, 535530, 728076, 741643, 610063, 486808, 424678, 314129]
35741C14129j57682M3630L89326M58583J50723j28960j14629m8563j12981k0229
35731G73347L67026N34451R3594l84392j31538N37990O48950R5668k68371o1594
35721B205131J81391J63009L19982Q00793J001705O66384M82901R15812J330155
35712H067263J079751O85668R94114J772432K154367K063100K171988K683195
35704B1671878L102740L127130K878307K286476J077540n30040j834329k504689
35696B9275013k842833l082688l014416k504947j907800j670967j798399j895520
35688A0557443j630078j086938o99256p34596q72264o01220o4252K3795m94585
35679D398049q20071l68030K92687L05328k17696n60082n66434n78573n42087
$$ y = [314129, 156447, 200077, 589403, 1047986, 1198709, 1069749, 955120, 906557, 793576, 773347, 1140373, 1674824, 1768418, 1384026, 1252488, 1790478, 2439428, 2535096, 2266725, 2205131, 2386522, 2549531, 2869513, 3670306, 4672011, 5338395, 5821296, 6737108, 8067263, 9147014, 9832682, 10826796, 12599228, 14753595, 16816695, 18988683, 21671878, 24774618, 27901748, 30780055, 33066531, 34144071, 33614031, 31779702, 29275013, 26432180, 23349492, 20335076, 17830129, 15922329, 14251362, 12452963, 10557443, 8927365, 7840427, 7141171, 6406575, 5534311, 4933091, 4868839, 4892634, 4398049, 3577978, 3209948, 3502635, 3807963, 3590267, 3030185, 2463751, 1885178, 1343091]
35670A343091j15176M84353O29988K39915j92810m37853o25529o30792k12273
35661D82914K94297K96318o1052j08829J55347P8460l73042m22638J77389O57746
35651A176910M80123J09777N2478J9926l44385o88150n69109k30881j15737j14935
35641b23983R1465L82902M46996L19220J98074N8875j47684k60796k19178k35519
35631D10372l73199l74739j70582n5279r3855N3250L98904M01899j01968m40460
35621c45657j24460L36287K76943p1220q9984J92048L30897K90288K78266J53069
35611A226477k47960n35416k88223J60954K09909n0557j24807m3399j61479l00916
35601a55417j7803M44302M19518l1526j82954J34934L18147R2708r6629o929j7965
$$ y = [1343091, 1227915, 1712268, 2342256, 2582171, 2389361, 1951508, 1325979, 695187, 482914, 777211, 1073529, 1012477, 903648, 1058995, 1137455, 764413, 341775, 519164, 1176910, 1657033, 1766810, 1819288, 1839214, 1494829, 806679, 237570, 6689, -109048, -223983, -132518, 250384, 697380, 1016600, 1214674, 1273549, 1125865, 865069, 645891, 410372, 37173, -337566, -508148, -563427, -657282, -604032, -205128, 196771, 94803, -345657, -470117, -133830, 143113, 71893, -18091, 173957, 504854, 795142, 1073408, 1226477, 978517, 443101, 154878, 315832, 525741, 475184, 350377, 306978, 145499, -155417, -173220, 271082, 690600, 659074, 476120, 611054, 929201, 1021909, 925280, 918351, 900386]
35590I00386l24455n08870k93585k1687n227k5327J28170K02730j2458k29788
35580a90111j24642J55768K91538K24710K8529k54505m18626j95459K28065L02701
35570D7968l2488j77059J44469L74121M8857l99079l66087n6621m9107l07964
35560g72990l58529j38077N1117J99154M72997O29911L05507k07793k39349K03860
35550A45808M21438J43810r7371O0251K04006j04908n64290n86541j37284L07869
35540b07212L93288J48766j60195k08457J38395N65699N60143P1503l91672m77203
35530D33055l93535l78327k42582J71968N10167L85820L8754k8513J50843J32731
35520G80381j51173l04270j36531R7811J76465J69165J56795Q7354j9805o1045
$$ y = [900386, 575931, 67061, -226524, -248211, -253438, -278765, -150595, 52135, 39677, -190111, -314753, -158985, 132553, 357263, 385792, 131287, -287339, -482798, -254733, 47968, 15480, -161579, -17110, 357011, 405868, 6789, -359298, -415919, -465026, -772990, -1131519, -1269596, -1218479, -1019325, -546328, 83583, 389090, 181297, -58052, 145808, 567246, 711056, 613685, 673936, 877942, 773034, 208744, -377797, -515081, -207212, 186076, 334842, 174647, -33810, 104585, 670284, 1230427, 1301930, 910258, 433055, 39520, -338807, -581389, -409421, 100746, 486566, 525320, 496807, 647650, 780381, 629208, 324938, 188407, 286218, 462683, 631848, 788643, 875997, 856192, 795147]
35510G95147o1794r7356o5934J04723J59246j03948k94518J00077P56041P70069
35500B061753m865o47744m72019Q9140K97583J28715m3918j95086m63778o51346
35490I8435n00652j66401P8919K66376M15933K47336k58460m82925j8258N31720
35480B12023L57495k99202n33186j68587J36901N7502m8477L0751M6582p8009
35470b86207q6186R863r2254k77351n7254M98986O73293K08032k55005j90759
35460A45158P1647M4667j37919j26700q646n0741j87097j88932l7113J72942L81741
35449G9007M36167K00487q0994k0885K19613R3448l59619m61887m2002K24628
35439B87963j7902k07719M9526K31213o1087k16332L13554Q41311M39590m73089
$$ y = [795147, 733353, 635997, 570063, 674786, 834032, 730084, 435566, 535643, 1291684, 2061753, 2056888, 1409144, 937125, 1026265, 1323848, 1452563, 1408645, 1213559, 749781, 98435, -402217, -568618, -489699, -223323, 192610, 439946, 181486, -301439, -319697, 212023, 569518, 270316, -262870, -431457, -294556, -237054, -285531, -254780, -208198, -286207, -372393, -362530, -454784, -732135, -789389, -290403, 382890, 590922, 335917, 145158, 216805, 261472, 123553, -3147, -11793, -62534, -249631, -438563, -475676, -302734, 79007, 515174, 715661, 634667, 613782, 833395, 926843, 567224, 105337, 63335, 287963, 270061, 62342, 111868, 343081, 281994, 65662, 379216, 1220527, 1660117, 1187028]
35429A187028p21727j82146J92340k3009k56798j06910Q6420K1875q5416m9658
35419F1999l9046j49694k27864k35602k77631k43765M4823L72157L72681J60205
35409a61737J10542J42512q6972l84509k20193K98572M90254J91290n1728J9844
35399C47875M7243j18168j37492L2946m1812l83615m05434L9180K99143M2163
35389b77971j76477K2736J35073k15944m53310n2531M28371K71078j34841k722
35379d56538M18349K89435k82077l70441K03971N98331L29916j07871k19800j64232
35369B39043j53573m3171J48524P1997k50868k85397P9276K01927k27570n30966
35359g50778j12295M88775M29319p3279j60138K08247K57925j93750m02453J6016
$$ y = [1187028, 465301, 283155, 475495, 452486, 195688, 88778, 175198, 197073, 111657, 61999, 22953, -126741, -354605, -590207, -867838, -1111603, -1066780, -694623, -321942, -161737, -51195, 91317, 4345, -380164, -600357, -301785, 188469, 379759, 328031, 347875, 395118, 276950, 139458, 172404, 130592, -253023, -658457, -619277, -320134, -277971, -454448, -431712, -296639, -512583, -965893, -1018424, -590053, -318975, -453816, -456538, -38189, 251246, -30831, -401272, -197301, 401030, 730946, 623075, 403275, 239043, 85470, 42299, 190823, 262820, 11952, -273445, -194169, 7758, -219812, -750778, -863073, -374298, 55021, -18258, -178396, 29851, 287776, 94026, -308427, -292411]
35349b92411M31676K69152j02160j40361q2896l62235o14867k07712N29844O07156
35339C5186r3862n57436j47552N00821N47459J41932o6241j9386j03918k88908
35329e1905k08107O2204O6541j98487k17938J67172M62259L17980O3245J15058
35319E78022L07620K17188j37995l44813k15480l404J665j52347j92362p350J73355
35308B24099N0896l14007n13130l29701m6524K864n0107Q9471K65312Q9780k81091
35297h12138k18545L89671Q19072M85526k48592o26497m53790q5543J98317L28207
35287b24312K13488j11443k68527K3698L83023J80465m66856p00329j09777O02192
35277d78378N29680k07783o39693k38008M54314O07505J34339l50536l87655j24866
$$ y = [-292411, 139265, 408417, 306257, 165896, 83000, -279235, -894102, -1101814, -571970, 35186, -58676, -616112, -763664, -262843, 284616, 426548, 360307, 340921, 237003, -51905, -260012, -197808, -131267, -329754, -547692, -380520, 81739, 399719, 462964, 578022, 885642, 1102830, 964835, 620022, 404542, 401138, 402803, 250456, 58094, 50744, 224099, 274995, -39012, -552142, -881843, -928367, -925503, -975610, -886139, -620827, -531047, -812138, -1030683, -641012, 178060, 663586, 414994, -211503, -665293, -750836, -552519, -224312, -10824, -122267, -390794, -367096, 15927, 196392, -270464, -970793, -1080570, -478378, 51302, -156481, -796174, -1034182, -579868, 27637, 161976, -188560, -576215, -701081]
35267g01081O0340L9482q5840k05749k17906l2544K37382K90774O7874n8474J80313
35256d25429M51748K77959j88057l63511j42943j7653k30978m20910k91925n8770
35246a410469O4641K53242N59097N51774q01n29989l69660K42136N20500K85686
35236A66157N7895R5797R3667q1143q8511J78480K36765k13251o57798m39076
35226f51018K60298O47052L80851j05915l21681k58730j14924R7821M04961N93740
35216I32455M02801q3307m59962m36318j20245J26486L7375l19215n74543l94536
35206h89009J32852N28990M53217R1722j28624p3400P2636J58509J33505r5338
35196C85060m49821m48101K27381R53124P20288l46313r01029k69177M88730J98446
$$ y = [-701081, -640741, -601259, -687099, -892848, -1110754, -1143298, -905916, -615142, -547268, -605742, -425429, 26319, 304278, 116221, -247290, -390233, -407886, -638864, -1059774, -1351699, -1410469, -1345828, -1092586, -533489, 18285, 17484, -512505, -882165, -640029, -119529, 166157, 224052, 319849, 413516, 332373, 243862, 422342, 659107, 445856, -211942, -651018, -390720, 256332, 637183, 531268, 209587, -49143, -164067, -66246, 338715, 932455, 1335256, 1251949, 791987, 355669, 235424, 361910, 399285, 80070, -494473, -889009, -756157, -227167, 226050, 317772, 189148, 115748, 188384, 346893, 480398, 385060, -64761, -512862, -285481, 667643, 1387931, 1041618, 140589, -128588, 360142, 558588]
35186E58588n81532n00372L69120O88203N3668m66712k11394J13612j12621l25575
35176d15015O7563N28113L47673j08986j49527n571k33380m78327p2273N55821
35166C6091M00867l59583m99809K57033P23077J40529o15721m34825L63247O36280
35156F47186J05192m66326n02064k18592k2130O5684K15229M01485M15452J36412
35146G77528k94015n53079m38736j10623P9194K4546k8992J13821K83661J94631
35136D7936j20246l19446j81303J29709K81548J81554N8291J14166K21293J14723
35126E28225j82546l70823l21485k19979j72021q827L13450M67385K29614q7933
35116A75060p9510J08868L1842l02545m25313j20913L00245M76680L62554Q6057
$$ y = [558588, -22944, -523316, -154196, 534007, 587675, 120963, -90431, 23181, -89440, -415015, -347452, 180661, 528334, 419348, 269821, 264250, 30870, -447457, -519730, 36091, 436958, 77375, -422434, -165401, 557676, 698205, 82484, -352341, 10906, 647186, 752378, 286052, -216012, -434604, -456734, -391050, -175821, 225664, 641116, 777528, 483513, -69566, -508302, -618925, -539731, -515185, -544177, -430356, -146695, 47936, -72310, -391756, -573059, -443350, -161802, 19752, 78043, 192209, 413502, 528225, 345679, -25144, -346629, -566608, -738629, -747456, -434006, 33379, 262993, 175060, 95550, 204418, 236260, -66285, -491598, -612511, -312266, 164414, 526968, 613025]
35106F13025k09195l41564k16038Q239J23966J67019K19491J08518k74296n41901
35096c42736k68914K32556K62590j55697k72323J58859M70169K22975o1556J33366
35086C79289L51929n3083o76558n45653L20941P78449J53907p84312q75397r8064
35076a048552M95163K18558m11924m67714J30728N79238L61041p5897r0457J59051
35066a50765N5476l93627n34308j41720K12715R3801j61774j06152J10535J61977
35056h53842J71937L56765M45402R3014l96603m19974o4K70847J51258j3763O64
35045a94359j4356j58464j44809J56592L66722J46385k39012k92916j5759J38215
35035b51761m3985k54539j46064J88029L74522K42904m1161k59135l51838l25540
$$ y = [613025, 403830, 62266, -153772, -145533, -21567, 145452, 364943, 473461, 199165, -342736, -611650, -379094, -116504, -272201, -544524, -385665, 84504, 307479, 245923, 379289, 731218, 678135, 1577, -544076, -223135, 555314, 709221, -75091, -950488, -1048552, -553389, -334831, -746755, -1214469, -1083741, -504503, -143462, -219359, -309816, -150765, -95289, -488916, -1023224, -1164944, -952229, -858428, -1020202, -1126354, -1015819, -853842, -681905, -325140, 120262, 213276, -183327, -603301, -603365, -332518, -181260, -195023, -194359, -208715, -367179, -511988, -355396, 11326, 157711, -81301, -374217, -389976, -251761, -295746, -550285, -696349, -508320, -133798, 109106, 67945, -191190, -543028, -868568]
35025h68568j55862Q9825K02421R0679l4698M2129J75825Q0690j54966j39605
35015f72130K10406N00942M06139M7017k98202n11621n02896j41010M17948O66354
35005A22947L38360j71440l01034l6168J80887R4518j35255k56814k00122n1693
34995d15814O4732R9166J14003J21261m4778m25048o03792j61741N31504O15387
34985a05120K069l82464J8234N34143L80244j06681j56721J07431K5858l17136
34975a43k50369K28013M32082K07150J12900K80904J39162m51372p78369m23868
34965e03910M1737K7113j75869m1124K73346K96840O5135m6799K3058O9713N1634
34954H0874K8699p7300k67495k68987P1050M32641M16865Q5620j88608k07774
$$ y = [-868568, -1024430, -934605, -732184, -641505, -676203, -634074, -458249, -377559, -532525, -672130, -461724, 39218, 445357, 492374, 194172, -317449, -820345, -961355, -543407, 122947, 461307, 289867, -11167, -47335, 133552, 228070, 92815, -163999, -364121, -415814, -351082, -251916, -137913, -16652, -61430, -486478, -1090270, -1252011, -720507, -105120, -103051, -485515, -467281, 66862, 447106, 340425, 183704, 291135, 316993, -143, -250512, -22499, 409583, 616733, 729633, 1010537, 1149699, 698327, -80042, -503910, -462173, -435060, -610929, -652053, -378707, -81867, -16732, -63531, -40473, 29240, 80874, 109573, 32273, -235222, -504209, -433159, -518, 416347, 501967, 313359, 105585]
34944A05585m7977R7732P787l42703n34142j12265O09259P29159J9815o25441
34934i3191m39119J61345L51059J41292P7595J50888q2110n08646m98981N2067
34924f87801M95088L59315j01652m20029m36611j99992J72412M08142K68436p5277
34914b17969k06009l3114J57834K02787J93053J31714p9442k84316j83048J32555
34904a85955K31826L3524n7466J31496J97698j61929n57751l99232K54544P24841
34894B11596N32078q1190m65392k72433J91910L31063l2864m42854m00653L774
34884d24965K76329J79464q5648k59731k65725j12889J27093K60858J67657K3767
34874a13790O3899J80278O7502k75862n07368l89523r786L95120N79226L71394
$$ y = [105585, 57608, 155340, 163127, -179576, -713718, -825983, -216724, 512435, 532250, -93191, -532310, -370965, -19906, 121386, 198981, 349869, 267759, -240887, -739868, -687801, -192713, 166602, 64950, -355079, -791690, -991682, -819270, -411128, -142692, -217969, -423978, -457092, -299258, -96471, 96582, 228296, 148854, -135462, -318510, -185955, 45871, 79395, 21929, 153425, 351123, 189194, -368557, -767789, -513245, 211596, 743674, 662484, 197092, -75341, 116569, 447632, 414768, -28086, -428739, -424965, -148636, 30828, -54820, -314551, -580276, -693165, -566072, -305214, -137557, -113790, -49891, 130387, 197889, -77973, -585341, -974864, -984650, -589530, -10304, 361090]
34864C61090q3051l15651r9289J79323R6504j24278k7317K30624J24195k96380
34854D5770m47528j71869Q7034J03253J07218J28364j03206m41406l30802K25284
34844g97888N14954K44774m336J68600L14629K3981l17439k72316j22959k20373
34834d68373k35566J80564N75880L61117j65532k87366l451J18250n2028j31000
34824a07505K3849J81793K18692J50116j04329m50985m30828J03753M86395J08193
34814A79144n60133o05407l8904L26743J67741n2781K1189K53690M57778M96281
34804F45341R6765o77173j010010k89699P37689Q03136k7504m75010j5643N09199
34794B97091M24597J04564m4405k79365o71729o55094n2146M05300K20944r5585
$$ y = [361090, 278039, -37612, -136901, 42422, 138926, 14648, -12669, 217955, 342150, 45770, -401758, -573627, -486593, -383340, -276122, -147758, -250964, -692370, -1023172, -797888, -282934, -38160, -42496, 126104, 440733, 464714, 147275, -125041, -248000, -468373, -703939, -523375, 52505, 413622, 248090, -39276, -42727, 75523, 23495, -107505, -83656, 98137, 316829, 466945, 362616, -88369, -519197, -415444, 70951, 179144, -380989, -986396, -1025300, -698557, -530816, -583597, -562408, -308718, 149060, 645341, 742106, 64933, -945077, -1234776, -497087, 306049, 278545, -196465, -212108, 297091, 721688, 826252, 781847, 502482, -169247, -824341, -876487, -471187, -250243, -345828]
34784c45828l1428O9418j49538k59156R5905L80480J04986j97133J00124N14834
34774B82664K57343l62020m64917q4230N9956q1611L6788L30092J67028l55892
34764b14799m19933J24217M83705K48124o1016m5977k8365k05477j63043K63852
34754a8712M82068P9404m32496m23159q4303N7395K3069R5096R8359k75032p02686
34743a100997n53088J27888O21516N29987J73565o9560k48388m63666m89071j15752
34733a587566L94089N57922K97355K9359J03830L61294L81059O5236k20026j30912
34723B51640J96409L35715J31778j45216k15316j36174j30237k37148l04807k42530
34713d95886j18693k3647L1176N8716M9269K7394P1322J90895K41598R0915j32216
$$ y = [-345828, -377256, -307838, -457376, -716532, -620627, -240147, -135161, -332294, -232170, 282664, 540007, 177987, -286930, -371160, -311204, -392815, -356027, -25935, 141093, -214799, -634732, -510515, -26810, 221314, 160298, 114321, 85956, -119521, -282564, -18712, 463356, 542760, 110264, -312895, -397198, -339803, -316734, -221638, -123279, -398311, -1100997, -1654085, -1526197, -904681, -374694, -201129, -270689, -519077, -982743, -1471814, -1587566, -1193477, -635555, -338200, -308841, -205011, 156283, 537342, 602578, 382552, 251640, 448049, 783764, 915542, 770326, 555010, 418836, 288599, 51451, -253356, -495886, -614579, -638226, -607050, -548334, -499065, -471671, -400349, -209454, 32144, 123059, -9157]
34702i157j29287J39727L08541Q1242k96114l34913N426K87897K59271J25362
34692D37995O8921m5985k56870k45895J29586M37580K65945r8194j18088J13385
34682F88380P0050k71795l92559j43868K144k01103l33730l2643L97440M93992
34672B76308L06661J23387q4865m41493o72116l97898J99199N19641L37848P452
34662A74124j39442j63598k02432j92234q8508l9302j18259j37648L7091J96900
34652f73308Q3853j74358k21757J6725K86525M23863M84605M28920Q3848m05643
34642C33273m96079K4448N29511K76055n07193q22869k48624M86173N10542p2035
34632A3202m62870k50779K20769M28954K32480j15030k49135j4293L31886L28686
$$ y = [-9157, -138444, 1283, 309824, 391066, 94952, -239961, -234535, 53362, 312633, 437995, 506916, 460931, 204061, -41834, 87752, 525332, 791277, 693083, 574995, 688380, 758430, 486635, 94076, -49792, -47648, -248751, -582481, -615124, -217684, 276308, 582969, 706356, 621491, 179998, -492118, -890016, -690817, -171176, 166672, 174124, 34682, -128916, -331348, -523582, -612090, -651392, -769651, -907299, -870208, -673308, -589455, -763813, -985570, -968845, -682320, -258457, 226148, 655068, 738916, 333273, -162806, -138358, 391153, 667208, 160015, -662854, -911478, -425305, 85237, 13202, -449668, -700447, -479678, -50724, 181756, 66726, -182409, -196702, 135184, 463870]
34622D63870j16876n32883m58221k4083K96741L23755K26536J17534k3685j11184
34612A61504l3765N4556j01452m02475m60860j53683K19415L69904L00263J12860
34602F6267j43941l63679l88331k09833L0603K44180L94033L67229J15913j48327
34592c5886j94840j22023j57864k44731j88831o8754o4600n1338J37809K46968
34582g44090J2133j80573J59957N97798K77759n54973p13279L8654N30400J25130
34572d51084k13306L47327R50543M60268n41932o43712J30675M95136M6385l16116
34562B64184j04436R8465p4885j69448K0791k6043m74335o53636k33233J30484
34552a222092l9387j78487K53633P10896M68079j04008j58331K38120L44432M6370
$$ y = [463870, 346994, -185889, -644110, -668193, -371452, -47697, 178839, 296373, 272688, 161504, 127739, 182295, 80843, -321632, -782492, -936175, -716760, -346856, -46593, 66267, -77674, -441353, -829684, -1039517, -1008914, -764734, -370701, -3472, 112441, -35886, -230726, -352749, -510613, -755344, -944175, -1012929, -1077529, -1128867, -991058, -744090, -731957, -912530, -752573, -154775, 122984, -431989, -1145268, -1106614, -576214, -451084, -664390, -317063, 633480, 1093748, 551816, -91896, 38779, 533915, 580300, 264184, 159748, 258213, 183328, 13880, 34671, 8628, -465707, -1119343, -1352576, -1222092, -1261479, -1439966, -1186333, -475437, -7358, -111366, -269697, -31577, 312855, 359225]
34542C59225q9080R0817J25492j54576l67369l20982k73968l14014j60102K16672
34532h87885L98112K03111J8827J42482K66129j4795n26551p25667l82413K24234
34522a284416O49648O34553K69732m8073O118K56111K00403k77623o69687n06603
34512g69837K0171L74768L83277K82812K12280N6374j91664k78902o7677J72678
34502A94280P9311k82389m36356q9129M55140O18445K21109l40965n78748l70012
34492e29314Q5810M99764N63296J08922n39258o76283n6232O29592N88133K6307
34482G00737j89109J47053L49173R517m04444m09935k15133j33446P083L07519
34472A69015L03698k59575p08444l26873M51180O40840K00756m7585J69057K86030
$$ y = [359225, 270145, 360962, 486454, 331878, -35491, -356473, -630441, -944455, -1104557, -887885, -489773, -286662, -267835, -125353, 140776, 125981, -400570, -1126237, -1508650, -1284416, -634768, -215, 269517, 221444, 227562, 483673, 684076, 406453, -263234, -769837, -749666, -374898, 8379, 291191, 503471, 559845, 368181, 89279, 21602, 194280, 273591, -8798, -445154, -534283, -79143, 539302, 760411, 419446, -159302, -529314, -443504, 56260, 619556, 728478, 189220, -487063, -543295, 86297, 674430, 700737, 511628, 658681, 1007854, 1017371, 612927, 202992, -12141, -145587, -138504, 169015, 472713, 213138, -495306, -822179, -370999, 269841, 470597, 423012, 592069, 878099]
34462H78099L4277j74310j55986k46203m23713j57361M85709O07354q0247n74635
34452A92984j08654N50246L02352n12734o96631p7344M00949K76361O7043J23768
34442E18340Q8550k34416m02168j25853J96327J61392k0780p650R1523M4002k2560
34431B86707P9829J45539j07570m75172m74762m2193L61581L60843Q4885j16347
34421A03340j56532k15208l25964k31676J86433N44377L80102j20991l00732j3702
34411a50553J32703k01853m57017q3658M69765M22362r0322k89607k7286J38925
34401a36541L5403O3796K61987J64906k14855k47849J73038L32286n0363k50445
34391A31363J80553N21990P8828n56112m27316K05669L15388k19516n02900j07421
$$ y = [878099, 912376, 738066, 582080, 335877, -87836, -245197, 240512, 847866, 767619, 192984, 84330, 634576, 936928, 424194, -272437, -349781, 51168, 327529, 394572, 518340, 606890, 372474, -29694, -155547, 40780, 202172, 181392, 173742, 265265, 309267, 286707, 366536, 512075, 404505, -70667, -545429, -587622, -226041, 134802, 219687, 103340, -53192, -268400, -594364, -826040, -639607, -95230, 284872, 163881, -136851, -150553, -17850, -219703, -676720, -760378, -290613, 131749, 41427, -248180, -275466, -136541, -101138, -37342, 224645, 389551, 174696, -73153, 99885, 432171, 381808, 131363, 311916, 833906, 912734, 356622, -70694, 134975, 450363, 230847, -272053, -379474]
34381c79474L43961K36754k04223m06980j98435J85807M31178L22270r2818m37658
34371a99618l68921J0624L44163M98263N32120L71528m4812m07765l21501O6814
34361D80895J86727j51938m88387l46937J82232O03590N29235q381n71537o72388
34351b56889k78805J28297J53496n3619j33716l2141J12042K85211M35423L01721
34341F61020j48752m27577j89348J26604o0559m82753m25554Q5741L57411K10055
34331b93712J73053M14660M14736k9024l43917j42136J26937k2802l23033l09763
34321c35001j08090o0091k9268K77886O12581M53277j67694o47235n75220j15292
34311f94147L25550M78655L18203N9137P037K16937L91207K72212r463j50811
$$ y = [-379474, -35513, 201241, -2982, -409962, -608397, -422590, 8588, 330858, 238040, -199618, -568539, -557915, -213752, 284511, 816631, 1188159, 1143347, 735582, 414081, 480895, 667622, 515684, 27297, -319640, -137408, 466182, 995417, 987036, 415499, -256889, -535694, -407397, -253901, -307520, -441236, -473377, -361335, -76124, 359299, 661020, 512268, 84691, -104657, 21947, -38612, -521365, -946919, -861178, -503767, -293712, -120659, 294001, 708737, 679713, 335796, 193660, 320597, 297795, -25238, -335001, -443091, -503182, -532450, -254564, 358017, 811294, 643600, -3635, -578855, -694147, -368597, 110058, 428261, 487398, 494435, 711372, 1102579, 1374791, 1365328, 1214517]
34301A214517q7332m694n8175k23505l30680j94650J37261K87784l4361n33314
34291A72851o10023j88593J81701J59443M1458J43119K73718J79282L8292Q2491
34281D73739J22609o6321k26571k0305L02236K07352k79459n74973l54803R0204
34271c26292L29716K42379l5747k77882k47515J06540M95965N44582K02837k41521
34261G93062n03680m96819k95511q8108o3773j82396j78583O5831L29150L78506
34251b42321K67405J27226p5173l43505m84449l91383k28167q1152K32920O98047
34241e20552Q37822L79347j72904j78612J94088K66413j09236m47807m57301l04614
34231e13356q2312L22952P42562P23708K01768l14639m06617j83878N6600J97579
$$ y = [1214517, 1127185, 1122491, 1064316, 840811, 510131, 315481, 452742, 740526, 706165, 172851, -437172, -625765, -444064, -284621, -243163, -100044, 173674, 352956, 391248, 473739, 596348, 530027, 303456, 283151, 585387, 792739, 513280, -61693, -416496, -326292, 3424, 245803, 210056, -67826, -315341, -208801, 287164, 831746, 1034583, 793062, 289382, -207437, -502948, -591056, -654829, -837225, -1015808, -949977, -620827, -242321, 25084, 152310, 77137, -266368, -750817, -1142200, -1370367, -1451519, -1218599, -520552, 317270, 696617, 523713, 345101, 539189, 805602, 696366, 248559, -208742, -513356, -595668, -272716, 469846, 1193554, 1395322, 1080683, 674066, 490188, 546788, 744367]
34221G44367K04685M6681j65165k67659k98184l41952k35657J29357L59411L5719
34211B11603m51390l11935L72104O64012K51246o0519K44941M77032m9329p27538
34201F20227n55547K55266O33665K94137n2472l4490p3443l34012k37654N13969
34191A029646J210290J052750L18514l6111L15464P59263O89960K39675j01442
34182E478009k18255m02693p74164j013409q10751l59727j31185k28123k91145
34173A248557r6279J05672K7410k00837k93495k54434k24767j30167J09435K22408
34163E13503n5916l85244j70911M69627P15762J94527m74113n91565k92864j05688
34153a82882o6639J39151M55097N06263K59704N0590k0769j69434l84745l68816
$$ y = [744367, 949052, 995733, 830568, 562909, 264725, -77227, -312884, -183527, 175884, 211603, -239787, -551722, -179618, 484394, 735640, 675121, 920062, 1397094, 1347765, 620227, 64680, 319946, 953611, 1247748, 1195276, 1160786, 1087343, 753331, 515677, 1029646, 2239936, 3292686, 3611200, 3575089, 3890553, 4649816, 5339776, 5579451, 5478009, 5259754, 4857061, 4082897, 3069488, 2258737, 1899010, 1767825, 1539702, 1248557, 1152278, 1257950, 1285360, 1084523, 791028, 536594, 311827, 181660, 291095, 513503, 457587, 72343, -98568, 371059, 1086821, 1281348, 807235, 215670, -77194, -182882, -249521, -110370, 344727, 850990, 1110694, 1161284, 1140515, 971081, 586336, 217520]
34143B17520j17216r614j47087j52789J10763J98878j46837m25596j17773M35211
34133a54540N36486K00491j503M9843l5605k71178j96753K11336L48901l5111
34123F52367m14853l78088k05588j50873Q2927N69531O35548q1219p07351k87320
34113b84919N97843N49387m94982j091178m28327N62630P03261J56502j62708
34104A07509j0555J49226P9260j9541k4785k0083j888R3869J54299K6839j98789
34093C35361l20801l08442k19318j4276K92134M80288L83416J32956o5954j96125
34083D99239k65344j62097P0002J22263r7164j91571J22620M56521K82752k19462
34073F17759m19634j89180J716r4462j88536n9572O9026l1033j88760j13268J84749
$$ y = [217520, 100304, 90690, -56397, -209186, -98423, 100455, -46382, -471978, -589751, -154540, 381946, 582437, 580934, 630777, 595172, 323994, 127241, 338577, 687478, 652367, 237514, -140574, -346162, -497035, -414108, 155423, 790971, 709752, 2401, -284919, 312924, 862311, 367329, -723849, -1152176, -589546, 113715, 270217, 107509, 96954, 246180, 325440, 305899, 281114, 261031, 259143, 353012, 507311, 534150, 335361, 14560, -293882, -513200, -527476, -235342, 244946, 628362, 761318, 695364, 499239, 233895, 71798, 141800, 264063, 166899, -24672, 97948, 554469, 837221, 617759, 198125, 8945, 10661, -83801, -272337, -331909, -262883, -293916, -482676, -595944, -411195]
34062d11195M26787L52082p0329n18979m76236J78958Q06206O61485q4672m98429
34052C65678j55443L00794J38373m57147p82108o06959k49738O6618L59858N13921
34042e06153L31528n966m2222K57312L67626j3880m52913l83982P3717L34423
34032d0510K08579O5857J57252K67752J78053J9649p7053k71720n94569o22085
34022g08795p3350N61678O08596K38856J84514M80978L67189l69989q67018m79109
34012e6450J99102K83243r1840k17481l7292o744r5262P5868L04694N3081m39508
34001b8589l57899K76085M89630o3106n01560j81824K77600J33115k28244n9583
33991b44375M19307M58857P1908j12415O302j5092j82318l8659L69845M19832
$$ y = [-411195, 15592, 367674, 297345, -221634, -697870, -518912, 287294, 948779, 864107, 365678, 210235, 511029, 649402, 192255, -589853, -1196812, -1446550, -1379932, -1020074, -506153, -174625, -180591, -222813, 34499, 402125, 388245, -64668, -448650, -374933, -40510, 168069, 233926, 391178, 658930, 836983, 856632, 779579, 507859, -86710, -708795, -782145, -220467, 388129, 626985, 811499, 1292477, 1659666, 1289677, 422659, -56450, 142652, 425895, 334055, 116574, 79282, 72538, -22724, 53144, 357838, 410919, -28589, -386488, -110403, 379227, 316121, -185439, -367263, -89663, 43452, -184792, -244375, 174932, 633789, 705697, 593282, 599584, 584492, 402174, 363515, 733360, 1153192]
33981A153192n0261m43874l70573j59933j37798j06131Q8503J30756j53188l34487
33971c83794o3231K80368K09034k7165Q3882L26158P5956n11334n49833J86595
33961c73364P94563N69143L7739K8984L18262R2209n47848n95472K44480R37992
33951A506688N90215k44511m28682R6978L74399n1503n53013m79864n7187J14088
33941H67608o7914k45735k02717l3760J23718K22438K35541J48657j4272k23474
33931H10090m10210m17755j84060M9759M611j62891l7514L41197M22121m499m02173
33920H676k81610O2964Q0310j58004j79369M6686J21394l5190p5962J12035K19006
33909g9064J03853M6595J99703K45213r1945n17529n14747o0266L22001K07196
$$ y = [1153192, 1102931, 659057, 288484, 128551, -9247, -115378, -26875, 103881, -49307, -383794, -447025, -166657, 42377, 15212, 99094, 425252, 501208, -10126, -559959, -373364, 421199, 990342, 1028081, 1057065, 1375327, 1467536, 919688, 324216, 568696, 1506688, 2096903, 1852392, 1423710, 1520688, 1895087, 1843584, 1290571, 810707, 753520, 867608, 799694, 553959, 351242, 317482, 441200, 663638, 899179, 1047836, 1033564, 810090, 399880, -17875, -201935, -152176, -147565, -310456, -347970, -6773, 415348, 410849, 8676, -272934, -209970, -129660, -287664, -467033, -420347, -298953, -334143, -410105, -298070, -79064, 24789, 71384, 271087, 516300, 424355, -93174, -607921, -668187, -346186, -138990]
33899a38990k33931m39750q6957N37932Q28598N12516p5176m04868l04088o739
33889A88547J92069J71771n335j55764j30625k1995p3558k83963l30859n9349
33879e09061K31748K44403J28349J35122J21257j48610m37711l19682J01476L09483
33869a43226J57332k3707p1785j54818k43417o3166K79508K70003j51293l20631
33859d65200J55754O85089M97779k11654n52539j66880L74777M13465j0289l54327
33849C65975k94564l7885M7362m0075M3896L95014N62838J41801n35357p46855
33839i7850l60800M8752R9093L3446R0119N1536k19423l33320K9751M72622L98312
33828B12238p3210k86493l5798J98619L5532k81236l11822k1140K79784L82526
$$ y = [-138990, -372921, -812671, -899628, -361696, 466902, 979418, 904242, 499374, 195286, 188547, 380616, 552387, 547052, 391288, 260663, 238668, 165110, -118853, -449712, -509061, -277313, -32910, 95439, 230561, 351818, 203208, -234503, -554185, -452709, -143226, 14106, -9601, -81386, -236204, -479621, -542787, -263279, 6724, -144569, -465200, -309446, 375643, 873422, 661768, 109229, -57651, 317126, 730591, 720302, 365975, 71411, 33526, 80888, 40813, 84709, 479723, 1042561, 1184362, 649005, -97850, -458650, -409898, -310805, -277359, -187240, -135704, -355127, -688447, -658696, -186074, 212238, 139028, -147465, -183263, 15356, 50888, -230348, -542170, -563310, -283526, 99000]
33818I9000L24767J64611j29708m67906n18967q9693M23610L65587k43297n58205
33808f30201o4043N73826M24075k92388n21569L2277N66669N01286J82882K2924
33798G95738j23066l13906j81897K32028J97108m82952q32685j34872P86784P29187
33788F71467p6272m42304p2026K65792J60265l1433j33557l84553o42874l93584
33778a079079K74506O08949L09775j04335j99922j05211M4874L19677N05057K40690
33768H14981k01878j51836K88076K71417l40381o21387j05274M06333J87342k55360
33758B92033j62160K03114J74177j10937j00907Q4028o2832m15411m12396n0952
33748e62243J63966J04381P2857J01207m9370k60635j42658K66867N14473M23431
$$ y = [99000, 423767, 588378, 458670, -9236, -528203, -617896, -194286, 171301, -71996, -630201, -694244, -120418, 303657, 11269, -510300, -478023, 88646, 589932, 772814, 795738, 672672, 358766, 176869, 408897, 606005, 123053, -709632, -844504, -57720, 671467, 595195, 152891, 80865, 346657, 506922, 475489, 341932, -42621, -685495, -1079079, -804573, -195624, 114151, 9816, -190106, -295317, -250443, 69234, 574291, 814981, 613103, 461267, 749343, 1020760, 680379, 58992, -46282, 360051, 547393, 292033, 129873, 332987, 507164, 396227, 295320, 379348, 316516, -98895, -511291, -562243, -398277, -293896, -221039, -119832, -169202, -429837, -572495, -305628, 208845, 632276]
33738F32276K11605j1884k90836m46010k59930K3957p135k12664j09774K53820
33728b16575L51083J02272j4267J31444J05533j92564k35728J68014L94800N541
33718E99553m45748k58519K73683L16601k13300n64602k75387K73691M97613K87500
33708D91085p6722l10098k72006q452K22466J58362j49325l76958l23647j04202
33698g49497P3205J38066J14960K9390n0920k2356R5918J17728o8333k86448k55647
$$ y = [632276, 843881, 831997, 541161, 95151, -164779, -140822, -147957, -360621, -470395, -216575, 134508, 236780, 222513, 353957, 459490, 266926, 31198, 199212, 594012, 599553, 153805, -104714, 168969, 485570, 272270, -292332, -567719, -294028, 203585, 491085, 414363, 104265, -167741, -176193, 46273, 204635, 55310, -321648, -645295, -749497, -676292, -538226, -423266, -393876, -444796, -467152, -371234, -253506, -321839, -608287, -863934]
$$ [...]
##END NTUPLES=NMR SPECTRUM
##END=
