##TITLE=31Pdec_LR-743-2
 , 24 sc
 17.12.2021
##JCAMPDX= 6.0         $$ Bruker NMR JCAMP-DX V2.0
##DATA TYPE= NMR SPECTRUM
##DATA CLASS= NTUPLES
##ORIGIN= UXNMR, Bruker Analytische Messtechnik GmbH
##OWNER= root
$$ XWIN-NMR		Version 3.5
$$ Fri Dec 17 12:37:18 2021 Russian Standard Time (UT+4h)  she@DPX200
##.OBSERVE FREQUENCY= 81.013821
##.OBSERVE NUCLEUS= ^31P
##.ACQUISITION MODE= SIMULTANEOUS
##.ACQUISITION SCHEME= undefined
##.AVERAGES= 24
##.DIGITISER RES= 16
##SPECTROMETER/DATA SYSTEM= spect
##.PULSE SEQUENCE= zgpg30
##.SOLVENT NAME= CDCl3
##.SHIFT REFERENCE= (INTERNAL, CDCl3, 0, 248.564)
##AUDIT TRAIL= $$ (NUMBER, WHEN, WHO, WHERE, WHAT)
$$ ##TITLE= Audit trail, XWIN-NMR		Version 3.5
$$ ##JCAMPDX= 5.01
$$ ##ORIGIN= Bruker BioSpin GmbH
$$ ##OWNER= she
$$ F:/spectra/data/she/nmr/P31/1/pdata/1/auditp.txt
$$ ##AUDIT TRAIL=  $$ (NUMBER, WHEN, WHO, WHERE, WHAT)
(   1,<2021-12-17 12:35:29.15 +0400>,<she>,<DPX200>,
      <created by zg, POWCHK disabled, PULCHK disabled
       configuration hash MD5:
       00 E9 B6 7A A2 85 ED C7 34 08 36 98 17 FE 4E 26
       data hash MD5: 32K
       34 9C FC 69 0D 7C 18 10 68 01 68 E6 9C 08 BC 63>)
(   2,<2021-12-17 12:35:31.53 +0400>,<she>,<DPX200>,
      <Start of raw data processing
       efp BC_mod = 2 LB = 1 FT_mod = 6 PKNL = 1 PHC0 = -9165.188 PHC1 = 92.86993 SI = 64K 
       data hash MD5: 64K
       68 26 E0 16 2B 59 21 62 FA 42 61 32 9B A6 B7 95>)
(   3,<2021-12-17 12:35:54.51 +0400>,<she>,<DPX200>,
      <pk PHC0 = -169.849 PHC1 = 0 
       data hash MD5: 64K
       5D B2 0A A8 48 74 4F 6F C1 53 FC EC C5 E6 DC 11>)
$$ ##END=
$$ 
$$ hash MD5
$$ FA AA CA 72 53 63 D8 FB 0B 88 53 EE 9C 31 46 F8
##$RELAX= 
##$RELAX= 
##$RELAX= 
##$RELAX= 
##$RELAX= 
##$RELAX= 
##$RELAX= 
##$RELAX= 
$$ Bruker specific parameters
$$ --------------------------
##$DU= <F:/spectra>
##$EXPNO= 1
##$NAME= <P31>
##$PROCNO= 1
##$TYPE= <nmr>
##$USER= <she>
##$AMP= (0..31)
100 100 100 100 100 100 100 100 100 100 100 100 100 100 100 100 100 100 
100 100 100 100 100 100 100 100 100 100 100 100 100 100 
##$AQSEQ= 0
##$AQ_mod= 1
##$AUNM= <au_zg>
##$AUTOPOS= <>
##$BF1= 81.014009
##$BF2= 200.13
##$BF3= 200.13
##$BF4= 200.13
##$BF5= 200.13
##$BF6= 200.13
##$BF7= 200.13
##$BF8= 200.13
##$BYTORDA= 1
##$CFDGTYP= 0
##$CFRGTYP= 5
##$CHEMSTR= <none>
##$CNST= (0..31)
1 1 145 1 1 1 1 1 1 1 1 1 1 1 1 1 1 1 1 1 1 1 1 1 1 1 1 1 1 1 1 1 
##$CPDPRG= <waltz16>
##$CPDPRG1= <>
##$CPDPRG2= <waltz16>
##$CPDPRG3= <>
##$CPDPRG4= <mlev>
##$CPDPRG5= <mlev>
##$CPDPRG6= <mlev>
##$CPDPRG7= <mlev>
##$CPDPRG8= <mlev>
##$CPDPRGB= <>
##$CPDPRGT= <>
##$D= (0..31)
0 1 0 0 0 0 0 0 0 0 0 0.03 2e-05 3e-06 0 0 0 0 0 0 0 0 0 0 0 0 0 0 0 0 
0 0 
##$DATE= 1639730128
##$DBL= (0..7)
120 120 120 11 120 120 24 19 
##$DBP= (0..7)
150 150 150 150 150 150 150 150 
##$DBP07= 0
##$DBPNAM0= <>
##$DBPNAM1= <>
##$DBPNAM2= <>
##$DBPNAM3= <>
##$DBPNAM4= <>
##$DBPNAM5= <>
##$DBPNAM6= <>
##$DBPNAM7= <>
##$DBPOAL= (0..7)
0.5 0.5 0.5 0.5 0.5 0.5 0.5 0.5 
##$DBPOFFS= (0..7)
0 0 0 0 0 0 0 0 
$$ [...]
##$SUBNAM2= <"">
##$SUBNAM3= <"">
##$SUBNAM4= <"">
##$SUBNAM5= <"">
##$SUBNAM6= <"">
##$SUBNAM7= <"">
##$SUBNAM8= <"">
##$SUBNAM9= <"">
##$SW= 501.771253377433
##$SWIBOX= (0..15)
0 1 3 0 0 0 0 0 0 0 0 0 0 0 0 0 
##$SW_h= 40650.406504065
##$TD= 32768
##$TD0= 1
##$TE= 0
##$TE2= 300
##$TE3= 300
##$TEG= 300
##$TL= (0..7)
0 120 53 12 22 120 120 120 
##$TP= (0..7)
150 150 150 150 150 150 150 150 
##$TP07= 0
##$TPNAME0= <>
##$TPNAME1= <>
##$TPNAME2= <>
##$TPNAME3= <>
##$TPNAME4= <>
##$TPNAME5= <>
##$TPNAME6= <>
##$TPNAME7= <>
##$TPOAL= (0..7)
0.5 0.5 0.5 0.5 0.5 0.5 0.5 0.5 
##$TPOFFS= (0..7)
0 0 0 0 0 0 0 0 
##$TUNHIN= 0
##$TUNHOUT= 0
##$TUNXOUT= 0
##$USERA1= <user>
##$USERA2= <user>
##$USERA3= <user>
##$USERA4= <user>
##$USERA5= <user>
##$V9= 5
##$VALIST= <valist>
##$VCLIST= <CCCCCCCCCCCCCCC>
##$VD= 0
##$VDLIST= <DDDDDDDDDDDDDDD>
##$VPLIST= <PPPPPPPPPPPPPPP>
##$VTLIST= <TTTTTTTTTTTTTTT>
##$WBST= 1024
##$WBSW= 4
##$XGAIN= (0..3)
0 0 0 0 
##$XL= 0
##$YL= 0
##$YMAX_a= 3287
##$YMIN_a= -3220
##$ZGOPTNS= <>
##$ZL1= 120
##$ZL2= 120
##$ZL3= 120
##$ZL4= 120
##$ABSF1= 0
##$ABSF2= 0
##$ABSG= 0
##$ABSL= 0
##$ALPHA= 0
##$AQORDER= 0
##$ASSFAC= 0
##$ASSFACI= 0
##$ASSFACX= 0
##$ASSWID= 0
##$AUNMP= <proc_1d>
##$AZFE= 0.1
##$AZFW= 0.5
##$BCFW= 0
##$BC_mod= 2
##$BYTORDP= 0
##$COROFFS= 0
##$CY= -3
##$DATMOD= 1
##$DC= 0
##$DFILT= <>
##$DTYPP= 0
##$F1P= 0
##$F2P= 0
##$FCOR= 1
##$FTSIZE= 65536
##$FT_mod= 6
##$GAMMA= 0
##$GB= 0
##$INTBC= 1
##$INTSCL= 5.30512e-09
##$ISEN= 30
##$LB= 1
##$LEV0= 0
##$LPBIN= 0
##$MAXI= 10000
##$MC2= 0
##$MEAN= 0
##$ME_mod= 0
##$MI= 50
##$NCOEF= 0
##$NC_proc= -5
##$NLEV= 6
##$NOISF1= 182.463
##$NOISF2= 159.3651
##$NSP= 0
##$NTH_PI= 0
##$NZP= 0
##$OFFSET= 248.5645
##$PC= 4
##$PHC0= -9335.037
##$PHC1= 92.86993
##$PH_mod= 1
##$PKNL= yes
##$PPARMOD= 0
##$PSCAL= 0
##$PSIGN= 0
##$REVERSE= no
##$SF= 81.014009
##$SI= 65536
##$SIGF1= 159.3651
##$SIGF2= -187.1042
##$SINO= 113.3802
##$SIOLD= 16384
##$SREGLST= <1H.CDCl3>
##$SSB= 0
##$STSI= 65536
##$STSR= 0
##$SW_p= 40650.406504065
##$SYMM= 0
##$S_DEV= 0
##$TDeff= 32768
##$TDoff= 0
##$TI= <>
##$TILT= no
##$TM1= 0
##$TM2= 0
##$TOPLEV= 0
##$USERP1= <user>
##$USERP2= <user>
##$USERP3= <user>
##$USERP4= <user>
##$USERP5= <user>
##$WDW= 1
##$XDIM= 65536
##$YMAX_p= 286513205
##$YMIN_p= -2673386
$$ End of Bruker specific parameters
$$ ---------------------------------
##NTUPLES= NMR SPECTRUM
##VAR_NAME=  FREQUENCY,     SPECTRUM/REAL,   SPECTRUM/IMAG
##SYMBOL=    X,             R,               I
##VAR_TYPE=  INDEPENDENT,   DEPENDENT,       DEPENDENT
##VAR_FORM=  AFFN,          ASDF,            ASDF
##VAR_DIM=   65536,         65536,           65536
##UNITS=     HZ,            ARBITRARY UNITS, ARBITRARY UNITS
##FACTOR=    0.620285442955139, 1,           1
##FIRST=     20137.2065510759, 0,            0
##LAST=      -20513.1999529892, 0,           0
##MIN=       -20513.1999529892, -2673386,    0
##MAX=       20137.2065510759, 286513205,    0
$$ Real data points
##PAGE= N=1
##DATA TABLE= (X++(R..R)), XYDATA
$$ [...]
$$ plain form
39608 26410 -31151 -94082 -106730 -89147 -87994 -97671 -82593 -57226 -64899 -77991 -20139 87299
39596 87299 115839 20090 -81861 -94258 -83824 -130682 -170298 -125838 -77004 -118632 -151347
39585 -151347 -26111 166310 186334 13898 -104145 -5214 195763 313277 303388 204712
39575 204712 40097 -137732 -238578 -248865 -243273 -241715 -186784 -102820 -118125 -254648 -345592
39564 -345592 -260797 -88811 6623 -1140 -38771 -78884 -126486 -134037 -56465 44052 53185 -46321
39552 -46321 -154396 -178900 -131777 -98808 -135173 -192535 -165253 -30099 100599 121149 81540
39541 81540 103647 183397 193735 76692 -85846 -197927 -232654 -189497 -95773 -57856 -168055
39530 -168055 -333777 -346700 -167303 6690 18154 -50124 -42118 39183 83210 61218 44384
$$ packed form
39608B6410n7561o2931j2648J7583J153r677J5078K5367p673j3092N7852J07438
39596H7299K8540r5749j01951j2397J0434m6858l9616M4460M8834m1628l2715
39585a51347J25236J92421K0024j72436j18043R8931K00977J17514r889r8676
39575B04712j64615j77829j00846j0287N592J558N4931Q3964j5305j36523r0944
39564c45592Q4795J71986R5434p763l7631m0113m7602p551P7572J00517R133r9506
39552d6321j08075k4504M7123L2969l6365n7362K7282J35154J30698K0550l9609
39541H1540K2107P9750J0338j17043j62538j12081l4727M3157R3724L7917j10199
39530a68055j65722j2923J79397J73993J1464o8278Q006Q1301M4027k1992j6834
$$ plain form
39519 44384 82920 156432 211882 198132 103689 -10484 -71771 -100239 -168572 -251058 -233508
39508 -233508 -109006 -30346 -97914 -214735 -236791 -160690 -69589 8500 82026 114780 74431
39497 74431 10363 -9952 3409 10906 35181 115884 210230 226489 143880 36654 -12677 14136
39485 14136 67285 72105 300 -90596 -122224 -95817 -76659 -92469 -122436 -172639 -260088 -323974
39473 -323974 -276443 -162284 -135674 -234189 -307873 -237630 -100004 -34452 -58173 -101960 -132710
39462 -132710 -149331 -140876 -131473 -184424 -285638 -315038 -217566 -107441 -107753 -179440 -214301 -206303
39450 -206303 -207870 -194738 -113083 -9348 23163 -5452 -12594 40 -48840 -163013 -242798
39439 -242798 -237001 -212453 -234690 -267052 -240178 -162204 -102351 -91668 -90392 -57022 -16563 -32413
$$ packed form
39519D4384L8536P3512N5450j3750r4443j14173o1287k8468o8333q2486J7550
39508b33508J24502P8660o7568j16821k2056P6101R1101P8089P3526L2754m0349
39497G4431o4068k0315J3361P497K4275Q0703R4346J6259q2609j07226m9331K6813
39485A4136N3149M820p1805r0896l1628K6407J9158j5810k9967n0203q7449o3886
39473c23974M7531J14159K6610r8515p3684P0243J37626O5552k3721m3787l0750
39462a32710j6621Q455R403n2951j01214k9400R7472J10125l12p1687l4861P998
39450b06303j567J3132Q1655J03735L2511k8615p142J2634m8880j14173p9785
39439b42798N797K4548k2237l2362K6874P7974N9853J0683J276L3370M0459j5850
$$ plain form
39427 -32413 -115324 -196887 -214794 -189345 -176855 -182399 -175464 -159516 -150318 -110280 948 118388
39415 118388 118458 -13002 -157523 -227829 -255462 -288234 -304492 -275694 -224883 -173649 -108430 -42191
39403 -42191 -32528 -94867 -168051 -202098 -208466 -194098 -128723 -18171 65253 69047 20583 -20093
39391 -20093 -10945 62963 153855 146040 -5746 -155211 -123911 25917 51816 -110060 -237705
39380 -237705 -147828 50058 132077 46570 -96258 -202792 -244140 -214233 -143701 -93035 -72767
39369 -72767 -48239 -48646 -144055 -278510 -289757 -164663 -102189 -222758 -384499 -409898 -330448
39358 -330448 -263478 -203133 -101231 -18941 -15912 -1937 113977 221412 148283 -65483 -219771
39347 -219771 -232096 -191017 -168839 -148796 -124448 -124236 -134514 -108947 -50678 -6672 -6735 -64242
$$ packed form
39427c2413q2911q1563j7907K5449J2490n544O935J5948R198M0038J11228J17440
39415A18388P0j31460j44521p0306k7633l2772j6258K8798N0811N1234O5219O6239
39403d2191R663o2339p3184l4047o368J4368O5375J10552Q3424L794m8464m0676
39391b0093R148P3908R0892p815j51786j49465L1300J49828K5899j61876j27645
39380b37705Q9877J97886Q2019q5507j42828j06534m1348K9907P0532N0666K0268
39369g2767K4528m07r5409j34455j1247J25094O2474j20569j61741k5399P9450
39358c30448O6970O0345J01902Q2290L029J3975J15914J07435p3129k13766j54288
39347b19771j2325M1079K2178K0043K4348K12j0278K5567N8269M4006o3n7507
$$ plain form
39335 -64242 -175032 -262852 -225689 -102597 -64820 -154414 -191940 -67786 57397 22512 -44682
39324 -44682 49887 201156 153160 -73461 -209022 -159930 -102818 -137090 -139934 -38303 40270
39313 40270 -1691 -68491 -57347 -23748 -41929 -62024 -29199 -3830 -35902 -43356 46592 131850
39301 131850 58683 -143352 -283752 -250264 -119043 -25266 -9116 -13333 18234 75285 108048
39290 108048 100524 90410 99981 77650 -43560 -236101 -376925 -371750 -252692 -141685 -131396
39279 -131396 -202429 -249928 -199085 -91887 -35754 -72506 -142289 -177301 -172020 -148247 -114997
39268 -114997 -83636 -60479 -10690 95911 193537 173117 48211 -45658 -52548 -63398 -121734
39257 -121734 -112511 45265 222623 235990 90657 -61679 -135571 -155864 -153843 -146205 -170039
$$ packed form
39335f4242j10790q7820L7163J23092L7777q9594l7526J24154J25183l4885o7194
39324d4682R4569J51269m7996k26621j35561M9092N7112l4272k844J01631P8573
39313D0270m1961o6800J1144L3599j8181k0095L2825K5369l2072p454Q9948Q5258
39301A31850p3167k02035j40400L3488J31221R3777J6150m217L1567N7051L2763
39290A08048p524j0114R571k2331j21210j92541j40824N175J19058J11007J0289
39279a31396p1033m7499N0843J07198N6133l6752o9783l5012N281K3773L3250
39268a14997L1361K3157M9789J06601R7626k0420j24906r3869o890j0850n8336
39257a21734R223J57776J77358J3367j45333j52336p3892k0293K021P638k3834
$$ plain form
39246 -170039 -227213 -239904 -159771 -65076 -51460 -89920 -94759 -62444 -31605 23930 134849
39235 134849 223460 180574 26689 -107113 -133779 -73074 -5872 -21471 -137779 -229127 -145332
39224 -145332 48659 112267 -12854 -86244 54551 218936 167998 -7595 -71061 -29397
39214 -29397 -42736 -80354 -1652 105232 21262 -195561 -252273 -87174 47712 18465 -17082
39203 -17082 43650 62905 -33055 -71758 55267 163453 74791 -67956 -26016 152368 214892
39192 214892 76650 -107436 -188791 -160304 -73361 26080 85011 81584 69615 102333 135886
39181 135886 87712 -35445 -145960 -193219 -202020 -202434 -184894 -133564 -64104 -12403 2511 -3681
39169 -3681 -4859 -2273 -14093 -26490 -3470 37761 27802 -41971 -87013 -67524 -65750 -138108 -189064
$$ packed form
39246a70039n7174j2691Q0133R4695J3616l8460m839L2315L0839N5535J10919
39235A34849Q8611m2886j53885j33802k6666O0705O7202j5599j16308r1348Q3795
39224a45332J93991O3608j25121p3390J40795J64385n0938j75593o3466M1664
39214b9397j3339l7618P8702J06884q3970k16823n6712J65099J34886k9247l5547
39203a7082O0732J9255r5960l8703J27025J08186q8662j42747M1940J78384O2524
39192B14892j38242j84086q1355K8487Q6943R9441N8931l427j1969L2718L3553
39181A35886m8174j23157j10515m7259q801m14J7540N1330O9460N1701J4914o192
39169c681j178K586j1820j2397K3020M1231r959o9773m5042J9489J774p2358n0956
$$ plain form
39156 -189064 -119322 -14210 -22704 -105058 -85342 59848 152326 78903 -58097 -109777 -65054
39145 -65054 -4043 26317 26148 5113 -21611 -44810 -78716 -123802 -137090 -103178 -93456 -167167
39133 -167167 -256053 -252280 -173970 -128809 -144586 -155765 -132209 -100638 -63637 -17927 -22720 -122524
39121 -122524 -232742 -234293 -151126 -100056 -103499 -96018 -70849 -58068 -3143 148749 281987
39110 281987 225111 22908 -107784 -90618 -51694 -64857 -55313 11166 55574 50163 60686
39099 60686 82255 29658 -68605 -76222 -112 -16759 -177432 -307170 -287160 -219172 -199449
39088 -199449 -147456 -3797 98640 36014 -85017 -82067 36448 114620 72908 -44105 -171266
39077 -171266 -261438 -280953 -250659 -231980 -223549 -159445 -49102 -80 -45679 -76348 -14304
$$ packed form
39156a89064O9742J05112q494q2354J9716J45190R2478p3423j37000n1680M4723
39145f5054O1011L0360j69k1035k6724k3199l3906m5086j3288L3912R722p3711
39133a67167q8886L773P8310M5161j5777j1179K3556L1571L7001M5710m793r9804
39121a22524j10218j551Q3167N1070l443P481K5169J2781N4925J51892J33238
39110B81987n6876k02203j30692J7166L8924j3163R544O6479M4408n411J0523
39099F0686K1569n2597r8263p617P6110j6647j60673j29738K0010O7988J9723
39088a99449N1993J43659J02437o2626j21031K950J18515P8172m1712j17013j27161
39077a71266r0172j9515L0294J8679Q431O4104J10343M9022m5599l0669O2044
$$ plain form
39066 -14304 63978 57389 -17082 -83209 -103176 -55908 71772 212352 245311 152578 42041
39055 42041 -17473 -61965 -109426 -121056 -118845 -177705 -256803 -215060 -50361 60286 23669
39044 23669 -57292 -100934 -163174 -248631 -236965 -122259 -95639 -233030 -323833 -198799 -19721
39033 -19721 -21530 -145661 -174294 -88312 -40113 -71753 -100857 -112404 -142559 -137803 -44162 25612
39021 25612 -67734 -232030 -249135 -110554 -24688 -90088 -177647 -168397 -112566 -95610 -109945
39010 -109945 -127380 -164670 -205490 -167179 -23883 114870 126544 34521 -21371 37005 128116
38999 128116 116521 -3730 -88889 -38536 57132 45007 -68700 -146454 -138274 -117096 -98469
38988 -98469 -9225 123689 145445 16727 -95160 -74487 -34778 -111543 -241575 -300540 -313098
$$ packed form
39066a4304P8282o589p4471o6127j9967M7268J27680J40580L2959r2733j10537
39055D2041n9514m4492m7461j1630K211n8860p9098M1743J64699J10647l6617
39044B3669q0961m3642o2240q5457J1666J14706K6620j37391r0803J25034J79078
39033a9721j809j24131k8633Q5982M8199l1640k9104j1547l0155M756R3641O9774
39021B5612r3346j64296j7105J38581Q5866o5400q7559R250N5831J6956j4335
39010a09945j7435l7290m0820L8311J43296J38753J1674r2023n5892N8376R1111
38999A28116j1595j20251q5159N0353R5668j2125j13707p7754Q180K1178J8627
38988i8469Q9244J32914K1756j28718j11887K0673L9709p6765j30032n8965j2558
$$ plain form
38977 -313098 -355028 -371627 -277040 -137074 -74937 -76507 -57511 -40115 -84749 -123724 -55661
38966 -55661 50023 38733 -73533 -121949 -56198 1062 -36582 -118555 -178976 -206566 -176068
38955 -176068 -54190 99692 166204 124959 69052 49915 28386 -4782 9556 78584 115937
38944 115937 72206 8859 -11106 -16618 -51041 -80473 -57819 -23459 -50162 -105694 -65378 106888
38932 106888 263020 229492 30992 -138348 -174359 -179718 -263957 -349452 -304830 -183450 -156008
38921 -156008 -244157 -307534 -292956 -298453 -352746 -330910 -172093 -7893 28645 -24510 -76910
38910 -76910 -133953 -214436 -250256 -191902 -108653 -73988 -55026 -19186 -37196 -160331 -294008
38899 -294008 -315108 -236167 -153073 -113895 -127120 -201227 -287060 -285799 -198804 -151125 -185302 -180399
$$ packed form
38977c13098m1930j6599R4587J39966O2137j570J8996J7396m4634l8975O8063
38966e5661J05684j1290j12266m8416O5751N7260l7644q1973o0421k7590L0498
38955a76068J21878J53882O6512m1245n5907j9137k1529l3168J4338O9028L7353
38944A15937m3731o3347j9965n512l4423k9432K2654L4360k6703n5532M0316J72266
38932A06888J56132l3528j98500j69340l6011n359q4239q5495M4622J21380K7442
38921a56008q8149o3377J4578n497n4293K1836J58817J64200L6538n3155n2400
38910g6910n7043q0483l5820N8354Q3249L4665J8962L5840j8010j23135j33677
38899b94008k1100P8941Q3094L9178j3225p4107q5833J261Q6995M7679l4177M903
$$ plain form
38887 -180399 -77929 -16831 -98851 -184795 -107191 51102 90520 492 -69254 -62187 -46160
38876 -46160 -50337 -45231 -35617 -26852 32913 138759 155147 15419 -112959 -50334 109141 144209
38864 144209 51409 8659 55710 63901 5270 1033 76822 94274 -17563 -144846 -163526
38853 -163526 -89677 -11491 11395 -39517 -121533 -127893 -17018 81830 24316 -119283 -146478
38842 -146478 -16561 108456 122811 104374 145488 207456 203142 115988 -10266 -118965 -156531
38831 -156531 -116606 -70896 -83595 -113398 -81478 -3767 42761 53282 84715 134657 140272 86349
38819 86349 19944 -26965 -49815 -39634 -13440 -23156 -59650 -30645 72697 97001 -49657
38808 -49657 -203433 -151957 43833 132907 32133 -99063 -122485 -65720 2065 60322 77202
$$ packed form
38887a80399J02470O1098q2020q5944P7604J58293L9418r0028o9746P067J6027
38876d6160m177N106R614Q765N9765J05846J6388j39728j28378O2625J59475L5068
38864A44209r2800m2750M7051Q191n8631m237P5789J7452j11837j27283j8680
38853a63526P3849P8186K2886n0912q2016o360J10875R8848n7514j43599k7195
38842a46478J29917J25017J4355j8437M1114O1968m314q7154j26254j08699l7566
38831a56531L9925M5710j2699k9803L1920P7711M6528J0521L1433M9942N615n3923
38819H6349o6405m6909k2850J0181K6194r716l6494K9005J03342K4304j46658
38808d9657j53776N1476J95790Q9074j00774j31196k3422N6765O7785N8257J6880
$$ plain form
38797 77202 7330 -122042 -233640 -307547 -363762 -372270 -304270 -232744 -243620 -283599 -238007
38786 -238007 -118554 -23653 40763 132045 203625 154211 27032 -24763 27513 59369 2606
38775 2606 -77557 -117127 -111905 -46759 81439 181881 164339 95794 104008 157122 120836 9099
38763 9099 -24430 56867 124380 105690 63745 37567 -11078 -70217 -71000 -23884 2376 27290
38751 27290 101608 130906 -18090 -240324 -274054 -92779 37191 -45612 -186606 -190898 -84875
38740 -84875 4418 33091 -367 -98308 -174467 -102154 62766 97047 -63341 -215107 -210970
38729 -210970 -174744 -249421 -335138 -267616 -103298 -25094 -61807 -82119 -10400 94931 141594
38718 141594 86121 -38252 -116504 -47808 102998 143941 -1994 -195241 -265989 -185552 -10950
$$ packed form
38797G7202o9872j29372j11598p3907n6215q508O8000P1526j0876l9979M5592
38786b38007J19453R4901O4416R1282P1580m9414j27179n1795N2276L1856n6763
38775B606q0163l9570N222O5146J28198J00442j7542o8545Q214N3114l6286j11737
38763I099l3529Q1297O7513j8690m1945k6178m8645n9139p83M7116K6260K4914
38751B7290P4318K9298j48996k22234l3730J81275J29970q2803j40994m292J06023
38740h4875Q9293K8673l3458r7941p6159P2313J64920L4281j60388j51766M137
38729b10970L6226p4677q5717O7522J64318P8204l6713k0312P1719J05331M6663
38718A41594n5473j24373p8252O8696J50806M0943j45935j93247p0748Q0437J74602
$$ plain form
38707 -10950 195584 328220 274070 79917 -53534 -30770 23188 -11509 -69768 -57947 -30140
38696 -30140 -69922 -135115 -165444 -215433 -326036 -386864 -297597 -161274 -134594 -174067 -127349
38685 -127349 -12663 5533 -101958 -180950 -150144 -117562 -178827 -253141 -215583 -92109 -19184
38674 -19184 -55050 -119167 -115980 -58105 -37595 -94156 -151270 -109111 17566 99718 41158 -111091
38662 -111091 -219829 -193863 -58352 85394 153652 143407 106524 68668 8829 -68663 -99903
38651 -99903 -47111 28779 41755 -10258 -67983 -99201 -100533 -59321 12604 55232 46398 54740
38639 54740 123870 174989 130112 57552 63969 107866 71504 -32941 -91949 -87687 -96018 -113178
38627 -113178 -65233 15202 4350 -104556 -177036 -142656 -65895 5520 99631 201429 233797
$$ packed form
38707a0950K06534J32636n4150j94153j33451K2764N3958l4697n8259J1821K7807
38696c0140l9782o5193l0329m9989j10603o0828Q9267J36323K6680l9473M6718
38685a27349J14686J8196j07491p8992L0806L2582o1265p4314L7558J23474P2925
38674a9184l5866o4117L187N7875K0510n6561n7114M2159J26677Q2152n8560j52249
38662a11091j08738K5966J35511J43746O8258j0245l6883l7856n9839p7492l1240
38651i9903N2792P5890J2976n2013n7725l1218j332M1212P1925M2628q834Q342
38639E4740O9130N1119m4877p2560O417M3897l6362j04445n9008M262q331j7160
38627a13178M7945Q0435j0852j08906p2480L4380P6761P1415R4111J01798L2368
$$ plain form
38616 233797 191075 149859 128074 76762 15306 13915 40356 947 -65106 -32332 60158 32262
38604 32262 -122703 -189877 -79842 15060 -66337 -199392 -185396 -43317 73145 114288 131348
38593 131348 134287 95407 32216 -13607 -26535 5765 86740 149837 107785 -8924 -83557
38582 -83557 -102060 -161402 -263458 -277784 -164212 -53200 -32686 -32392 -2006 -21186 -125658
38571 -125658 -192708 -120933 17019 106665 139373 136517 76019 -8486 -7871 82092 113601 19528
38559 19528 -70795 -57661 -37483 -107350 -168722 -86073 92062 223068 263781 237501 131393
38548 131393 -29952 -124631 -93633 -58880 -142542 -266074 -268106 -139215 -9340 31405 -6507
38537 -6507 -66260 -81470 -28209 17288 -29968 -103034 -67086 23137 -34933 -241342 -339876 -221798
$$ packed form
38616B33797m2722m1216k1785n1312o1456j391K6441l9409o6053L2774R2490k7896
38604C2262j54965o7174J10035R4902q1397j33055J3996J42079J16462M1143J7060
38593A31348K939l8880o3191m5823j2928L2300Q0975O3097m2052j16709p4633
38582h3557j8503n9342j02056j4326J13572J11012K0514K94L0386j9180j04472
38571a25658o7050P1775J37952Q9646L2708k856o0498q4505O15Q9963L1509r4073
38559A9528r0323J3134K0178o9867o1372Q2649J78135J31006M0713k6280j06108
38548A31393j61345r4679L0998L4753q3662j23532k032J28891J29875M0745l7912
38537f507n9753j5210N3261M5497m7256p3066L5948R0223n8070k06409r8534J18078
$$ plain form
38525 -221798 -114102 -195910 -285973 -143645 130656 255995 174492 41367 -60663 -147822
38515 -147822 -176018 -96711 -6390 -33484 -135851 -184055 -164973 -137064 -85829 526 23877
38504 23877 -67141 -129134 -34044 90315 51822 -81807 -93011 34691 123981 104592 65919
38493 65919 47375 3675 -46943 -46422 -35998 -77803 -91563 21102 148698 100476 -76426
38482 -76426 -155225 -83547 -30836 -81485 -127519 -93122 -34218 24536 131757 239475 203141
38471 203141 19018 -126525 -116978 -48490 -46407 -95844 -125082 -118367 -78890 -1264 65031 38884
38459 38884 -63139 -130765 -122792 -109562 -127492 -118812 -55756 -3777 -10834 -35899 -33751 -23228
38447 -23228 -34746 -66395 -112811 -164713 -177386 -120950 -54155 -55132 -88932 -49060 72340 164473
$$ packed form
38525b21798J07696q1808r0063J42328K74301J25339q1503j33125j02030q7159
38515a47822k8196P9307R0321k7094j02367m8204J9082K7909N1235Q6355K3351
38504B3877r1018o1993R5090J24359l8493j33629j1204J27702Q9290j9389l8673
38493F5919j8544m3700n0618N21J0424m1805j3760J12665J27596m8222j76902
38482g6426p8799P1678N2711n0649m6034L4397N8904N8754J07221J07718l6334
38471B03141j84123j45543R547O8488K083m9437k9238O715L9477P7626O6295k6147
38459C8884j02023o7626P973J3230j7930Q680O3056N1979p057k5065K148J0523
38447b3228j1518l1649m6416n1902j2673N6436O6795r77l3800L9872J21400R2133
$$ plain form
38435 164473 152579 68924 -34595 -139142 -214736 -225468 -195809 -186254 -198011 -184464 -148670
38424 -148670 -135247 -132260 -82088 7090 54561 18015 -66326 -142906 -157330 -50025 165007
38413 165007 336769 309196 113743 -73347 -155219 -183888 -215443 -226357 -196088 -158825 -136729
38402 -136729 -111271 -90593 -123481 -212945 -280308 -246628 -112019 52535 162074 183496 175448
38391 175448 224575 309233 295371 125602 -69898 -136414 -87131 -29912 10733 61239 62192
38380 62192 -63757 -235079 -271591 -137918 18939 86283 97804 106255 86293 18549 -41471
38369 -41471 -43099 -12609 4683 12647 31652 46925 30388 -12817 -47102 -47477 -29260 -30372 -51965
38356 -51965 -40654 24589 61934 -4595 -90633 -47410 79083 65003 -152382 -345468 -326007
$$ packed form
38435A64473j1894q3655j03519j04547p5594j0732K9659R555j1757J3547L5794
38424a48670J3423K987N0172Q9178M7471l6546q4341p6580j4424J07305K15032
38413A65007J71762k7573j95453j87090q1872k8669l1555j0914L0269L7263K2096
38402a36729K5458K0678l2888q9464o7363L3680J34609J64554J09539K1422q048
38391A75448M9127Q4658j3862j69769j95500o6516M9283N7219M0645N0506R53
38380F2192j25949j71322l6512J33673J56857O7344J1521Q451j9962o7744o0020
38369d1471j628L0490J7292P964J9005J5273j6537m3205l4285l75J8217j112k1593
38356e1965J1311O5243L7345o6529q6038M3223J26493j4080k17385j93086J9461
$$ plain form
38345 -326007 -221562 -250829 -374424 -381172 -224369 -56885 14525 14761 -22129 -81395 -102223
38334 -102223 -47352 -3739 -55268 -104161 -544 189561 247971 125498 -4523 -30111 -37438
38323 -37438 -113649 -193824 -189006 -133644 -117750 -157929 -199422 -187745 -107385 -1814 41077 -16778
38311 -16778 -93515 -78276 21713 92258 53508 -70157 -194644 -235612 -164019 -54139 -21851
38300 -21851 -71961 -92296 -47956 -53718 -165390 -243353 -159409 -8461 49995 45080 100628 183719
38288 183719 159409 43746 -4172 73434 170029 186018 120116 14074 -67360 -47088 52446
38277 52446 79277 -37742 -146112 -89064 44489 72163 6714 -20170 -16627 -71144 -121584
38266 -121584 -47534 67984 42858 -79146 -91431 7105 5443 -138266 -205584 -75157 91539
$$ packed form
38345c26007J04445k9267j23595o748J56803J67484P1410K36l6890n9266k0828
38334a02223N4871M3613n1529m8893J03617J90105N8410j22473j30021k5588p327
38323c7438p6211q0175M818N5362J5894m0179m1493J1677Q0360J05571M2891n7855
38311a6778p6737J5239R9989P0545l8750j23665j24487m0968P1593J09880L2288
38300b1851n0110k0335M4340n762j11672p7963Q3944J50948N8456m915N5548Q3091
38288A83719k4310j15663m7918P7606R6595J5989o5902j06042q1434K0272R9534
38277E2446K6831j17019j08370N7048J33553K7674o5449k6884L543n4517n0440
38266a21584P4050J15518k5126j22004j2285R8536j662j43709o7318J30427J66696
$$ plain form
38255 91539 113528 21633 -61457 -89154 -68410 -28103 -51226 -188162 -331025 -336931 -253275
38244 -253275 -226967 -230303 -122885 34040 10496 -216951 -405229 -415124 -363184 -331217 -215247
38233 -215247 14705 172681 133724 35114 44968 117335 126695 79887 48879 30224 -4074
38222 -4074 -34865 -66450 -144044 -230000 -201403 -38557 122746 180172 160638 94317 -32953
38211 -32953 -162256 -185940 -136281 -154438 -230589 -198594 -45546 22165 -86297 -192416 -146120
38200 -146120 -39219 9665 46039 103809 71655 -85611 -184978 -100999 5094 -64998 -238086
38189 -238086 -318805 -292905 -262176 -208690 -57859 109524 128458 -9977 -161914 -232159 -229033
38178 -229033 -169954 -69023 20486 58703 71275 77377 41772 -36036 -87040 -94968 -130658 -193344
$$ packed form
38255I1539K1989r1895q3090k7697K0744M0307k3123j36936j42863n906Q3656
38244b53275K6308l336J07418J56925k3544k27447j88278r895N1940L1967J15970
38233b15247K29952J57976l8957r8610R854P2367R360m6808l1008j8655l4298
38222d074l0791l1585p7594q5956K8597J62846J61303N7426j9534o6321j27270
38211c2953j29303k3684M9659j8157p6151L1995J53048O7711j08462j06119M6296
38200a46120J06901M8884L6374N7770l2154j57266r9367Q3979J06093p0092j73088
38189b38086q0719K5900L0729N3486J50831J67383J8934j38435j51937p0245L126
38178b29033N9079J00931Q9509L8217J2572O102l5605p7808n1004p928l5690o2686
$$ plain form
38166 -193344 -168400 -35841 48508 3682 -19604 107794 248584 203764 30113 -60027 -21647
38155 -21647 12042 -22495 -63042 -78362 -101583 -127932 -130287 -147837 -218514 -263474 -188746 -66907
38143 -66907 -57888 -163483 -217135 -126393 14922 79888 53517 -7453 -60095 -80409 -54870
38132 -54870 -4876 23079 11726 -12162 -21098 -16715 -13904 -14655 -3300 28804 50749 12855 -73429
38119 -73429 -119147 -73924 -10223 -16831 -62557 -67427 -51560 -76421 -86645 15069 154819 146275
38107 146275 -18559 -134310 -84078 14767 31933 4989 11881 32646 35354 49971 69076
38096 69076 24715 -54363 -25715 132595 236599 154174 -8724 -89270 -75253 -16287 100652
38085 100652 244642 270872 120667 -44230 -67564 -28887 -80964 -181674 -177675 -64358 25944
$$ packed form
38166a93344K4944J32559Q4349m4826k3286J27398J40790m4820j73651r0140L8380
38155b1647L3689l4537m0547j5320k3221k6349k355j7550p0677m4960P4728J21839
38143f6907R019j05595n3652R0742J41315O4966k6371o0970n2642k0314K5539
38132e4870M9994K7955j1353k3888q936M383K811p51J1355L2104K1945l7894q6284
38119g3429m5718M5223O3701o608m5726m870J5867k4861j0224J01714J39750q544
38107A46275j64834j15751N0232R8845J7166k6944O892K0765K708J4617J9105
38096F9076m4361p9078K8648J58310J04004q2425j62898q0546J4017N8966J16939
38085A00652J43990K6230j50205j64897k3334L8677n2077j00710L999J13317R0302
$$ plain form
38074 25944 37307 26749 30181 31091 24321 529 -78688 -194112 -234978 -153485 -64486 -81390
38062 -81390 -147375 -148551 -96607 -67096 -50376 -6853 14044 -41317 -100762 -71686 -14874 -63859
38050 -63859 -218069 -354602 -403223 -380668 -298668 -174780 -101081 -167366 -324912 -428446 -398250
38039 -398250 -264277 -94210 34478 38826 -95534 -271475 -379046 -396849 -349769 -245521
38029 -245521 -118332 -46451 -47057 -41955 -5251 -38309 -197728 -356021 -358650 -235434 -130997
38018 -130997 -97160 -76866 -33179 21938 78321 112397 77503 -11914 -61259 -36349 -27261 -86992
38006 -86992 -119252 -34745 91662 141123 122424 97369 44321 -61591 -135691 -107138 -63663
37995 -63663 -111204 -173330 -105833 52904 124184 42178 -95230 -192799 -224634 -173094 -53413
$$ packed form
38074B5944J1363j0558L432R10o770k3792p9217j15424m0866Q1493Q8999j6904
38062h1390o5985j176N1944K9511J6720M3523K0897n5361n9445K9076N6812m8985
38050f3859j54210j36533m8621K2555Q2000J23888P3699o6285j57546j03534L0196
38039c98250J33973J70067J28688M348j34360j75941j07571j7803M7080J04248
38029b45521J27189P1881o06N102L6704l3058j59419j58293k629J23216J04437
38018a30997L3837K0294M3687N5117N6383L4076l4894q9417m9345K4910R088n9731
38006h6992l2260Q4507J26407M9461j8699k5055n3048j05912p4100K8553M3475
37995f3663m7541o2126O7497J58737P1280q2006j37408r7569l1835N1540J19681
$$ plain form
37984 -53413 30513 -289 -59590 -8137 129364 205006 172255 115903 80812 30812 -26651
37973 -26651 -31044 3709 -6939 -70704 -107526 -102764 -133678 -208093 -211861 -84589 57910 63236
37961 63236 -56935 -147543 -107836 -778 46206 5108 -33940 -6097 30795 -2408 -59530
37950 -59530 -27427 82600 125243 30530 -95514 -134359 -114076 -130317 -188864 -208287 -135985
37939 -135985 -8626 74468 29892 -109632 -194503 -136614 -47303 -76079 -163528 -138550 -34975
37928 -34975 -69953 -270329 -380248 -245994 -51308 -16567 -75260 -39693 77356 112897 18268
37917 18268 -105857 -163791 -118514 26847 186975 224271 118035 3042 -32620 -49396 -85098
37906 -85098 -65641 9822 -2017 -135438 -198129 -73786 65923 48425 -9151 66621 172328
$$ packed form
37984e3413Q3926l0802n9301N1453J37501P5642l2751n6352l5091n0000n7463
37973b6651m393L4753j0648o3765l6822M762l0914p4415l768J27272J42499N326
37961F3236j20171r0608L9707J07058M6984m1098l9048K7843L6892l3203n7122
37950e9530L2103J10027M2643r4713j26044l8845K0283j6241n8547j9423P2302
37939a35985J27359Q3094m4576j39524q4871N7889Q9311k8776q7449K4978J03575
37928c4975l4978k00376j09919J34254J94686L4741n8693L5567J17049L5541r4629
37917A8268j24125n7934M5277J45361J60128L7296j06236j14993l5662j6776l5702
37906h5098J9457P5463j1839j33421o2691J24343J39709j7498n7576P5772J05707
$$ plain form
37895 172328 104475 -79968 -169332 -150629 -167432 -211903 -153728 -24219 11857 -58296 -99061
37884 -99061 -89080 -119606 -150519 -45701 132470 139027 -83225 -291160 -281042 -133307 -27619
37873 -27619 3551 28276 63389 82890 93410 117638 150889 173024 162778 99781 5433 -37009
37861 -37009 27880 135348 164795 78805 -55025 -147687 -147309 -65362 9328 -12825 -92764 -100646
37849 -100646 -22608 -597 -96222 -163106 -66234 106886 185420 145972 69752 -15521 -106417
37838 -106417 -138445 -74552 4310 14922 -16580 -54115 -128405 -209205 -170776 -24443 280
37827 280 -211603 -426954 -379852 -157964 -32326 -44295 -30422 47332 75428 32152 -29
37816 -29 -27556 -119706 -222390 -213084 -113999 -56610 -68134 -71638 -50209 -38464 -11298 51609
$$ packed form
37895A72328o7853j84443q9364J8703j6803m4471N8175J29509L6076p0153m0765
37884i9061R981l0526l0913J04818J78171O557k22252k07935J0118J47735J05688
37873b7619L1170K4725L5113J9501J0520K4228L3251K2135j0246o2997r4348m2442
37861c7009O4889J07468K9447q5990j33830r2662L78Q1947P4690k2153p9939p882
37849a00646P8038K2011r5625o6884R6872J73120P8534l9448p6220q5273r0896
37838a06417l2028O3893P8862J0612l1502l7535p4290q0800L8429J46333K4723
37827B80k11883k15351M7102K21888J25638j1969J3873P7754K8096m3276l2181
37816b9k7527r2150j02684R306R9085N7389j1524l504K1429J1745K7166O2907
$$ plain form
37804 51609 69100 -4540 -45653 53002 176619 168800 91634 80469 72853 -53211 -188506
37793 -188506 -137052 30682 72225 -33087 -84123 -15711 43074 53620 117064 230880 270329
37782 270329 228804 220558 234036 138467 -48744 -154446 -133257 -118782 -170484 -204782 -197504
37771 -197504 -217400 -232368 -118127 102230 246831 239294 181322 142155 84536 17411 7633
37760 7633 14623 -78513 -243569 -318117 -258936 -187619 -169075 -147048 -117814 -161116 -262415 -290822
37748 -290822 -193765 -61455 13515 1738 -109059 -269924 -327404 -195561 -16011 28235
37738 28235 -22041 -18578 18299 -18654 -63115 27037 182497 217186 148402 129630 128222 -4444
37726 -4444 -184554 -170822 13064 83893 -38808 -116463 -95 161786 203650 148144 59953
$$ packed form
37804E1609J7491p3640m1113R8655J23617p819p7166j1165p616j26064j35295
37793a88506N1454J67734M1543j05312n1036O8412N8785J0546O3444J13816L9449
37782B70329m1525q246J3478r5569j87211j05702K1189J4475n1702l4298P278
37771a97504j9896j4968J14241K20357J44601p537n7972l9167n7619o7125r778
37760G633O990r3136j65056p4548N9181P1317J8544K2027K9234m3302j01299k8407
37748b90822R7057J32310P4970j1777j10797j60865n7480J31843J79550M4246
37738B8235n0276L463L6877l6953m4461R0152J55460L4689o8784j8772j408j32666
37726d444j80110J3732J83886P0829j22701p7655J16368J61881M1864n5506q8191
$$ plain form
37715 59953 -42781 -79906 27558 152274 87172 -104048 -152695 -17537 66478 5258 -27231
37704 -27231 55215 105538 49882 22670 89292 130319 100728 111891 164516 102326 -72880
37693 -72880 -149687 -72065 -39345 -131333 -162915 -45661 36602 -29404 -89824 -40733 -23273
37682 -23273 -112523 -127929 25092 123810 -10996 -189748 -158845 -2963 34697 -50072 -79394
37671 -79394 -12999 38680 28152 -5009 -45415 -81930 -63140 5001 20587 -53259 -111717 -85034
37659 -85034 -51229 -78730 -107651 -87863 -83883 -136508 -159846 -76783 64421 180650 237886
37648 237886 205029 70589 -65576 -78960 -14144 -13790 -62142 -21478 79308 57701 -93098
37637 -93098 -166334 -85953 -9931 -26431 -32211 11509 -4312 -76472 -44443 96478 142045 47293
$$ packed form
37715E9953j02734l7125J07464J24716o5102j91220m8647J35158Q4015o1220l2489
37704b7231Q2446N0323n5656k7212O6622M1027k9591J1163N2625o2190j75206
37693g2880p6807P7622L2720r1988l1582J17254Q2263o6006o0420M9091J7460
37682b3273q9250j5406J53021R8718j34806j78752L0903J55882L7660q4769k9322
37671g9394O6395N1679j0528l3161m0406l6515J8790O8141J5586p3846n8458K6683
37659h5034L3805k7501k8921J9788L980n2625k3338Q3063J41204J16229N7236
37648B37886l2857j34440j36165j3384O4816L54m8352M0664J00786k1607j50799
37637i3098p3236Q0381P6022j6500n780M3720j5821p2160L2029J40921M5567r4752
$$ plain form
37625 47293 28638 165739 226596 55883 -170414 -257754 -264302 -273549 -191540 17117 160680
37614 160680 105332 -10703 -40028 -54226 -120078 -111217 42669 163304 96655 -47853 -126477
37603 -126477 -188918 -278682 -260781 -72756 91008 73022 3911 43042 105110 71995 36960
37592 36960 95593 127398 37094 -18107 91337 184864 56690 -159446 -208366 -119888 -97087
37581 -97087 -148369 -130507 -46132 -23832 -89630 -187530 -323634 -477173 -491676 -278480 -17897
37570 -17897 54956 -38008 -107889 -82617 -18465 46923 74629 -15000 -194951 -281404 -186359
37559 -186359 -64634 -56703 -67945 24614 139266 157136 137460 165165 163005 57839 -42942
37548 -42942 -42510 -42931 -140845 -219156 -150972 -29324 13905 30409 87056 74023 -90589 -252998
$$ packed form
37625D7293j8655J37101O0857j70713k26297q7340o548r247Q2009K08657J43563
37614A60680n5348j16035k9325j4198o5852Q861J53886J20635o6649j44508p8624
37603a26477o2441q9764J7901J88025J63764j7986o9111L9131O2068l3115l5035
37592C6960N8633L1805r0304n5201J09444R3527j28174k16136m8920Q8478K2801
37581i7087n1282J7862Q4375K2300o5798r7900j36104j53539j4503K13196K60583
37570a7897P2853r2964o9881K5272O4152O5388K7706q9629j79951q6453R5045
37559a86359J21725P931j1242R2559J14652J7870j9676K7705k160j05166j00781
37548d2942M32m21r7914p8311O8184J21648M3229J6504N6647j3033j64612j62409
$$ plain form
37536 -252998 -250604 -165989 -138550 -123531 -63901 -81588 -241007 -338062 -205009 -22357 -31012
37525 -31012 -126329 -57554 135312 216849 158851 122070 131837 77921 -30356 -79560 -63856
37514 -63856 -54494 -34583 35346 88369 71884 66816 112681 87208 -49743 -100639 54687 205165
37502 205165 126800 -58487 -118672 -90002 -116385 -123660 6441 123287 26609 -154485 -157346
37491 -157346 -24995 4453 -76731 -90710 -39079 -63401 -125134 -76949 13026 -51851 -238756
37480 -238756 -335202 -305329 -288749 -297871 -221042 -82789 -12108 5701 78899 168197 149089
37469 149089 42596 -53696 -158458 -290276 -307382 -139777 -16755 -148434 -345650 -306668
37459 -306668 -121538 -97631 -219165 -212811 -63776 -20135 -118207 -139540 -47830 -55980 -217719
$$ packed form
37536b52998K394Q4615K7439J5019N9630j7687j59419r7055J33053J82652q655
37525c1012r5317O8775J92866Q1537n7998l6781R767n3916j08277m9204J5704
37514f3856R362J9911O9929N3023j6485n068M5865k5473j36951n0896J55326J50478
37502B05165p8365j85287o0185K8670k6383p275J30101J16846r6678j81094k861
37491a57346J32351K9448q1184j3979N1631k4322o1733M8185Q9975o4877j86905
37480b38756r6446K9873J6580r122P6829J38253P0681J7809P3198Q9298j9108
37469A49089j06493r6292j04762j31818j7106J67605J23022j31679j97216L8982
37459c06668J85130K3907j21534O354J49035M3641r8072k1333R1710q150j61739
$$ plain form
37448 -217719 -327785 -282564 -207016 -182076 -154776 -138960 -203702 -261342 -168961 -20102 -18050
37437 -18050 -96418 -19748 166365 176308 -15709 -119933 -26515 41167 -40137 -88990 17495
37426 17495 117961 65979 -31096 -31388 20726 29379 -2564 -65017 -191742 -334681 -364420 -260828
37414 -260828 -143930 -87883 -67096 -81744 -154439 -218920 -200106 -169970 -229721 -301875 -261156
37403 -261156 -190164 -247295 -362649 -353181 -262922 -270405 -322968 -213730 13477 102512 21324
37392 21324 -9553 60688 40167 -111244 -189111 -122114 -86705 -155008 -172678 -88070 -63283
37381 -63283 -139851 -126882 36674 123428 -16095 -210176 -255959 -202777 -186582 -208738 -228958
37370 -228958 -271827 -310667 -244670 -103654 -70231 -189290 -263149 -149588 35059 122501 111862
$$ packed form
37448b17719j10066M5221P5548K4940K7300J5816o4742n7640R2381J48859K052
37437a8050p8368P6670J86113R943j92017j04224R3418O7682q1304m8853J06485
37426A7495J00466n1982r7075k92N2114Q653l1943o2453j26725j42939k9739J03592
37414b60828J16898N6047K0787j4648p2695o4481J8814L0136n9751p2154M0719
37403b61156P0992n7131j15354R468R0259p483n2563J09238K27207Q9035q1188
37392B1324l0877P0241k0521j51411p7867O6997L5409o8303j7670Q4608K4787
37381f3283p6568J2969J63556Q6754j39523j94081m5783N3182J6195k2156k0220
37370b28958m2869l8840O5997J41016L3423j19059p3859J13561J84647Q7442j0639
$$ plain form
37359 111862 75946 32633 12968 80066 181909 158066 -11754 -134259 -72962 65020 104708
37348 104708 22640 -93913 -178654 -202015 -159487 -91199 -29592 61252 187814 226360 85359
37337 85359 -85174 -54559 145549 260904 189602 85776 73027 87395 53887 10535 -7776
37326 -7776 -38946 -94837 -132156 -144710 -160089 -158117 -119862 -109696 -164316 -174478 -47141 103331
37314 103331 120286 62285 76116 119920 68172 -6908 52416 171132 138877 -26237 -116018
37303 -116018 -93097 -101052 -143220 -76822 73056 112425 13934 -40601 24072 94788 114178
37292 114178 134342 126839 15076 -109570 -82779 35100 39040 -69421 -109006 -62678 -71402
37281 -71402 -110427 -17961 156570 185071 57688 1171 76626 102332 8285 -72704 -99943
$$ packed form
37359A11862l5916m3313j9665O7098J01843k3843j69820j22505O1297J37982L9688
37348A04708q2068j16553q4741k3361M2528O8288O1607R0844J26562L8546j41001
37337H5359j70533L0615K00108J15355p1302j03826j2749J4368l3508m3352j8311
37326g776l1170n5891l7319j2554j5379J972L8255J0166n4620j0162J27337J50472
37314A03331J6955n8001J3831M3804n1748p5080N9324J18716l2255j65114q9781
37303a16018K2921p955m2168O6398J49878L9369r8491n4535O4673P0716J9390
37292A14178K0164p503j11763j24646K6791J17879L940j08461l9585M6328q724
37281g1402l9025R2466J74531K8501j27383n6517P5455K5706r4047q0989k7239
$$ plain form
37270 -99943 -171448 -246335 -167057 5737 28299 -119118 -208028 -173521 -183864 -261508 -219659
37259 -219659 -41439 55515 7945 -8729 45268 -4472 -170311 -231965 -135471 -82948 -131287
37248 -131287 -95447 38908 14538 -237592 -425056 -350621 -187812 -133196 -119251 -40542 44953
37237 44953 93713 170660 251671 217586 117582 129013 215993 181182 76173 143671 327931
37226 327931 336959 260368 554508 1233328 1650153 1376960 792922 464641 404896 322140
37216 322140 192189 155845 155128 68516 -21879 -18634 -35997 -161026 -232144 -123582 -3454
37205 -3454 -46220 -133032 -94477 -8571 -4686 -8886 68265 120384 54966 -15222 -6158 -42430
37193 -42430 -186886 -248869 -96787 82611 70872 -67360 -171137 -244996 -322268 -312239 -198269
$$ packed form
37270i9943p1505p4887P9278J72794K2562j47417q8910L4507j0343p7644M1849
37259b19659J78220R6954m7570j6674N3997m9740j65839o1654R6494N2523m8339
37248a31287L5840J34355k4370k52130j87464P4435J62809N4616J3945P8709Q5495
37237D4953M8760P6947Q1011l4085j00004J1431Q6980l4811j05009O7498J84260
37226C27931R028p6591K94140O78820M16825k73193n84038l28281n9745q2756
37216C22140j29951l6344p17q6612r0395L245j7363j25029p1118J08562J20128
37205c454m2766q6812L8555Q5906L885m200P7151N2119o5418p0188R064l6272
37193d2430j44456o1983J52082J79398j1739j38232j03777p3859p7272J0029J13970
$$ plain form
37182 -198269 -148935 -230907 -262082 -143580 -61770 -149885 -234175 -147907 -17827 4464 21733
37171 21733 150054 264431 241326 198785 239981 214388 -1374 -232819 -284104 -244883 -257132
37160 -257132 -222353 -28865 154094 111740 -65721 -141362 -80897 -5642 40733 62151 12534
37149 12534 -81726 -80536 25300 39085 -116435 -243802 -206299 -147526 -191704 -213625 -118506
37138 -118506 -59722 -144084 -203847 -105897 -7369 -52221 -97034 -5868 62813 -51595 -200020
37127 -200020 -195226 -138576 -181095 -211768 -94698 19322 -60541 -214624 -219250 -113799 -67337
37116 -67337 -64219 -10913 19322 -71171 -176887 -158612 -83624 -72864 -83290 -50544 -51601 -122296
37104 -122296 -128577 -19575 29231 -70791 -128475 -13991 85019 -8460 -158022 -200508 -252723
$$ packed form
37182a98269M9334q1972l1175J18502Q1810q8115q4290Q6268J30080K2291J7269
37171B1733J28321J14377k3105m2541M1196k5593k15762k31445n1285L9221j2249
37160b57132L4779J93488J82959m2354j77461p5641O0465P5255M6375K1418m9617
37149A2534r4260J190J05836J3785j55520j27367L7503N8773m4178k1921R5119
37138a18506N8784q4362n9763R7950R8528m4852m4813R1166O8681j14408j48425
37127b00020M794N6650m2519l0673J17070J14020p9863j54083m626J05451M6462
37116f7337L118N3306L0235r0493j05716J8275P4988J0760j0426L2746j057p0695
37104a22296o281J09002M8806j00022n7684J14484R9010r3479j49562m2486n2215
$$ plain form
37093 -252723 -446720 -625627 -598019 -450300 -329644 -173576 67052 209504 140329 65983
37083 65983 161002 240333 97917 -106431 -136781 -88320 -148437 -205061 -68773 136717 178576
37072 178576 113966 135161 207272 196962 168134 219265 224972 67196 -81890 -38521 43579
37061 43579 -56997 -223348 -219334 -112694 -113356 -171822 -107257 22068 33003 -36517 -27384 26345
37049 26345 -13453 -120516 -195845 -269248 -360189 -334875 -154879 -40525 -121779 -180831 -29294
37038 -29294 132982 56472 -133943 -196465 -188145 -266238 -335033 -263325 -205321 -328117 -461493
37027 -461493 -392187 -255225 -253015 -256237 -94595 30110 -125782 -353016 -300381 -67412 -7494
37016 -7494 -124905 -148217 -49452 -20740 -61702 -31051 13702 -56718 -113372 27952 222023
$$ packed form
37093b52723j93997j78907K7608J47719J20656J56068K40628J42452o9175p4346
37083F5983R5019P9331j42416k04348l0350M8461o0117n6624J36288K05490M1859
37072A78576o4610K1195P2111j0310k8828N1131N707j57776j49086M3369Q2100
37061D3579j00576j66351M014J06640o62n8466O4565J29325J0935o9520R133N3729
37049B6345l9798j07063p5329p3403r0941K5314J79996J14354q1254n9052J51537
37038b9294J62276p6510j90415o2522Q320p8093o8795P1708N8004j22796j33376
37027d61493O9306J36962K210l222J61642J24705j55892k27234N2635K32969N9918
37016g494j17411k3312R8765K8712m0962L0651M4753p0420n6654J41324J94071
$$ plain form
37005 222023 215801 95081 102189 177185 101732 -67327 -134271 -161942 -297450 -379967 -184495
36994 -184495 105723 145199 -1032 -9415 113729 93695 -64763 -88712 61550 162762
36984 162762 155239 175842 216510 145788 7574 -64291 -123840 -248676 -258232 4827 284431
36973 284431 240204 4437 -48302 70455 55953 -103283 -148331 -71697 -107063 -245372 -241168
36962 -241168 -75641 25712 5124 -2449 5253 -58801 -92554 31811 139921 3012 -216639
36951 -216639 -201645 -23313 7203 -104804 -110695 -23293 -50817 -132650 -46161 113386 67295
36940 67295 -110745 -102007 80865 132550 13177 -37980 3249 -54000 -159249 -72041 148119
36929 148119 193324 38559 -45603 9935 20823 -39406 -31636 -10109 -132524 -269452 -170021
$$ packed form
37005B22023o222j20720P108P4996p5453j69059o6944k7671j35508q2517J95472
36994a84495K90218L9476j46231q383J23144k0034j58458k3949J50262J01212
36984A62762p523K0603M0668p0722j38214p1865n9549j24836r556K63059K79604
36973B84431m4227k35767n2739J18757j4502j59236m5048P6634l5366j38309M204
36962b41168J65527J01353k0588p573P702o4054l3753J24365J08110j36909k19651
36951b16639J4994J78332L0516j12007n891Q7402k7524q1833Q6489J59547m6091
36940F7295j78040Q738J82872N1685j19373n1157M1229n7249j05249Q7208K20160
36929A48119M5205j54765q4162N5538J0888o0229P770K1527j22415j36928R9431
$$ plain form
36918 -170021 48883 60220 -96166 -93705 86055 153516 60497 31966 79496 -3271 -179372
36907 -179372 -204537 -100313 -97748 -152024 -27664 174145 112589 -184289 -341802 -263643 -205010
36896 -205010 -224431 -104935 150764 271059 205515 178932 234396 196637 89293 107427 186844
36885 186844 86483 -124898 -156199 -25585 1315 -56462 36051 191745 111602 -103827
36875 -103827 -54415 249720 379521 213418 81655 141006 181489 114604 103317 150579 81030
36864 81030 -42447 1695 118597 40017 -113473 -2824 259201 252537 21864 13790 248426
36853 248426 276596 8535 -146194 -54198 -46333 -210285 -216502 -3788 66814 -84994 -95935
36842 -95935 118154 172083 -51498 -167517 -21655 29511 -167095 -243670 -10384 171543
$$ packed form
36918a70021K18904J1337j56386K461J79760O7461r3019k8531M7530q2767j76101
36907a79372k5165J04224K565n4276J24360K01809o1556k96878j57513P8159N8633
36896b05010j9421J19496K55699J20295o5544k6583N5464l7759j07344J8134P9417
36885A86844j00361k11381l1301J30614K6900n7777R2513J55694q0143k15429
36875a03827M9412L04135J29801j66103j31763N9351M0483o6885j1287M7262o9549
36864H1030j23477M4142J16902p8580j53490J10649K62025o664k30673q074K34636
36853B48426K8170k68061j54729R1996P865j63952o217K12714P0602j51808j0941
36842i5935K14089N3929k23581j16019J45862N1166j96606p6575K33286J81927
$$ plain form
36832 171543 43357 -124132 -87935 -47004 -161295 -197304 -3612 151141 52831 -93482
36822 -93482 -77917 -37663 -115171 -173604 -109729 -65451 -110611 -91389 33268 88973 49203
36811 49203 94729 215062 191416 51423 59102 183464 102091 -184455 -298281 -145115 -56352
36800 -56352 -153440 -161953 -1234 43696 -90872 -89888 117927 173675 -60821 -242025 -162364
36789 -162364 -72854 -153682 -195749 -51637 87188 80461 52267 57770 -7944 -71953 59042
36778 59042 255871 219038 83444 251964 610696 612354 207847 -50052 53217 120763
36768 120763 -31271 -68650 124299 187132 19586 6286 229586 233312 -116842 -313460
36758 -313460 -100550 76983 -90664 -237468 -55762 131583 8285 -162085 -75139 75877
$$ packed form
36832A71543j28186j67489L6197M0931j14291l6009J93692J54753r8310j46313
36822i3482J5565M0254p7508n8433O3875M4278m5160J9222J24657N5705l9770
36811D9203M5526J20333k3646j39993P679J24362q1373k86546j13826J53166Q8763
36800e6352r7088q513J60719M4930j34568R84K07815N5748k34496j81204P9661
36789a62364Q9510q0828m2067J44112J38825o727k8194N503o5714o4009J30995
36778E9042J96829l6833j35594J68520L58732J658m04507k57899J03269O7546
36768A20763j52034l7379J92949O2833j67546j3300K23300L726l50154j96618
36758c13460K12910J77533j67647j46804J81706J87345j23298j70370Q6946J51016
$$ plain form
36748 75877 46630 -7341 66763 80124 -64243 -105436 74983 193473 99261 45825 165937
36737 165937 223605 128901 121139 217706 101465 -223032 -322342 -107998 -18900 -194625 -212484
36726 -212484 77075 230147 46167 -57263 135316 225063 -927 -136007 54065 169741
36716 169741 -42808 -197520 -16805 157227 68943 40807 278213 401677 170668 -24663
36706 -24663 109386 243179 114149 42543 249521 356707 95906 -152571 -57456 81421
36696 81421 -38534 -163502 -58709 4796 -164389 -253004 -84566 -25401 -275570 -430808
36686 -430808 -227078 -31988 -118950 -161409 65135 201372 18232 -118001 15428 45811
36676 45811 -215325 -324410 -51570 131768 -53105 -141099 164041 373537 124061 -138228
$$ packed form
36748G5877k9247n3971P4104J3361j44367m1193J80419J18490r4212n3436J20112
36737A65937N7668r4704p762R6567j16241l24497r9310K14344Q9098j75725j7859
36726b12484K89559J53072j83980j03430J92579Q9747k25990j35080J90072J15676
36716A69741k12549j54712J80715J74032q8284k8136K37406J23464k31009j95331
36706b4663J34049J33793j29030p1606K06978J07186k60801k48477R5115J38877
36696H1421j19955j24968J04793O3505j69185q8615J68438N9165k50169j55238
36686d30808K03730J95090q6962m2459K26544J36237j83140j36233J33429L0383
36676D5811k61136j09085K72840J83338j84873q7994L05140K09496k49476k62289
$$ plain form
36666 -138228 -26985 72939 -164563 -308125 -13528 251747 61979 -184438 -69477 54760
36656 54760 -171853 -363420 -164568 8122 -218623 -406796 -149221 114275 -57599 -241777
36646 -241777 15839 288624 83238 -194500 -6899 305948 210801 -17813 93667 282129
36636 282129 143600 4494 273257 564706 389812 86515 155132 308352 103716 -118749
36626 -118749 126486 507336 478672 258119 296535 379715 154198 -66670 85881 246292
36616 246292 16610 -202261 26772 276896 47408 -252713 -76045 214538 67259 -185430
36606 -185430 -5260 277216 115585 -179077 -70374 143522 -40373 -286004 -78347 211401
36596 211401 12889 -314538 -143850 232524 181387 -94685 -54738 95042 -94484 -315289
$$ packed form
36666a38228J11243R9924k37502j43562K94597K65275j89768k46417J14961J24237
36656E4760k26613j91567J98852J72690k26745j88173K57575K63496j71874j84178
36646b41777K57616K72785k05386k77738J87601L12847r5147k28614J11480J88462
36636B82129j38529j39106K68763K91449j74894l03297O8617J53220k04636k22465
36626a18749K45235L80850k8664k20553L8416Q3180k25517k20868J52551J60411
36616B46292k29682k18871K29033K50124k29488l00121J76668K90583j47279k52689
36606a85430J80170K82476j61631k94662J08703K13896j83895k45631K07657K89748
36596B11401j98512l27427J70688L76374n1137k76072L9947J49780j89526k20805
$$ plain form
36586 -315289 -95730 198651 38128 -211458 13906 360888 247098 3615 191273 445139
36576 445139 177242 -228542 -121870 172703 34229 -203136 70892 472656 320992 -34829
36566 -34829 108888 431806 222787 -206852 -99227 316928 310997 30592 75169 236063
36556 236063 -13335 -315759 -45676 416698 339595 1899 87769 323866 77099 -294172
36546 -294172 -81841 362976 261347 -128303 -66907 234698 140193 -67105 217580 591924
36536 591924 345468 -132982 -68600 235403 77224 -211103 14388 303206 -44108 -491750
36526 -491750 -208646 297442 118208 -301418 -57176 397087 128961 -380663 -106420 519462
36516 519462 403460 -128532 -9652 496141 393420 -35132 165324 651696 456723 -12456
$$ packed form
36586c15289K19559K94381j60523k49586K25364L46982j13790k43483J87658K53866
36576D45139k67897m05784J06672K94573j38474k37365K74028M01764j51664l55821
36566c4829J43717L22918k09019m29639J07625M16155n931k80405M4577J60894
36556B36063k49398l02424K70083M62374p7103l37696Q5870K36097k46767l71271
36546b94172K12331M44817j01629l89650O1396L01605r4505k07298K84685L74344
36536E91924k46456m78450O4382L04003j58179k88327K25491K88818l47314m47642
36526d91750K83104N06088j79234m19626K44242M54263k68126n09624K74243O25882
36516E19462j16002n31992J18880N05793j02721m28552K00456M86372j94973m69179
$$ plain form
36506 -12456 277602 894643 735146 266384 744602 1761513 1845981 1041713 638248 772372
36496 772372 531164 24251 129175 565963 390976 -35264 282777 881525 610951 -93447
36486 -93447 26014 642352 528066 -14069 189526 767433 526160 -94676 166482 832793
36476 832793 560162 -162774 97980 877227 669207 -115043 35023 704471 376027 -458800
36466 -458800 -160115 792902 641939 -222308 -19205 892329 702767 -247066 -108985 810640
36456 810640 670513 -194729 77287 1081162 851399 -188635 36716 1123297 916655
36447 916655 -173586 110353 1356770 1165098 -107804 64832 1426703 1384357 93317
36438 93317 133963 1356874 1177357 -176314 3415 1479271 1429476 79466 315011
$$ packed form
36506a2456K90058O17041j59497m68762M78218J016911Q4468q04268m03465J34124
36496G72372k41208n06913J04924M36788j74987m26240L18041N98748k70574p04398
36486i3447J19461O16338j14286n42135K03595N77907k41273o20836K61158O66311
36476H32793k72631p22936K60754P79247k08020p84250J50066O69448l28444q34827
36466d58800K98685R53017j50963q64247K03103R11534j89562r49833J38081R19625
36456H10640j40127q65242K72016J003875k29763j040034K25351J086581k06642
36447I16655j090241K83939J246417j91672j272902J72636J361871m2346j291040
36438I3317M0646J222911j79517j353671J79729J475856m9795j350010K35545
$$ plain form
36429 315011 1826617 1569648 -66649 218007 2055997 1917693 118647 373830 2362781
36420 2362781 2129882 12094 305821 2762034 2761689 398720 507308 3039707 2914739
36411 2914739 256344 586124 3769960 3765924 697687 1232345 5293502 5520018 2040793
36402 2040793 3226094 9031856 9969242 6243577 9224402 18914378 21744103 18086517
36394 18086517 26123460 46922641 57244320 58049776 94688700 189965586 283035173
36387 283035173 286513205 197197478 100407038 61328794 60804306 51765399 30294212
36380 30294212 20339708 23291236 21036340 11551414 8165797 11877776 11290869 5331135
36372 5331135 3600250 6963457 6945205 2658108 1564881 4473408 4669180 1376046 682280
$$ packed form
36429C15011J511606k56969j636297K84656J837990j38304j799046K55183J988951
36420B362781k32899k117788K93727K456213l45k362969J08588K532399j24968
36411B914739k658395L29780L183836m036l068237N34658M061157K26516l479225
36402B040793J185301N805762R37386l725665K980825R689976K829725l657586
36394A8086517Q036943K0799181J0321679Q05456L6638924R5276886R3069587
36387B83035173L478032q9315727r6790440l9078244n24488r038907k1471187
36380C0294212r954504K951528k254896r484926l385617L711979n86907n959734
36372E331135j730885L363207j8252m287097j093227K908527J95772l293134o93766
$$ plain form
36363 682280 3324164 3693892 994349 295048 2348661 2559584 322421 -70647 1888767
36354 1888767 2164052 362263 354551 2399879 2567255 426140 -210296 1307375 1496284
36345 1496284 -277382 -720844 821420 1253442 -91583 -357466 986143 1131270 -420565
36336 -420565 -855834 464600 911699 -188390 -428183 744684 972483 -261033 -627703
36327 -627703 428534 693801 -355122 -579659 498388 777186 -187204 -302387 847530
36318 847530 1117397 40484 -173057 1114897 1718407 721443 2184 526814 779017
36309 779017 53666 -186923 574093 779935 -62108 -313020 617386 1110589 431274 -18283
36299 -18283 431043 522929 -223328 -478441 211467 470007 -197762 -439818 251280 544502
$$ packed form
36363F82280K641884L69728k699543o99301K053613K10923k237163l93068J959414
36354A888767K75285j801789p712K045328J67376k141115o36436J517671J88909
36345A496284j773666m43462J542264M32022j345025k65883J343609J45127j551835
36336d20565m35269J320434M47099j100089k39793J172867K27799j233516l66670
36327f27703J056237K65267j048923k24537J078047K78798r64390j15183J149917
36318H47530K69867j076913k13541J287954O03510r96964p19259N24630K52203
36309G79017p25351k40589P61016K05842q42043k50912R30406M93203o79315m49557
36299a8283M49326R1886p46257k55113O89908K58540o67769k42056O91098K93222
$$ plain form
36289 544502 -96207 -401993 149108 342630 -286174 -502013 175033 534357 87328 -23240
36279 -23240 621396 907514 583752 951642 2226357 2716818 1700311 701072 792405 972178
36269 972178 397979 -39084 352616 665954 211878 -185766 97184 304879 -66211 -240792
36259 -240792 190477 358427 -161322 -453771 -43467 175155 -279459 -511857 -18493 305820
36249 305820 -104799 -438851 -145085 37524 -355735 -550594 -99768 171269 -254148 -593817
36239 -593817 -295344 -46942 -344006 -532111 -182933 37272 -250668 -345570 96028 300953
36229 300953 -91044 -231093 323272 687059 270592 -134481 143489 473804 224209 -98822
36219 -98822 14589 89197 -240081 -392554 -17416 217769 -110545 -354932 -76480 98953
$$ packed form
36289E44502o40709l05786N51101J93522o28804k15839O77046L59324m47029j10568
36279b3240O44636K86118l23762L67890J274715M90461j016507r99239R1333J79773
36269I72178n74199m37063L91700L13338m54076l97644K82950K07695l71090j74581
36259b40792M31269J67950n19749k92449M10304K18622m54614k32398M93364L24313
36249C05820m10619l34052K93766J82609l93259j94859M50826K71037m25417l39669
36239e93817K98473K48402k97064j88105L49178K20205k87940r4902M41598K04925
36229C00953l91997j40049N54365L63787m16467m05073K77970L30315k49595l23031
36219i8822J13411P4608l29278j52473L75138K35185l28314k44387K78452J75433
$$ plain form
36209 98953 -248852 -478483 -173075 -6000 -412893 -665401 -225337 206582 -19440 -348579
36199 -348579 -159028 86205 -156168 -433937 -247195 -54024 -330442 -592695 -328872 17326
36189 17326 -76728 -253353 -79622 84935 -111748 -238224 54952 280111 40407 -181584
36179 -181584 33180 219764 -37006 -265416 -32970 195953 -28297 -258105 -30120 232049
36169 232049 50564 -204717 -89838 55450 -141744 -287243 -7960 248061 36075 -227952
36159 -227952 -64704 164829 -12623 -272179 -141275 114862 61233 -96846 -30300 22439
36149 22439 -196338 -357103 -171832 10791 -110131 -175750 119996 392486 278096 91181
36139 91181 149488 159721 -102700 -238283 19114 229075 54737 -111023 46463 119817
$$ packed form
36209I8953l47805k29631L05408J67075m06893k52508M40064M31919k26022l29139
36199c48579J89551K45233k42373k77769J86742J93171k76418k62253K63823L46198
36189A7326r4054j76625J73731J64557j96683j26476K93176K25159k39704k21991
36179a81584K14764J86584k56770k28410K32446K28923k24250k29808K27985K62169
36169B32049j81485k55281J14879J45288j97194j45499K79283K56021k11986k64027
36159b27952J63248K29533j77452k59556J30904K56137n3629j58079O6546N2739
36149B2439k18777j60765J85271J82623j20922o5619K95746K72490j14390j86915
36139I1181N8307J0233k62421j35583K57397K09961j74338j65760J57486P3354
$$ plain form
36129 119817 -203867 -482026 -348674 -207887 -405804 -522732 -214396 52103 -142023 -370180
36119 -370180 -196596 -15213 -248167 -487035 -276459 -6636 -159242 -379042 -181334 94644
36109 94644 -61986 -361850 -290930 -67483 -142510 -300243 -123793 160283 137172 4571
36099 4571 122941 265918 92856 -132867 -50888 81708 -81783 -264547 -113442 85301
36089 85301 -24126 -138583 110788 397767 298937 90741 172806 267260 3731 -261807
36079 -261807 -64585 260053 151906 -179435 -202159 -41637 -138865 -354903 -284628 -81333
36069 -81333 -127888 -249682 -71644 197278 136747 -79702 -35552 126086 29462 -156148
36059 -156148 -49076 169444 89312 -137888 -105172 64486 -5082 -180478 -82377 162709
$$ packed form
36129A19817l23684k78159J33352J40787j97917j16928L08336K66499j94126k28157
36119c70180J73584J81383k32954k38868K10576K69823j52606k19800J97708K75978
36109I4644j56630k99864P0920K23447p5027j57733J76450K84076k3111j32601
36099D571J18370J42977j73062k25723Q1979J32596j63491j82764J51105J98743
36089H5301j09427j14457K49371K86979r8830k08196Q2065R4454k63529k65538
36079b61807J97222L24638j08147l31341k2724J60522r7228k16038P0275K03295
36069h1333m6555j21794J78038K68922o0531k16449M4150J61638r6624j85610
36059a56148J07072K18520q0132k27200L2716J69658o9568j75396R8101K45086
$$ plain form
36049 162709 157420 -39218 -101081 -80069 -208565 -347300 -265115 -159659 -283385 -397046
36039 -397046 -212235 6416 -82431 -231009 -78071 138106 43215 -127860 12217 222470
36029 222470 83668 -168848 -65426 206635 147444 -142856 -204782 -76804 -114765 -233490
36019 -233490 -115765 86172 28694 -111407 33457 260825 148335 -111360 -31634 260817
36009 260817 253701 -31572 -151128 -72237 -104656 -185831 -24231 210699 120541 -151184 -136377
35998 -136377 122835 201805 92073 118800 221900 89209 -133707 -41195 240803 224334
35988 224334 -77821 -209108 -98070 -84841 -197020 -141771 31790 -14407 -229640 -243743
35978 -243743 -72800 -76490 -256206 -270967 -115748 -117748 -282263 -289190 -123463 -92127 -237928
$$ packed form
36049A62709n289j96638o1863K1012j28496j38735Q2185J05456j23726j13661
36039c97046J84811K18651q8847j48578J52938K16177r4891j71075J40077K10253
36029B22470j38802k52516J03422K72061n9191k90300o1926J27978l7961j18725
36019b33490J17725K01937n7478j40101J44864K27368j12490k59695P9726K92451
36009B60817p116k85273j19556P8891l2419q1175J61600K34930r0158k71725J4807
35998a36377K59212P8970j09732K6727J03100j32691k22916R2512K81998j6469
35988B24334l02155j31287J11038J3229j12179N5249J73561m6197k15233j4103
35978b43743J70943l690j79716j4761J55219k000j64515o927J65727L1336j45801
$$ plain form
35967 -237928 -318988 -315332 -383768 -405168 -168565 105273 33579 -251414 -311521 -157895 -155543
35956 -155543 -300941 -265291 -60311 5374 -52038 31836 169510 62819 -157966 -117108
35946 -117108 85577 39511 -185222 -149212 113336 122105 -185213 -361977 -255927 -180698
35936 -180698 -233900 -152572 70054 100527 -104696 -213917 -140242 -136427 -222148 -141354 58562
35925 58562 37699 -184670 -216592 2821 112104 8209 -16171 99618 60833 -161200
35915 -161200 -211790 -2594 119220 7997 -48448 99142 206618 133076 80226 155347
35905 155347 168099 33419 -56832 -10692 17148 -33831 -24284 74508 129590 136572 201851 257804
35893 257804 170779 62124 114933 174096 -3155 -235743 -180186 29154 -18727 -274880
$$ packed form
35967b37928q1060L656o8436k1400K36603K73838p1694k84993o0107J53626K352
35956a55543j45398L5650K04980O5685n7412Q3874J37674j06691k20785M0858
35946a17108K02685m6066k24733L6010K62548Q769l07318j76764J06050P5229
35936a80698n3202Q1328K22626L0473k05223j09221P3675L815q5721Q0794J99916
35925E8562k0863k22369l1922K19413J09283j03895k4380J15789l8785k22033
35915a61200n0590K09196J21814j11223n6445J47590J07476p3542n2850P5121
35905A55347J2752j34680r0251M6140K7840n0979R547R8792N5082O982O5279N5953
35893B57804q7025j08655N2809N9163j77251k32588N5557K09340m7881k56153
$$ plain form
35883 -274880 -316905 -106887 -16891 -118504 -99530 90981 157466 61906 85269 231014 190956
35872 190956 -29019 -73785 94565 122238 -52959 -77241 139301 243410 91383 -16168
35862 -16168 82005 156692 84750 52558 110258 54923 -101336 -78104 128158 182009 16356
35851 16356 -48907 72986 65771 -174960 -314833 -163475 33516 72516 68028 83008 -25906
35840 -25906 -229683 -270521 -131167 -92842 -211085 -224425 -84988 -57063 -178369 -166690 14836
35829 14836 57821 -91298 -103517 105804 203511 69447 13807 159288 193664 -19988 -156808
35818 -156808 -23223 103784 11128 -88943 -14760 55205 -12395 -37894 65676 72580 -113698
35807 -113698 -243411 -184535 -154496 -260335 -272254 -92107 21235 -62481 -104056 14405
$$ packed form
35883b74880m2025K10018Q9996j01613J8974J90511O6485r5560K3363J45745m0058
35872A90956k19975m4766J68350K7673j75197k4282K16542J04109j52027j07551
35862a6168R8173P4687p1942l2192N7700n5335j56259K3232K06262N3851j65653
35851A6356o5263J21893p215k40731j39873J51358J96991L9000m488J4980j08914
35840b5906k03777m0838J39354L8325j18243j3340J39437K7925j21306J1679J81526
35829A4836M2985j49119j2219K09321R7707j34064n5640J45481L4376k13652j36820
35818a56808J33585J27007r2656j00071P4183O9965o7600k5499J03570O904j86278
35807a13698j29713N8876L0039j05839j1919J80147J13342q3716m1575J18461
$$ plain form
35797 14405 37214 -161811 -299588 -190809 -76295 -156429 -245417 -185718 -166225 -318598 -415688
35786 -415688 -284351 -127690 -141535 -188974 -129684 -88971 -136525 -91038 94193 151840 -30101
35775 -30101 -163584 -52012 78135 6944 -122014 -144367 -166718 -244471 -184840 45783 136934
35764 136934 -51214 -208669 -109413 8861 -79768 -174755 -72068 19893 -115089 -263149
35754 -263149 -161287 19945 -15324 -191380 -259542 -225662 -217483 -178011 -30153 88963 57546
35743 57546 -8672 -18477 -102655 -297247 -356004 -158625 30592 8667 -13351 168891 337041
35732 337041 232487 30473 25638 123071 57411 -114808 -151260 -64212 -41992 -83431 -55447
35721 -55447 18285 28230 6805 25376 11709 -95232 -174422 -124865 -57171 -81503 -107514 -51188
$$ packed form
35797A4405K2809j99025j37777J08779J14514q0134q8988N9699J9493j52373r7090
35786d15688J31337J56661j3845m7439N9290M0713m7554M5487J85231N7647j81941
35775c0101j33483J11572J30147p1191j28958k2353k2351p7753N9631K30623R1151
35764A36934j88148j57455R9256J18274q8629r4987J02687R1961j34982j48060
35754b63149J01862J81232l5269j76056o8162L3880Q179L9472J47858J19116l1417
35743E7546o6218r805q4178j94592n8757J97379J89217k1925k2018J82242J68150
35732C37041j04554k02014m835R7433o5660j72219l6452Q7048K2220m1439K7984
35721e5447P3732R945k1425J8571j3667j06941p9190M9557O7694k4332k6011N6326
$$ plain form
35709 -51188 -17546 -80369 -114787 -40307 21547 15690 94231 292073 373611 229436 106291
35698 106291 189845 280741 165354 -6655 -18865 36745 -3010 -44262 30005 70464 -55109
35687 -55109 -143220 27407 282125 306815 127519 -2135 -21719 -49381 -94345 -84789 -61699
35676 -61699 -92450 -114461 -68324 -31625 -46041 -11229 80217 48388 -143950 -240605 -89880
35665 -89880 87664 68119 -26563 -9609 29180 -48311 -132882 -102808 -94614 -231361 -333731
35654 -333731 -223244 -74136 -130588 -291443 -310285 -210539 -171362 -181046 -127763 -75951 -145663
35643 -145663 -256909 -265525 -210268 -189293 -164062 -108958 -147238 -303394 -351323 -164541 22123
35632 22123 -25245 -160199 -136388 -28864 -49402 -150919 -150843 -74567 -59047 -72138 -21876 13005
$$ packed form
35709e1188L3642o2823l4418P4480O1854n857P8541J97842Q1538j44175j23145
35698A06291Q3554R0896j15387j72009j2210N5610l9755m1252P4267M0459j25573
35687e5109q8111J70627K54718K4690j79296j29654j9584k7662m4964R556K3090
35676f1699l0751k2011M6137L6699j4416L4812R1446l1829j92338r6655J50725
35665h9880J77544j9545r4682J6954L8789p7491q4571L0074Q194j36747j02370
35654c33731J10487J49108n6452j60855j8842R9746L9177r684N3283N1812o9712
35643a45663j11246q616N5257K0975K5231N5104l8280j56156m7929J86782J86664
35632B2123m7368j34954K3811J07524k0538j01517P6P6276J5520j3091N0262L4881
$$ plain form
35620 13005 -60324 -126378 -60514 27139 8442 3694 155356 327066 314001 176409 88508
35609 88508 34965 -68972 -137415 -72648 4306 -54619 -165676 -182579 -142803 -123214 -59509
35598 -59509 66544 91985 -44557 -135942 -58749 -14771 -164136 -316603 -277726 -197123 -254252
35587 -254252 -306210 -197439 -113394 -238829 -350368 -166534 146206 237902 122838 53314
35577 53314 61443 35464 42945 164998 210289 7582 -215029 -156182 57015 113668 52820
35566 52820 104741 201468 121728 -45546 -57974 13859 -52949 -163525 -83240 64925 -4206
35555 -4206 -173899 -98949 145592 149161 -132250 -309181 -215152 -108059 -152517 -183384 -84451
35544 -84451 15268 22565 5579 -15639 -81025 -94973 46952 180677 96328 -25024 169027
$$ packed form
35620A3005p3329o6054O5864Q7653j8697m748J51662J71710j3065j37592q7901
35609H8508n3543j03937o8443O4767P6954n8925j11057j6903L9776J9589O3705
35598e9509J26053K5441j36542r1385P7193M3978j49365j52467L8877Q0603n7129
35587b54252n1958J08771Q4045j25435j11539J83834L12740R1696j15064o9524
35577E3314Q129k5979P481J22053M5291k02707k22611N8847K13197N6653o0848
35566E2820N1921R6727p9740j67274j2428P1833o6808j10576Q0285J48165o9131
35555d206j69693P4950K44541L569k81411j76931R4029J07093m4458l0867R8933
35544h4451R9719P297j6986k1218o5386j3948J41925J33725q4349j21352J94051
$$ plain form
35533 169027 579556 728123 477079 202960 175061 224741 161803 87033 109460 115242 9705
35522 9705 -97664 -104607 -66350 -31133 30329 60921 -57016 -248456 -285738 -145079 -52098
35511 -52098 -104445 -127398 1724 145352 138397 19274 -76916 -92801 -47758 3738 -7048
35500 -7048 -64812 -37100 121567 231099 137243 -23240 -44173 -1711 -93445 -245681 -221205
35489 -221205 -42830 43862 -12633 -42196 -14897 -69644 -182583 -166694 -28333 18621 -71944
35478 -71944 -122220 -81157 -90521 -158599 -120293 8860 -6798 -205707 -310766 -161952 42966
35467 42966 92963 66515 115395 186474 148469 20250 -89941 -139690 -126923 -33119 107223
35456 107223 183910 135699 21845 -62402 -68487 -1592 70522 48268 -74043 -173847 -176309
$$ packed form
35533A69027M10529J48567k51044k74119k7899M9680o2938p4770K2427N782j05537
35522I705j07369o943L8257L5217O1462L0592j17937j91440l7282J40659R2981
35511e2098n2347k2953J29122J43628o955j19123r6190j5885M5043N1496j0786
35500g048n7764K7712J58667J09532r3856j60483k0933M2462r1734j52236K4476
35489b21205J78375Q6692n6495k9563K7299n4747j12939J5889J38361M6954r0565
35478g1944n0276M1063r364o8078L8306J29153j5658j98909j05059J48814K04918
35467D2966M9997k6448M8880P1079l8005j28219j10191m9749J2767R3804J40342
35456A07223P6687m8211j13854q4247o085O6895P2114k2254j22311r9804k462
$$ plain form
35445 -176309 -159793 -183794 -163321 -60453 -24236 -143281 -238359 -139848 2001 -40379 -179171
35434 -179171 -168820 -21144 63138 65933 117598 180476 109608 -31236 -42157 75262 158101
35423 158101 187615 242880 238116 45334 -198641 -253668 -168680 -164324 -218380 -150456 -27767
35412 -27767 -64734 -185982 -135799 20470 -23800 -245166 -289449 -80581 59925 -16247 -73321
35401 -73321 26979 91197 240 -69495 -4333 47705 1123 -6015 67812 44355 -118179
35390 -118179 -198954 -109453 -63139 -172308 -224418 -67805 103127 75708 -50083 -82576 -43034
35379 -43034 -36679 -34705 21009 77884 90119 104391 121652 62283 -51840 -93539 -73451 -147866
35367 -147866 -317655 -378096 -247474 -86844 -16315 22978 53026 -14786 -158491 -227790 -215225
$$ packed form
35445a76309J6516k4001K0473J02868L6217j19045r5078R8511J41849m2380j38792
35434a79171J0351J47676Q4282K795N1665O2878p0868j40844j0921J17419Q2839
35423A58101K9514N5265m764j92782k43975n5027Q4988M356n4056O7924J22689
35412b7767l6967j21248N0183J56269m4270k21366m4283K08868J40506p6172n7074
35401g3321J00300O4218r0957o9735O5162N2038m6582p138P3827k3457j62534
35390a18179q0775Q9501M6314j09169n2110J56613J70932k7419j25791l2493L9542
35379d3034O355J974N5714N6875J2235J4272J7261n9369j14123m1699K0088p4415
35367a47866j69789o0441J30622J60630P0529L9293L0048o7812j43705o9299J2565
$$ plain form
35356 -215225 -257757 -320448 -212370 16356 64821 -122866 -231778 -92245 58144 13516
35346 13516 -69543 -9001 70955 2262 -118464 -137620 -116692 -166196 -230117 -236306 -239906 -243426
35334 -243426 -120015 109929 192294 22051 -154651 -124456 -19879 -25716 -49995 47907 148599
35323 148599 81438 -58707 -86411 -50014 -110899 -239713 -286665 -237225 -171302 -81128 56901
35312 56901 134711 42280 -137220 -234119 -216600 -170543 -145766 -143705 -164893 -172854 -114942 -43732
35300 -43732 -80866 -208272 -266963 -215895 -187199 -219240 -169275 13320 165712 176588 137085
35289 137085 111601 8259 -184617 -284066 -194377 -72009 -56847 -74747 -57236 -99204 -220996
35278 -220996 -233307 -44431 139150 131937 57154 96269 180132 167523 118617 140626 152412
$$ packed form
35356b15225m2532o2691J08078K28726M8465j87687j08912J39533J50389m4628
35346A3516q3059O0542P9956o8693j20726j9156K0928m9504o3921o189l600l520
35334b43426J23411K29944Q2365j70243j76702L0195J04577n837k4279R7902J00692
35323A48599o7161j40145k7704L6397o0885j28814m6952M9440O5923R0174J38029
35312E6901P7810r2431j79500r6899J7519M6057K4777K061k1188p961N7912P1210
35300d3732l7134j27406n8691N1068K8696l2041M9965J82595J52392J0876l9503
35289A37085k5484j03342j92876r9449Q9689J22368J5162j7900J7511m1968j21792
35278b20996j2311J88876J83581p213p4783L9115Q3863j2609m8906K2009J1786
$$ plain form
35267 152412 53786 -45700 -15815 40115 -31546 -148036 -135538 -28074 20279 1931 3036
35256 3036 -4170 -91532 -196477 -223107 -227411 -306769 -401149 -391489 -300348 -218638 -135818 -18852
35244 -18852 44083 -40302 -195777 -275097 -248349 -165903 -46572 70584 93318 25857 12756
35233 12756 108970 170604 110004 67040 154291 228537 130317 -21449 -13302 120172 178265
35222 178265 115454 51671 40040 34870 31561 56426 72835 48567 44235 97956 115844 18946
35210 18946 -101784 -122940 -78791 -67210 -68542 -11124 73584 108254 103320 106080 95364 38076
35198 38076 -28601 -60360 -66465 -52069 -10787 -2808 -86002 -154244 -54095 116201 97159 -86482
35186 -86482 -100780 151322 315419 129978 -152255 -173545 -16139 -7521 -199343 -378982
$$ packed form
35267A52412r8626r9486K9885N5930p1661j16490J2498J07464M8353j8348J105
35256C036p206q7362j04945k6630m304p9358r4380R660R1141Q1710Q2820J16966
35244a8852O2935q4385j55475p9320K6748Q2446J19331J17156K2734o7461j3101
35233A2756R6214O1634o0600m2964Q7251P4246r8220j51766Q147J33474N8093
35222A78265o2811o3783j1631n170l309K4865J6409k4268m332N3721J7888r6898
35210A8946j20730k1156M4149J1581j332N7418Q4708L4670m934K760j0716n7288
35198C8076o6677l1759o105J4396M1282P979q3194o8242J00149J70296j9042j83641
35186h6482j4298K52102J64097j85441k82233k1290J57406Q618j91822j79639
$$ plain form
35176 -378982 -442704 -438539 -357832 -178026 -20828 -13681 -83143 -98787 -97819 -153619 -172701 -61106
35164 -61106 55236 26600 -47689 -1401 83339 18849 -148161 -216157 -152853 -81943 -42130
35153 -42130 -8212 -48689 -207622 -330073 -260936 -119588 -122752 -237299 -271589 -208410 -170427
35142 -170427 -147565 -45260 71022 63571 -8416 15751 93439 48998 -98493 -155418 -71951
35131 -71951 19274 54689 84062 96000 37607 -27797 -10090 13544 -75408 -186196 -144807
35120 -144807 -3863 37112 -37832 -80387 -71534 -113181 -170516 -113191 12519 36457 -34422
35109 -34422 -50658 -25365 -101101 -229506 -208062 -50178 8199 -86787 -120345 208 82493
35098 82493 -13947 -160405 -207347 -202704 -228410 -236634 -185140 -150965 -181391 -188285 -102827 -640
$$ packed form
35176c78982o3722M165Q0707J79806J57198P147o9462j5644R68n5800j9082J11595
35164f1106J16342k8636p4289M6288Q4740o4490j67010o7996O3304P0910L9813
35153d2130L3918m0477j58933j22451O9137J41348l164j14547l4290O3179L7983
35142a70427K2862J02305J16282p451p1987K4167P7688m4441j47491n6925Q3467
35131g1951R1225L5415K9373J1938n8393o5404J7707K3634q8952j10788M1389
35120a44807J40944M0975p4944m2555Q853m1647n7335N7325J25710K3938p0879
35109c4422j6236K5293p5736j28405K1444J57884N8377r4986l3558J20553Q2285
35098H2493r6440j46458m6942M643k5706q224N1494L4175l0426o894Q5458J02187
$$ plain form
35086 -640 19960 -31720 -94163 -128113 -97111 12123 128722 167589 150587 138025 88853 -46426
35074 -46426 -152953 -85953 60968 65618 -59583 -81550 59774 156385 90386 2603 1362
35063 1362 -23993 -152095 -234407 -133401 33401 73311 -4030 -62151 -68004 -78537 -93071
35052 -93071 -76825 -61217 -83162 -84752 58 109592 126765 54082 6853 49170 131599 186412
35040 186412 200189 180131 118164 22198 -59344 -91205 -115699 -203226 -314918 -287030 -38204
35029 -38204 253372 312105 106543 -115946 -167220 -123402 -116432 -103315 9273 152130 185152
35018 185152 111017 29694 -42811 -141698 -207918 -155591 -43105 -6486 -49631 -59422 -5893
35007 -5893 27909 1774 -39948 -72658 -108390 -124248 -95807 -79696 -143888 -241980 -272261 -231065
$$ packed form
35086f40K0600n1680o2443l3950L1002J09234J16599L8867j7002j2562m9172j35279
35074d6426j06527O7000J46921M650j25201k1967J41324R6611o5999q7783j241
35063A362k5355j28102q2312J01006J66802L9910p7341n8121n853j0533j4534
35052i3071J6246J5608k1945j590Q4810J09534J7173p2683m7229M2317Q2429N4813
35040A86412J3777k0058o1967r5966q1542l1861k4494q7527j11692K7888K48826
35029c8204K91576N8733k05562k22489n1274M3818O970J3117J12588J42857L3022
35018A85152p4135q1323p2505r8887o6220N2327J12486L6619m3145r791N3529
35007e893L3802k6135m1722l2710l5732j5858K8441J6111o4192r8092l0281M1196
$$ plain form
34995 -231065 -196981 -201921 -224457 -257763 -275198 -200191 -36788 48839 -73238 -283525 -354698
34984 -354698 -251046 -131915 -107896 -149603 -196171 -205583 -134988 -759 93871 104435 128532
34973 128532 219218 245234 108043 -40976 -20901 63791 -11792 -205925 -277553 -191754 -157827
34962 -157827 -262678 -355087 -333855 -285224 -268978 -208691 -80027 613 -29109 -66461 -19032
34951 -19032 49244 29742 -79315 -191407 -224692 -159218 -69041 -69238 -153958 -160630 -6927 138598
34939 138598 85444 -78096 -120361 -30076 -10958 -145975 -299529 -353018 -326277 -256161 -146213
34928 -146213 -44164 787 42542 133649 164234 2369 -250307 -358595 -275585 -153529
34918 -153529 -82010 -46743 -94193 -268302 -413249 -322873 -81677 25535 -54785 -101068 -20641
$$ packed form
34995b31065L4084m940k2536l3306j7435P5007J63403Q5627j22077k10287p1173
34984c54698J03652J19131K4019m1707m6568r412P0595J34229R4630J0564K4097
34973A28532R0686K6016j37191j49019K0075Q4692p5583j94133p1628Q5799L3927
34962a57827j04851r2409K1232M8631J6246O0287J28664Q0640k9722l7352M7429
34951a9032O8276j9502j09057j12092l3285O5474R0177j97q4720o672J53703J45525
34939A38598n3154j63540m2265R0285J9118j35017j53554n3489K6741P0116J09948
34928a46213J02049M4951M1755R1107L0585j61865k52676j08288Q3010J22056
34918a53529P1519L5267m7450j74109j44947R0376K41196J07212q0320m6283Q0427
$$ plain form
34907 -20641 21717 -61293 -127663 -85326 -40991 -63479 -59494 7160 22100 -46653 -65251 10227
34895 10227 37700 -41903 -88628 -38914 -42219 -170738 -235383 -76451 163323 243324 138494
34884 138494 -18191 -152941 -250236 -271841 -226924 -206570 -230875 -191203 -51236 42951 -26015
34873 -26015 -168251 -240312 -237391 -210428 -136267 -10921 54902 -17893 -133810 -159017 -111484
34862 -111484 -90726 -100698 -70953 120 35751 -7760 -85201 -98487 25735 243841 388060
34851 388060 332001 151093 23086 -3200 -18155 -66896 -110608 -149654 -213532 -242598 -162787
34840 -162787 -62279 -88380 -180368 -141509 15200 58756 -76488 -173183 -84450 55994 92343
34829 92343 72747 85524 93482 70523 93510 157626 107088 -99507 -255618 -202149 -68947
$$ packed form
34907b0641M2358q3010o6370M2337M4335k2488L985O6654J4940o8753j8598P5478
34895A0227K7473p9603m6725M9714l305j28519o4645J58932K39774Q0001j04830
34884A38494j56685j34750r7295k1605M4917K0354k4305L9672J39967R4187o8966
34873b6015j42236p2061K921K6963P4161J25346O5823p2795j15917k5207M7533
34862a11484K0758r972K9745P1073L5631m3511p7441j3286J24222K18106J44219
34851C88060n6059j80908j28007k6286j4955m8741m3712l9046o3878k9066P9811
34840a62787J00508k6101r1988L8859J56709M3556j35244r6695Q8733J40444L6349
34829I2343j9596J2777P958k2959K2987O4116n0538k06595j56111N3469J33202
$$ plain form
34818 -68947 -49535 -110908 -112142 -55417 -25746 -8938 44405 79579 32061 -35322 -44019 -51663
34806 -51663 -140669 -247520 -257810 -195636 -171346 -201807 -217710 -202316 -203675 -240100 -282077 -298861
34794 -298861 -269751 -197384 -142574 -172851 -247550 -242853 -120705 20546 85308 70804 10654
34783 10654 -57170 -66716 5175 57878 -2054 -85515 -54806 16000 -51530 -203838 -208833 -54115
34771 -54115 17164 -82932 -165147 -136766 -154733 -268818 -258205 -24470 168007 87043 -102836
34760 -102836 -127713 -19443 20825 -30828 -74195 -106951 -144415 -85774 97341 204672 82580
34749 82580 -107501 -140675 -82038 -127052 -247250 -277196 -221108 -187642 -136218 22753 176390
34738 176390 151423 24588 -780 44473 -39099 -242235 -346374 -289095 -230857 -239447 -194723
$$ packed form
34818f8947J9412o1373j234N6725K9671J6808N3343L5174m7518o7383q697p644
34806e1663q9006j06851j0290O2174K4290l0461j5903J5394j359l6425m1977j6784
34794b98861K9110P2367N4810l0277p4699M697J22148J41251O4762j4504o0150
34783A0654o7824r546P1891N2703n9932q3461L0709P0806o7530j52308m995J54718
34771e4115P1279j00096q2215K8381j7967j14085J0613K33735J92477q0964j89879
34760a02836k4877J08270M0268n1653m3367l2756l7464N8641J83115J07331j22092
34749H2580j90081l3174N8637m5014j20198k9946N6088L3466N1424J58971J53637
34738A76390k4967j26835k5368M5253q3572k03136j04139N7279N8238q590M4724
$$ plain form
34727 -194723 -58314 25546 -18002 -61279 11658 130044 165432 105200 26820 -4849 22602
34716 22602 53079 -11291 -180931 -305538 -237830 -42065 72999 3198 -170904 -311666
34706 -311666 -328408 -207471 -48032 -8466 -110702 -179180 -90997 22699 -19261 -152667
34696 -152667 -172249 -48078 74868 135208 192926 242902 212026 132767 110204 117731 33046
34685 33046 -116319 -157922 -53225 36132 6957 -59139 -88652 -141295 -253903 -330500 -296110
34674 -296110 -223520 -199284 -178752 -86076 31197 62745 348 -53528 -21680 66436 121042
34663 121042 88190 6235 -33324 768 29841 -28361 -134977 -178103 -123570 -40960 7759
34652 7759 22602 11969 -27400 -62630 -36949 42030 88600 43829 -52413 -119831 -130660 -119764
$$ packed form
34727a94723J36409Q3860m3548m3277P2937J18386L5388o0232p8380l1669K7451
34716B2602L0477o4370j69640j24607O7708J95765J15064o9801j74102j40762
34706c11666j6742J20937J59439L9566j02236o8478Q8183J13696m1960j33406
34696a52667j9582J24171J22946O0340N7718M9976l0876p9259k2563P527q4685
34685C3046j49365m1603J04697Q9357k9175o6096k9513n2643j12608p6597L4390
34674b96110P2590K4236K0532R2676J17273L1548o2397n3876L1848Q8116N4606
34663A21042l2852q1955l9559L4092K9073n8202j06616m3126N4533Q2610M8719
34652G759J4843j0633l9369l5230K5681P8979M6570m4771r6242o7418j0829J0896
$$ plain form
34640 -119764 -126696 -149352 -149659 -101793 -34892 -13407 -66692 -153404 -202782 -176707 -93460 -11239
34628 -11239 20301 17103 50056 146809 241397 268617 254413 239553 182007 49943 -51912
34617 -51912 -6871 100319 80468 -56694 -101615 23107 143477 115099 17696 -28246 -46237
34606 -46237 -86848 -103993 -79431 -105176 -202594 -223066 -86165 40702 -17655 -163514 -188165
34595 -188165 -103266 -91764 -199314 -292994 -298103 -276359 -266593 -221811 -132167 -72461 -85838 -114370
34583 -114370 -82811 1608 52976 -6305 -150288 -249068 -215060 -129457 -126416 -171427 -106579
34572 -106579 71227 165346 74652 -57572 -89628 -90123 -166976 -255725 -238380 -140566 -56267
34561 -56267 5952 59348 44872 -51420 -106127 -33920 60960 57945 21934 68889 147096 128803
$$ packed form
34640a19764o932k2656l07M7866O6901K1485n3285q6712m9378K6075Q3247Q2221
34628a1239L1540l198L2953R6753R4588K7220j4204j4860n7546j32064j01855
34617e1912M5041J07190j9851j37162m4921J24722J20370k8378r7403m5942j7991
34606d6237m0611j7145K4562k5745r7418k0472J36901J26867n8357j45859k4651
34595a88165Q4899J1502j07550r3680n109K1744R766M4782Q9644N9706j3377k8532
34583a14370L1559Q4419N1368n9281j43983r8780L4008Q5603L041m5011O4848
34572a06579J77806R4119r0694j32224l2056m95p6853q8749J7345R7814Q4299
34561e6267O2219N3396j4476r6292n4707P2207R4880l015l6011M6955P8207j8293
$$ plain form
34549 128803 22464 -74504 -140864 -189434 -163928 -48428 21560 -63777 -195263 -209767 -152582
34538 -152582 -177388 -266790 -266183 -148406 -42673 -22799 -43659 -74228 -138275 -228194 -298817
34527 -298817 -330290 -311644 -217291 -82579 -19561 -68625 -131994 -137602 -140668 -170914 -140327 -23226
34515 -23226 45836 -4992 -48797 -3128 190 -117458 -168775 -7122 160584 66006 -182773
34504 -182773 -275401 -179403 -114504 -145436 -140165 -78758 -78415 -134506 -128894 -71405 -60140 -44505
34492 -44505 89083 241902 212575 46049 -32181 2690 -16666 -82308 -8779 177938 211217
34481 211217 21213 -131863 -67885 73080 118830 106912 99350 17811 -169514 -307122 -262493
34470 -262493 -117691 -23233 -7491 -36367 -113964 -216631 -255251 -202231 -153909 -192589 -273825
$$ packed form
34549A28803j06339r6968o6360m8570K5506J15500O9988q5337j31486j4504N7185
34538a52582k4806q9402O07J17777J05733J9874k0860l0569o4047q9919p0623
34527b98817l1473J8646R4353J34712O3018m9064o3369n608l066l0246L0587J17101
34515b3226O9062n0828m3805M5669L318j17648n1317J61653J67706r4578k48779
34504a82773r2628R5998O4899l0932N271O1407L43n6091N612N7489J1265J5635
34492d4505J33588J52819k9327j66526p8230L4871j9356o5642P3529J86717L3279
34481B11217j90004j53076O3978J40965M5750j1918p562q1539j87325j37608M4629
34470b62493J44802R4458J5742k8876p7597j02667l8620N3020M8322l8680q1236
$$ plain form
34459 -273825 -297611 -215591 -56382 79305 76442 -49277 -122989 -39071 73854 61866 -1693
34448 -1693 25621 69459 -25760 -172144 -155335 -20531 -12756 -146232 -173839 -14826 123496
34437 123496 114255 76204 83524 27784 -114738 -178536 -109365 -89026 -208377 -282048 -162452
34426 -162452 4868 32393 -13013 30995 134507 148379 48570 -61320 -106125 -75837 8701
34415 8701 79341 62583 -4324 -11785 29400 -21595 -205388 -380322 -429851 -396326 -348396 -275193
34403 -275193 -182079 -141935 -180447 -236473 -274285 -301389 -267978 -118422 48900 66227 -43712
34392 -43712 -98423 -59341 -68855 -153106 -151385 -16142 73296 333 -119454 -165971 -186841 -229454
34380 -229454 -219405 -127709 -56347 -44030 10567 123805 140867 -676 -129366 -97868 7834
$$ packed form
34459b73825k3786Q2020J59209J35687k863j25719p3712Q3918J12925j1988o3559
34448a693K7314M3838r5219j46384J6809J34804P775j33476k7607J59013J38322
34437A23496r241l8051P320n5740j42522o3798O9171K0339j19351p3671J19596
34426a62452J67320K7525m5406M4008J03512J3872r9809j09890m4805L0288Q4538
34415H701P0640j6758o6907p461M1185n0995j83793j74934m9529L3525M7930P3203
34403b75193R3114M0144l8512n6026l7812k7104L3411J49556J67322J7327j09939
34392d3712n4711L9082r514q4251J721J35243Q9438p2963j19787m6517k0870m2613
34380b29454J0049R1696P1362J2317N4597J13238J7062j41543j28690L1498J05702
$$ plain form
34369 7834 45789 18681 -26027 -109553 -210682 -221251 -129965 -73618 -104022 -97830 1239 62066
34357 62066 533 -79852 -97428 -122301 -180543 -164735 -68543 -62298 -190348 -252227 -148684
34346 -148684 -71888 -152125 -192241 -2603 245731 279047 127931 2522 -53683 -104831 -83753
34335 -83753 91902 286116 305147 197699 148138 167091 127637 18227 -71897 -136496 -208422
34324 -208422 -222850 -130210 -47434 -94011 -184701 -187460 -160772 -210883 -246951 -135592 13182
34313 13182 -11457 -174881 -260203 -209263 -140909 -96978 -38096 -31482 -160070 -287515 -207228
34302 -207228 -4081 37455 -105459 -141226 67525 285815 274308 119335 44090 85933
34292 85933 120918 75796 -23623 -128417 -191395 -184497 -152146 -174419 -239567 -242483 -147901 -57609
$$ packed form
34369G834L7955k7108m4708q3526j01129j0569R1286N6347l0404O192R9069O0827
34357F2066o1533q0385j7576k4873n8242J5808R6192O245j28050o1879J03543
34346a48684P6796q0237m0116J89638K48334L3316j51116j25409n6205n1148K1078
34335h3753J75655J94214J9031j07448m9561J8953l9454j09410r0124o4599p1926
34324b08422j4428R2640Q2776m6577r0690k759K6688n0111l6068J11359J48774
34313A3182k4639j63424q5322N0940O8354M3931N8882O614j28588j27445Q0287
34302b07228K03147M1536j42914l5767K08751K18290j1507j54973p5245M1843
34292H5933L4985m5122r9419j04794o2978O898L2351k2273o5148k916R4582R0292
$$ plain form
34280 -57609 -64314 -128149 -160898 -159253 -178610 -214333 -185320 -46322 120789 164213 26227
34269 26227 -174820 -269345 -226997 -158476 -139179 -126420 -68073 8507 53023 47485 -22310 -149046
34257 -149046 -237682 -186364 -65485 -64272 -208073 -300599 -225081 -115489 -113315 -144453 -96377
34246 -96377 -43950 -102951 -195049 -169412 -60346 -17935 -53679 -50722 24333 98237 135736 147668
34234 147668 104874 -1347 -69653 -17119 62099 30925 -56962 -36559 98320 187954 149832
34223 149832 58665 -5995 -35046 -20752 41298 89116 66069 33381 73975 118413 29676
34212 29676 -153656 -233690 -131603 9383 40347 -10350 -26851 27033 93528 108851 58111
34201 58111 -24159 -88410 -118847 -133998 -131334 -82102 -2095 44096 44463 62064 112733 117396
$$ packed form
34280e7609o705o3835l2749J645j9357l5723K9013J38998J67111M3424j37986
34269B6227k01047r4525M2348O8521J9297J2759N8347P6580M4516n538o9795j26736
34257a49046q8636N1318J20879J213j43801r2526P5518J09592K174l1138M8076
34246i6377N2427n9001r2098K5637J09066M2411l5744K957P5055P3904L7499J1932
34234A47668m2794j06221o8306N2534P9218l1174q7887K0403J34879Q9634l8122
34223A49832r1167o4660k9051J4294O2050M7818k3047l2688M0594M4438q8737
34212B9676j83332q0034J02087J40986L0964n0697j6501N3884O6495J5323n0740
34201E8111q2270o4251l0437j5151K664M9232Q0007M6191L67J7601N0669M663
$$ plain form
34189 117396 34865 -58748 -88761 -75779 -48347 14211 78933 43295 -82531 -130032 -25390
34178 -25390 69827 8872 -112402 -143316 -132945 -199782 -291999 -298268 -273243 -316670 -335933 -185340
34166 -185340 38012 103755 3786 -63617 -31029 -13130 -31209 31129 161932 181473 45534
34155 45534 -54549 -835 55044 -58781 -254426 -309223 -172008 -5803 30271 -61694 -169003
34144 -169003 -210520 -205089 -204104 -187502 -91371 55224 121110 50845 -49939 -75252 -53526 -38228
34132 -38228 4569 80795 75859 -67478 -199925 -170925 -72863 -82185 -155889 -116323 25835
34121 25835 78419 -20433 -125301 -127856 -75731 -29548 14253 36600 585 -37580 21682 148185
34109 148185 208262 169381 128998 136876 140366 112590 87493 60480 -4403 -65868 -43863 32257
$$ packed form
34189A17396q2531r3613l0013J2982K7432O2558O4722l5638j25826m7501J04642
34178b5390R5217o0955j21274l0914J0371o6837r2217o269K5025m3427j9263J50593
34166a85340K23352O5743r9969o7403L2588J7899j8079O2338J30803J9541j35939
34155D5534j00083N3714N5879j13825j95645n4797J37215J66205L6074r1965j07309
34144a69003m1517N431R85J6602R6131J46595O5886p0265j00784k5313K1726J5298
34132c8228M2797P6226m936j43337j32447K9000R8062r322p3704L9566J42158
34121B5835N2584r8852j04868k555N2125M6183M3801K2347l6015l8165N9262J26503
34109A48185O0077l8881m0383P878L490k7776k5097k7013o4883o1465K2005P6120
$$ plain form
34097 32257 49938 -13509 -73695 -86552 -85988 -88680 -81682 -77617 -68267 19939 193455 293147 189068
34084 189068 -7604 -109277 -137221 -222004 -306587 -223708 -30049 32209 -78482 -139574 -33212
34073 -33212 93311 108591 79956 75972 24685 -105221 -184655 -120709 -11370 14962 -25343
34062 -25343 -54328 -55087 -24519 61749 155713 141835 15229 -75138 -37790 36362 37198 -7736
34050 -7736 -27688 -41373 -97929 -174267 -213318 -197013 -131995 -36767 27895 5745 -51408 -24026
34038 -24026 103804 208974 189588 70043 -65958 -152985 -150987 -74493 -15457 -44141 -106010
34027 -106010 -113584 -92451 -110540 -122777 -47816 52374 56179 7297 52399 176458 215404
34016 215404 126147 24938 -41694 -131415 -205390 -147695 -17274 -17665 -158325 -211992 -88873
$$ packed form
34097C2257J7681o3447o0186j2857N64k692O998M065R350Q8206J73516R9692j04079
34084A89068j96672j01673k7944q4783q4583Q2879J93659O2258j10691o1092J06362
34073c3212J26523J5280k8635l984n1287j29906p9434O3946J09339K6332m0305
34062b5343k8985p59L0568Q6268R3964j3878j26606r0367L7348P4152Q36m4934
34050g736j9952j3685n6556p6338l9051J6305O5018R5228O4662k2150n7153K7382
34038b4026J27830J05170j9386j19545j36001q7027J998P6494N9036k8684o1869
34027a06010p574K1133j8089j2237P4961J00190L805m8882M5102J24059L8946
34016B15404q9257j01209o6632q9721p3975N7695J30421l91j40660n3667J23119
$$ plain form
34005 -88873 18023 -29089 -97724 -52783 9380 -34251 -115022 -141692 -189040 -324541 -422693
33994 -422693 -353418 -206577 -132193 -93054 21437 153896 164371 73296 17612 23642 10302
33983 10302 -25793 -9211 50209 56192 -8190 -52188 -31144 -11816 -49352 -84874 -21330 128051
33971 128051 216649 122578 -76826 -158887 -32098 122962 88126 -97358 -224461 -230233 -226549
33960 -226549 -242948 -179045 -43968 -1998 -96799 -150498 -49651 67969 44219 -62372 -118914
33949 -118914 -138641 -194923 -242138 -190973 -74930 3319 20753 9103 -45843 -166592 -304924
33938 -304924 -390432 -401946 -336774 -195657 -46469 9089 -13255 13162 117280 180228 156489
33927 156489 161440 238842 238449 73824 -81024 -40684 96936 114880 20481 1043 107271
$$ packed form
34005h8873J06896m7112o8635M4941O2163m3631q0771k6670m7348j35501r8152
33994d22693O9275J46841P4384L9139J14491J32459J0475r1075n5684O030j3340
33983A0302l6095J6582N9420N983o4382m3998K1044J9328l7536l5522O3544J49381
33971A28051Q8598r4071j99404q2061J26789J55060l4836j85484j27103n772L684
33960b26549j6399O3903J35077M1970r4801n3699J00847J17620k3750j06591n6542
33949a18914j9727n6282m7215N1165J16043P8249J7434j1650n4946j20749j38332
33938c04924q5508j1514O5172J41117J49188N5558k2344K6417J04118O2948k3739
33927A56489M951P7402l93j64625j54848M0340J37620J7944r4399j9438J06228
$$ plain form
33916 107271 198298 175146 81674 -19557 -112633 -166149 -136243 -41135 55562 119945 140077
33905 140077 98876 31809 35593 126632 176061 90654 -37611 -84322 -87465 -137855 -181371 -121284
33893 -121284 -36178 -79044 -206707 -236024 -147852 -97325 -117775 -73498 45210 54613 -86851
33882 -86851 -147189 -1707 107157 -53792 -277278 -195936 121423 238366 10742 -214430
33872 -214430 -158600 8276 43277 39494 170805 318673 311941 303776 500930 737235 837171
33861 837171 1225687 2448746 4025986 4580996 3490735 1764029 781485 705556 746583
33852 746583 525579 356092 392304 352263 143784 57102 176215 186713 -41623 -201873
33842 -201873 -93705 45154 -16307 -142033 -151251 -119860 -120336 -24793 178669 220546 -20959
$$ packed form
33916A07271R1027k3152r3472j01231r3076n3516K9906R5108R6697O4383K0132
33905A40077m1201o7067L784R1039M9429q5407j28265m6711l143n0390m3516O0087
33893a21284Q5106m2866j27663k9317Q8172N0527k0450M4277J18708R403j41464
33882h6851o0338J45482J08864j60949k23486Q1342L17359J16943k27624k25172
33872b14430N5830J66876L5001l783J31311J47868o732q165J97154K36305R9936
33861H37171L88516J223059J577240N55010j090261j726706r82544p5929M1027
33852G46583k21004j69487L6212m0041k08479q6682J19113J0498k28336j60250
33842b01873J08168J38859o1461j25726r218L1391m76R5543K03462M1877k41505
$$ plain form
33831 -20959 -241272 -153193 73009 113983 -14868 -82987 -47950 -26204 -27138 552 -6002 -106342
33819 -106342 -194098 -161873 -86307 -64173 -36474 39243 40404 -93779 -195032 -141327 -80672
33808 -80672 -147497 -191572 -61296 76758 16796 -98794 -20348 157784 161178 15540 -24508
33797 -24508 62783 64654 -50646 -97056 -47528 -83982 -230353 -271469 -116974 46061 63494
33786 63494 29222 79729 174092 191801 106355 -25815 -146038 -211821 -213089 -182553 -131454
33775 -131454 -20970 126197 174164 51820 -107524 -140324 -73069 -21156 24035 126541
33765 126541 220996 198230 103796 55202 31269 -54388 -140112 -98691 13530 15775 -106363
33754 -106363 -177386 -97794 47354 141055 136270 26907 -128843 -189393 -86275 43607 32026
$$ packed form
33831b0959k20313Q8079K26202M0974j28851o8119L5037K1746r34K7690o554j00340
33819a06342q7756L2225P5566K2134K7699P5717J161j34183j01253N3705O0655
33808h0672o6825m4075J30276J38054n9962j15590P8446J78132L394j45638m0048
33797b4508Q7291J871j15300m6410M9528l6454j46371m1116J54495J63035J7433
33786F3494l4272N0507R4363J7709q5446j32170j20223o5783j268L0536N1099
33775a31454J10484J47167M7967j22344j59344l2800O7255N1913M5191J02506
33765A26541R4455k2766r4434m8594k3933q5657q5724M1421J12221K245j22138
33754a06363p1023P9592J45148R3701m785j09363j55750o0550J03118J29882j1581
$$ plain form
33743 32026 -75296 -109381 -44853 4748 1033 7354 46121 93838 163567 241729 226471 87166
33731 87166 -25864 -9026 -4130 -149009 -278103 -153349 119724 218710 75800 -90807
33721 -90807 -165176 -225520 -269293 -185135 -26904 -1926 -135221 -228103 -193393 -149454 -139703
33710 -139703 -60795 59409 19259 -205402 -345964 -224222 -17057 16426 -119813 -235985
33700 -235985 -227145 -133525 -40651 -12898 -44632 -47673 19403 40915 -89575 -244478 -211396
33689 -211396 -32874 47737 -29720 -83408 -34347 -18385 -91529 -117082 -51632 -64999 -233376
33678 -233376 -360081 -264998 -46732 99803 143291 145317 101762 7007 -63764 -66142 -57028
33667 -57028 -63241 -23631 59210 75571 -55 -50880 -33557 -54765 -137405 -131347 11984 99626
$$ packed form
33743C2026j07322l4085O4528M9601l715O321L8767M7717O9729P8162j5258j39305
33731H7166j13030J6838M896j44879j29094J24754K73073R8986j42910j66607
33721i0807p4369o0344m3773Q4158J58231K4978j33295r2882L4710M3939R751
33710a39703P8908J20204m0150k24661j40562J21742K07165L3483j36239j16172
33700b35985Q840R3620R2874K7753l1734l041O7076K1512j30490j54903L3082
33689b11396J78522Q0611p7457n3688M9061J5962p3144k5553O5450j3367j68377
33678b33376j26705R5083K18266J46535M3488K026m3555r4755p0771k378R114
33667e7028o213L9610Q2841J6361p5626n0825J7323k1208q2640O058J43331Q7642
$$ plain form
33655 99626 418 -120011 -68559 53336 26268 -128988 -210766 -161810 -103623 -96706 -78017
33644 -78017 -23482 2697 -32077 -88095 -130004 -145827 -113266 -40987 -12706 -96259 -232490
33633 -232490 -295394 -240713 -131654 -48720 -29965 -64006 -93304 -62217 5500 28949 -8194
33622 -8194 -33070 -8633 9198 -15561 -25459 26721 85667 77040 14529 -43664 -84740 -124788
33610 -124788 -153873 -154200 -134861 -110089 -77119 -32910 24296 102956 175218 154681 1495 -177397
33598 -177397 -238989 -195064 -174331 -215424 -239383 -218967 -212988 -217692 -152855 -32722 15356 -42923
33586 -42923 -82066 -21707 49904 30724 -51322 -120853 -157368 -155360 -108742 -85231 -175806 -319362
33574 -319362 -335818 -197421 -95614 -152426 -242126 -213409 -118570 -79039 -72006 -14696 55226
$$ packed form
33655I9626r9208j20429N1452J21895k7068j55256q1778M8956N8187O917J8689
33644g8017N4535K6179l4774n6018m1909j5823L2561P2279K8281q3553j36231
33633b32490o2904N4681J09059Q2934J8755l4041k9298L1087O7717K3449l7143
33622h194k4876K4437J7831k4759r898N2180N8946q627o2511n8193m1076m0048
33610a24788k9085l27J9339K4772L2970M4209N7206P8660P2262k0537j53186j78892
33598a77397o1592M3925K0733m1093k3959K0416N979m704O4837J20133M8078n8279
33586d2923l9143O0359P1611j9180q2046o9531l6515K008M6618K3511r0575j43556
33574c19362j6456J38397J01807n6812q9700K8717R4839L9531P033N7310O9922
$$ plain form
33563 55226 51668 8630 20177 75172 94615 81848 99818 135592 114261 30933 -36066 -37821
33551 -37821 -2633 22176 21109 12961 31476 79459 97093 29937 -71905 -105673 -74725 -88833
33539 -88833 -178137 -225713 -142515 -1803 72707 63419 31919 12267 677 -6572 -16654 -32465
33527 -32465 -21569 39211 84252 21228 -115421 -184110 -128624 -31570 45823 136627 235711
33516 235711 239632 98416 -84483 -178016 -159818 -81532 -883 12130 -85495 -222805 -277775
33505 -277775 -250231 -239503 -235800 -111969 126421 274308 202895 32336 -72233 -111573 -145937
33494 -145937 -144686 -85910 -65813 -153749 -248671 -226730 -135701 -101964 -130656 -136871 -102327 -68334
33482 -68334 -32509 26152 66878 34280 -56250 -154862 -239880 -281925 -227571 -90071 29834
$$ packed form
33563E5226l558m3038J1547N4995J9443j2767J7970L5774k1331q3328o6999j755
33551c7821L5188K4809j067q148J8515M7983J7634o7156j01842l3768L0948j4108
33539h8833q9304m7576Q3198J40712P4510r288l1500j9652j1590p249j0082j5811
33527c2465J0896O0780M5041o3024j36649o8689N5486R7054P7393R0804R9084
33516B35711L921j41216j82899r3533J8198P8286Q0649J3013r7625j37310n4970
33505b77775K7544J0728L703J23831K38390J47887p1413j70559j04569l9340l4364
33494a45937J251N8776K0097q7936r4922K1941R1029L3737k8692o215L4544L3993
33482f8334L5825N8661M0726l2598r0530r8612q5018m2045N4354J37500J19905
$$ plain form
33471 29834 83776 139596 233420 274469 196899 97970 107356 206051 288912 326120 346429 333502
33459 333502 262191 186712 180333 222647 237674 207992 173117 153094 144136 153522 178627 184565
33447 184565 146989 84580 27758 -3155 8553 42098 21379 -77709 -139091 -58963 48200
33436 48200 -22429 -237936 -341070 -226052 -73704 -39039 -40069 20886 50393 -49977 -169263
33425 -169263 -145340 -6249 112973 174709 202516 161124 43383 -23231 69896 227055 273287
33414 273287 199016 131341 121409 110570 70149 37056 25259 10006 -6841 7328 62275 129369
33402 129369 159866 111759 7681 -48855 1510 60484 5248 -98087 -82782 34676 68296
33391 68296 -27343 -96251 -76989 -105734 -233641 -293922 -181192 -33527 7796 3373 32298
$$ packed form
33471B9834N3942N5820R3824M1049p7570r8929R386R8695Q2861L7208K0309j2927
33459C33502p1311p5479o379M2314J5027k9682l4875k0023q958R386K5105N938
33447A84565l7576o2409n6822l0913J1708L3545k0719r9088o1382Q0128J07163
33436D8200p0629k15507j03134J15018J52348L4665j030O0955K9507j00370j19286
33425a69263K3923J39091J19222O1736K7807m1392j17741o6614R3127J57159M6232
33414B73287p4271o7675r932j0839m0421l3093j1797j5253j6847J4169N4947O7094
33402A29369L0497m8107j04078n6536N0365N8974n5236j03335J5305J17458L3620
33391F8296r5639o8908J9262k8745j27907o0281J12730J47665M1323m423K8925
$$ plain form
33380 32298 21093 -79751 -155268 -131573 -118513 -177047 -161734 12051 163808 130851 46383
33369 46383 95342 192491 167155 84958 99073 141281 66634 -26406 56417 229297 225413 27445
33357 27445 -111774 -71544 1118 -17735 -59531 -39240 5216 14014 -863 -6128 8202 35054
33345 35054 25836 -87128 -261007 -328948 -224275 -106122 -130712 -220813 -218302 -139165 -93098
33334 -93098 -64076 25188 120252 111116 33156 2659 14235 -21006 -97791 -141976 -148111 -146096
33322 -146096 -116608 -77931 -138461 -306536 -386201 -246424 -51999 -16752 -67584 3090 168192
33311 168192 214388 85881 -69222 -147494 -165532 -135366 -63748 -24371 -59793 -88330 -60536
33300 -60536 -78475 -183194 -192621 17925 241013 217090 43324 2258 104753 126940 16215
$$ packed form
33380C2298j1205j00844p5517K3695J3060n8534J5313J73785J51757l2957q4468
33369D6383M8959R7149k5336q2197J4115M2208p4647r3040Q2823J72880l884j97968
33357B7445j39219M0230P2662j8853m1796K0291M4456Q798j4877n265J4330K6852
33345C5054r218j12964j73879o7941J04673J18153k4590r0101K511P9137M6067
33334i3098K9022Q9264R5064r136p7960l0497J1576l5241p6785m4185o135K015
33322a46096K9488L8677o0530j68075p9665J39777J94425L5247n0832P0674J65102
33311A68192M6196j28507j55103p8272j8038L0166P1618L9377l5422k8537K7794
33300f0536j7939j04719r427K10546K23088k3923j73766m1066J02495K2187j10725
$$ plain form
33289 16215 -67952 -69706 -84552 -121976 -103188 -65264 -105203 -165410 -128423 -57210 -79756 -125054
33277 -125054 -60421 11153 -85807 -234735 -182541 15356 86249 22246 62177 210599 208117
33266 208117 19045 -80720 10430 56080 -72062 -171805 -96614 -12962 -80979 -181359 -161976
33255 -161976 -100087 -119649 -159352 -108069 -3488 56317 60549 38989 1739 -10110 40500
33244 40500 69749 -35837 -194113 -195875 -22498 120744 117472 61162 32355 -4652 -34622
33233 -34622 37258 180699 230896 145665 59213 35988 -2946 -68895 -66289 -16490 -68268 -215099
33221 -215099 -250453 -89561 97613 157981 134257 95602 20211 -66957 -62580 19000 27497
33210 27497 -68118 -118389 -58723 -12856 -50317 -65448 5951 63037 37273 19706 89677 188351
$$ packed form
33289A6215q4167j754j4846l7424J8788L7924l9939o0207L6987P1213k2546m5298
33277a25054O4633P1574r6960j48928N2194J97897P0893o4003L9931J48422k482
33266B08117j89072r9765R1150M5650j28142r9743P5191Q3652o8017j00380J9383
33255a61976O1889j9562l9703N1283J04581N9805M232k1560l7250j1849N0610
33244D0500K9249j05586j58276j762J73377J43242l272n6310k8807l7007k9970
33233c4622P1880J43441N0197q5231q6452k3225l8934o5949K606M9799n1778j46831
33221b15099l5354J60892J87174O0368k3724l8655p5391q7168M377Q1580Q497
33210B7497r5615n0271N9666M5867l7461j5131P1399N7086k5764j7567O9971R8674
$$ plain form
33198 188351 246088 273150 262536 171148 49215 19068 83683 121993 92815 64259 38283
33187 38283 -50599 -155657 -149989 -47732 17983 35207 107252 214950 225445 138002 81088
33176 81088 71379 20440 -38883 4034 90302 62830 -41351 -53915 11732 17758 15237 149348
$$ packed form
33198A88351N7737K7062j0614r1388j21933l0147O4615L8310k9178k8556k5976
33187C8283q8882j05058N668J02257O5715J7224P2045J07698J0495q7443n6914
33176H1088r709n0939n9323M2917Q6268k7472j04181j2564O5647O026k521J34111
$$ [...]
##END NTUPLES=NMR SPECTRUM
##END=
