##TITLE=31Pdec_LR-743-1
 , 24 sc
 15.12.2021
##JCAMPDX= 6.0         $$ Bruker NMR JCAMP-DX V2.0
##DATA TYPE= NMR SPECTRUM
##DATA CLASS= NTUPLES
##ORIGIN= UXNMR, Bruker Analytische Messtechnik GmbH
##OWNER= root
$$ XWIN-NMR		Version 3.5
$$ Wed Dec 15 11:51:58 2021 Russian Standard Time (UT+4h)  she@DPX200
##.OBSERVE FREQUENCY= 81.013821
##.OBSERVE NUCLEUS= ^31P
##.ACQUISITION MODE= SIMULTANEOUS
##.ACQUISITION SCHEME= undefined
##.AVERAGES= 24
##.DIGITISER RES= 16
##SPECTROMETER/DATA SYSTEM= spect
##.PULSE SEQUENCE= zgpg30
##.SOLVENT NAME= DMSO
##.SHIFT REFERENCE= (INTERNAL, DMSO, 0, 248.564)
##AUDIT TRAIL= $$ (NUMBER, WHEN, WHO, WHERE, WHAT)
$$ ##TITLE= Audit trail, XWIN-NMR		Version 3.5
$$ ##JCAMPDX= 5.01
$$ ##ORIGIN= Bruker BioSpin GmbH
$$ ##OWNER= she
$$ F:/spectra/data/she/nmr/P31/1/pdata/1/auditp.txt
$$ ##AUDIT TRAIL=  $$ (NUMBER, WHEN, WHO, WHERE, WHAT)
(   1,<2021-12-15 11:50:27.21 +0400>,<she>,<DPX200>,
      <created by zg, POWCHK disabled, PULCHK disabled
       configuration hash MD5:
       00 E9 B6 7A A2 85 ED C7 34 08 36 98 17 FE 4E 26
       data hash MD5: 32K
       4D 09 49 4C D6 A8 C4 25 FB 56 FF 2A 87 BD D2 F4>)
(   2,<2021-12-15 11:50:43.10 +0400>,<she>,<DPX200>,
      <Start of raw data processing
       efp BC_mod = 2 LB = 1 FT_mod = 6 PKNL = 1 PHC0 = -9028.995 PHC1 = -264.13 SI = 64K 
       data hash MD5: 64K
       07 6E 31 AF 13 72 A5 F9 1F D3 D6 F1 D0 07 37 21>)
(   3,<2021-12-15 11:51:19.23 +0400>,<she>,<DPX200>,
      <pk PHC0 = -142.3154 PHC1 = 351.3999 
       data hash MD5: 64K
       92 0E D9 A0 62 6B EC 8F 80 08 17 73 63 EF D6 F7>)
(   4,<2021-12-15 11:51:24.75 +0400>,<she>,<DPX200>,
      <abs ABSG = 5 
       data hash MD5: 64K
       70 2A 8B C9 B6 ED 57 A9 98 79 8A EC 48 13 D5 D4>)
$$ ##END=
$$ 
$$ hash MD5
$$ 1C 5A 7A 54 7D 50 F6 50 FE 91 84 E3 BC AE BA A4
##$RELAX= 
##$RELAX= 
##$RELAX= 
##$RELAX= 
##$RELAX= 
##$RELAX= 
##$RELAX= 
##$RELAX= 
$$ Bruker specific parameters
$$ --------------------------
##$DU= <F:/spectra>
##$EXPNO= 1
##$NAME= <P31>
##$PROCNO= 1
##$TYPE= <nmr>
##$USER= <she>
##$AMP= (0..31)
100 100 100 100 100 100 100 100 100 100 100 100 100 100 100 100 100 100 
100 100 100 100 100 100 100 100 100 100 100 100 100 100 
##$AQSEQ= 0
##$AQ_mod= 1
##$AUNM= <au_zg>
##$AUTOPOS= <>
##$BF1= 81.014009
##$BF2= 200.13
##$BF3= 200.13
##$BF4= 200.13
##$BF5= 200.13
##$BF6= 200.13
##$BF7= 200.13
##$BF8= 200.13
##$BYTORDA= 1
##$CFDGTYP= 0
##$CFRGTYP= 5
##$CHEMSTR= <none>
##$CNST= (0..31)
1 1 145 1 1 1 1 1 1 1 1 1 1 1 1 1 1 1 1 1 1 1 1 1 1 1 1 1 1 1 1 1 
##$CPDPRG= <waltz16>
##$CPDPRG1= <>
##$CPDPRG2= <waltz16>
##$CPDPRG3= <>
##$CPDPRG4= <mlev>
##$CPDPRG5= <mlev>
##$CPDPRG6= <mlev>
##$CPDPRG7= <mlev>
##$CPDPRG8= <mlev>
##$CPDPRGB= <>
##$CPDPRGT= <>
##$D= (0..31)
0 1 0 0 0 0 0 0 0 0 0 0.03 2e-05 3e-06 0 0 0 0 0 0 0 0 0 0 0 0 0 0 0 0 
0 0 
##$DATE= 1639554626
##$DBL= (0..7)
120 120 120 11 120 120 24 19 
##$DBP= (0..7)
150 150 150 150 150 150 150 150 
##$DBP07= 0
##$DBPNAM0= <>
##$DBPNAM1= <>
##$DBPNAM2= <>
$$ [...]
##$SUBNAM3= <"">
##$SUBNAM4= <"">
##$SUBNAM5= <"">
##$SUBNAM6= <"">
##$SUBNAM7= <"">
##$SUBNAM8= <"">
##$SUBNAM9= <"">
##$SW= 501.771253377433
##$SWIBOX= (0..15)
0 1 3 0 0 0 0 0 0 0 0 0 0 0 0 0 
##$SW_h= 40650.406504065
##$TD= 32768
##$TD0= 1
##$TE= 0
##$TE2= 300
##$TE3= 300
##$TEG= 300
##$TL= (0..7)
0 120 53 12 22 120 120 120 
##$TP= (0..7)
150 150 150 150 150 150 150 150 
##$TP07= 0
##$TPNAME0= <>
##$TPNAME1= <>
##$TPNAME2= <>
##$TPNAME3= <>
##$TPNAME4= <>
##$TPNAME5= <>
##$TPNAME6= <>
##$TPNAME7= <>
##$TPOAL= (0..7)
0.5 0.5 0.5 0.5 0.5 0.5 0.5 0.5 
##$TPOFFS= (0..7)
0 0 0 0 0 0 0 0 
##$TUNHIN= 0
##$TUNHOUT= 0
##$TUNXOUT= 0
##$USERA1= <user>
##$USERA2= <user>
##$USERA3= <user>
##$USERA4= <user>
##$USERA5= <user>
##$V9= 5
##$VALIST= <valist>
##$VCLIST= <CCCCCCCCCCCCCCC>
##$VD= 0
##$VDLIST= <DDDDDDDDDDDDDDD>
##$VPLIST= <PPPPPPPPPPPPPPP>
##$VTLIST= <TTTTTTTTTTTTTTT>
##$WBST= 1024
##$WBSW= 4
##$XGAIN= (0..3)
0 0 0 0 
##$XL= 0
##$YL= 0
##$YMAX_a= 14821
##$YMIN_a= -15019
##$ZGOPTNS= <>
##$ZL1= 120
##$ZL2= 120
##$ZL3= 120
##$ZL4= 120
##$ABSF1= 248.5645
##$ABSF2= -253.2056
##$ABSG= 5
##$ABSL= 3
##$ALPHA= 0
##$AQORDER= 0
##$ASSFAC= 0
##$ASSFACI= 0
##$ASSFACX= 0
##$ASSWID= 0
##$AUNMP= <proc_1d>
##$AZFE= 0.1
##$AZFW= 0.5
##$BCFW= 0
##$BC_mod= 2
##$BYTORDP= 0
##$COROFFS= 0
##$CY= -3
##$DATMOD= 1
##$DC= 0
##$DFILT= <>
##$DTYPP= 0
##$F1P= 0
##$F2P= 0
##$FCOR= 1
##$FTSIZE= 65536
##$FT_mod= 6
##$GAMMA= 0
##$GB= 0
##$INTBC= 1
##$INTSCL= 5.30512e-09
##$ISEN= 30
##$LB= 1
##$LEV0= 0
##$LPBIN= 0
##$MAXI= 10000
##$MC2= 0
##$MEAN= 0
##$ME_mod= 0
##$MI= 50
##$NCOEF= 0
##$NC_proc= -3
##$NLEV= 6
##$NOISF1= 182.463
##$NOISF2= 159.3651
##$NSP= 0
##$NTH_PI= 0
##$NZP= 0
##$OFFSET= 248.5645
##$PC= 4
##$PHC0= -9171.311
##$PHC1= 87.2699
##$PH_mod= 1
##$PKNL= yes
##$PPARMOD= 0
##$PSCAL= 0
##$PSIGN= 0
##$REVERSE= no
##$SF= 81.014009
##$SI= 65536
##$SIGF1= 159.3651
##$SIGF2= -187.1042
##$SINO= 113.3802
##$SIOLD= 16384
##$SREGLST= <1H.CDCl3>
##$SSB= 0
##$STSI= 65536
##$STSR= 0
##$SW_p= 40650.406504065
##$SYMM= 0
##$S_DEV= 0
##$TDeff= 32768
##$TDoff= 0
##$TI= <>
##$TILT= no
##$TM1= 0
##$TM2= 0
##$TOPLEV= 0
##$USERP1= <user>
##$USERP2= <user>
##$USERP3= <user>
##$USERP4= <user>
##$USERP5= <user>
##$WDW= 1
##$XDIM= 65536
##$YMAX_p= 381716198
##$YMIN_p= -5327337
$$ End of Bruker specific parameters
$$ ---------------------------------
##NTUPLES= NMR SPECTRUM
##VAR_NAME=  FREQUENCY,     SPECTRUM/REAL,   SPECTRUM/IMAG
##SYMBOL=    X,             R,               I
##VAR_TYPE=  INDEPENDENT,   DEPENDENT,       DEPENDENT
##VAR_FORM=  AFFN,          ASDF,            ASDF
##VAR_DIM=   65536,         65536,           65536
##UNITS=     HZ,            ARBITRARY UNITS, ARBITRARY UNITS
##FACTOR=    0.620285442955139, 1,           1
##FIRST=     20137.2065510759, 0,            0
##LAST=      -20513.1999529892, 0,           0
##MIN=       -20513.1999529892, -5327337,    0
##MAX=       20137.2065510759, 381716198,    0
$$ Real data points
##PAGE= N=1
##DATA TABLE= (X++(R..R)), XYDATA
$$ [...]
54288E1295M3390j37878j04988P5753J42734K6347p9408m0054L8014J7536o1192
54277b8451q8649o6799o3438p5748m7890K6147R5459J15051P3045m878n3907k2796
54265a42854N3559Q3885L0577n8915j20342j12928j6985J27969K05015J31706
54255A80687k3355j20093j17069p3515k5945K4608M4652J4533M056O8756J17852
54244I5167L9238r1241j02619N530Q2051P8484P3439O3761l1387j53094j39123
54233g9794p521M8887p004k104J06390J29045p317j02832l1210L7827m4482j30044
54221i0159m7113Q2505O0966m3069m3934K8523K9613J822P6658J67332P0440j63612
54209A29972k59362j23298M3568P2476K4905Q191Q366j2223k0916m92J000l1029
$$ y = [51295, 94685, -43193, -148181, -72428, 70306, 96653, 17245, -22809, 15205, 32741, -28451, -117100, -183899, -247337, -323085, -370975, -344828, -249369, -134318, -61273, -66151, -120058, -142854, -89295, -5410, 25167, -33748, -154090, -267018, -284003, -156034, 48981, 180687, 157332, 37239, -79830, -153345, -179290, -154682, -110030, -95497, -91441, -22685, 95167, 134405, 43164, -59455, -53925, 28126, 106610, 180049, 243810, 212423, 59329, -79794, -87315, -38428, -45432, -47536, 58854, 187899, 180582, 77750, 46540, 84367, 39885, -90159, -137272, -54767, 6199, -36870, -80804, -52281, -22668, -20846, 55812, 223144, 293584, 129972, -129390, -252688, -209120, -136644, -111739, -103548, -95182, -107405, -128321, -128813, -127813, -158842]
54197a58842l8901M723N7564R6040J35016J41597N1048r8040j63139q2590L6559
54186a8965O6374J2572k6569Q711Q9389J33371P6366n0558j26223q0173L63j1477
54174G3181q8202q8679J6598R6726O3015j0709k4646K809j559m5580q4732q7161
54162a78939l2419Q1196J79485J52137J3354p4603k4535L0693o0164k07044j89091
54151c09930J1768J71546J38728J8097k0716K9712P0492O0686J8609m9238j12509
54140B7245r1940J6287P4058n853q3549J3645J81100J50239q6538k18179o4902
54129h8387J52757J48009k7109j18401o9842m0743q7724q2525L5124J37027J07757
54118F5943Q852l8639j9645N874J1587N665j5956m9133n3716j298P1207R4071
$$ y = [-158842, -197743, -193020, -135456, -39416, 95600, 237197, 288245, 190205, 27066, -55524, -18965, 47409, 59981, 33412, 42123, 131512, 264883, 341249, 290691, 164468, 84295, 84658, 73181, -15021, -103700, -87102, 9624, 72639, 61930, 37284, 40093, 38534, -7046, -91778, -178939, -211358, -130162, 49323, 201460, 214814, 140211, 115676, 146369, 86205, -120839, -309930, -298162, -126616, 12112, 30209, 9493, 39205, 109697, 170383, 188992, 139754, 27245, -64695, -48408, 25650, 19797, -63752, -50107, 130993, 281232, 194694, -23485, -88387, 64370, 212379, 185270, 66869, -2973, -43716, -131440, -213965, -178841, -41814, 65943, 74795, 36156, 16511, 22385, 33972, 39637, 23681, -25452, -79168, -80466, -9259, 84812]
54106H4812M0545m6862r6417p1594n369L8363M1083L5407K8899j2814p3099n7157
54094i4203O7221J74496J32385l514o7852k7159m429o0183r4203j5248J08041
54083A15352J42999O6376l2323p6913o8212m1803j7709j20J943k1352n0153l3467
54071a5382M3255J02072M9265q3374j54308r9549j4160M366p573J5697K8224l8398
54059a69865j15667p5940N9821J34377P3950l0717p5494n8393j7806L7123Q7061
54048a51550P7265o226q2431n6325N6941J30582P0040n5845p6352N9076J82782
54037A47957J17402o8681j48846o1884K1600j9512r4334q7231k8879J5638O0975
54026a45795R7109M3495p2402p5514P4045J53494J1072j67518j41912J5546Q1714
$$ y = [84812, 125357, 78495, -17922, -89516, -94885, -56522, -15439, 19968, 48867, 36053, -37046, -94203, -26982, 147514, 279899, 276385, 208533, 181374, 176945, 116762, 22559, 7311, 115352, 258351, 324727, 292404, 215491, 147279, 105476, 87767, 87647, 89590, 68238, 18085, -15382, 27873, 129945, 179210, 95836, -58472, -158021, -172181, -167815, -175388, -159691, -131467, -169865, -285532, -361472, -301651, -167274, -93324, -124041, -199535, -257928, -275734, -238611, -151550, -74285, -80511, -162942, -219267, -162326, -31744, 38296, -17549, -93901, -34825, 147957, 265359, 196678, 47832, -14052, 7548, -11964, -106298, -193529, -222408, -206770, -145795, -48686, -5191, -77593, -153107, -79062, 74432, 85504, -82014, -223926, -208380, -126666]
54015a26666M6658M1032M3165m1595j22574n4654O4424M2937m4521J4571J52266
54004A5043J07316r6400j57078p408Q0662j8188q4024K8235J33883O2221o0525
53993C737o8040k0889k1406r473O0000O5038n4565j25658r261J47064J39930K8528
53981A35005j364M3252J1013j11555j79888j14428K0555J31904J67057J05647
53971B07198j3241r0614p4245k4560j7970m3297m6266j5297K2321L6446P956l5482
53959h7051j4566Q5644J36765L3114j07308q1283Q3359J54014M5832o8503m9489
53948A30528J5583j0756j16777j96976j71535j2039K11291L03252J39508j10360
53938A81719j58364j079Q6535j7791j22215n9543O7247Q5752j0373j26402j87474
$$ y = [-126666, -80008, -38976, 4189, -37406, -159980, -214634, -150210, -107273, -151794, -137223, 15043, 122359, 25959, -131119, -138527, -57865, -76053, -160077, -131842, 2041, 64262, 3737, -64303, -85192, -106598, -116071, -56071, 8967, -45598, -171256, -180517, -33453, 106477, 135005, 133641, 176893, 187906, 76351, -103537, -217965, -197410, -65506, 101551, 207198, 193957, 103343, 29098, 4538, -13432, -56729, -102995, -118292, -95971, -59525, -51569, -87051, -101617, -15973, 120792, 153906, 46598, -34685, 48674, 202688, 248520, 180017, 130528, 146111, 135355, 18578, -178398, -349933, -361972, -150681, 152571, 292079, 181719, 23355, 22276, 108811, 91020, -31195, -90738, -23491, 62261, 51888, -74514, -261988]
53927b61988j31492L8744J68741J16997j955J8215J06063K9397j41775r8482J38567
53916a8968J77385q4695k37951k5246K28647J62058o0225r7289M238K655o4020
53905a3411j2769Q9607O3414k7619k6162j6182j37373k30776o7207J99229K18104
53894C8855L691r8739K3636J19016L0270p7771l9058N8258N6043l6362r3775m5113
53882f1049O2136J04830J2607j05570o3689J17132J92871N7111r4900r8715o6966
53871E5798j09488q3089J05043K07840K456k72349k38343K5076J28175L772n3143
53860b28252O4782J33494L5731o1280m3230j3857l6329k0788M5645M3378k7982
53849a08688j6477R1488J18965J3380n7240j1233J2413o4110j00321o91R4423
$$ y = [-261988, -393480, -354736, -185995, -68998, -70953, -52738, 53325, 82722, -59053, -157535, -18968, 158417, 73722, -164229, -189475, 39172, 201230, 141005, 43716, 47954, 50609, -13411, -26180, 63427, 126841, 99222, 73060, 56878, -80495, -311271, -378478, -179249, 38855, 42546, -56193, -32557, 86459, 116729, 38958, -100, 58158, 114201, 77839, -15936, -61049, 1087, 105917, 118524, 12954, -50735, 66397, 259268, 316379, 221479, 122764, 55798, -53690, -136779, -31736, 176104, 178560, -93789, -332132, -307056, -178881, -175109, -228252, -163470, -29976, 5755, -55525, -98755, -112612, -148941, -169729, -124084, -80706, -108688, -125165, -33677, 85288, 98668, 41428, 30195, 42608, -21502, -121823, -122514, -28091]
53838b8091M0255p4849q3085J1696P8899N4984j8316p0999n0083L8209J01442
53827F2O3386q458M544O7361L7104q4896j30454l1397P2497N9454m079p455K6896
53814F4565J1923n4090r7036o8765J4967R0372P9586l0703j38558j24999m866
53803b57604R2805R0909L3634n092k996K3894N0038N1686L1109J6089J2686J548
53791A38706l922K7174N1922j0623j20636j36273m1851J2416k6845j4784J14055
53780a0661J85244O9898q0690r1660n2978j10360j61657m6564J24513J43284P0675
53769C9044J00564J68810O0562j60116k07401m7004N6748r291o9021k5257j3719
53758a06081q8413q1047Q1927K02784J16212n8304j23411p3393j6272Q737R292
$$ y = [-28091, 12164, -62685, -145770, -134074, -55175, -191, -18507, -89506, -139589, -101380, 62, 63448, 54990, 59534, 126895, 163999, 79103, -51351, -82748, -10251, 49203, 45124, 37669, 64565, 76488, 22398, -74638, -143403, -128436, -38064, 41522, 10819, -127739, -252738, -257604, -164799, -73890, -40256, -45348, -48344, -24450, 25588, 77274, 108383, 124472, 137158, 138706, 134784, 161958, 213880, 203257, 82621, -53652, -95503, -83087, -109932, -124716, -10661, 174583, 244481, 163791, 72131, 19153, -91207, -252864, -299428, -174915, -31631, 39044, 139608, 308418, 368980, 208864, 1463, -45541, 11207, 1916, -67105, -92362, -106081, -194494, -275541, -193614, 9170, 125382, 67078, -56333, -129726, -145998, -137261, -127969]
53747a27969k5797o9552n8097j2384j9411m9679L1715K11280K75697J12390j09574
53736A58619j76140j01722m1405m8391n4833k2488J2153K1738L3762Q1453J37400
53725A46J21111P823q4933j7483J44271J67454q757j49834p5874N5048J6832j08076
53713F7728r1659L4404M9402n9508r7536k6373p67m0243O159J30863J29850l3345
53701F8975j36998p3514j3909p7315j25080m2703L8538p917o1159K6833J52465
53690b51784J26612j2764p1474J560Q2527R3560Q1226Q2505N3843l5201j23112
53679B7498j18624k0558N9856K7039n8743m1730J02743K01615J14895o9756j72994
53668E1241j50231o2379O4132J92957K04951N6175q4806n6001L4676j3099j42390
$$ y = [-127969, -153766, -223318, -281415, -293799, -313210, -362889, -331174, -119894, 155803, 268193, 158619, -17521, -119243, -160648, -209039, -263872, -286360, -274207, -252469, -218707, -137254, 146, 121257, 129080, 44147, 26664, 170935, 338389, 329632, 179798, 103924, 158972, 175804, 67728, -23931, 10473, 59875, 367, -97169, -123542, -124309, -164552, -158393, -27530, 102320, 68975, -68023, -141537, -155446, -232761, -357841, -400544, -362006, -369923, -431082, -404249, -251784, -125172, -137936, -209410, -207850, -125323, -31763, 49463, 131968, 185811, 150610, 27498, -91126, -111684, -51828, -24789, -83532, -125262, -22519, 179096, 293991, 224235, 51241, -98990, -161369, -97237, 95720, 300671, 356846, 272040, 216039, 250715, 237616, 95226]
53657I5226j32245J4692O8574m3877j32028o1212O5587J08000O5159l267n9766
53646a5157o0133M501M0189k1846p5349R9J00959N3562o4473l4020J18256J49058
53634A95646Q160r6413o8106m1445p8107n4144O3120J13215K1580p4746p6188
53623h7428n5563o1476k6962M5597M7463j3008Q158J13383J20212k2861j32071
53612f4556r3586k3649k2702j3320O3755J16808P8366J4952k2658o5412r0209
53601a22211k9473N0410J3601q3062n5142O9923Q0291l1281m4977P2743J00106
53590B0928j7701o2968K7370L0305j17938j55498K9722J61950N3784o7949R872
53579h8123J01394j5696j80627j38429K8575J00020J00296J45307J40493j8321
$$ y = [95226, -37019, -22327, 46247, 2370, -129658, -190870, -125283, -17283, 47876, 44609, -15157, -75290, -70789, -30600, -52446, -127795, -127696, -26737, 26825, -37648, -71668, 46588, 195646, 203806, 107393, 39287, -2158, -80265, -134409, -71289, 41926, 63506, -11240, -87428, -142991, -204467, -231429, -185832, -138369, -151377, -143219, -29836, 90376, 67515, -64556, -158142, -181791, -204493, -217813, -154058, -37250, 41116, 56068, 33410, -32002, -122211, -151684, -101274, -87673, -170735, -225877, -155954, -75663, -106944, -151921, -79178, 20928, 3227, -59741, -32371, -2066, -120004, -275502, -245780, -83830, -30046, -97995, -88123, 13271, -2425, -183052, -321481, -292906, -192886, -92590, 52717, 193210, 174889]
53569A74889j47975l9858J49977J24459p5887j58381m2653P6368O2754l2458j19507
53558b8272j32658k9315J00965O8013j10149j37110J10056L04999J37977j77616
53548A06890k23054j1758R3500j9387j12127n2241K5861L1617M2744P6949M2846
53537A840l1305N788J46452J87768M3154j27045j61886q7895l374N5427P5476
53526A04400L7590k3183l6751q85K5525K1489N125k8063o8229m6844N6280J23749
53514A70203M7822r2235j35875o7693J475K4497M1512N6818L7523N879N826R345
53502A05097l0550p6870o7375k3892Q39K0665N6401N9536P909j5539L3932M5381
53490A15534o9478j82963j21243N0179J13828K8754l6995N549N0076N031n6251
$$ y = [174889, 26914, -12944, 137033, 261492, 185605, 27224, -15429, 60939, 123693, 91235, -28272, -160930, -190245, -89280, -21267, -131416, -268526, -158470, 146529, 284506, 106890, -116164, -127922, -34422, -53809, -165936, -218177, -192316, -160699, -117955, -41006, 1840, -29465, -23677, 122775, 310543, 353697, 226652, 64766, -23129, -26503, 28924, 104400, 141990, 118807, 82056, 81171, 106696, 128185, 133310, 105247, 37018, -9826, 46454, 170203, 218025, 125790, -10085, -77778, -76303, -51806, -10294, 46524, 84047, 89926, 95752, 105097, 74547, -2323, -69698, -93590, -92751, -72086, -15685, 43851, 51760, 36221, 70153, 115534, 46056, -136907, -258150, -207971, -94143, -65389, -102384, -96835, -46759, -41728, -97979]
53479i7979l3141L7232M4128k9461q1599k4300J00103J57843P9603n4072j14771
53468a6414p6446o212M9504P9627N1152m3871j12557o4152L5134N1464m490j8748
53456g6009R932p557m2161J0663R3851N0152p4743p1445O3848J04260q726o7875
53444a5810P913K8368q5309j18208N1264K05399J46139O615k1889L496k6595m4181
53432A37202o243n0409k01205k09133L8100K32676R6058j56208j53781N8729J67132
53421d7082J06599N0159L5698j5940l6253P2698J64747M5980j58039j77049l8411
53410C107J4384m8343n4519M095j3376o7667Q093J52682J33921l8880j05290K0559
53398H766J36140R8277q832q8908j44336j41284k1930J22671J31157L0367j7214
$$ y = [-97979, -131120, -93888, -49760, -79221, -160820, -185120, -85017, 72826, 152429, 98357, -16414, -92860, -99072, -49568, 30059, 81211, 37340, -75217, -139369, -104235, -52771, -57261, -76009, -66077, -73634, -115795, -105132, -11281, 38871, -35872, -107317, -43469, 60791, 52065, -15810, -7897, 20471, -64838, -183046, -131782, 73617, 219756, 226371, 204482, 207978, 181383, 137202, 130959, 80550, -120655, -329788, -291688, -59012, 37046, -119162, -272943, -214214, -47082, 59517, 109676, 145374, 129434, 93181, 165879, 330626, 376606, 218567, 41518, 3107, 17491, -30852, -85371, -81276, -94652, -162319, -154226, -1544, 132377, 93497, -11793, 8766, 144906, 243183, 234351, 145443, 1107, -140177, -162107, -39436, 91721, 122088, 104874]
53387A04874j727m3080j08262m6642R1132P9506r5305j76047l8272J22695J11271
53376A43l189n5925k0626L9289R1666J11188O3229j9580n4199l2817k1671l0894
53364F6614j1598K1204k05o0490o7789k52O6186O9224P716q5531j34002n3435
53352a82358J07913J67926O1022m2362n516M5772m4718j63518j08340N2748P9580
53341c1851n3664j40685p7405L3318R5876J20544J15372O5257J999m9710j30114
53330e1063k09740j27268J49696L51709K37835l4247j37603n2048q553n9849m6892
53319A1977M9712O3482l9926r6023k8336M9216M7498N303l3749n9563l1017N2777
53307h649P7225j3813p2892J7383J04730J4920j11104l8739J31359J09870r4460
$$ y = [104874, 103147, 60067, -48195, -94837, -3705, 75801, -19504, -195551, -233823, -111128, 143, -3046, -58971, -79597, -40308, 51358, 162546, 225775, 206195, 151996, 119179, 97508, 66614, 55016, 76220, 76015, 15525, -52264, -52516, 13670, 82894, 90610, 5079, -128923, -182358, -74445, 93481, 154503, 112141, 106625, 152397, 107679, -55839, -164179, -111431, -31851, -85515, -226200, -303605, -270287, -174411, -53867, 61505, 126762, 128761, 79051, -51063, -260803, -388071, -238375, 113334, 351169, 316922, 179319, 127271, 118718, 58869, 11977, 61689, 125171, 85245, -10778, -39114, 10102, 57600, 62903, 29154, -30409, -61426, -8649, 68576, 54763, -18129, -746, 103984, 118904, 7800, -30939, 100420, 210290, 115830]
53296A15830k02779j26950l6047L671Q6190J75406J23263j3711k6148P2991P4431
53285B46147k5675k1341Q8045O7021j17804k10633r8121L3820O1441Q4136J29095
53274B36131N6286j20718j68578k9398N0127o2850j61799o8987P0641O3861j9341
53263a54625j5380N6809P8284L1028k9634p2109o7474n166L1481l4411r5662R502
53251b67357J95689K09350K4687j11662p0502K675k0733p4546q3754p7361n1618
53240c25132M0629J24781P6155k7289K677J16071Q2053r0703j39449J919J00946
53229c7342M7952R348O2728N3481n8794q0300M2341Q6428m5731j41718o8972o38
53217a31217o0969q8635L3395J37954Q5851R536K5490J0986j05553j41334P413
$$ y = [115830, -86949, -213899, -249946, -246275, -160085, 15321, 138584, 124873, 98725, 171716, 246147, 220472, 199131, 287176, 354197, 236393, 25760, -72361, -38541, 22900, 107036, 236131, 292417, 171699, 3121, -26277, 23850, -39000, -200799, -269786, -199145, -135284, -154625, -170005, -113196, -34912, -3884, -33518, -105627, -173101, -178267, -146786, -181197, -276859, -267357, -71668, 137682, 162369, 50707, -19795, -17120, -37853, -112399, -196153, -273514, -325132, -284503, -159722, -83567, -110856, -108179, 7892, 89945, -758, -140207, -138288, -37342, 10610, 19958, 82686, 136167, 77373, -2927, 39414, 125842, 80111, -61607, -130579, -131217, -192186, -280821, -247426, -109472, -23621, -14085, 11405, 22391, -83162, -224496, -217083]
53206b17083J27318M3472p1951j7649Q3255L4594p6933o9837R257L0195L7649
53195h7713R9838J11772R917l9413O7546J29502j8777j67774o8480J22362J06084
53184B64864m4199m3387P7847M3726j42161j84883j6823Q4248l0359j51428q2557
53173b25112O5174J10595R2951J34889J81276Q1335j36915k54819j44514N3862
53163d1278J04146k8166j46177j00406J6559L6448k8970m4557P636K8471P540
53152a88754K8668P8037N5538j3957P76Q8182R7050K0244J8808J05804Q3510j03434
53140B70472k27205j31400K2953K9453o6481j11503q8121m7947K1517J08101J16096
53129a04065L0700k1405J4211K9056k4622l2666M4780O6550k7477q3555r045O0951
$$ y = [-217083, -89765, -46293, -118244, -135893, -52638, -18044, -94977, -164814, -155557, -125362, -87713, 12125, 123897, 133814, 94401, 161947, 291449, 272672, 104898, 36418, 158780, 264864, 220665, 177278, 255125, 298851, 156690, -28193, -45016, 39232, 8873, -142555, -225112, -159938, -49343, 43608, 178497, 359773, 441108, 304193, 49374, -95140, -41278, 62868, 34702, -111475, -211881, -195322, -158874, -187844, -232401, -224765, -196294, -188754, -160086, -82049, -26511, -40468, -39692, 48490, 145540, 165784, 184592, 290396, 373906, 270472, 43267, -88133, -65180, -35727, -102208, -213711, -301832, -349779, -328262, -220161, -104065, -73365, -94770, -80559, -51503, -76125, -108791, -64011, 2539, -24938, -108493, -117538, -56587]
53117e6587K8185J0355Q1240R4424k9796j03005J1723J28662M7356j01210r7531
53106A3816j0312k8899j03148o5001L9082M8328k797K2241O8343p668j27164q7506
53094b40685Q7072J78783J21498M5169Q161n2871j22134j03135j9674N913k3445
53083a15348R629R9456J03473q774q7935l3817O6757Q5715J9120m0052j8411O8052
53071A47865J16284L3971j24713j87446q4501M7510N8408j9218o2599m6287k1295
53060a42021N082M6327O4854L5067J2885M3790P3554M3976k358r169j5494p4529
53048H1964j37279j21218m0439J9283J3475k8691m2036K3203J27031J37015K003
53037C4311j15543m0595J23858J26965k6441p5379N9196J38867J2105j42663j34061
$$ y = [-56587, -28402, -18047, 63193, 157617, 127821, 24816, 36539, 165201, 212557, 111347, 13816, 3504, -25395, -128543, -193544, -154462, -106134, -108931, -86690, -18347, -26015, -153179, -240685, -153613, 25170, 146668, 191837, 199998, 147127, 24993, -78142, -97816, -91903, -115348, -105719, -6263, 97210, 88436, 501, -33316, 33441, 119156, 138276, 98224, 79813, 147865, 264149, 298120, 173407, -14039, -98540, -51030, 7378, -11840, -74439, -120726, -142021, -136939, -90612, -25758, 9309, 22194, 65984, 139538, 183514, 181156, 171987, 156493, 81964, -55315, -176533, -216972, -197689, -184214, -212905, -254941, -231738, -104707, 32308, 34311, -81232, -121827, 2031, 128996, 102555, 27176, 86372, 225239, 237344, 94681, -39380]
53026c9380m7503k9582k6055N0768J01681J6619r4794o8457N0394J03204N9678
53015G6573n587n8038p3336P730J47797J71961O652j70473j62436j1747J00810
53004B9906R3497P810q0944q8671J0807R2008J5621j17142p5384J09168J52019
52993A48695j7145j31954m9629K3083o5557j41169n6349L1089j4597l6286Q0134
52982b29685J29541l8133j85151p6839R4654O0099l5915P6291K54110J69909r2765
52971A26116j57302K0949J13179k2034j57825j08088L5834J24294J23612M3406
52961A42141p9712j32196n4508L1012Q439k3918N5221J32759N0141r0539r3940
52950e5100j5931l5644j01653l5954R9712Q5032o4491j17695j5881P2544P1451
$$ y = [-39380, -86883, -116465, -142520, -91752, 9929, 26548, -68246, -136703, -86309, 16895, 76573, 70986, 12948, -60388, -52658, 95139, 267100, 273752, 103279, -59157, -70904, 29906, 123403, 131213, 50269, -38402, -27595, 64413, 80034, -37108, -112492, -3324, 148695, 131550, -404, -50033, -26950, -92507, -233676, -290025, -258936, -273533, -309819, -229685, -100144, -138277, -323428, -400267, -305613, -245514, -281429, -205138, 48972, 218881, 126116, -31186, -10237, 102942, 80908, -76917, -185005, -149171, -24877, 98735, 142141, 62429, -69767, -124275, -93263, -84824, -108742, -53521, 79238, 129379, 38840, -55100, -71031, -106675, -208328, -244282, -144570, -59538, -124029, -241724, -257605, -185061, -113610]
52939a13610P2722R6832O0597j0949k455N8632L3195o8280r5607k7441L463m4249
52927c7150p0490l5505q311p368K3640P7178P8644J8002m2571o5867m7054J0860
52915a05992N0229j790p9997l6436Q1576N1825j19281j26521J23277K82903J10981
52904B30774j15306p9959L4480p3444k27518q5112J96963J92301m9063r1026J14551
52893D7641J59756p6931k14152l0998J80722J33618k6613m8941J9094L565p8814
52882F7947r7715k8388O1068J10344P7200k3418p3873M740R4020M1162p5495o6223
52870I1369M1486N2461n2695r5730j4705O1357N7663L2408P603n4286j11283q6993
52858g1345k6557j3413K054Q3352J19944J379j31613q3164N7995O7575l1109m5839
$$ y = [-113610, -40888, 55944, 116541, 105592, 103137, 161769, 194964, 126684, 31077, 3636, 7099, -37150, -107640, -143145, -151456, -158824, -135184, -58006, 20638, 38640, -3931, -69798, -116852, -105992, -55763, -57553, -137550, -173986, -92410, -40585, -159866, -286387, -163110, 119793, 230774, 115468, 35509, 69989, -3455, -230973, -316085, -119122, 73179, 24116, -66910, 47641, 207397, 130466, -83686, -114684, 66038, 199656, 173043, 124102, 143196, 146761, 67947, -29768, -58156, 2912, 113256, 190456, 167038, 93165, 97905, 191925, 233087, 157592, 91369, 132855, 185316, 132621, 36891, 22186, 83543, 141206, 173614, 181217, 126931, 15648, -71345, -97902, -111315, -109261, -25909, 94035, 95414, -36199, -119363, -61368, 6207, -24902, -70741]
52846g0741K1087J7713l5893o778N0398r514j07506o6647M0632K9840j9866Q0192
52834g7083K09063J07293j21442j46331J5015M5489q4381r2511N1791P1642o6908
52823h8363p9588P9757J13972n3339j27997m52O3970m0114m6448J47308K29082
52812A97788J5184k11220j82327n1401l4483l6473P1867J57296R3773J0419J3108
52801D3531j9309j19841o7051J96306L34843J21896j61421j63920K217K4425q2040
52790A09636r2737j2378j2576p6567n4717K8753K9476m1256n8302j9241p741o502
52778b14152M3165Q5601M8588N47K7989N9203q877j07630r9227K547P6018Q0838
52766e390O4720N3646M8508N6049M3959l6041j25239r6799K5020N5519o5836j69763
$$ y = [-70741, -49654, -31941, -67834, -74612, -24214, -33728, -141234, -207881, -167249, -137409, -157275, -77083, 131980, 239273, 117831, -28500, -13485, 32004, -52377, -144888, -93097, -21455, -88363, -167951, -88194, 25778, -27561, -155558, -156010, -92040, -132154, -178602, -31294, 197788, 212972, 1752, -180575, -231976, -266459, -302932, -231065, -73769, 20004, 30423, 43531, 24222, -95619, -162670, 33636, 368479, 490375, 328954, 165034, 167251, 191676, 109636, 16899, 4521, -8055, -84622, -139339, -110586, -81110, -122366, -180668, -199909, -207650, -214152, -170987, -85386, -36798, -36251, -8262, 50941, 42064, -65566, -164793, -162246, -86228, -5390, 59330, 112976, 161484, 217533, 261492, 225451, 100212, 3413, 28433, 83952, 18116, -151647]
52754a51647j30341m5136k6042j2476O0164R4475O622q6007l1425J15426J76270
52743c0117R1167m5225j15177o3311O6104J29671L0067j15746r8691P1635J60569
52732H0946N2810r7637j25943o2127L082O0863J00196O6385n026R235J01798J04503
52720B89085l8279j56908j15217l059L1034k1399q7304j22022r1631J4317J13593
52709a87790J17975Q5113J10598J11210m4941k32826j98265J4404J02209J255
52699a21058k7548J13615J82997N2811n1715L0595J02273k2948j75446j29479
52689d5903K3214P7179N5371P4101P7222j9031r7141k4921Q2431M4783p1873p6356
52677I9076K4360N9816k1928j11172j20513n4888M2437R7114L8504q0444j04240
$$ y = [-151647, -281988, -327124, -353166, -365642, -305478, -211003, -204381, -290388, -321813, -206387, -30117, 61050, 15825, -99352, -162663, -96559, 33112, 63179, -52567, -151258, -79623, 80946, 133756, 36119, -89824, -151951, -148869, -88006, 12190, 78575, 73549, 82784, 184582, 289085, 250806, 93898, -21319, -24378, 6656, -14743, -102047, -224069, -315700, -301383, -187790, -69815, 15298, 125896, 237106, 192165, -40661, -238926, -224522, -122313, -121058, -148606, -34991, 148006, 200817, 149102, 179697, 281970, 259022, 83576, -45903, -22689, 54490, 109861, 183962, 261184, 242153, 145012, 120091, 202522, 247305, 175432, 99076, 123436, 183252, 161324, 50152, -70361, -125249, -82812, 14302, 52806, -27638, -131878]
52666a31878O956J12606J15298Q5081Q1032L6966o9753j23148o2202O042l80j1690
52654D4930J8651O230p6982j03421r421P4491M3796j5528j1387n231n4621q2114
52642a70607l3395J3858J7576N6102J33253J10908l9138j37460q6387k8132o6125
52631b29547p0872N5413J54016O3630r7137j18386p884Q7867J22463J23613O8581
52620A51757l8136q8092k3824M9461L1098k9326n7023o8398o7344O72R9494R9620
52608E9959J1490K660R1294P7481r9206k09516j05250K9893j367r1568n3731N4457
52596b33404O9256N667j9659j489J0300L7938Q5162P2477L057J5617J34711J70658
52584C50291K2688j27028r4243L0895O4764K424o0847j05452j31847r9211m1760
$$ y = [-131878, -124922, -12316, 102982, 188063, 269095, 306061, 236308, 113160, 50958, 57000, 56620, 44930, 63581, 69811, -7171, -110592, -120013, -45522, -1726, -17254, -28641, -33872, -88493, -170607, -204002, -190144, -172568, -116466, 16787, 127695, 88557, -48903, -135290, -163422, -229547, -300419, -245006, -90990, -27360, -124497, -242883, -250767, -162900, -40437, 83176, 151757, 113621, 25529, 1705, 51166, 82264, 52938, -4085, -72483, -139827, -139155, -39661, 59959, 71449, 74109, 165403, 242884, 143678, -65838, -171088, -141195, -142562, -234130, -287861, -233404, -164148, -158481, -178140, -179629, -169329, -131391, -46229, 26248, 29305, 44922, 179633, 350291, 372979, 245951, 151708, 182603, 247367, 249791, 188944, 83492, -48355, -147566, -189326]
52573a89326n8876r8444J2261K27788K67508O2495j00373m3019L5387l9833j00639
52562b5071J5026J28638M7459o8263j388J16360M8752j11938j17193M726L8884
52551G5992k5141k0131P7816J40463J16195L6230r8960k34803k10061K011J63230
52540B2841R3287n7178p4828k1343n3178j06270m2465O1908N7623J501K3339O2316
52528c2447L601o6688j1143Q8812P2325k0283n3750n1439r9143j29350m2984Q0025
52516b62464J14937J01949J16601R1632k2875r9355m7510L110m8317o3159O0211
52505e5240J41112K4478j08546m8615N9282j2674j40427o8530J15696J32543l09
52494C8770l3115N4811N6279n3542q2817J4573P4578K4558l3708l9202k6942M426
$$ y = [-189326, -248202, -346646, -334385, -106597, 160911, 223406, 123033, 80014, 115401, 75568, -25071, -10045, 118593, 166052, 97789, 96401, 212761, 261513, 149575, 32382, 37108, 75992, 50851, 30720, 108536, 248999, 365194, 401424, 302464, 67661, -142400, -140389, 22841, 116128, 58950, -15878, -37221, -90399, -196669, -239134, -177226, -119603, -118102, -94763, -32447, -28846, -95534, -106677, -17865, 54460, 34177, -19573, -71012, -170155, -299505, -342489, -262464, -147527, -45578, 71023, 162655, 139780, 40425, -7085, -3975, -52292, -115451, -55240, 85872, 110350, 1804, -46811, 12471, -203, -140630, -209160, -93464, 39079, 38770, 5655, 60466, 116745, 63203, -19614, -5041, 69537, 94095, 60387, 21185, -5757, -1331]
52482a331O0405M3198j05589k29011j41331Q6291K30548K11776R6329o3323j87752
52471B10j29690R6623K11793M3496j73540j37812O2157J34389N5090J7746M7645
52460B28107J5228n8937m2335L4172L5714j1149J3176O8565L5750l9470l7911
52449B40910q98k5015m6175J8504N5730m9499j57576r5674K5456J6630l6824M2260
52437a2171J48465O2711j35358j89610r5619m9756o8721j5121Q4521R4103N4703
52426a21853Q2754Q6784o4577k07021r5305J43025J69244k2641j29178n3651J2736
52415a99683l12L5405J10498O3577o9559p1199N7506P9826m6375q9351L3717J10084
52403A4134J4049q6292l8136N3212L5161n1138p3818l569R0041J29891P9952j3659
$$ y = [-1331, 59074, 102272, -3317, -232328, -373659, -287368, -56820, 154956, 251285, 187962, 210, -129480, -32857, 178936, 222432, 48892, -88920, -26763, 107626, 162716, 180462, 228107, 243335, 184398, 142063, 176235, 211949, 200800, 213976, 282541, 318291, 278821, 240910, 240012, 214997, 168822, 187326, 243056, 193557, 35981, -59693, -34237, -17607, -54431, -12171, 136294, 199005, 63647, -125963, -221582, -271338, -340059, -355180, -270659, -176556, -121853, -39099, 47685, -16892, -223913, -319218, -176193, -6949, -29590, -158768, -212419, -199683, -199995, -164590, -54092, 9485, -60074, -131273, -73767, 6059, -40316, -129667, -95950, 14134, 28183, -58109, -96245, -43033, -7872, -59010, -132828, -136397, -46356, 83535, 163487, 149828]
52391A49828m5922P716M5921J3013j3250l750o3979j97582k03743k551J69280
52380a45019J19137J0910M4442Q0584p5627k51445j58286J09500K24344J35427
52370I3967M7203J9493k8183l6944P8242J49907j6518k46432k21171K712J03033
52359e4691K5462j0530L7981Q550r0220q5108O465J1286m6115L201J16294J08188
52347C0763J7658K6864Q7938J8784j08354q1571K9769l433j08282k6039J74729
52336E8826J83792J3031k2098J15404J22214q4136k28343j76024j14341j47033
52326b78708j35561l4210J5422Q13O5071J65505J02532o4278m6082J65198K39201
52315A94903M9229j37456j21027l4879k9596m5598k2204k1278m8301k8285K177
$$ y = [149828, 103906, 111622, 157543, 170556, 157306, 153556, 89577, -108005, -311748, -314299, -145019, -25882, -14972, 29470, 110054, 34427, -217018, -375304, -265804, -41460, 93967, 141170, 160663, 132480, 95536, 173778, 323685, 307167, 60735, -160436, -157724, -54691, -29229, -39759, -1778, 6772, -83448, -168556, -162091, -150805, -196920, -193719, -77425, 30763, 48421, 75285, 163223, 182007, 73653, -7918, 21851, 18418, -89864, -115903, 58826, 242618, 255649, 233551, 348955, 471169, 387033, 158690, -17334, -131675, -278708, -414269, -448479, -433057, -432244, -367173, -201668, -99136, -163414, -209496, -44298, 194903, 244132, 106676, -14351, -49230, -78826, -124424, -146628, -167906, -216207, -244492, -242315]
52304b42315m0957n5604R4653K49927J52235q1787j12160M3232N1306j23576j60766
52293b25812J8885J16453J3927l5333Q7434J51124L2086o2652r951J1327r7615
52282a27j49204l2696Q0282O7094M5376P9584M3520p5043p8500P8308J62242M8077
52270B68913q4796p8212j3575J4391M4081O8708O447q0565m0362N8892P661j39185
52258C2398j18337N4157P7205r4326j52983J4958J36513M6219n6561q022O4180
52247d599N1161M8330P6052q654j72988j62773N1105J62467K6116j15519p0788
52236a20090J1979k1363o3879q477M6922L1347L8295Q9031N9279m2900m1334O7931
52224D6741P3432o3393j24801l0517M3729K4740M5786J10805M4244j36065j90125
$$ y = [-242315, -283272, -338876, -244223, 5704, 157939, 76152, -36008, 7224, 58530, -65046, -225812, -206927, -90474, -76547, -111880, -24446, 126678, 158764, 96112, 86161, 97488, -127, -149331, -182027, -101745, -34651, 10725, 90309, 133829, 58786, -19714, 58594, 220836, 268913, 184117, 105905, 92330, 106721, 150802, 219510, 225957, 145392, 105030, 163922, 171583, 32398, -85939, -31782, 45423, -48903, -201886, -186928, -50415, -4196, -60757, -68779, -4599, 46562, 94892, 170944, 162290, -10698, -173471, -122366, 40101, 66217, -49302, -120090, -108111, -129474, -193353, -201830, -154908, -123561, -85266, 3765, 63044, 20144, -21190, 46741, 120173, 56780, -68021, -98538, -54809, -30069, 15717, 126522, 170766, 34701, -155424]
52213a55424q1219k6916o2083Q954J57918J13650j06355j49997N7522J71871N0742
52202b1337j5036J20207J84434K6121r4313j2823L5270j01709j84195m6581Q8182
52191b1780M9477K4384J30945J40403o5297k07752j09166l1360j71369k58728
52181e20243m4886K12026J73724j6388k3987J16442J46820N3663Q220K3380k798
52170A25973n3819n9343m2446k5113L0084O8355k4208j51299p9413J37947J77331
52159A04049j5435j20021k411P2935m0031j11499o512N3845n7900j19078j171
52148b43229P6263j1687m9864O6326J00793m0496q1574Q9398J62160j3885j12591
52137e8386O0155J73062k0831k04644p2390J12912K0167j48604p0604R5868M8488
$$ y = [-155424, -236643, -263559, -325642, -316688, -158770, -45120, -151475, -301472, -243950, -72079, -21337, -36373, 83834, 268268, 294389, 200076, 187253, 222523, 120814, -63381, -109962, -21780, 27697, 52081, 183026, 323429, 258132, 50380, -58786, -90146, -261515, -520243, -565129, -353103, -179379, -195767, -219754, -103312, 43508, 97171, 105391, 128771, 125973, 72154, 12811, -29635, -54748, -24664, 43691, 19483, -131816, -211229, -73282, 104049, 88614, -31407, -33818, 39117, -914, -112413, -118925, -65080, -122980, -242058, -243229, -166966, -178653, -228517, -162191, -61398, -101894, -183468, -94070, 68090, 54205, -58386, 1769, 174831, 154000, -50644, -123034, -10122, 10045, -138559, -209163, -113295, -64807]
52126f4807q1969j4326J39573J17070O280L0609R8382J5720j07469q1605o393
52115E1065k9798k7172J01349J34969p0186k24329o4088J67212J34003l4345n3086
52104H5594r254r7203j53788K8946K19317J00090j49720j48459M2187P9573n5452
52093e8169j17552q0671q7001q2699M6596J51263N6827o4351J9546J55695Q3261
52082B2745p1969l6507R5407N8842p0589m3330P0097L2367q3534m8626N2957r499
52070c1639j29804l8369J69543J69790k5733j15285l9850j3750q4548r3580k7044
52059b60269j0264q467R7083K10136J54149J2062j8309J0150o6419j54793o7050
52048a01991P7993L1087j14007n5243J74407K32003K5874j47838p1853J20174
$$ y = [-64807, -146776, -161102, -21529, 95541, 101821, 132430, 230812, 246532, 139063, 57458, 51065, 21267, -5905, 95444, 230413, 160227, -64102, -128190, 39022, 173025, 138680, 85594, 76340, -20863, -174651, -145705, 73612, 173702, 23982, -124477, -82290, -2717, -58169, -175721, -256392, -343393, -426092, -379496, -228233, -171406, -235757, -216211, -60516, 22745, -49224, -85731, 9676, 68518, -2071, -45401, 24696, 57063, -26471, -75097, -22140, -31639, -161443, -199812, -30269, 139521, 113788, -1497, -41347, -55097, -139645, -233225, -260269, -270533, -279000, -181917, 28219, 182368, 194430, 176121, 186271, 119852, -34941, -101991, -23998, 7089, -106918, -162161, 12246, 244249, 270123, 122285, 50432, 170606]
52038A70606J96902J01999o7451j74344j34321j5223K2544l7398m5713K4809J4361
52027E6771r4367r0000P1210J32390m883p5669M8940Q0670j49184l02119q0669
52016d06910K31298K24339O999p5498m0867r3947j40219J3518K09883J83173L5385
52005A47154P653R946j45109k76086j11166J69016J82606k4313r9652J0009O4998
51994f4944J6479J3815L4989m9950j46526p2336Q3347J06647K9328O756M519n1829
51982h9705l5842J17764J71993j3995j45749K6388K15280O8311j94871j61398
51972d1824N5515O8602p0460l6418J00357J6977j99361j72332P6915J73830M8904
51961B0705k7831j811n3011j22147J2473K26229J76744q1864j58211J2834J01209
$$ y = [170606, 367508, 469507, 402056, 227712, 93391, 78168, 100712, 63314, 17601, 42410, 56771, -37596, -127596, -56386, 76004, 71121, -4548, 44392, 125062, -24122, -326241, -406910, -175612, 48727, 55726, -19772, -60639, -154586, -294805, -281287, -71404, 111769, 147154, 154807, 164753, 19644, -256442, -367608, -198592, -15986, -40299, -139951, -129942, -64944, -48465, -34650, 339, -49611, -196137, -268473, -185126, -78479, -49151, -42395, -37876, -89705, -125547, -7783, 164210, 150215, 4466, 30854, 246134, 314445, 119574, -41824, 13691, 82293, 11833, -24585, 75772, 92749, -106612, -278944, -202029, -28199, 20705, -7126, -8937, -61948, -184095, -171622, 54607, 231351, 149487, -8724, 4110, 105319]
51950A05319j3035q4274Q014R0242O8170M5738L8141m7780j45919j09098k0380
51939f4862o5464j60120p7891J26670K00173J16794N5300M2575k0130q1571l9356
51928C2118J3227l2362m7977P1453J28886k7396j50073l645J65623M4884j56994
51917C7744p0237J60580J40585p1993j25521l3643o3777j45367j1358K13787J84301
51906B15101k8733o9530M9263K4964j14572p6053J00766J04746n6513r6072j018
51895E2349K287n8290J5092J25065M0327j11015n4689Q6017K4567j03239O075
51884B4546J85209O4458k10161k09288L955L3323q7044k1031J42929O2731j13771
51873a24144J4172K58801J07987k69697k17329K33171L47748o1697l42645j40231
$$ y = [105319, 92284, 8010, 16024, 106266, 174436, 220174, 258315, 210535, 64616, -44482, -64862, -130326, -290446, -368337, -241667, -41494, 75300, 130600, 173175, 153045, 71474, 32118, 45345, 12983, -34994, 36459, 165345, 137949, -12124, -15769, 149854, 194738, 37744, -32493, 128087, 268672, 196679, 71158, 37515, -26262, -171629, -182987, 30800, 215101, 186368, 116838, 166101, 191065, 76493, 440, 101206, 205952, 149439, 53367, 52349, 54636, -3654, 11438, 136503, 176830, 65815, 11126, 97143, 121710, 18471, 24546, 209755, 274213, 64052, -145236, -141281, -107958, -195002, -216033, -73104, -10373, -124144, -109972, 148829, 256816, -12881, -230210, 2961, 350709, 289012, -53633, -193864]
51863a93864R8880L2247l7647J24688K12223K913j96973j13196N4524P2661M9632
51852A06088J03002J17028M4387J7648K8648o8249j84071j04444L9859m7854k27005
51841a74963j15288J64625J37535j47170j66666J14184J64114j22067k14661O4376
51831b95981K05031m4478k16987J1537K55365J45862m9386P777J30312L6490j23128
51820F2414j00924M749J0851j6803J3850J7995k3953J8794J13463N7327j03306
51809E4457q6283J01704J35217m3221j18994J2014Q7931J4024P467R8982M3848
51798C07146j55583j95415m1019J5093n3163L8200K51083K04063j00504k01017
51788F8884K5119J63454K3793q6946k9209o4321k21768j49437J68000K56063k2001
$$ y = [-193864, -94984, -62737, -100384, 24304, 236527, 239440, 42467, -70729, -16205, 56456, 106088, 209090, 326118, 370505, 388153, 416801, 348552, 164481, 60037, 99896, 52042, -174963, -290251, -125626, 11909, -135261, -301927, -187743, -23629, -145696, -360357, -295981, -90950, -135428, -352415, -340878, -85513, 60349, 10963, 18740, 149052, 185542, 62414, -38510, -33761, -22910, -39713, -25863, -7868, -31821, -13027, 100436, 157763, 54457, -31826, 69878, 205095, 161874, 42880, 54894, 142825, 156849, 164316, 263298, 307146, 151563, -43852, -84871, -69778, -122941, -84741, 166342, 370405, 269901, 68884, 94003, 257457, 281250, 194304, 165095, 100774, -120994, -270431, -102431, 153632, 131631]
51777A31631j97065l5064P6645r4454j86350M0092K27679Q5281j01657m3694N1192
51766d5764m0224j21026j8085N7438l6700o7694Q0964J26378o9121j87364k4907
51755c46105J37422O6968k7445L7382O6686o5584j16036M8165J48239j283j46561
51744a98152o0522Q8014J07741R0642J05726L2629r5633m9154J31166J20784r4713
51733A78528j60729j3100J2499j34405r3891J71121K23762m3880j78170J0266
51723b7999J23072l3435q3959J45838K40942k7891k52451j27178L8434l3540r4386
51712a32553N4902J39720j0618r1808O0351J17969q1909j85078j9297M4849j52480
51701b55952j72811J85209L98929J05555k35464j43033R6467N3134p1406N7863
$$ y = [131631, -65434, -100498, -23853, -118307, -304657, -264565, -36886, 48395, -53262, -96956, -45764, -85988, -207014, -225099, -167661, -204361, -272055, -191091, -64713, -133834, -321198, -346105, -208683, -141715, -169160, -131778, -65092, -130676, -246712, -198547, -50308, -51591, -198152, -258674, -170660, -62919, 27723, 133449, 166078, 70445, 21291, 152457, 273241, 178528, 17799, 4699, 17198, -117207, -211098, -39977, 183785, 139905, -38265, -27999, 95073, 61638, -22321, 123517, 364459, 336568, 84117, -43061, -4627, -38167, -132553, -77651, 62069, 51451, -40357, 19994, 137963, 56054, -129024, -148321, -103472, -255952, -428763, -243554, 155375, 260930, 25466, -117567, -21100, 32034, -39372, 18491]
51691A8491K13412P0191j37344n9142J22525P9567o0130m6977j5039j32531j81857
51680a28834J0278J60940K7137j35786o9557J1715r8698j48329O4600K34558R8658
51669B6682n8531M3943J34108p5965k90337j30544J92806K56585R0738k9374q4263
51658G5848j52183j22767K7617O2108p1215o6531J55130K17665k2968j59075K4024
51647c2347J21651j31173l24644j04570J87087J45427j8608J1063M7737j18765
51637b17142j97449N0900K64242Q2770j95418j49769N2814O1618j2359P3092J61429
51626b5272M9800n6311M5569J23584k8012j54643l0267R9472J1150o6170M7289
51615A6189R0329r0442j73517J0935R6240j18074k23957M1541K67030J18698n4885
$$ y = [18491, 231903, 302094, 164750, 105608, 228133, 307700, 247570, 200593, 185554, 53023, -128834, -118556, 42384, 69521, -66265, -135822, -124107, -222805, -371134, -306534, -71976, 26682, -31849, 12094, 146202, 70237, -220100, -350644, -157838, 98747, 189485, 160111, 75848, -76335, -199102, -171485, -109377, -180592, -247123, -91993, 125672, 102704, -56371, -32347, 89304, -41869, -366513, -471083, -283996, -138569, -157177, -146114, -98377, -217142, -414591, -363691, -99449, -16679, -212097, -361866, -309052, -247434, -259793, -186701, -25272, 24528, -31783, 13786, 137370, 109358, -45285, -75552, 23920, 35070, -31100, 16189, 106518, 16076, -157441, -146506, -50266, -168340, -392297, -350756, -83726, 34972, -19913]
51604a9913P4975J96115K0104j24214K9054J09645j45314k87245K7355L29955
51594B10517J66380p9959M8857K04917n9514l73098k08607J33137R0462j47812
51584a4720q1501J41579Q0105j23082n9884J37665R5861p1988n5739K3309o1491
51573A0114j20962J9409O3177j68592k60117N2274K89066O7362j52418Q2624L28878
51562B10815N7489l31010k25235R9927O5199j25810K7883K93184J63091j35915
51552I9618q5725J28375L3912j66505j9349K30645Q9734k06745j35914J06100
51542G4146J3186k23556j06795J59225N5515k17723j01682K51439K64408m718
51532A63445n8169O7705k5877k24526j24125J27699J00043q3240k7057J23689
$$ y = [-19913, 55062, 251177, 271281, 147067, 176121, 285766, 140452, -146793, -119438, 210517, 376897, 296938, 345795, 550712, 491198, 118100, -90507, 42630, 133092, -14720, -96221, 45358, 125463, 2381, -57503, 80162, 176023, 104035, 48296, 71605, 10114, -110848, -91439, -28262, -196854, -456971, -404697, -115631, -48269, -200687, -118063, 210815, 268304, -62706, -287941, -188014, -122815, -248625, -220742, 72442, 235533, 99618, 13893, 142268, 176180, 9675, -9674, 220971, 310705, 103960, -31954, 74146, 87332, -136224, -243019, -83794, -28279, -246002, -347684, -96245, 168163, 163445, 105276, 172981, 147104, -77422, -201547, -73848, 26195, -57045, -84102, 39587]
51522C9587N537j73220k3388K06197P1747j84010p8905J77829J07394r8689O213
51511E6292J89943q466l08225j62591J91694J68987p5654j7506J76555K2544k29800
51500C773k7394L52049K28412k19672k63207O5449J11795j59442j92540M6608
51490e4169P5775j08661p1680J48019J38305k7116L3741J77597J4341k28365p6144
51479B1643K26380J06525k55430k45211N6789R1382r8210l7731J75787P9891j83084
51468f1269j21327J27933P8926j22391j1247K12647N5839k39249j06399K32309
51458D5772J63739j42036q1301J96705J14575j52181j5790L13000J78232k43522
51448C77193k52464O0506N2455j90793q0778K27829J12240k38942j34694K55144
$$ y = [39587, 45124, -128096, -151484, 54713, 126460, -57550, -136455, 41374, 148768, 50079, 56292, 246235, 237769, -70456, -233047, -41353, 127634, 51980, 34474, 211029, 233573, 3773, -23621, 328428, 556840, 337168, 73961, 139410, 251205, 91763, -100777, -54169, 21606, -87055, -158735, -10716, 127589, 100473, 134214, 311811, 326152, 97787, 21643, 248023, 354548, 99118, -146093, -89304, 2078, -96132, -133863, 41924, 121815, -61269, -182596, -54663, 24263, -98128, -109375, 103272, 159111, -80138, -186537, 45772, 209511, 67475, -13826, 182879, 297454, 145273, 129483, 442483, 620715, 377193, 124729, 185235, 237690, 46897, -33881, 193948, 306188, 67246, -67448, 187696]
51438A87696J82451k36832k25075J79317K19271j35374k04566M6518K4088k21980
51428a84486r7441K61063J74380k09715j22751L30232L03375k04215l32684N7048
51418b5194K11863n0779j10911J40229J23643j90094j91921J28609J47072j43744
51408C8773j30763J57720R5675k44336j79449K12919J86761k19436k26426J84512
51398a24050K45485r9650j23070K17971K08493j66037j70889J94041J63350k54062
51388I1582k38158K25351K59229k15078k92747J90938L48888o5060k32524J20381
51378A92802K37170j55360l36244q624J87701k2314r9756J07675O7534k32200
51368f1616j45625K93176K92314j84444k69907J78661K95255j47372l20901O6907
$$ y = [187696, 370147, 133315, -91760, 87557, 306828, 171454, -33112, 13406, 37494, -184486, -281927, -20864, 153516, -56199, -178950, 151282, 454657, 250442, -82242, -25194, 186669, 135890, 24979, 165208, 288851, 98757, -93164, 35445, 182517, 38773, -91990, 65730, 161405, -82931, -262380, -49461, 137300, -82136, -308562, -124050, 121435, 21785, -101285, 116686, 325179, 159142, -11747, 182294, 345644, 91582, -146576, 78775, 338004, 122926, -169821, 21117, 370005, 304945, 72421, 192802, 429972, 274612, -61632, -70256, 117445, 95131, -4625, 103050, 170584, -61616, -207241, 85935, 378249, 193805, -76102, 102559, 397814, 250442, -70459, -3552]
51358c552K65506l2095j66922J04905J52537j86766k26073J91469L30211k0803
51348D08417j60918J13676J25258k80561l65076O9580K76224j6172j57340Q6243
51338I9331J30718j52101j52853J77327J55133k37888k32152K12920K68267j55064
51328A13638k13554K10364K71435j55226k15453K11374K46038k26323k73437K45158
51318B14014L41513j92270l51005J48736L27962j45826l37417J02694K78965j50564
51308B36802l10830J28183L01288j07827k40892J85552K84687k09951l55482J48154
51298E9684L33843j36597k93415K23509M27133r5403l82235J2655J87636k54579
51288H2231l91409J55146M03728p9227l14744J68640M08874q8658l76332P0365
$$ y = [-3552, 261954, 229859, 62937, 167842, 320379, 133613, -92460, 99009, 429220, 408417, 247499, 361175, 486433, 205872, -159204, -89624, 186600, 170428, 13088, 99331, 230049, 77948, -74905, 102422, 257555, 19667, -212485, 435, 268702, 113638, -99916, 110448, 381883, 226657, 11204, 222578, 468616, 242293, -31144, 214014, 555527, 363257, 12252, 160988, 488950, 343124, 5707, 108401, 387366, 236802, -74028, 54155, 355443, 247616, 6724, 192276, 476963, 267012, -88470, 59684, 393527, 256930, -36485, 187024, 614157, 518754, 136519, 149174, 336810, 82231, -309178, -154032, 249696, 170469, -144275, 24365, 433239, 344581, -31751, 38614]
51278C8614L42695q9345l56769N9052L32476j5788k01446J52557K21089k76039
51268B07096l73360K26930M36073j48683m09254J43013M00900j74307m74989J01918
51258f4663M74714k0790l73297Q1170L77387j21440m49051L8906L87797o5084
51248B65649m08859Q220L28811m0534k68110J42804L14082j79404l64471J75532
51238b6280L84622j79229m07738J62255L79266k25524m30395K60419N34698j91201
51228B60893n60345J16904N02519j49002n11584J95926O31512n6467n45050P9986
51218c4708N49486o2509n18360J01696N63815n4742n24109O3217M51119k48738
51208B86167o85958R7706O79820m6072o89509j6781O91515J53246m73915N5350
$$ y = [38614, 381309, 291964, -64805, -5753, 326723, 310935, 109489, 262046, 483135, 207096, -166264, 60666, 496739, 348056, -61198, 81815, 482715, 308408, -166581, -64663, 410051, 389261, 15964, 97134, 474521, 353081, -95970, -57064, 330733, 265649, -143210, -134990, 193821, 153287, -114823, 27981, 342063, 162659, -201812, -26280, 358342, 179113, -228625, -66370, 312896, 87372, -343023, -82604, 452094, 260893, -299452, -182548, 319971, 170969, -340615, -144689, 486823, 430356, -114694, -34708, 514778, 452269, -66091, 35605, 599420, 544678, 20569, 83786, 534905, 286167, -399791, -302085, 377735, 331663, -357846, -374627, 316888, 470134, -3781, 51569]
51198E1569O40944P1792n86527j40530M16066j3191m39370J14171N59158n3006
51188F21076n49274K8148M62332j69804n52695K21752O71744k08258q08174O3577
51178b19576P91744K5776o98871L3788P56183M0108o74872L5732P15605p6234
51168G29383q35322m0134Q01122O5708q09978j59314O80159Q4061o67432n4467
51158b06214O05145j07291p28509J59499R26766L7609q02869P1152R62500J47745
51148A065533o75495K07340R87223j18955j150718j02612J058796J13091j093296
51139B90907k49741R09846P5869j046994j43053J063181J95830j036423k10113
51130a50691J003833J87266r87993j29666J033116J14583j059107p1617J135407
$$ y = [51569, 692513, 764305, 177778, 37248, 453314, 440123, 753, 114924, 674082, 621076, 71802, 99950, 562282, 392478, -160217, 61535, 733279, 525021, -283153, -219576, 572168, 597944, -100927, -67139, 689044, 729152, 54280, 90012, 805617, 729383, -105939, -146073, 655049, 720757, -89221, -248535, 431624, 515685, -151747, -206214, 398931, 291640, -436869, -277370, 649396, 687005, -115864, -44712, 917788, 1065533, 390038, 597378, 1584601, 1465646, 314928, 212316, 1271112, 1384203, 290907, 41166, 951012, 1026881, -20113, -163166, 900015, 1095845, 59422, -150691, 853142, 1040408, 52415, -77251, 955865, 1070448, 11341, -60276, 1075131]
51121A075131P7658j179297m1603J302999R3347j411809k65555J278410J63959
51112A093240j326795n4013J595039L06372j479497k60835J532316K85266j541946
51103A49147k45599J620215K37094j691539j59859J974570M39249j820967k77531
51094B24780K051071L95764k120791m55214K173303M51082k267540l71544K588216
51085B669127N97978k619125n79320K872757P86845k848790n91497L377752J057483
51076D723210l138654n87578L972506J169500l816579o13144N157707J941977
51068H808945m105379J5276P491828L619049l601761L144643J4109468P365136
51060C6847205o076941K652433K3113603J9209847M917692L7540832J10413149
$$ y = [1075131, 1152789, -26508, -68111, 1234888, 1328235, -83574, -349129, 929281, 1093240, -233555, -287568, 1307471, 1613843, 134346, -126489, 1405827, 1691093, 149147, -96452, 1523763, 1760857, 69318, -90541, 1884029, 2323278, 502311, 224780, 2275851, 2671615, 550824, 95610, 2268913, 2719995, 452455, 80911, 2669127, 3267105, 647980, 68660, 2941417, 3728262, 879472, 287975, 3665727, 4723210, 1584556, 996978, 4969484, 6138984, 2322405, 1709261, 6866968, 8808945, 4703566, 4718842, 12210670, 15829719, 12227958, 15372601, 29482069, 36847205, 30770264, 33422697, 56536300, 75746147, 80663839, 118204671, 228617820]
51053B28617820J25768251K7330127r9757433j31344929o5907787o917089q922805
51046F8866155k6440917j4328280N303524N56670j2898249q636604L036901R24375
51038A6383575p294017m254179L601597J431634n119106k905624L196179J471463
51030F511522l756939j937520K976457J313223l269896j733795K622108J317434
51022D042594k717753j545717K229875J200428k274008j259474K051376J092380
51014B819701k122703j338680J664172J004282j703037r56990J681102R82527
51006B030374j559815r54188J386690P23559j540935q40423J437562Q32752j349232
50997A66344p83857J299736P26804j312367p57866J233288O79170j312139p99967
$$ y = [228617820, 354386071, 381716198, 281958765, 150613836, 84706049, 77788960, 68866155, 42425238, 28096958, 33400482, 33957152, 21058903, 12422299, 15459200, 16383575, 9089558, 4835379, 8436976, 9868610, 4749504, 1843880, 5040059, 6511522, 2754583, 817063, 3793520, 5106743, 1836847, 103052, 2725160, 4042594, 1324841, -220876, 2008999, 3209427, 935419, -324055, 1727321, 2819701, 696998, -641682, 1022490, 2026772, 323735, -633255, 1047847, 2030374, 470559, -483629, 903061, 1626620, 85685, -754738, 682824, 1515576, 166344, -617513, 682223, 1409027, 96660, -661206, 572082, 1251252, -60887, -860854]
50988h60854J218536Q70686j008848p28230R49880N36839j139299o47937J150171
50979C40944P86217r80236p13470R43937O48238j022587p84489Q69658P21017
50970H09229q47073p26923P82375P08498o89446n69526P98011O40300p76930p06160
50960e77645O64110O64294o03048o15236N40958M88758o30458n16357O42024N78922
50950F36322n11385m28187N97008M12951o69819m59075P16642N91987n82296n35527
50940b31379N71602N23411n63921n22914N61149N52078n18509n71554M09061M31522
50930F40546n22254n23693M38957M83107m04469l94770N04605M88481m32516m74988
50920a96994L66101L64463m54454l93424M67357L92892n27421m89023M94420N95896
$$ y = [-860854, 357682, 1228368, 219520, -508710, 441170, 978009, -161290, -809227, 340944, 1127161, 146925, -566545, 377392, 1025630, 3043, -781446, 88212, 809229, -37844, -764767, 17608, 726106, 36660, -532866, 265145, 905445, 128515, -577645, 86465, 750759, 147711, -467525, 73433, 562191, -68267, -584624, 57400, 636322, 124937, -303250, 293758, 706709, 36890, -422185, 294457, 886444, 304148, -231379, 340223, 863634, 299713, -223201, 337948, 890026, 371517, -200037, 209024, 640546, 118292, -405401, 33556, 516663, 112194, -282576, 222029, 710510, 277994, -196994, 169107, 533570, 79116, -314308, 153049, 545941, 18520, -470503, 23917, 619813]
50910F19813k97253m39003L56465M63776l09563m51732J91579K15544m17147l13461
50900c80982M54365M14408l49820l16770M41824L70685m74136m89445L33882L94336
50890C98347l74216m03763L88290M38204l68004m65879L19335M54694k97884m77586
50880c88462J89126L47169k40184k92214L36385L45067l63948m25681K97935M33613
50870B38806k06742k95347L50988M18665k80386m44368J39971K38015l04230k58339
50860d02967M42002M51906l36872m89250K46336M81581j26248l04720K60201L43005
50850E64974l14433m45147K28426M10196k35751m18837K59594N27372j12066m82176
50840a7848j9921K78328p1217j90030K27738K48251l38300m60155J56764L93215
$$ y = [619813, 322560, -116443, 240022, 703798, 394235, -57497, 134082, 349626, -67521, -380982, 73383, 487791, 137971, -178799, 263025, 633710, 159574, -329871, 4011, 398347, 24131, -379632, 8658, 446862, 78858, -387021, -67686, 387008, 89124, -388462, -199336, 147833, -92351, -384565, -48180, 296887, -67061, -492742, -194807, 238806, 32064, -263283, 87705, 506370, 225984, -218384, -78413, 159602, -144628, -402967, 39035, 490941, 154069, -335181, -88845, 392736, 266488, -38232, 221969, 564974, 250541, -194606, 33820, 444016, 208265, -210572, 49022, 576394, 464328, -17848, -37769, 240559, 169342, -20688, 207050, 455301, 117001, -343154, -186390, 206825]
50830B06825j33201l73085Q2138K59418k11997l77615J17390L39177n1165j57340
50820b99455K88406L56894j72252k86603K56004L66408k78370n46506L0323L94905
50810A09754k0024l13574N0125K74794q0347k28033J97955L40253j97336n12285
50800c78718p7531L22874J20196r9774P7096J18787k04352k55732J40318K48006
50790A1170j30496k17454K04778L27400j00857k61556J39121L12382n0458k09150
50780B4880J09278J83549j96076k63666J69185K78943j46593k58863J72370K76611
50770C49618j93968l38682J28047K88168j91655l92774O8469K91242j50184l78258
50760e19977Q4532M21587J28932q0790K11630K90590j98247m47992k6332K80793
$$ y = [206825, 73624, -299461, -217323, 42095, -169902, -547517, -430127, -90950, -142115, -299455, -11049, 345845, 173593, -113010, 142994, 509402, 231032, -315474, -285151, 109754, 89730, -223844, -173719, 101075, 20728, -207305, -9350, 330903, 133567, -378718, -456249, -133375, -13179, -112953, -35857, 82930, -121422, -377154, -236836, 11170, -119326, -336780, -132002, 195398, 94541, -167015, -27894, 284488, 234030, 24880, 134158, 317707, 121631, -142035, 27150, 306093, 159500, -99363, 73007, 349618, 155650, -183032, -54985, 233183, 41528, -351246, -282777, 8465, -141719, -519977, -435445, -13858, 115074, 34284, 245914, 536504, 338257, -109735, -136067, 144726]
50750A44726j7343k33799O0670J99761j71653l30953O8549K57156j23117k54609
50740d00612K47055M87394l5979m33629o6278K97127j0570l24204o785L23967
50730G7486M3515k78172l0297K76802P5655j71988J8571J74295j18730l17459
50720b50322l585K34907n4900k78700L3723K70566p6052l80957n3630L37913J44384
50709g6653j80522j0353K93054J68280q4483j989J26867n1847j88110J6055J32832
50698A43131j23287k46988P5715K78768k1225k52531K8679K84438M9570j71407
50688D4863P1589K58130q2097m03673j44228K30721J26150j19321m532J52694
50678A30296n9931k56593o590K88583J49072j02240l8041O0144j16195j99871
$$ y = [144726, 127383, -106416, -45746, 154015, -17638, -348591, -280042, -22886, -146003, -400612, -153557, 333837, 297858, -135771, -202049, 95078, 84508, -239696, -246481, 77486, 121001, -157171, -187468, 89334, 164989, -6999, 11572, 185867, 67137, -250322, -253907, -19000, -73900, -352600, -318877, -48311, -124363, -505320, -558950, -221037, -76653, -257175, -267528, 25526, 193806, 109323, 107334, 234201, 182354, -5756, 10299, 143131, 19844, -227144, -151429, 127339, 106114, -146417, -117738, 166700, 216270, 44863, 116452, 374582, 292485, -111188, -255416, -24695, 101455, -17866, -22398, 130296, 70365, -186228, -192818, 95765, 244837, 142597, 104556, 164700, 48505, -151366]
50668a51366Q1531K41751o5715l08795l4881K69124R0530j75595m4127J40953
50658D3410l7959k11201J5547K30351J5967j97374M5637L15980J00100k28812
50648I1646j30028J16666K1954j82770q1782R8144J2183q2882R5954K09910l3032
50637A35963k31269l2463J74946K2778j21813P7286K15981m1947k36395K4091
50627a2842K61751J4862k63680n4160K47652R3546j92108o7505K08607J23144
50617C59267j31356j11132L2477l0398j10009L4452J17137q2399j87234M4809
50607f4386J66799r9325k34501J14756L74630N3253l21817j49949J73272O0033
50597G2765j81204l1234K06527M9595j82465j8440K06942K9204j87592L0007K66013
$$ y = [-151366, -69835, 171916, 106201, -202594, -237475, 31649, 122179, -53416, -97543, 43410, 5451, -205750, -190203, 40148, 56115, -141259, -95622, 220358, 320458, 91646, -38382, 78284, 100238, -82532, -164314, -66170, -53987, -136869, -40915, 168995, 135963, -95306, -127769, 47177, 69955, -51858, 25428, 241409, 199462, -36933, -12842, 248909, 263771, 91, -54069, 193583, 287129, 95021, 27516, 236123, 359267, 227911, 116779, 149256, 118858, 8849, 43301, 160438, 78039, -109195, -64386, 102413, 3088, -231413, -116657, 257973, 311226, -10591, -160540, 12732, 72765, -108439, -139673, 66854, 116449, -66016, -84456, 122486, 151690, -35902, -5895, 260118]
50586B60118j9609l85975j69087K66401J70258k42760k43124Q3377J16411q1906
50576b45896K0533L08067K23400j41821k04260M9206J21667l9007m7268J07656
50566A52277Q8680q8845j26270m4254n3228n2386J18905K25276M0587j42955j8600
50555I9187J30690l7221k38693q5091J64511P8461j52148j04649J00417J06411
50545F1875k953J0079J665j75572k26376L9335K25509L1418j55915J4436J72065
50534d434m6129k46661j6672K54079R6221j51250k1358J68699k3774k43905j4125
50523b49309K92319J30504j63024j0750K83460J08785k78273k34495P9657O8343
50513B7217j62827j04447J16319M7057j17407P5782L46913J43763k60346k01952
$$ y = [260118, 240509, -145466, -314553, -48152, 122106, -120654, -363778, -280401, -163990, -245896, -225363, 82704, 306104, 164283, -39977, 9229, 130896, 91889, 44621, 152277, 240957, 152112, 25842, -18412, -71640, -124026, -5121, 220155, 260742, 117787, 99187, 229877, 192656, -46037, -131128, 33383, 111844, -40304, -144953, -44536, 61875, 58922, 69001, 70666, -104906, -331282, -291947, -66438, -35020, -190935, -176499, -4434, -50563, -297224, -313896, -59817, 36404, -114846, -136204, 32495, 8721, -235184, -249309, 43010, 173514, 10490, -260, 283200, 391985, 113712, -120783, -41126, 27217, -135610, -240057, -123738, -76681, -194088, -118306, 228607, 372370, 112024, -89928]
50503h9928J65770J83774r4634q9934J56859J16448j58591j62463M5505j1409
50493F1397k32921j21278K01633J76858j23870j20133J90507K52260j4167j39991
50483A30295j6498J5678p7659k3051R5024k3181k12324r6236J50968R3333j33052
50472i6703r0954J01922L7819j28540J5164K53184R8031k25821j30538K33505
50462F7069K27886j18092k17083k3102m36j35850j2000K45635J31302k13684j69935
50451b18290K16665K90018l9834j95817j9377M4329j13676j11013Q4300Q4693
50441B1998r7464o0915J36761M7980k44809k03650J55703K60631J4315r9507K5009
50430d3948o141k04402j42062J51831J76225q1518j01649J70788K27338j1509
$$ y = [-89928, 75842, 259616, 164982, 75048, 231907, 348355, 189764, 27301, 72806, 61397, -171524, -292802, -91169, 85689, -38181, -158314, 32193, 284453, 270286, 130295, 113797, 129475, 51816, 28765, 123789, 100608, -111716, -207952, -56984, 36349, -96703, -187657, -85735, -47916, -176456, -161292, 91892, 189923, -35898, -166436, 67069, 294955, 176863, -40220, -63322, -63758, -199608, -211608, 34027, 165329, -48355, -218290, -1625, 288393, 248559, 52742, 33365, 77694, -35982, -146995, -62695, 21998, -75466, -136381, 380, 48360, -196449, -400099, -244396, 16235, 30550, -68957, -43948, -50089, -254491, -396553, -244722, -68497, -150015, -251664, -80876, 146462, 134953]
50420A34953o2215J43454J13698k09393k75602M6950K10866l252j27925P1567
50410D3101J91041k87j56528o3885O420p4311m1231J44220J38279j00053j71006
50399h4240K4813J11686k7176o4114O7588L3377j69993j14871K25408L20118o563
50388C16033k57786j18564Q7021N9745l0269k0830m2948j04523k580J76105R4518
50377A55922j64791j42662J63260K33105n9427k23957m0850R2307n3512j50985
50367a91590O1J04677r007o3114Q0348J31224l8326j17719M9291J72336P4577
50356A92758j2540M8595N0825r0177j48483n2724j4624n5469M8446K40323J88399
50345C95329q1581j70033j4428K3750j25473j21473P4576Q0632j57627k14330
$$ y = [134953, 72738, 216192, 329890, 120497, -155105, -108155, 102711, 99459, -28466, 43101, 234142, 233855, 77327, 13442, 19862, -54449, -95680, 48540, 186819, 86766, -84240, -59427, 52259, 25083, -39031, 28557, 61934, -108059, -222930, 2478, 322596, 316033, 58247, -60317, 26704, 86449, 56180, 35350, -7598, -112121, -114701, 61404, 155922, -8869, -151531, 11729, 244834, 185407, -38550, -79400, 12907, -40605, -191590, -191529, -86852, -95859, -158973, -78625, 52599, 14273, -103446, -54155, 118181, 192758, 180218, 228813, 279638, 189461, 40978, -11746, -26370, -81839, -33393, 206930, 395329, 313748, 143715, 129287, 153037, 27564, -93909, -19333, 61299, -96328, -310658]
50335c10658L6095J92430P8626J6294J34222J17119j17097j90337K4107J40587
50325A21388k4639j41425k7459M0042o1614l7476J95282K64422J7474j86495j32965
50314B6535p7030j55093j12603J12039J76692j2901q2515J02256J64172n4875
50304H6677j62269N1168K01984J2840j96542j09380O2928M1959m7369k5113J711
50293h1406m6277k1640Q8864P1764o1521m0108J12597O6699j51709j36257J24546
50282g4448J62501j06119j96709M2115J46993o1513j31801J19660K08859q8837
50272B0701k48159O2027L41092J35574j83889j37629N2755Q129q1214O7952J93565
50261B30904p983k40938j21169J26731J07091m0844J1603J31131K6567j50015
$$ y = [-310658, -274563, -82133, -3507, 12787, 147009, 264128, 147031, -43306, -19199, 121388, 96749, -44676, -72135, -32093, -93707, -131183, 64099, 328521, 345995, 159500, 26535, -50495, -205588, -318191, -206152, -29460, -42361, -124876, -22620, 141552, 86677, -75592, -24424, 177560, 190400, -6142, -115522, -52594, -10635, -58004, -83117, -81406, -127683, -149323, -60459, 11305, -50216, -90324, 22273, 88972, -62737, -198994, -74448, 88053, -18066, -214775, -172660, -25667, -87180, -218981, -99321, 109538, 20701, -227458, -165431, 175661, 311235, 127346, -10283, 42472, 50601, -30613, 37339, 230904, 222921, -18017, -139186, -12455, 94636, 53792, 65395, 196526, 223093, 73078]
50251G3078r2495Q2872R2207J3869N7267J03780l2729j80787j14171R460m4807
50240c2456j41206o3863M7578j5214j02573N029J63801J35777K0506K2853N8127
50229I8359k9434j17740m3741O5593L9403j8604K7335N9387l2621r0011J6077
50218b5997J11745L0845r0245q9754n0995n7286l115J24138J25594l0159q8242
50207d3471K9817O6850o2215q0597R7010J39758q5974k15163k9384J38292K2978
50196b2099q8480P2300K22118N1054j90491j41417N1855P5655J9777R7469J54456
50185C02197k2730k20197j24925J25260J85224N2667m5597p3138j02244o3528
50175A2989O6014Q8544p5712j70982l6427Q5576p733j01136K1316J59702P8878
$$ y = [73078, -19417, 63455, 155662, 169531, 226798, 330578, 297849, 117062, 2891, 12351, -32456, -173662, -237525, -189947, -205161, -307734, -302705, -138904, -3127, 17379, 40232, 98359, 68925, -48815, -92556, -26963, 12440, -6164, 21171, 80558, 47937, -42074, -25997, 85748, 116593, 26348, -63406, -114401, -171687, -174802, -50664, 74930, 44771, -43471, -13654, 53196, -9019, -89616, 7394, 147152, 61178, -153985, -183369, -45077, -22099, -110579, -38279, 183839, 234893, 44402, -97015, -45160, 30495, 50272, 147741, 302197, 279467, 59270, -65655, 59605, 244829, 297496, 251899, 178761, 76517, 12989, 79003, 167547, 91835, -79147, -115574, -29998, -37731, -138867, -117551, 42151, 121029]
50164A21029n9760l2188L9356j0869m3987N4946Q0311q3860j58735K9235J66722
50153A02200j317j82343o3359J07323j1808k12717j28855R0712Q4038n6301p503
50142b79930J54266J29682j7156o639J06314N9166j00826j20014j4962N445n2847
50131a37501m9838k8946p1221m0508J45516K33593K5828k07464j32984Q7796R6965
50120g8764n3791o7912M8257P6403K9393M9380N2918q4891j89745o3211J10972
50109a70991O9803m4917L8346J88744J06280j11776j42061q196J7851n2889P492
50098a02314J54156J32233m1473j07951k2828K3270j7098k4723j726l7133o8011
50087a13598L480O4764k3434j33478p2910P2808J11760Q8096J33342J60193L7599
$$ y = [121029, 61269, 29081, 68437, 57568, 13581, 68527, 148838, 64978, -93757, -64522, 102200, 100883, -81460, -144819, -37496, -49304, -262021, -390876, -300164, -216126, -272427, -279930, -125664, 4018, -13138, -19777, 86537, 145703, 44877, -75137, -90099, -84654, -137501, -187339, -216285, -287506, -328014, -182498, 51095, 76923, -130541, -263525, -175729, -78764, -132555, -200467, -152210, -75807, -46414, 2966, 55884, -29007, -218752, -281963, -170991, -101188, -146105, -107759, 80985, 187265, 75489, -66572, -74768, -56917, -109806, -102314, 51842, 184075, 142602, 34651, 11823, 35093, 17995, -6728, -8454, -45587, -113598, -110118, -45354, -68788, -202266, -275176, -202368, -90608, -2512, 130830, 291023, 328622]
50076C28622j09523j03100k7977l3701l8106N2001P3123r3941k15555p2212J28864
50065a11505J03295j8215K7080J28165M3357r7517k9648J20134N1460j44329j49392
50054g7115p90P039j14436r0101Q7768J50805L3490p0289q4213r2414p4171L2272
50042b92155R4481j8397j23717J2275K32943K09971k4946j71668j55641j16870
50032c53724l9117J67835L26179J87240j02617j73784j2310O4693l6243r0993
50022f2841m723O2557L5935K0910L5004k6473j38386j51290n4348J9035K5334
50011b39286K9343M8601P6621J54458K35021J45580j12445k48269j04089O3453
50001D8988J639j23552o3578N4843L040q8195J9569J88196J30020p0549j19624
$$ y = [328622, 219099, 115999, 88022, 54321, 16215, 68216, 141339, 47398, -168157, -240369, -111505, -8210, -26425, 655, 128820, 172177, 74660, 45012, 165146, 216606, 72277, -77115, -77905, -70866, -185302, -275403, -187635, -36830, -3340, -73629, -157842, -250256, -324427, -292155, -197674, -216071, -339788, -327513, -94570, 115401, 90455, -81213, -236854, -353724, -392841, -225006, 101173, 288413, 185796, 12012, -298, 64395, 28152, -62841, -67564, -5007, 30928, 51838, 86842, 60369, -78017, -229307, -283655, -264620, -239286, -209943, -161342, -84721, 69737, 304758, 450338, 337893, 89624, -14465, 48988, 50627, -72925, -136503, -81660, -78620, -166815, -147246, 40950, 170970, 100421, -19203]
49990a9203l0913k5935p2319J5600J45290P7508j11322j40259j0554L7944k9538
49979a63701m6847o193k2924l6394P4794J85836J08152m2265l3219O4669L2620
49968A14528p0818m2693N1258J3262p4465J188J52150J33373k541k1693L9885
49957B93434k4626j51728j05228O9316J08988j6574j04252q5757m3655K6183J28518
49946I4619J02915j09206k30096m8717J74905J16620n8010r273J63344J37554
49936C34655l0355o1349p402r5611k06767p8554J40630J16029n7901m7290Q5667
49925I1752M3772p9918J3267J71496J5930k93571k47542J13086K30771k7441j99403
49914a67801o1213Q2878N1099M5229J25768O8322j09375q9849J29350J62526p4214
$$ y = [-19203, -50116, -76051, -148370, -132770, 12520, 90028, -21294, -161553, -172107, -134163, -163701, -210548, -216741, -239665, -276059, -201265, -15429, 92723, 50458, 17239, 81908, 114528, 43710, 1017, 52275, 65537, -8928, -7740, 144410, 277783, 275242, 253549, 293434, 268808, 117080, 11852, 81168, 190156, 173582, 69330, -16427, -60082, -33899, 94619, 197534, 88328, -141768, -190485, -15580, 101040, 43030, 33757, 197101, 334655, 304300, 242951, 235549, 139938, -66829, -145383, -4753, 111276, 53375, 6085, 91752, 135524, 55606, 68873, 240369, 256299, -37272, -284814, -171728, 59043, 31602, -167801, -229014, -146136, -95037, -49808, 75960, 144282, 34907, -54942, 74408, 236934, 162720]
49903A62720j94903k9906J05420J5286o6362K2538Q5809m789p7400l8682k9978
49892e0247o4170K7923J75316Q7241j90806k58804k3289J52388Q6167J5517N6961
49881A4197M359j57151j23543J28139J97976l4208j54235N2674K06150K0540j74946
49870b0048k8814K16009J62957q5281j77980r6176m6904m2811J6066N9041r859
49859e3800p5577j4177O1692J6199n3640j5828M6113J0035n1646k7594K8360L5584
49847i4279M4867R3456Q9889p660q4807o9153m3727o0396m6847J1445J6430l6612
49835a87394k7026N3471P3655K2160K9661R1540N9314n0042n3439M1567K3549
49824G7016j14075j21349N1287J25846k7978j57612n2770J22924J29681J835r3610
$$ y = [162720, -32183, -62089, 43331, 58617, -7745, 14793, 100602, 95813, 18413, -20269, -50247, -114417, -86494, 88822, 176063, -14743, -273547, -296836, -144448, -58281, -42764, 14197, 18556, -138595, -262138, -133999, 63977, 29769, -124466, -71792, 134358, 154898, -20048, -48862, 167147, 330104, 244823, 66843, -29333, -76237, -119048, -102982, -43941, -53800, -129377, -143554, -81862, -65663, -119303, -135131, -89018, -78983, -130629, -158223, -129863, -94279, -49412, 44044, 133933, 126273, 41466, -27687, -71414, -131810, -178657, -167212, -150782, -187394, -214420, -160949, -87294, -65134, -35473, 56067, 115381, 65339, 11900, 53467, 77016, -37059, -158408, -107121, 18725, -9253, -166865, -219635, -96711, 32970, 34805, -58805]
49813e8805j10901p3639J8378J04715Q8909K5028N9488J46645Q5925j16257k12343
49802d2857r7939N7837J17157J18108P8936l5447j23516m4561Q1145J6452j52462
49791b7147j20352Q4017J08689r7668j67107M9288K14766Q1208j21797j19143
49781a15246j1047M825j7359K8602M9452m0613j09077k4808J21549J85151J52707
49770B24136N0897j03300j86756o6949J27301J24175n6944j21240M233O5802m6136
49759A5219j20889m0180K6500j8668k8309N2454M9065q2912j29184r320O6682
49748b19542l564l0406Q2690J42215M1299k9991M9758J07544J9892n4158R476
49737A15213O9812R819m9419j2070J1225m1039l8024P1090J30746O3944o524k7650
$$ y = [-58805, -169706, -243345, -224967, -120252, -31343, -6315, 53173, 199818, 285743, 169486, -42857, -140796, -82959, 34198, 152306, 231242, 195795, 72279, 27718, 108863, 125315, -27147, -147499, -63482, 45207, -52461, -219568, -170280, 44486, 125694, 3897, -115246, -126293, -121468, -138827, -110225, -60773, -101386, -210463, -235271, -113722, 71429, 224136, 275033, 171733, -15023, -81972, 45329, 169504, 112560, -8680, -4447, 61355, 15219, -105670, -145850, -119350, -138018, -166327, -113873, -64808, -147720, -276904, -286224, -219542, -223106, -253512, -170822, -28607, 12692, -17299, 32459, 140003, 159895, 105737, 115213, 185025, 194844, 145425, 133355, 144580, 103541, 65517, 136607, 267353, 331297, 324773, 297123]
49725B97123r1433j55882m8746J57468J60915p0242k12033j11540J5800K9968
49715b8602N9948J20411J1622k27555k51446P685J71543N0058n5665O5700J63015
49704H6714L3494q7740M679Q7901m8031j81309o6564J15619R8250k3939m5212
49693b6138k3476o5789n8195O7402J15050j9221j02402K3254J28045N778j53545
49682a09237j25224l8052p1646j05534j509R6385O5013O5557J92707K24615M4557
49671B37632p4604M7837J37344l9570k25453j35615K9267j2306r2506M1439J95927
49660A09392Q9244q6645j2814J39825J8198k32058j95455P6022J54285l2245j26345
49649i8596K4740J73141J27997j6233j32571j91335j43174K1448J36354O1163
$$ y = [297123, 205690, 49808, 1062, 158530, 319445, 249203, 37170, -74370, -58570, -28602, 31346, 151757, 163379, -64176, -315622, -307937, -136394, -86336, -142001, -76301, 86714, 120208, 32468, 37147, 125048, 77017, -104292, -170856, -55237, 43013, 19074, -26138, -49614, -115403, -173598, -106196, 8854, -10367, -112769, -89515, 38530, 44308, -109237, -234461, -272513, -344159, -449693, -451202, -354817, -289804, -224247, -31540, 193075, 237632, 163028, 210865, 348209, 308639, 83186, -52429, -23162, -35468, -127974, -86535, 109392, 198636, 111991, 99177, 239002, 257200, 25142, -170313, -94291, 59994, 27749, -98596, -73856, 99285, 227282, 211049, 78478, -112857, -256031, -234583, -98229, -37066]
49639c7066o2903k9257Q2794O5475l8460k9653Q2117J14622L1632m8002p3519
49628E7780o2380O990R4862N0604j31356k03910l3897J51455J21741n236l1468
49617A5185k6796j11153j58823m5504O5840J5339m0076N9748J35667J0590j01909
49606a81892L0927J85551M7490j98606j55743J04699J79954J9855n3744O0158
49596C8649J28671M5101m2630o2582q9163r7131k53R9116L8119q3479m3719J07033
49584C7732J34612L4452P548Q0977R5071K6050R8K6666R560l5007m1237p9055
49572B97467k05225k58717r9068R5636Q5886k7575l32J14950R8926m698J1741
49561A08991J05238P1210m5646l4944O1266K0219j29435j49269k4523L4549q748
$$ y = [-37066, -99969, -129226, -46432, 19043, -19417, -49070, 33047, 147669, 179301, 131299, 57780, -4600, 2390, 97252, 147856, 16500, -187410, -221307, -69852, 51889, 46653, 15185, -11611, -122764, -281587, -327091, -261251, -245912, -285988, -226240, -90573, -79983, -181892, -150965, 34586, 82076, -116530, -272273, -167574, 12380, 32235, -21509, 38649, 167320, 212421, 169791, 107209, 18046, -79085, -79338, 19778, 57897, -25582, -69301, 37732, 172344, 206796, 214344, 295321, 390392, 416442, 416540, 443206, 452766, 417759, 376522, 297467, 92242, -166475, -265543, -169907, -84021, -111596, -111928, 3022, 101948, 97250, 108991, 214229, 285439, 239793, 204849, 266115, 286334, 156899, 7630, -16893, 17656, 8908]
49550H908j307M7694j5583j36503r9895O7792J14423q000q3099j4683O6120Q7733
49538C3600J03889P5948p4603k03115q4755J72316K21473J5017j26600m5421L4169
49527A21918o1299j55299m8420J28560J15454q5297k18179j12459J19768K23581
49517B8328R9079p2113n8431R0769J10686n7044j50548j2485J35882N0580j40626
49506B4077j57114P550J42339J50763P9034m3738j63368j46772J8360J35508R7947
49495A44586N9031J12746Q6493j02286j98730l1389J35817L5528j31013o7543
49485D3240P4142j853j59887q7275R7295N2442j33768q7224J54947J83539o9596
49474F6002k25884j06180L9736K9564N728Q8928J71262J56646Q5434k4229j64088
$$ y = [8908, 7601, 55295, 39712, -96791, -196686, -128894, -14471, -22471, -105570, -120253, -54133, 33600, 137489, 213437, 138834, -64281, -149036, 23280, 244753, 259770, 133170, 87749, 121918, 60619, -94680, -143100, -14540, 100914, 15617, -202562, -315021, -195253, 28328, 127407, 55294, -3137, 87632, 198318, 141274, -9274, -21759, 114123, 164703, 24077, -133037, -125487, 16852, 167615, 246649, 202911, 39543, -107229, -88869, 46639, 144586, 203617, 316363, 402856, 300570, 101840, 70451, 206268, 241796, 110783, 43240, 117382, 115529, -44358, -131633, -34338, 18104, -115664, -202888, -47941, 135598, 66002, -159882, -266062, -226326, -196762, -191034, -102106, 69156, 225802, 311236, 287007, 122919]
49463A22919j89279j870J80979R4034j19828j13525Q0732J13098p6518j77672
49453h6930n7118O0189K4426k7680J9345Q6565J05873J01415M4154r2689j64623
49442A2927m1734J06508M3704j11117p1373J01858R9051q6266j53625k0764Q6685
49431c4146O9465N6174O8004p454j08348o4689M4261j17j26778p7672J07177J51416
49419G7293M1471M11J8071r4262k28754j01662J71175J86616m8337j19962N1925
49408d6015R4762j02637j84512L976J43368L6554p9904l3583O988l6089L1816
49397a65276K13538K03245l9983j38527L9977J20117r3905k32367j6930K29714
49387A19603J46137o9661p1031M0326p726j26453p5059P0463Q4163K465q140J2705
$$ y = [122919, -66360, -68230, 112749, 206783, 86955, -26570, 54162, 167260, 90742, -86930, -144048, -83859, -59433, -87113, -67768, 18797, 124670, 226085, 270239, 177550, 12927, -28807, 77701, 121405, 10288, -61085, 40773, 139824, 53558, -100067, -120831, -34146, 35319, 91493, 159497, 152043, 43695, -20994, 23267, 23150, -103628, -181300, -74123, 77293, 118764, 119175, 137246, 42984, -185770, -287432, -116257, 70359, 22022, -97940, -46015, 48747, -53890, -238402, -234426, -91058, -54504, -134408, -167991, -161003, -197092, -165276, 48262, 251507, 211524, 72997, 112974, 233091, 139186, -93181, -110111, 119603, 265740, 196079, 125048, 165374, 157648, 31195, -43864, 26599, 110762, 113227, 105087, 117792]
49375A17792m0667o8136M1397J38047M4605j18410j30411k1812L7471L0188K7520
49364E7584M470n4532m2616O8987J08615j7992j35034q4548J2733n40l8760K7800
49352i3833J02371M1947o5444m9512N5049Q9776K6947l8489m9669q829N3262N1090
49340A14666o6273j60633m5368J85255K28460K8797j35626j00385k2555l4553
49330h215l6141K4433J0781q9786o3885J27449J99944J5994j50538o8376P8486
49319D0146N1711l9387p745M3208m5231j48541r0509K0943J3199j9553P2927J70826
49307F1994J00776k1952n650N0066n0199j98987j50943L7404J00213J1959j3473
49296g8792O8283O8301p6692j81481j06282N3272J32812R4908J3367k7497K415
$$ y = [117792, 77125, 8989, 50386, 188433, 233038, 114628, -15783, -37595, -124, 30064, 57584, 62054, 7522, -35094, 33893, 142508, 124516, -10518, -95066, -82333, -82873, -121633, -93833, 8538, 50485, -14959, -64471, -9422, 80354, 107301, 68812, 19143, 10314, 63576, 114666, 48393, -112240, -157608, 27647, 256107, 284904, 149278, 48893, 26338, -8215, -44356, -19923, -9142, -98928, -162813, -35364, 164580, 180574, 30036, -38340, 40146, 91857, 52470, 44725, 87933, 42702, -105839, -196348, -175405, -162206, -181759, -108832, 61994, 162770, 140818, 135168, 185234, 135035, -63952, -214895, -177491, -77278, -65319, -78792, -10509, 57792, -18900, -200381, -306663, -253391, -120579, -25671, -12304, -39801, -37386]
49285c7386N1455M4212k579j07M8208K9804p6839j33340n0985P3491J12420O1442
49273A19796k6268j14239j38482m8308O7539O8603o216l344N0297j3353j49837
49262a93812j12144J15176K35140J09163l3849q111N2615J0014k5553L1286L5879
49251B15804q6930j44482j8011R4826K7156o3408q637O0752L34m9498M1779Q9659
49239A59344p4440k32016j10901J32602J52060m1774j50097o9186N0373J19444
49229f4591J57291J17788l1292j47094r9641r515m0101r4574j799J40664J19276
49218D6412j9694o0201J4459M5510P643J513J2822m0650r3409l1637O8022N8362
49206I152q017Q261N0055k1966j24661o7680R4002J31373K2104m1507J703K4612
$$ y = [-37386, 14069, 58281, 55702, 55595, 103803, 133607, 56768, -76572, -127557, -54066, 58354, 119796, 93528, -20711, -159193, -207501, -139962, -71359, -77575, -80919, -30622, -43975, -193812, -305956, -190780, 44360, 153523, 119674, 111563, 164178, 174192, 148639, 179925, 215804, 128874, -15608, -33619, 61207, 88363, 24955, 16318, 77070, 77404, 27906, 69685, 159344, 84904, -147112, -258013, -125411, 26649, -15125, -165222, -234408, -184035, -64591, 92700, 210488, 179196, 32102, -67539, -77054, -117155, -211729, -213528, -72864, 46412, 26718, -33483, -19024, 26486, 34129, 35642, 48464, 7814, -85595, -117232, -49210, 9152, 1135, 9396, 59451, 37485, -87176, -154856, -60854, 70519, 92623, 51116, 52819, 77431]
49194G7431q369O388O6499M2773o7201j14273o0060k7900n1942p915J37626K16950
49182B10007J00617j01574j79841p8542O1704P9528k2121p7108K1803J38713O3732
49171B16918j42781j89441J29J37606J6676j48503o8640J52375J93271J7078j18237
49160F6451p8942J1327L5822J9429r394p0026j23367r3962q915L4751K8820L7851
49148a50155N3505J4014n4713o2470n205L3923J9049r853k0785j1613K0925O1469
49136a11909P0154N0355N3774P4980L9455n5522j07103p0003k5100k9385l7043
49125a47347k2277k6696l7104J2818Q2890O7724K1023Q9759J95484R4893j71011
49114A60156k50822l9260J26043K1773j04248n230J22758K2638j39661q0185Q8010
$$ y = [77431, 69062, 75450, 141949, 184722, 117521, 3248, -56812, -84712, -136654, -144569, -6943, 210007, 310624, 209050, 29209, -49333, 12371, 91899, 69778, -7330, 14473, 153186, 216918, 74137, -115304, -115175, 22431, 39107, -109396, -178036, -25661, 167610, 184688, 66451, -12491, -1164, 34658, 54087, 44693, -25333, -148700, -242662, -251577, -216826, -188006, -150155, -96650, -82636, -137349, -199819, -205024, -171101, -152052, -161905, -182690, -194303, -173378, -111909, -41755, 8600, 62374, 137354, 176809, 121287, 14184, -55819, -80919, -110304, -147347, -169624, -196320, -233424, -220606, -137716, -69992, -48969, 40790, 236274, 331167, 160156, -90666, -129926, -3883, 17890, -86358, -91588, 31170, 53808, -85853, -166038, -78028]
49103g8028P3831p2259q9393Q992O226q7809q6771r177j8770o8048J5982J60666
49091b44558J41877l290l1185P7324J09003K4011L760Q1194P4856o2464j47880
49080B2648q7460j5828m4827j01032p8703J9958J25878J52456M1304j15450j04810
49069a85866R9122K13899M3665j86730j61966L7707J05586J1589k9000K1705J5819
49058a4470l6153Q351R8003N6077o2418m8753O2400N5236m2020n294J22644O0581
49046B54184j80692k48906k9439J60505R7046m1941o5450p2022j48963j31694
49036d07372P5423K40400J44325n8849r3114K4510Q0200K0110l8607m3820l3058
49025h9852J479Q3143J42111R3800j8521q6576r6960j14164j43043j18315k2068
$$ y = [-78028, -4197, -76456, -165849, -156857, -150631, -238440, -325211, -334388, -353158, -421206, -405224, -244558, -102681, -105971, -137156, -59832, 49171, 73182, 76942, 158136, 232992, 170528, 22648, -64812, -80640, -125467, -226499, -305202, -285244, -159366, -6910, 34394, -81056, -185866, -86744, 127155, 170820, -15910, -177876, -140169, -34583, -22994, -51994, -30289, -14470, -50623, -42272, 55731, 111808, 49390, 637, 63037, 118273, 76253, 70959, 193603, 254184, 73492, -175414, -204853, -44348, 52698, 10757, -54693, -126715, -275678, -407372, -331949, -91549, 52776, -6073, -99187, -74677, 5523, 25633, -12974, -56794, -89852, -88373, -5230, 136881, 230681, 212160, 125584, 28624, -85540, -228583, -346898, -368966]
49014c68966P1856Q6860L6685N231L2842N3561j292o1255M937J53063J68248j7336
49002A64434j88517j58122l6246j3397m7522O792J03079R6226K0051M998J3347
48991c4877o5638j44072o1816Q5415P1118n4968l7717J18610J37827l2545j05211
48980a23874N2675J79665N4895j47285j60167k4213N6365N6847Q5524J31277R2888
48969B54597j2324o3282k4974K0919J4322k2563n0292n9557n5569l8210j846M5750
48957F971N9306r407j21095j53400n3578P7329J17057O2264k6104j07876j17142
48946b65675K0498K11166K10714j9727j72877k9455J71477R3838j44348j60166
48936h4555O4457J70099J9115j22965p1009J6694j2327m9013J5098P3241L2458
$$ y = [-368966, -297110, -210250, -173565, -168334, -135492, -81931, -83223, -144478, -139541, 13522, 181770, 164434, -24083, -182205, -218451, -231848, -279370, -272578, -169499, -73273, -53222, -48224, -34877, -100515, -244587, -306403, -220988, -149870, -204838, -242555, -123945, 13882, -18663, -123874, -71199, 108466, 163361, 16076, -144091, -168304, -111939, -55092, 30432, 161709, 254597, 242273, 178991, 154017, 174936, 189258, 166695, 116403, 56846, 1277, -36933, -38779, 6971, 66277, 56870, -64225, -217625, -271203, -193874, -76817, -14553, -40657, -148533, -265675, -245177, -34011, 176703, 156976, -15901, -45356, 126121, 219959, 75611, -84555, -20098, 150001, 169116, 46151, -24858, -8164, -20491, -69504, -54406, 18835, 51293]
48925E1293l742L8684L4796r5392j90242r5125P4725J22224O5872M6854O4807
48914A14754J6089q2173j01621r129Q5180Q1939l477q3438q2208M880J00062J17691
48902A58549N9442r052n9936j01482r5799J036J11228Q5973p4256j79702j00442
48891b04441N4324R5067R649m3084L4134J49841J54174L6456p1553q4291o8968
48880F1308j05511j27758l5461R2158Q2267l9827o3865N9247J21970J254j45343
48869i9561j54965r3486n5804K3474J63508J87548K0580r6125L4277K05928J27339
48858B62713r6640j49851j6148O4353L2977K8466M7648l2155j42251j00313L4676
48847f6525M0394o6500o4850N8427R9010K5927K405J8519r2960k47698j48258
$$ y = [51293, 47551, 86235, 121031, 25639, -164603, -259728, -185003, -62779, 3093, 49947, 114754, 130843, 48670, -52951, -62080, 23100, 105039, 101562, 18124, -64084, -59204, 40858, 158549, 217991, 208939, 149003, 47521, -48278, -47242, 63986, 149959, 75703, -103999, -204441, -150117, -55050, -45401, -88485, -54351, 95490, 249664, 286120, 214567, 130276, 61308, -44203, -171961, -207422, -115264, -32997, -72824, -136689, -77442, 44528, 45782, -99561, -254526, -348012, -403816, -380342, -216834, -29286, -8706, -104831, -70554, 135374, 262713, 166073, 16222, 74, 64427, 97404, 125870, 173518, 141363, -888, -101201, -66525, -26131, -92631, -157481, -99054, -44, 25883, 28288, 46807, -46153, -293851, -442109]
48836d42109J82922L35364J21871j34494j13299N5762Q5057k4529p8676k2277
48826c4408M6365N5033m494j01712j42782n3379P1926O8867k9640l1998Q6449
48815f9773J36845M1462m5331j3526M2733K7868r897k0697m3595q4437q3175m4574
48803a66097k3912J7631J35995K08080P0949j55381j77054K5424J61789Q2031
48793A79455m7069p1749m8099l4138J5289O4085m437j26287r0231R4309J69579
48782A00707N0055m8567K699N3135j5183r4645r7288r4231r5722L862J52863J35081
48770E2766m9335j29056q624Q2357K2356L81J12253J45608q101j03299L2963J70485
48758C20754O3734j40624j86859j20240j05300q9013L5198J42974P3100o6867
$$ y = [-442109, -259187, 76177, 198048, 63554, -49745, 6017, 91074, 66545, -12131, -34408, 11957, 66990, 62496, -39216, -181998, -235377, -163451, -94584, -124224, -156222, -69773, 67072, 108534, 63203, 49677, 92410, 120278, 110381, 89684, 46089, -38348, -121523, -166097, -190009, -172378, -36383, 171697, 242646, 87265, -89789, -64365, 97424, 179455, 132386, 60637, 12538, -21600, -6311, 57774, 53337, -72950, -163181, -68872, 100707, 150762, 102195, 104894, 158029, 142846, 48201, -49087, -143318, -239040, -235178, -82315, 52766, 3431, -125625, -134249, -51892, -29536, -29155, 83098, 228706, 220605, 117306, 150269, 320754, 384488, 243864, 57005, -63235, -168535, -257548, -222350, -79376, -6276, -73143]
48748g3143p1515L9150J12751J21925J05851K7056r7959j08446M5593J48551L6057
48737B85871j30284j28753j8294K3050O011K6122K7804p2458j73883j38522k1312
48726c14648M7723P0175Q9745O0457k1459l4429N0671P2045l4325q1672M0906
48715e4811J43335N9665n9494l0911L8296j2122q0076k0730M9959j4894q0394
48704f2177K1572J39901N4090j10144q7159O2844P4652n7707j13123m5781N138
48693a17894K6675J02050J46396K7001j19028n1972J32134J07481j45823k89362
48683a82342j51902M3774O4903k4988n6258n365N6940Q8028O0921k8870j03425
48672b38584p6114J2192N7037N9625Q8550J17553O5200l8030q0141l3887M2070
$$ y = [-73143, -144658, -105508, 7243, 129168, 235019, 262075, 164116, 55670, 101263, 249814, 285871, 155587, 26834, 8540, 31590, 37601, 63723, 91527, 19069, -154814, -293336, -314648, -266925, -196750, -107005, -46548, -68007, -102436, -51765, 20280, -14045, -95717, -54811, 88524, 148189, 88695, 57784, 96080, 83958, 3882, -16848, 33111, 18217, -62177, -40605, 99296, 153386, 43242, -43917, 18927, 93579, 35872, -77251, -123032, -117894, -91219, 10831, 157227, 184228, 65200, 13228, 145362, 252843, 107020, -182342, -334244, -290470, -225567, -250555, -306813, -312178, -255238, -167210, -106289, -135159, -238584, -314698, -302506, -245469, -185844, -97294, 20259, 85459, 47429, -32712, -66599, -24529]
48661b4529J11599J41484O2964r9685j69606n3435Q1506N2177n0519l7290M6542
48650F1208K6772o4697m9499O4059R6274J6677k5855J3546K3514k5213l6505k540
48638I7741k8563j16767j39714n9084K5120O3512J02478J25547N0496q2857j13101
48627g5192M126J20530J07523O143p4457q6859m1594K6361O8076O8727O7796P2541
48615B63721K0118r1421j34520l5588P4515M0113q3710j34454q9852m0887n644
48604b17609M5560N9378j2355o4824K0174J50494J43998J7222n5941k7659l222
48593E5216j7827n324K3284j6313r2619p1463N9496J53429J17771J6932n6518
48582A66064q2152o9996k8761J7098N0862P4974N3666o0741j83121j30303Q8858
$$ y = [-24529, 87070, 228554, 291518, 191833, 22227, -31208, 50298, 102475, 51956, 14666, 61208, 87980, 23283, -26216, 37843, 134117, 150794, 124939, 138485, 161999, 136786, 100281, 97741, 69178, -47589, -187303, -246387, -221267, -157755, -55277, 70270, 120766, 37909, -75192, -71066, 49464, 156987, 163130, 88673, 1814, -39780, -13419, 54657, 123384, 191180, 263721, 283839, 192418, 57898, 22310, 96825, 136938, 53228, -81226, -171078, -211965, -217609, -172049, -112671, -125026, -189850, -169676, -19182, 124816, 142038, 86097, 58438, 55216, 37389, 32065, 55349, 39036, -53583, -125046, -65550, 87879, 205650, 222582, 166064, 83912, 13916, -14845, 2253, 53115, 128089, 181755, 121014, -62107, -192410, -103552]
48571a03552J98403L6515j70490j32573P2605J53758N6340l1862l3516m1255p2051
48560f7678m4372J9918K2850m867L6222R0173K9608p8896n7895O2634Q3722k0194
48548G1225p4264k0396J6100m467K3997J05545J00128j2057o9394J83O9529M0358
48536B46487k2490m5682n0708n4285l5061k3932o1900p5109K3929J38223J04423
48525A43895k2094m5678K9548J5786j00730j18887J7501J15535O3266j5270k2498
48514F0374l5500r1330q1871K3669Q8094M5911Q340L6365M2510L789J9601O9850
48502A89802m163j71906j76937K8615J43164N680j11791L1737K11414J13428j17325
48491A41718j15993R2154J56093j0513j33615p3093p506n1624n5669P3386J57043
$$ y = [-103552, 94851, 131366, -39124, -171697, -99092, 54666, 111006, 79144, 45628, 4373, -67678, -112050, -92132, -69282, -74149, -37927, 52246, 81854, 2958, -54937, 7697, 91419, 71225, -3039, -23435, -7335, -11802, 12195, 117740, 217868, 205811, 136417, 136600, 206129, 246487, 223997, 178315, 127607, 73322, 38261, 14329, -47571, -122680, -98751, 39472, 143895, 121801, 76123, 105671, 121457, 20727, -98160, -80659, 34876, 98142, 82872, 60374, 24874, -66456, -148327, -124658, -36564, 9347, 17687, 54052, 96562, 100351, 119952, 189802, 185639, 13733, -163204, -134589, 8575, 14255, -97536, -65799, 145615, 259043, 141718, 25725, 117879, 273972, 263459, 129844, 56751, 49245, -2379, -58048, 15338, 172381]
48480A72381M0162j32496j40573k2259K3375m2264p7221r416P2346P5254J4707
48469b6004m4155n6726J05J09404J82673J27980k6238j41863j29060l3629N1298
48458A3785Q8749Q0383K2110o2831j02806n6363K5561O9934P0715N4026J1617
48447B14880n8225r8209o6858j7997j6027k6164Q532M4072J8340n162O2249J37681
48435A97112O3484j14990j80867p7883N573n3420j26929o4539O9575J17050N6599
48424a09235n812M164O5323R8149L4969q4176j13324j019Q2070j6113j49050p9931
48412b73985J02617J02816p1508j03080Q0313J65036k524j51300p3391K9011m4273
48401b40268j10486L4088K01993J34825l9404n1992L6969M677r7359o7528M6210
$$ y = [172381, 212543, 80047, -60526, -82785, -59410, -101674, -178895, -188311, -115965, -40711, -26004, -70159, -126885, -126780, -17376, 165297, 293277, 267039, 125176, -3884, -37513, 13785, 102534, 182917, 205027, 142196, 39390, -16973, 8588, 78522, 149237, 203263, 214880, 156655, 58446, -8412, -26409, -42436, -68600, -60068, -15996, 2344, -2818, 59431, 197112, 260596, 145606, -35261, -113144, -107571, -160991, -287920, -352459, -282884, -165834, -109235, -115047, -110883, -45560, 52589, 87558, 3382, -109942, -110961, -28891, -45004, -194054, -273985, -171368, -68552, -140060, -243140, -162827, 2209, -315, -151615, -225006, -195995, -240268, -350754, -316666, -114673, 20152, -19252, -71244, -34275, -29598, -126957, -194485, -148275]
48390a48275N6749Q734O2118J34676M2777j13832r3474N4815Q2988j3558l1648
48379D2070L0854k261r9755n8288R5394J26982J6847k3214L6306J624j36310j42377
48367a12128L8698J62850R2825o627P372L8397j7571q4969p7688m0476k3786j121
48355b4224K7762J8291j4832l5211q9382j88094j68788P5070L16548K50692l5362
48344A32470j77565p8057K1793k679q326P4031J10114M6362o10r85m7024r0796
48332b1272J8595J87813J30400j51113k96085j21083J16660J39569K2766k1030
48322E220L4863Q7813Q0125O1j12765j21599M1573J77218N3073j91816k13339
48311a59573j7543N1444q8952j22352R0378K50370J31540n7412o3591J4528j4246
$$ y = [-148275, -91526, -82792, -20674, 114002, 156779, 42947, -50527, 4288, 87276, 73718, 42070, 72924, 70663, -29092, -87380, 8014, 134996, 151843, 128629, 164935, 166559, 30249, -112128, -73430, 89420, 182245, 175618, 182990, 221387, 203816, 118847, 41159, 683, -23103, -24224, 3538, 21829, 6997, -28214, -117596, -305690, -474478, -399408, -82860, 167832, 132470, -45095, -123152, -101359, -104038, -112364, -38333, 71781, 118143, 117533, 116548, 69524, -21272, -2677, 185136, 315536, 164423, -131662, -252745, -136085, 3484, 26250, 5220, 40083, 127896, 208021, 208082, 95317, -26282, 15291, 192509, 245582, 53766, -159573, -177116, -125672, -214624, -336976, -246598, 3772, 135312, 77900, 14309, 28837, 14591]
48300A4591q3359m5754M3473O4283M7422N5745M3674r155k4350k941n1708j39884
48288h7963r6009O3237J07129l808k6739J20531J91213N0933q5605n9713l5124
48277A38082j26929j40968M0150J70218N0442j03518l8903R5498M4861r0058o2731
48266b3856P0993Q4873j6543o8815n9352o0120j6071J04826J30781m6325k09408
48255a09017j29459N0539O8105j5187K2387J28590R1824m0426m7934M6879L1324
48244I7625q7059r3570L3050Q4311o192p4923l8473l028k6175k4498L6150P3041
48232b9741M4548m19l5797o3636l7171N8899J07116J5068r2591m0471J01596J09460
48220A36861m6397j63980j11707L2155J42674J75247J26869K3401n3265m6385
$$ y = [14591, -68768, -114522, -71049, -6766, 40656, 96401, 140075, 130920, 106570, 103629, 51921, -87963, -183972, -120735, -13606, -17414, -44153, 76378, 267591, 318524, 232919, 173206, 138082, 11153, -129815, -89665, 80553, 130995, 27477, -11426, 84072, 128933, 38875, -23856, 47137, 132010, 115467, 46652, -12700, -72820, -88891, 15935, 146716, 100391, -109017, -238476, -187937, -119832, -135019, -112632, 15958, 107782, 67356, 19422, 66301, 97625, 10566, -83004, -49954, 34357, 28165, -46758, -85231, -88259, -114434, -138932, -102782, -29741, 14807, 14388, -21409, -85045, -122216, -63317, 43799, 58867, -33724, -74195, 27401, 136861, 90464, -73516, -185223, -153068, -10394, 164853, 291722, 315123, 261858, 215473]
48210B15473j1508k3033n2282m3831l0460n3506o2202j6761J4088j2961j0898
48199h7881O4943Q6028l2037j32035m6443J09022J10679j5404o5127l940J9556
48188G361l7394o1311r697L3831L3328L7692M6531J0401m4446m7148j6237j6497
48176f3586k0499L4832R5219N2515o6369j21257n2141O5208J26781P5829o5969
48165F0563j67314r1058R1510J37056j7687j29394k3080J17984N4913j07397r8874
48154a72778P7246J77824J07017o800o6888q8293o4138J9033P4060K6757k5570
48143E7470L1750J07618N3596o5720q9683m4799n1953n9576L9191J24076J1811
48132A13781j72339j45353N1410J02212m8391j12328K6712J17384k035j19886
$$ y = [215473, 203965, 180932, 128650, 84819, 54359, 853, -61349, -78110, -64022, -76983, -87881, -22938, 63090, 31053, -100982, -147425, -38403, 72276, 56872, -8255, -12195, 7361, -30033, -91344, -101041, -67210, -33882, 3810, 50341, 60742, 16296, -30852, -47089, -63586, -84085, -49253, 45966, 98481, 32112, -89145, -141286, -76078, 50703, 126532, 60563, -106751, -197809, -106299, 30757, 13070, -116324, -139404, -21420, 33493, -73904, -172778, -95532, 82292, 189309, 182509, 115621, 27328, -36810, -17777, 56283, 83040, 57470, 89220, 196838, 250434, 184714, 95031, 50232, -1721, -61297, -22106, 101970, 113781, -58558, -203911, -152501, -50289, -98680, -211008, -184296, -66912, -68947, -188833]
48122a88833k6333J34686J24920j2936q0155m6605k0020j5566L0365R2689Q5819
48111G8031J8078k2602j0454p37k4759m9678l9291m416J0545k0529o3708n7286
48099a86806l524K3868K322J2001R4504J52333R6393L420j0380J0252m8643j44034
48087A706j32572k0376M0457K403j9266M0920J01854Q8758L2363k2707p5276j00093
48075f1829m7552N4093J03362O0136j1888m2439j2999O0912J15816N1975j29592
48064A39995k52847j63276M5895J48191Q2326j9180n8902n7214k9116L8945Q7522
48053c7661K9258r1964j36004o3218M0453J12017J36406O7242r5574j91398p4521
48042c04964J23021J41243p256n7957O0236J05752n3661k01042j24385M5116P1296
$$ y = [-188833, -215166, -80480, 44440, 31504, -48651, -95256, -115276, -130842, -100477, -7788, 78031, 96109, 73507, 63053, 62316, 37557, -12121, -51412, -55828, -45283, -65812, -129520, -186806, -190330, -166462, -164140, -152139, -57635, 94698, 191091, 194511, 184131, 194383, 145740, 1706, -130866, -151242, -110785, -108382, -127648, -86728, 15126, 103884, 136247, 113540, 38264, -61829, -109381, -55288, 48074, 108210, 96322, 53883, 40884, 101796, 217612, 269587, 139995, -112852, -276128, -230233, -82042, 284, -18896, -77798, -135012, -164128, -125183, -37661, -8403, -100367, -236371, -299589, -259136, -147119, -10713, 56529, -39045, -230443, -304964, -181943, -40700, -47956, -105913, -45677, 60075, 6414, -194628, -319013, -273897, -202601]
48031b02601q750J518R7237R4265l7501j11554j8987J10660J09630j302p0969
48020c8354k8357M8092N4343n268l4833J7366Q2079N9351m1016j04661n7664M8393
48008e29J10464Q5903Q466o8064j10956j11719p5298j1566O1625J09976R8521
47997I6823L2475l1286l3171K7770Q3695N2292p5668j93120j67435j0224J03535
47986a14314N2311o3861p3753J4514N8553K8166K3865O3418N2712r373o558O6597
47974I2277O7063l3563p0611K4759Q1818k2907j43287j00504L7206R5906O2831
47963I0988K8078j013m4142l5587N1518R0179j2326j30626j06162O42K9075j9236
47951e8612k5949K6871O3235N8839L1877k2135o6113j7776P7438M3163j27570
$$ y = [-202601, -211351, -209833, -112596, -18331, -55832, -167386, -186373, -75713, 33917, 32615, -38354, -66711, -18619, 35724, 30456, -4377, 12989, 95068, 154419, 113403, 8742, -48922, -529, 109935, 195838, 204304, 136240, 25284, -86435, -161733, -173299, -111674, -1698, 96823, 129298, 98012, 64841, 92611, 176306, 228598, 152930, -40190, -207625, -217849, -114314, -62003, -125864, -199617, -185103, -126550, -98384, -74519, -11101, 41611, 32238, 25680, 92277, 159340, 125777, 55166, 79925, 161743, 138836, -4451, -104955, -67749, 28157, 90988, 119066, 118053, 73911, 38324, 89842, 180021, 167695, 37069, -69093, -68451, -39376, -58612, -84561, -57690, 5545, 64384, 96261, 74126, 8013, -9763, 67675, 110838, -16732]
47940a6732j85218r338J60136R9609m0793l1690L2479m0095j33526l4748J30774
47929f9142R6314m9345j1984J51998J09546j41321k26675j8490J60404P7228p8524
47918Ip3329J5901K2508k2931k1457N055J8836O6674J39899J13730n2350k10567
47906A978k18343j00396L7223J14283P5781n6354j26701j6678J41998J23204m8704
47895g2709j41476q2269j8893j4094L3563J28336J25905R787n0620P539M8213
47884b6718P997j865N5290N5058l1408n3866L9151R1986K4624k4732L3930P2221
47872B41668j8341j31067j29292m1963M4148J08079J14936N044j46734j60620
47862a14142k5266O7578L5183J2057O1420M8628p1661j14578K0856J46177Q2664
$$ y = [-16732, -201950, -211288, -51152, 48457, 7664, -24026, 8453, -31642, -165168, -199916, -69142, 27172, -22173, -34157, 117841, 227387, 86066, -140609, -159099, 1305, 78533, 9, -73320, -57419, -34911, -57842, -79299, -74244, -55408, 11266, 151165, 264895, 212545, 1978, -216365, -316761, -279538, -165255, -89474, -145828, -272529, -289207, -147209, -24005, -72709, -214185, -296454, -315347, -329441, -295878, -167542, -41637, -31850, -82470, -74931, -26718, -18721, -20586, 34704, 89762, 58354, 4488, 43639, 135625, 160249, 135517, 169447, 241668, 223327, 92260, -37032, -78995, -34847, 73232, 188168, 193212, 46478, -114142, -139408, -71830, -36647, -24590, 36830, 85458, 13797, -100781, -79925, 66252, 148916]
47851A48916n5302p4664l890K1377l773k3925o7983j38049j16478K9210J13178
47840a71383M589j22541l6402J85420K71602J48181j5798r3253j09406r4567l0631
$$ y = [148916, 93614, 18950, 15060, 36437, 32664, 8739, -59244, -197293, -313771, -284561, -171383, -166794, -289335, -325737, -140317, 131285, 279466, 263668, 170415, 61009, -33558, -64189]
$$ [...]
##END NTUPLES=NMR SPECTRUM
##END=
