##TITLE=31Pdec_LR-742-RM7
 , 24 sc
 19.11.2021
##JCAMPDX= 6.0         $$ Bruker NMR JCAMP-DX V2.0
##DATA TYPE= NMR SPECTRUM
##DATA CLASS= NTUPLES
##ORIGIN= UXNMR, Bruker Analytische Messtechnik GmbH
##OWNER= root
$$ XWIN-NMR		Version 3.5
$$ Fri Nov 19 11:21:45 2021 Russian Standard Time (UT+4h)  she@DPX200
##.OBSERVE FREQUENCY= 81.013821
##.OBSERVE NUCLEUS= ^31P
##.ACQUISITION MODE= SIMULTANEOUS
##.ACQUISITION SCHEME= undefined
##.AVERAGES= 24
##.DIGITISER RES= 16
##SPECTROMETER/DATA SYSTEM= spect
##.PULSE SEQUENCE= zgpg30
##.SOLVENT NAME= CDCl3
##.SHIFT REFERENCE= (INTERNAL, CDCl3, 0, 248.564)
##AUDIT TRAIL= $$ (NUMBER, WHEN, WHO, WHERE, WHAT)
$$ ##TITLE= Audit trail, XWIN-NMR		Version 3.5
$$ ##JCAMPDX= 5.01
$$ ##ORIGIN= Bruker BioSpin GmbH
$$ ##OWNER= she
$$ F:/spectra/data/she/nmr/P31/1/pdata/1/auditp.txt
$$ ##AUDIT TRAIL=  $$ (NUMBER, WHEN, WHO, WHERE, WHAT)
(   1,<2021-11-19 11:20:29.81 +0400>,<she>,<DPX200>,
      <created by zg, POWCHK disabled, PULCHK disabled
       configuration hash MD5:
       00 E9 B6 7A A2 85 ED C7 34 08 36 98 17 FE 4E 26
       data hash MD5: 32K
       0C 04 B2 F5 4B BD EA 99 AC BA BA 89 1C 14 59 73>)
(   2,<2021-11-19 11:20:32.14 +0400>,<she>,<DPX200>,
      <Start of raw data processing
       efp BC_mod = 2 LB = 1 FT_mod = 6 PKNL = 1 PHC0 = -9157.596 PHC1 = 12.6695 SI = 64K 
       data hash MD5: 64K
       0A 42 71 F8 BE 71 E0 11 F6 49 16 63 A7 B1 14 B5>)
(   3,<2021-11-19 11:21:07.23 +0400>,<she>,<DPX200>,
      <pk PHC0 = -42.88331 PHC1 = 100.3997 
       data hash MD5: 64K
       BA 1C FC A4 53 15 84 F8 EE 7A C7 CE F6 64 45 06>)
$$ ##END=
$$ 
$$ hash MD5
$$ 46 69 16 09 1D 84 9C F4 EB AA A9 E4 17 08 FC 26
##$RELAX= 
##$RELAX= 
##$RELAX= 
##$RELAX= 
##$RELAX= 
##$RELAX= 
##$RELAX= 
##$RELAX= 
$$ Bruker specific parameters
$$ --------------------------
##$DU= <F:/spectra>
##$EXPNO= 1
##$NAME= <P31>
##$PROCNO= 1
##$TYPE= <nmr>
##$USER= <she>
##$AMP= (0..31)
100 100 100 100 100 100 100 100 100 100 100 100 100 100 100 100 100 100 
100 100 100 100 100 100 100 100 100 100 100 100 100 100 
##$AQSEQ= 0
##$AQ_mod= 1
##$AUNM= <au_zg>
##$AUTOPOS= <>
##$BF1= 81.014009
##$BF2= 200.13
##$BF3= 200.13
##$BF4= 200.13
##$BF5= 200.13
##$BF6= 200.13
##$BF7= 200.13
##$BF8= 200.13
##$BYTORDA= 1
##$CFDGTYP= 0
##$CFRGTYP= 5
##$CHEMSTR= <none>
##$CNST= (0..31)
1 1 145 1 1 1 1 1 1 1 1 1 1 1 1 1 1 1 1 1 1 1 1 1 1 1 1 1 1 1 1 1 
##$CPDPRG= <waltz16>
##$CPDPRG1= <>
##$CPDPRG2= <waltz16>
##$CPDPRG3= <>
##$CPDPRG4= <mlev>
##$CPDPRG5= <mlev>
##$CPDPRG6= <mlev>
##$CPDPRG7= <mlev>
##$CPDPRG8= <mlev>
##$CPDPRGB= <>
##$CPDPRGT= <>
##$D= (0..31)
0 1 0 0 0 0 0 0 0 0 0 0.03 2e-05 3e-06 0 0 0 0 0 0 0 0 0 0 0 0 0 0 0 0 
0 0 
##$DATE= 1637306429
##$DBL= (0..7)
120 120 120 11 120 120 24 19 
##$DBP= (0..7)
150 150 150 150 150 150 150 150 
##$DBP07= 0
##$DBPNAM0= <>
##$DBPNAM1= <>
##$DBPNAM2= <>
##$DBPNAM3= <>
##$DBPNAM4= <>
##$DBPNAM5= <>
##$DBPNAM6= <>
##$DBPNAM7= <>
##$DBPOAL= (0..7)
0.5 0.5 0.5 0.5 0.5 0.5 0.5 0.5 
##$DBPOFFS= (0..7)
$$ [...]
##$SUBNAM2= <"">
##$SUBNAM3= <"">
##$SUBNAM4= <"">
##$SUBNAM5= <"">
##$SUBNAM6= <"">
##$SUBNAM7= <"">
##$SUBNAM8= <"">
##$SUBNAM9= <"">
##$SW= 501.771253377433
##$SWIBOX= (0..15)
0 1 3 0 0 0 0 0 0 0 0 0 0 0 0 0 
##$SW_h= 40650.406504065
##$TD= 32768
##$TD0= 1
##$TE= 0
##$TE2= 300
##$TE3= 300
##$TEG= 300
##$TL= (0..7)
0 120 53 12 22 120 120 120 
##$TP= (0..7)
150 150 150 150 150 150 150 150 
##$TP07= 0
##$TPNAME0= <>
##$TPNAME1= <>
##$TPNAME2= <>
##$TPNAME3= <>
##$TPNAME4= <>
##$TPNAME5= <>
##$TPNAME6= <>
##$TPNAME7= <>
##$TPOAL= (0..7)
0.5 0.5 0.5 0.5 0.5 0.5 0.5 0.5 
##$TPOFFS= (0..7)
0 0 0 0 0 0 0 0 
##$TUNHIN= 0
##$TUNHOUT= 0
##$TUNXOUT= 0
##$USERA1= <user>
##$USERA2= <user>
##$USERA3= <user>
##$USERA4= <user>
##$USERA5= <user>
##$V9= 5
##$VALIST= <valist>
##$VCLIST= <CCCCCCCCCCCCCCC>
##$VD= 0
##$VDLIST= <DDDDDDDDDDDDDDD>
##$VPLIST= <PPPPPPPPPPPPPPP>
##$VTLIST= <TTTTTTTTTTTTTTT>
##$WBST= 1024
##$WBSW= 4
##$XGAIN= (0..3)
0 0 0 0 
##$XL= 0
##$YL= 0
##$YMAX_a= 13270
##$YMIN_a= -16678
##$ZGOPTNS= <>
##$ZL1= 120
##$ZL2= 120
##$ZL3= 120
##$ZL4= 120
##$ABSF1= 0
##$ABSF2= 0
##$ABSG= 0
##$ABSL= 0
##$ALPHA= 0
##$AQORDER= 0
##$ASSFAC= 0
##$ASSFACI= 0
##$ASSFACX= 0
##$ASSWID= 0
##$AUNMP= <proc_1d>
##$AZFE= 0.1
##$AZFW= 0.5
##$BCFW= 0
##$BC_mod= 2
##$BYTORDP= 0
##$COROFFS= 0
##$CY= -3
##$DATMOD= 1
##$DC= 0
##$DFILT= <>
##$DTYPP= 0
##$F1P= 0
##$F2P= 0
##$FCOR= 1
##$FTSIZE= 65536
##$FT_mod= 6
##$GAMMA= 0
##$GB= 0
##$INTBC= 1
##$INTSCL= 5.30512e-09
##$ISEN= 30
##$LB= 1
##$LEV0= 0
##$LPBIN= 0
##$MAXI= 10000
##$MC2= 0
##$MEAN= 0
##$ME_mod= 0
##$MI= 50
##$NCOEF= 0
##$NC_proc= -4
##$NLEV= 6
##$NOISF1= 182.463
##$NOISF2= 159.3651
##$NSP= 0
##$NTH_PI= 0
##$NZP= 0
##$OFFSET= 248.5645
##$PC= 4
##$PHC0= -9200.479
##$PHC1= 113.0692
##$PH_mod= 1
##$PKNL= yes
##$PPARMOD= 0
##$PSCAL= 0
##$PSIGN= 0
##$REVERSE= no
##$SF= 81.014009
##$SI= 65536
##$SIGF1= 159.3651
##$SIGF2= -187.1042
##$SINO= 113.3802
##$SIOLD= 16384
##$SREGLST= <1H.CDCl3>
##$SSB= 0
##$STSI= 65536
##$STSR= 0
##$SW_p= 40650.406504065
##$SYMM= 0
##$S_DEV= 0
##$TDeff= 32768
##$TDoff= 0
##$TI= <>
##$TILT= no
##$TM1= 0
##$TM2= 0
##$TOPLEV= 0
##$USERP1= <user>
##$USERP2= <user>
##$USERP3= <user>
##$USERP4= <user>
##$USERP5= <user>
##$WDW= 1
##$XDIM= 65536
##$YMAX_p= 274725318
##$YMIN_p= -13422877
$$ End of Bruker specific parameters
$$ ---------------------------------
##NTUPLES= NMR SPECTRUM
##VAR_NAME=  FREQUENCY,     SPECTRUM/REAL,   SPECTRUM/IMAG
##SYMBOL=    X,             R,               I
##VAR_TYPE=  INDEPENDENT,   DEPENDENT,       DEPENDENT
##VAR_FORM=  AFFN,          ASDF,            ASDF
##VAR_DIM=   65536,         65536,           65536
##UNITS=     HZ,            ARBITRARY UNITS, ARBITRARY UNITS
##FACTOR=    0.620285442955139, 1,           1
##FIRST=     20137.2065510759, 0,            0
##LAST=      -20513.1999529892, 0,           0
##MIN=       -20513.1999529892, -13422877,   0
##MAX=       20137.2065510759, 274725318,    0
$$ Real data points
##PAGE= N=1
##DATA TABLE= (X++(R..R)), XYDATA
$$ [...]
39199B65067j79546l59179q4999K72064K89261M1447j27449j33578j35114j50430
$$ 265067 85521 -273658 -358657 -86593 202668 244115 116666 -16912 -152026 -302456
39189c02456m7232J42808K12571R4821n1832q6959k3492P4589J49382J24067q841
$$ -302456 -349688 -206880 5691 100512 48680 -38279 -61771 12818 162200 286267 277426
39178B77426j10991p1100J6462J9037j730N3560O7960r2723k40187q6738K47702
$$ 277426 166435 95335 111797 130834 129104 182664 250624 157901 -82286 -169024 78678
39167G8678L46037J10698j34174j89483j96690k24475j07599J31666J62857r9309
$$ 78678 424715 535413 401239 211756 15066 -209409 -317008 -185342 -22485 -121794
39157a21794k49988k0337K45311J26572j93177k34989K9736K15842J62495P5238
$$ -121794 -371782 -392119 -146808 -20236 -213413 -448402 -418666 -202824 -40329 34909
39147C4909Q8818R9005L2266m7122r8898j11231m714J99494K33078o3171l57831
$$ 34909 123727 222732 254998 207876 108978 -2253 -6967 192527 425605 362434 4603
39136D603k19839J83211K64510q8183l28594j05960K17374J86748n2171q3411
$$ 4603 -215236 -32025 232485 144302 -184292 -290252 -72878 113870 61699 -21712
39126b1712P3267N6314j88304l13287j31892J05916J04706q3683k06716j67781
$$ -21712 51555 107869 -80435 -393722 -525614 -419698 -314992 -398675 -605391 -773172
39116g73172p1138q634L6897R2436J23520R4962K9063l4067p7993p4258K3220
$$ -773172 -844310 -852944 -816047 -723611 -600091 -505129 -476066 -510133 -588126 -662384 -639164
39105f39164J75259K20516O2580j51194j88055m3186Q4205J15968J58421K04604
$$ -639164 -463905 -243389 -180809 -332003 -520058 -563244 -479039 -363071 -204650 -46
39095d6P1061k28984l50247r6143K17413J89072p4574j57704M184Q0627n9932
$$ -46 71015 -157969 -508216 -604359 -386946 -197874 -272448 -430152 -425968 -345341 -405273
39084d05273j37127N4153K94756K73001L7375r0608M6010K47159K03086j12556
$$ -405273 -542400 -488247 -193491 79510 116885 26277 72287 319446 522532 409976
39074D09976l50225j90671J76071K28408j36150l76834j03305K76235J65641k55203
$$ 409976 59751 -130920 45151 273559 137409 -239425 -342730 -66495 99146 -156057
39064a56057l12124O0888K41874q072j70863P9163K94942P2786j95766j023L46088
$$ -156057 -468181 -407293 -165419 -173491 -344354 -265191 29751 102537 -93229 -94252 251836
39053B51836J87073l57810n21126q8205K82816Q9962l04098l05736M5115K55415
$$ 251836 438909 81099 -440027 -528232 -245416 -155454 -459552 -765288 -720173 -464758
39043d64758J37414m1508n4219K5178P1222J03253J31716N6119j25596k01456
$$ -464758 -327344 -368852 -423071 -397893 -326671 -223418 -91702 -35583 -161179 -362635
39033c62635m9834R7884j7728k04702n1179L63873M62657L9191l48422j96713
$$ -362635 -412469 -314585 -332313 -537015 -588194 -224321 238336 277527 -70895 -267608
39023b67608J78391J93978n1890l7849K05204J45369k57074m05776p5354J95009
$$ -267608 -89217 104761 52871 15022 220226 365595 108521 -297255 -372609 -177600
39013a77600K3917j87753K999L09126K32942r3176j86351k7917J473j70533k24697
$$ -177600 -153683 -341436 -338437 -29311 203631 110455 -75896 -103813 -102340 -272873 -497570
39002d97570k4063J93199K12196Q6685l2404o2950m23O2432K48j31928j17197
$$ -497570 -521633 -328434 -116238 -29553 -61957 -124907 -125330 -62898 -62650 -194578 -311775
38991c11775N8959J20132l7099j08160J12610L19535J64732j48711j84461L7476
$$ -311775 -252816 -132684 -169783 -277943 -165333 154202 318934 170223 -14238 23238
38981B3238J40672K7123o5265m8384o4856j20266o0313Q5101J09142j5442j11000
$$ 23238 163910 191033 125768 77384 12528 -107738 -168051 -82950 26192 10750 -100250
38970a00250j05140o6839R816J54155K31634J21094j9510J4236J06398M0183p6546
$$ -100250 -205390 -272229 -262413 -108258 123376 244470 224960 239196 345594 385777 309231
38959C09231k2870N7834j13957l65843k69480J17865K88631R4318o5973L0042
$$ 309231 286361 344195 230238 -135605 -405085 -287220 1411 95729 29756 59798
38949E9798R8250o2635j94361p0728Q8621J6221j46110j09818R4772J96832O5589
$$ 59798 158048 95413 -98948 -169676 -81055 -64834 -210944 -320762 -225990 -29158 36431
38938C6431j73511k76442o8110L39617N34378K56424j86477k90510q1319l1065
$$ 36431 -137080 -413522 -481632 -142015 392363 648787 462310 171800 90481 59416
38928E9416k67713m00248k24736m2809p0674o7616J50112L05851J32929j46566
$$ 59416 -208297 -608545 -833281 -876090 -946764 -1014380 -864268 -558417 -425488 -572054
38918e72054j82730j3226J23202J88736K35390J77563l520r6916l724M0635j14611
$$ -572054 -754784 -768010 -644808 -456072 -220682 -43119 -46639 -143555 -147279 -106644 -221255
38907b21255k07262J785K71061K49746L2930p3374r5754k43574m07754k93584
$$ -221255 -428517 -426732 -155671 94075 127005 53631 -42123 -285697 -693451 -987035
38897i87035M9842K77076K60887J67737R2417L445k0220J05575J89141l962k80608
$$ -987035 -937193 -660117 -399230 -231493 -139076 -135631 -155851 -50276 138865 134903 -145705
38886a45705k18952J61605L80895K12845k3585j8831R6336P1629o3476j55915
$$ -145705 -364657 -203052 177843 390688 367103 348272 444608 516237 452761 296846
38876B96846k04445k44757j90920j7794R9943N1199o68R6095J73851J2456k30221
$$ 296846 92401 -152356 -343276 -361070 -261127 -209928 -210596 -114501 59350 71806 -158415
38865a58415k00716Q6811K30059L4512k06938j75233K4267R5753J2577m0464l4908
$$ -158415 -359131 -272320 -42261 -7749 -214687 -389920 -365653 -269900 -257323 -297787 -332695
38854c32695q2907j22593K6654K76930L05010P6670k7057J95502L93078J84893
$$ -332695 -415602 -538195 -511541 -234611 70399 147069 120012 315514 708592 893485
38844H93485k26246l47973j16022R9143R8228L4718J3177p0362k24368k69312
$$ 893485 667239 319266 203244 302387 400615 435333 448510 378148 153780 -115532
38834a15532j50504l1974R619Q5128K06923K16225R7273M9774J24630R9471j33576
$$ -115532 -266036 -298010 -288391 -203263 3660 219885 317158 366932 491562 591033 457457
38823D57457l55663l63340k39892j17639L9917K27919K62538P9882q4944m3390
$$ 457457 101794 -261546 -501438 -619077 -579160 -351241 -88703 -8821 -93765 -137155
38813a37155O8732P7747O5586J22863Q7724j52303l39756j89748J27853K19304
$$ -137155 -68423 9324 74910 197773 285497 133194 -206562 -396310 -268457 -49153
38803d9153M9885p5146k7232K1597l0174o4444l98Q3740J32110J76801J84811
$$ -49153 732 -74414 -101646 -80049 -110223 -174667 -175065 -91325 40785 217586 402397
38792D02397N9745j54861k63950j68254K2270J51966J65720Q2255m3617j14844
$$ 402397 462142 307281 43331 -124923 -102653 49313 215033 297288 253671 138827
38782A38827o6389L4666N0489o5376k32025l32846k80262o1068J92221K60171
$$ 138827 72438 107104 157593 92217 -139808 -472654 -752916 -813984 -621763 -361592
38772c61592Q9607q5235j6930K15142K97323R2524j97932l02263j78962j333P1462
$$ -361592 -271985 -357220 -374150 -159008 138315 230839 32907 -269356 -448318 -449651 -378189
38761c78189L9336k502j8841p1530j78575k10988m3067K17928K99659J00801j68753
$$ -378189 -338853 -341355 -360196 -431726 -610301 -821289 -864356 -646428 -346769 -245968 -414721
38750d14721k46279j05777Q3045J85826J94111J40614L1189j15878k08863j30859
$$ -414721 -661000 -766777 -683732 -497906 -303795 -163181 -131992 -247870 -456733 -587592
38740e87592R2891K28382Q3433j72829j63741J39617K97444L7010k81450j75558
$$ -587592 -494701 -266319 -182886 -355715 -519456 -379839 -82395 -45385 -326835 -502393
38730e02393K10080L14461R853k49926j49690Q4794J29387J7958k7263N5118J54434
$$ -502393 -292313 22148 32001 -217925 -367615 -282821 -153434 -135476 -162739 -107621 46813
38719D6813J51702J5469j33068r1519J18633J61120j38022m19155k78128P1749
$$ 46813 198515 213984 80916 -10603 108030 269150 131128 -288027 -566155 -494406
38709d94406J30276n5149m397L10546L90532Q5231j53778o5333M4768m0900o0243
$$ -494406 -364130 -419279 -423676 -113130 277402 362633 208855 143522 188290 147390 87147
38698H7147J53434K86461Q7972j98106k72269k00161j17974K4934J85554J69940
$$ 87147 240581 527042 615014 416908 144639 -55522 -173496 -148562 36992 206932
38688B06932O7621K08954M89209L59376k51662o78741n09396j46055j4500O3026
$$ 206932 274553 483507 972716 1332092 1080430 401689 -107707 -253762 -268262 -205236
38678b05236K61901K69242n3340k28847K0668K03058p3413l52881j54798J42100
$$ -205236 56665 325907 272567 43720 64388 267446 194033 -158848 -313646 -171546
38668a71546K9500j63966P7827M10995K00922l02489l48485O2171K54784N255
$$ -171546 -142046 -306012 -228185 182810 383732 81243 -267242 -205071 49713 54968
38658E4968k74625l18984k12162J8541L27697L94989R2292r8923K00181N26796
$$ 54968 -219657 -538641 -750803 -732262 -404565 -9576 82716 -16207 183974 710770
38648G10770K91842j90336k35269M4396L6827k32128k39001N498M3151r8703j8174
$$ 710770 1002612 812276 577007 621403 658230 426102 187101 192599 235750 137047 118873
38637A18873J75447L8969k75019k17521J30912J80952r0619j26739J80087L54333
$$ 118873 294320 333289 58270 -159251 -28339 152613 61994 -64745 115342 469675
38627D69675K34999J46588J67181L9708j83949j69790M6769J23054L4311L354
$$ 469675 704674 851262 1018443 1058151 874202 704412 751181 874235 908546 911900
38617I11900q43p7485k1548K31493K38704j84059m12892j7811L89994K19658j4315
$$ 911900 911057 833572 812024 1043517 1282221 1098162 685270 667459 1057453 1277111 1262796
38606A262796K56595M41499p3188n26225m3083O32858L79390k37966k7469N85911
$$ 1262796 1519391 1960890 1887702 1361477 1318394 1951252 2330642 2092676 2065207 2651118
38596B651118M65937O4564N29783J313564J137985N73875J009529J883809J855706
$$ 2651118 3117055 3181619 3711402 5024966 6162951 6736826 7746355 9630164 11485870
38587A1485870J757739L030512M328816L733807L204442N866286J0001804J2210717
$$ 11485870 13243609 16274121 20602937 24336744 27541186 33407472 43409276 55619993
38579E5619993J5827441K6964971L9871520L6849241J0221938k3225681l9224887
$$ 55619993 71447434 98412405 138283925 175133166 185355104 162129423 122904536
38572A22904536l3011557k0067963j3415269j1434908q258798m663226l904604
$$ 122904536 89892979 69825016 56409747 44974839 36716041 32052815 28148211
38565B8148211m617593l754014k076092j912580k600170k155249j049882q95338
$$ 28148211 23530618 19776604 17700512 15787932 13187762 11032513 9982631 9087293
38557I087293j307093j011592m16283n33135q37163m40688J8104l10997o91305
$$ 9087293 7780200 6768608 6352325 5819190 4982027 4541339 4559443 4248446 3557141
38548C557141k26220K99379j24927p69720n10469J16839M4137l20751n7360L73938
$$ 3557141 3330921 3630300 3505373 2735653 2225184 2342023 2386160 2065409 2008049 2381987
38538B381987N3326n29692l52685K17638J51236l29083k88914J08313L7932k97557
$$ 2381987 2435313 1905621 1552936 1770574 1921810 1592727 1303813 1412126 1450058 1152501
38528A152501r9657L57444J43409n61984p00183j31846K63654J53577M7459J09340
$$ 1152501 1052844 1410288 1553697 991713 291530 159684 423338 576915 624374 733714
38518G33714l8351l33203k58366J58517L36199J23420q7802j37251j63763p9003
$$ 733714 695363 362160 103794 262311 598510 721930 634128 496877 333114 254111
38508B54111K20263L64551M4328k89121r5188K66898J39842k42286j86690J90097
$$ 254111 474374 838925 883253 594132 498944 765842 905684 663398 476708 666805
38498F66805K14655j01570j84453m0178j42122l39235m7855N33370N71217r29
$$ 666805 881460 779890 595437 555259 413137 73902 26047 559417 1130634 1129705
38488A129705l49795j14578J57511R9872J7681P7851k1055l08423l51248n8906
$$ 1129705 779910 665332 822843 922715 940396 1018247 997192 688769 337521 278615
38478B78615J30112P0722J15749L18285K65959p7711k06116J5517J05419r6162
$$ 278615 408727 479449 595198 913483 1179442 1101731 895615 911132 1016551 920389
38468I20389r9729K81828M95370J88135j86037j72042j9697q7363j85529m4336
$$ 920389 820660 1102488 1597858 1785993 1599956 1427914 1408217 1320854 1135325 1090989
38458A090989J23835M8160r8838q8483n5567j03021J2151L45493M34783K0685
$$ 1090989 1214824 1262984 1164146 1075663 1020096 917075 929226 1274719 1709502 1730187
38448A730187l88265k47214J60998K19331l2991q6219J23483J94635L9638J0382
$$ 1730187 1341922 1094708 1255706 1475037 1442046 1355827 1479310 1673945 1713583 1723965
38438A723965K39428M36868M15306L30336L13084K91451K67376L78105N78166
$$ 1723965 1963393 2400261 2815567 3145903 3458987 3750438 4017814 4395919 4974085
38429D974085O28153N18902N53631Q59375J154602J190644J099527J053883Q81285
$$ 4974085 5602238 6121140 6674771 7534146 8688748 9879392 10978919 12032802 12914087
38420A2914087L64288k78911o15920o21193o76895r42962j126511r96420p55957
$$ 12914087 13278375 12999464 12383544 11762351 11085456 10142494 9015983 8019563 7263606
38411G263606o84346p15514o56403n72542o14556o48815m53250j72962j63146
$$ 7263606 6579260 5863746 5207343 4634801 4020245 3371430 2918180 2745218 2582072
38402B582072m05832n00128k69762K4950J58386K12946K52735J36015j44537l07128
$$ 2582072 2176240 1676112 1406350 1431300 1589686 1802632 2055367 2191382 2046845 1739717
38392A739717k10876j09722k12857l02382r8281K48659L56916J36621j66518l12420
$$ 1739717 1528841 1419119 1206262 903880 805599 1054258 1411174 1547795 1381277 1068857
38382A068857k32242L484K05242K07584J07558J47701K92752K53709L6321L1064
$$ 1068857 836615 840099 1045341 1252925 1360483 1508184 1800936 2054645 2090966 2122030
38372B122030L58242O03901N05184M02939O17752Q68998Q19173P48450J092192
$$ 2122030 2480272 3084173 3589357 3992296 4610048 5479046 6298219 7046669 8138861
38363H138861J675236K046326K282335K820890L759484M944337O374898P667658
$$ 8138861 9814097 11860423 14142758 16963648 20723132 25667469 32042367 39710025
38355C9710025P432994M376914p68426n372734p366455o933340n560783m261986
$$ 39710025 47143019 51519933 50751507 45378773 38012318 31078978 25518195 21256209
38347B1256209l229146k493045k096500j840315j462037j033968q37080r07590
$$ 21256209 18027063 15534018 13437518 11597203 10135166 9101198 8264118 7356528
38339G356528r77583q25099n09832k89273l59418o09805o69494l46514N7181J07978
$$ 7356528 6378945 5553846 5044014 4754741 4395323 3785518 3116024 2769510 2826691 2934669
38329B934669j64980l55501k98293k04935j81195n6328K00376L17118J53956n8660
$$ 2934669 2769689 2414188 2115895 1910960 1729765 1673437 1873813 2190931 2344887 2286227
38319B286227j09475j14639k31897l52435l01133j23749K0746P7928O4718j0292
$$ 2286227 2176752 2062113 1830216 1477781 1176648 1052899 1073645 1151573 1216291 1205999
38309A205999q5114p0348l771j234l4711J5507Q6490m094j95305k02372L6959
$$ 1205999 1120885 1050537 1046766 1045532 1010821 1026328 1112818 1108724 913419 711047 748006
38298G48006K53297K60669J57143K7808j95753m48906m65784j85186Q6805J14381
$$ 748006 1001303 1261972 1419115 1446923 1251170 802264 336480 151294 238099 352480
38288C52480M7707J07617K27062K17843O4641j35406l13595l60387j59628J49900
$$ 352480 400187 507804 734866 952709 1017350 881944 568349 207962 48334 198234
38278A98234K12086n6230k72140j09088K25508K99961O1925j55201j30282Q910
$$ 198234 410320 354090 81950 -27138 198370 498331 560256 405055 274773 283683
38268B83683M1094m9736r6129k015R8307J3281j80178j68085J37261L98406L34020
$$ 283683 324777 275041 178912 176897 275204 288485 108307 -59778 77483 475889 809909
38257H09909J45084J33427J59181n2667k82495r9784L26144L82938P737j90908
$$ 809909 954993 1088420 1247601 1194934 912439 812655 1138799 1521737 1529474 1338566
38247A338566N7616K85790J60611L5241K27098M01824J94853r8442k6270K61718
$$ 1338566 1396182 1681972 1842583 1877824 2104922 2506746 2701599 2603157 2576887 2838605
38237B838605L38973K26440K12272K44660R8092p2206O9601M14427N22866K97746
$$ 2838605 3177578 3404018 3616290 3860950 3959042 3886836 3956437 4370864 4893730 5191476
38227E191476O8069M2971R7332P0043p8087l48483o32825o58743l25636K8188
$$ 5191476 5259545 5302516 5399848 5469891 5391804 5043321 4410496 3751753 3426117 3454305
38217C454305J9394k56666m25763l89422l07300j97679J1060J51980k902k98918
$$ 3454305 3473699 3217033 2791270 2401848 2094548 1896869 1907929 2059909 2057007 1758089
38207A758089l62826j69146k9845o2286r9326j10171k52803m60982m18973n9700
$$ 1758089 1395263 1226117 1196272 1133986 1034660 924489 671686 210704 -208269 -267969
38197b67969K81636L29084J67014q586j33080j76057q8697N4217R9984N8003N8359
$$ -267969 13667 342751 509765 501179 368099 192042 103345 157562 257546 315549 373908
38186C73908P2388l4956j74912j03484J34204J95394k1563j90298o6023J49000
$$ 373908 446296 411340 236428 132944 267148 462542 440979 250681 184658 333658
38176C33658J53284j9829j41036j36627q3583l0703j7092j06599k28236j53722
$$ 333658 486942 467113 326077 189450 105867 75164 58072 -48527 -276763 -430485
38166d30485J69958M26207K98260q0462k89163j71903J8984L1207p4034r8872
$$ -430485 -260527 165680 463940 383478 94315 -77588 -58604 -27397 -101431 -200303
38156b00303j5077N2645N5825P2279J34650J50515M8956r3686j53721j10939j6923
$$ -200303 -215380 -162735 -106910 -34631 100019 250534 299490 205804 52083 -58856 -75779
38145g5779J01976J98552J60950k0123j33040j3429J49494O1066j76998j85539
$$ -75779 26197 224749 385699 365576 232536 219107 368601 429667 252669 67130
38135F7130N0694J08685j61842l26301n2452L20990L08082J9788r5830K166r75
$$ 67130 117824 226509 64667 -261634 -314086 6904 314986 334774 238944 241110 240135
38124B40135j34329j13510P8869J21342p0866j75815l072K06400J88852K8179
$$ 240135 105806 -7704 71165 192507 121641 -54174 -57246 149154 338006 366185
38114C66185o6788q1810j08236j39652j17935m0828O9072J73249J69378J395j76724
$$ 366185 299397 217587 109351 -30301 -148236 -189064 -119992 53257 222635 224030 47306
38103D7306j47616N0222J67294J14391M3030L0807l6122j86574k36169p1944J35761
$$ 47306 -100310 -50088 117206 231597 274627 305434 269312 82738 -153431 -225375 -89614
38092h9614J47684m8908k52742k56161j0411L04079L90201J59900j04800j02575
$$ -89614 58070 9162 -243580 -499741 -510152 -206073 184128 344028 239228 136653
38082A36653N7190M1479j52582j83247O9161K90495K07860m8784k20654k65612
$$ 136653 193843 235322 82740 -100507 -31346 259149 467009 418225 197571 -68041
38072f8041k40133r8971J52769L05890J91879m4472j32139m0603L7877R467j3546
$$ -68041 -308174 -407145 -254376 51514 243393 198921 66782 26179 64056 73523 59977
38061E9977P0175J78062J53856q954j32803p9637M4544K3208j37282j89242k8270
$$ 59977 130152 308214 462070 453116 320313 240676 285220 308428 171146 -18096 -46366
38050d6366J24119P5258l4312j5348J3316j20083k25873j2891L48710L85023K2802
$$ -46366 77753 153011 118699 103351 116667 -3416 -229289 -242180 106530 491553 514355
38039E14355l08029l11234j34113J9956J45726J90673k491l29261l99564r2616
$$ 514355 206326 -104908 -239021 -219065 -73339 117334 114843 -214418 -613982 -706598
38029g06598K19964K21222P6718P6322J70716J48291K1431m4379r026N3932R2999
$$ -706598 -486634 -265412 -188694 -112372 58344 206635 228066 183687 174661 228593 321592
38018C21592N4646r5284k24200j41407N7201N3457j67335k11565J10368M27919
$$ 321592 376238 280954 56754 -84653 -27452 26005 -141330 -352895 -242527 185392
38008A85392L37680k2218k31779j77921p5208p9387j53939j93302r1729J62268
$$ 185392 523072 500854 269075 91154 15946 -63441 -217380 -410682 -502411 -340143
37998c40143L46834J95245j64899k71181J3909K51598O5001l10436l98978j18445
$$ -340143 6691 201936 37037 -234144 -220235 31363 96364 -214072 -613050 -731495
37988g31495K41549M22759L31898K6538k20428j25932J59815J71865j41783k82539
$$ -731495 -489946 -67187 264711 291249 70821 -55111 104704 276569 134786 -147753
37978a47753l0508J48799r4571l54302j44153K83599L86687J80622K9066l6180
$$ -147753 -178261 -29462 -124033 -478335 -622488 -338889 47798 228420 257486 221306
37968B21306j61705j90155K8694J76041m1771k78674r6454K42092K47902P5920
$$ 221306 59601 -130554 -101860 74181 32410 -246264 -342718 -100626 147276 223196
37958B23196J21202J69847j28981l68319j5566M67784L44568M0195M27683J041431
$$ 223196 344398 514245 385264 16945 1379 469163 813731 853926 1281609 2323040
37948B323040Q23049N02777J916186M431883M595098Q01974l767861m936999k757482
$$ 2323040 3146089 3648866 5565052 9996935 14592033 15394007 11626146 6689147 3931665
37939C931665o71608m98085q92089n07903J5107j46345l95623k8897L74557N7959
$$ 3931665 3260057 2761972 1869883 1361980 1377087 1230742 835119 806222 1180779 1238738
37929A238738m98534m16576R7408K03253j59008l34718j28012L2871j9341K1313
$$ 1238738 740204 323628 421036 624289 465281 130563 2551 35422 16081 37394
37919C7394K27749K32834j10094m12293l23090j9872J14759K1642p5164n6836
$$ 37394 265143 497977 387883 -24410 -347500 -367372 -252613 -230971 -306135 -362971
37909c62971r715n66L5388J42605K21572J57888J3895l6479L1037M0934r6670
$$ -362971 -372686 -373252 -337864 -195259 26313 184201 198096 161617 192654 233588 136918
37898A36918j99614p0871J64957K00752j3624k07179j92875j02658j18227j70673
$$ 136918 -62696 -133567 31390 232142 218518 11339 -181536 -284194 -402421 -573094
37888e73094p6602J48673K97360K50897J10892M2874Q9682J60585J38454k2473
$$ -573094 -649696 -501023 -203663 47234 158126 201000 290682 451267 589721 567248
37878E67248k49534l74153k57461M3267K62961J76281j26863l11613j92277N5483
$$ 567248 317714 -56439 -313900 -270633 -7672 168609 41746 -269867 -462144 -406661
37868d06661J64888J27830J09276J24524M4415j17771j85936j02580J4819J12062
$$ -406661 -241773 -113943 -4667 119857 164272 46501 -139435 -242015 -227196 -115134
37858a15134K18714K15123p1156m52158m57553q005L75661K88643j0654q9800
$$ -115134 103580 318703 247547 -204611 -662164 -670169 -294508 -5865 -16519 -106319
37848a06319j397k9349j06310q507J01365q8824l81002k55685K72204N75969L21405
$$ -106319 -107716 -137065 -243375 -251882 -150517 -239341 -620343 -876028 -603824 -27855 293550
37837B93550p5346j09631J24277J93453j6120j94778m8383L33347N52085L84334
$$ 293550 218204 108573 232850 426303 410183 215405 167022 500369 1052454 1436788
37827A436788J99862O11297J490680J747225O24278j075368j797600j168402l02467
$$ 1436788 1636650 2247947 3738627 5485852 6110130 5034762 3237162 2068760 1766293
37818A766293j35912l68923l65887j94699j87321j87446N2260K37478R999l30545
$$ 1766293 1630381 1261458 895571 700872 513551 326105 378365 615843 625842 295297
37808B95297k78594J8273N2120j44188j14827J57638K36243J8737j41837j07356
$$ 295297 16703 34976 87096 -57092 -171919 -14281 221962 240699 98862 -8494
37798h494r9519j44861j5524K04426J37873j72744k16311J27660L22433N4156
$$ -8494 -108013 -252874 -268398 -63972 73901 -98843 -315154 -187494 134939 189095
37788A89095k37360j03805J81169J32579j32794j51341R8259K17323O0609j11338
$$ 189095 -48265 -152070 29099 161678 28884 -122457 -24198 193125 253734 142396
37778A42396j14196n2785k9784J4166J04515J33206K9834j32969k42584k39701
$$ 142396 28200 -24585 -54369 -40203 64312 197518 227352 94383 -148201 -387902
37768c87902j19167N6332J71440J73346J24901Q6972M6301J8429O9738J43272
$$ -387902 -507069 -450737 -279297 -105951 18950 105922 152223 170652 240390 383662
37758C83662M9828k16336l46400j20489K14191K36236o9559l03550k00727P0407
$$ 383662 433490 217154 -129246 -249735 -35544 200692 131133 -172417 -373144 -302737
37748c02737J97674J03932m6956r3136l9229j3744q1742j20499K6330K65483L03737
$$ -302737 -105063 -1131 -48087 -141223 -180452 -194196 -275938 -396437 -370107 -104624 199113
37737A99113O3108j63484j30352J866l6232j58550q1689J63986K43316K5022k44728
$$ 199113 262221 98737 -31615 -29749 -65981 -224531 -306220 -142234 101082 126104 -118624
37726a18624l12487j77621N2605K86951L81881K33383L955k2266J21269J01743
$$ -118624 -431111 -608732 -556127 -269176 112705 346088 350043 327777 449046 550789
37716E50789j57551k98635r3605J65836J28621o8890p9657N7051K1315j99540
$$ 550789 393238 94603 998 166834 295455 226565 146908 203959 225274 25734
37706B5734k70749o2635J58082J72515R2738O7047K2205j04208j46682J3634J56776
$$ 25734 -245015 -307650 -149568 22947 115685 182732 204937 100729 -45953 -32319 124457
37695A24457R583k89165l35656n3205J95561J70089R8587K47047M02599J47010
$$ 124457 134040 -155125 -490781 -543986 -348425 -178336 -79749 167298 569897 716907
37685G16907m41405p59938m58343Q8151L02542J53035O3642K20000L48159K11214
$$ 716907 275502 -484436 -942779 -854628 -552086 -399051 -335409 -115409 232750 443964
37675D43964k4115p2296O8788J95930K11730J57800N5230q5504j64723r2390M8323
$$ 443964 419849 347553 416341 612271 824001 981801 1037031 951527 786804 694414 742737
37664G42737R8428N1254K3605L0833k6748j50619k02908j23437k9257l6283j16836
$$ 742737 841165 892419 916024 946857 920109 769490 566582 443145 413888 377605 260769
37653B60769j94834k47660k41035j01487J41282L03344K63484J37313R8087J05770
$$ 260769 65935 -181725 -422760 -524247 -382965 -79621 183863 321176 419263 525033
37643E25033j1290k36690l23092j23810J78003K73506R2001j33403j49222L3430
$$ 525033 513743 277053 -46039 -169849 8154 281660 373661 240258 91036 124466
37633A24466J61734M0439k19902l09843r5901J96012K58237Q8337n1468k7709
$$ 124466 286200 326639 106737 -203106 -299007 -102995 155242 243579 192111 164402
37623A64402J9545k5869m2599Q7778K10076R9769j64872k94006k08074r5965m8578
$$ 164402 183947 158078 115479 203257 413333 513102 348230 54224 -153850 -249815 -298393
37612b98393N4835K08558J60847j58536l76970j59615K38547K75475j02065l77175
$$ -298393 -243558 -35000 125847 -32689 -409659 -569274 -330727 -55252 -157317 -534492
37602e34492j90442K20330M33918L74097K20180N2105j41306k58725j79192k428
$$ -534492 -724934 -504604 -70686 303411 523591 575696 434390 175665 -3527 -5955
37592e955M6473n9690j31819p7554k3633o3768p2503R4563L24306L38449O2064
$$ -5955 40518 -19172 -150991 -228545 -252178 -315946 -388449 -293886 30420 368869 430933
37581D30933k31978k25361N7670K74306J85440o5985j79912r3058Q412Q091j9915
$$ 430933 198955 -26406 31264 305570 491010 425025 245113 152055 160467 168558 148643
37570A48643k2240p1511j71080j58380N3758K98008L67680K73617J35391l0138
$$ 148643 126403 54892 -116188 -274568 -220810 77198 444878 718495 853886 823748
37560H23748k19979k92416j47261M5995O1457k5099J5770J22689P857l06847m09011
$$ 823748 603769 311353 164092 210087 271544 246445 262215 384904 392761 85914 -323097
37549c23097j04879K33918J82124j37854k69080p3781J51029J57979M4279J4413
$$ -323097 -427976 -194058 -11934 -149788 -418868 -492649 -341620 -183641 -139362 -124949
37539a24949Q5193J39802J32855J16681J18187Q2810n1190k49645l68510k75191
$$ -124949 -39756 100046 232901 349582 467769 550579 499389 249744 -118766 -393957
37529c93957j4503J80791J15443j28227k50025p8787J97759K46527K4768j38525
$$ -393957 -408460 -227669 -112226 -240453 -490478 -569265 -371506 -124979 -100211 -238736
37519b38736J1737K62462J93081k14116n00172l42132L5497K33194K04209J49521
$$ -238736 -226999 35463 228544 14428 -485744 -827876 -792379 -559185 -354976 -205455
37509b05455J03484k4713j32568m5572R9540J1611k10744j47690K35914M31045
$$ -205455 -101971 -126684 -259252 -304824 -205284 -193673 -404417 -552107 -316193 114852
37499A14852J45886k17444j72488J32505K09607j5439j84482j01059P0616J50011
$$ 114852 260738 43294 -129194 3311 212918 197479 12997 -88062 -17446 132565
37489A32565J32063M5132r1358j71196j06232l107j6624q6696n5713K9883N277
$$ 132565 264628 309760 218402 47206 -59026 -62133 -78757 -165453 -221166 -191283 -186006
37478a86006r0691p5378L3247M0116o5940q4343M0727J34404J04670N8809N8031
$$ -186006 -276697 -352075 -318828 -278712 -344652 -428995 -388268 -253864 -149194 -90385 -32354
37467c2354L2220j0074L5082J22691Q6032l8607k7397J21251J37194n0488j58574
$$ -32354 -134 -10208 24874 147565 233597 194990 167593 288844 426038 375550 216976
37456B16976l4197P2095m9163j93019j05828P3425P5242l7925l2198O0208L8233
$$ 216976 182779 254874 205711 12692 -93136 -19711 55531 17606 -14592 45616 83849
37445H3849n9352j5762J55182K06266M6831j57342k61516k57427j40114P3411
$$ 83849 24497 8735 163917 370183 417014 259672 -1844 -259271 -399385 -325974
37435c25974K15876J30061n7641r3306j248k6042j65364j17504K06466M53310
$$ -325974 -110098 19963 -37678 -130984 -132232 -158274 -323638 -441142 -234676 218634
37425B18634K97541j04975l37296k27528M5743K30568K24859R8743L708J2786
$$ 218634 516175 411200 73904 -153624 -107881 122687 347546 446289 449997 462783
37415D62783L1151m1311j01314L702J38417K128l45202m38824q6292K57208J11838
$$ 462783 493934 452623 351309 355011 493428 495556 150354 -288470 -374762 -117554 -5716
37404e716k99633l62056M7218M33428M15004J46822n6585j31642j53330j34450
$$ -5716 -305349 -667405 -620187 -186759 228245 375067 318482 186840 33510 -100940
37394a00940j18082k08279l32483k27810J36954L84898K35202n1716n9993J39199
$$ -100940 -219022 -427301 -759784 -987594 -850640 -465742 -230540 -282256 -342249 -203050
37384b03050J36130j20064k31860r125K29070J85572L9160Q9541K32412J39952
$$ -203050 -66920 -186984 -418844 -427969 -198899 -13327 25833 115374 347786 487738
37374D87738j84758l87859k70438j6475J19993J11009O0094N555o4115j11665
$$ 487738 302980 -84879 -355317 -371792 -251799 -140790 -80696 -75141 -139256 -250921
37364b50921p7765L4419J52596J87412R0079r0751k16198j84250m6931N4506N2120
$$ -250921 -328686 -294267 -141671 45741 135820 45069 -171129 -355379 -402310 -347804 -295684
37353b95684j3022q1260j13086p1393K4952M9926r5980k90368k67621M4598L74093
$$ -295684 -308706 -389966 -503052 -574445 -549493 -499567 -595547 -885915 -1153536 -1108938 -734845
37342g34845L86955Q2821j78635p4604K88053M47779J18241m15219n82399k18605
$$ -734845 -347890 -265069 -443704 -518308 -230255 217524 335765 -79454 -661853 -880458
37332h80458K39506L37445J42751N079O465k5953r5805j9890J73977K10999J4589
$$ -880458 -640952 -303507 -160756 -155677 -149212 -175165 -270970 -290860 -116883 94116 108705
37321A08705j43467o5694R0085J09532M0394K2143J1137j12476l04281m00377
$$ 108705 -34762 -100456 -10371 99161 139555 161698 172835 60359 -243922 -644299
37311f44299l08555n0297K68394M56081L63923Q7890j23662k02261k73095l08985
$$ -644299 -952854 -1003151 -734757 -278676 85247 173137 49475 -152786 -425881 -734866
37301g34866j04293K85702M47902J79994j74765k32314r1232l4194j8305J35135
$$ -734866 -839159 -553457 -105555 74439 -100326 -332640 -423872 -458066 -476371 -341236
37291c41236K94492K15808J6295o235R4267K0542k08406k77925j28629k1217m1243
$$ -341236 -46744 169064 185359 179124 273391 293933 85527 -192398 -321027 -342244 -383487
37280c83487o09J21662J04364o0895r5121N8899J01580p7070j58444O3251L07666
$$ -383487 -384096 -262434 -158070 -218965 -314086 -255187 -153607 -230677 -389121 -325870 -18204
37269a8204K59096L7147q2746r8932j15872m5214J68427K76024O6115k15291j83397
$$ -18204 240892 278039 195293 96361 -19511 -64725 103702 379726 445841 230550 47153
37258D7153Q8128J90783J4404j46757r7332L1031Q2135O0793l5431k42351m10235
$$ 47153 135281 326064 340468 193711 96379 127410 209545 270338 234907 -7444 -417679
37247d17679k81186R2578L09185J58209p7945o8884Q1322P8743l9282J0516K36660
$$ -417679 -698865 -606287 -297102 -138893 -216838 -285722 -204400 -125657 -164939 -154423 82237
37236H2237L19507J23016q0984m0987J00377P1679r1243j33704J380J04776K1026
$$ 82237 401744 524760 443776 402789 503166 574845 483602 349898 351278 456054 477080
37225D77080j77979l35759l46720j70941R5135J99690J8843j78386m5675K70665
$$ 477080 299101 -36658 -383378 -554319 -459184 -259494 -240651 -419037 -464712 -194047
37215a94047K66178j36522l94872j67619J34153J3318k90710j93935K64294M72722
$$ -194047 72131 -64391 -459263 -626882 -492729 -479411 -770121 -964056 -699762 -227040
37205b27040J98314j32740j73826j01800j37990j37946N1780K27318J50191m7391
$$ -227040 -28726 -161466 -335292 -437092 -575082 -713028 -661248 -433930 -283739 -331130
37195c31130r2715N414N2355J7203J6413O5937Q1780M2057k7833j33477k29133
$$ -331130 -423845 -418431 -366076 -348873 -332460 -266523 -184743 -142686 -170519 -303996 -533129
37184e33129j85871N980J44590R3095Q54N7974J72116J22419o4149j42791k2061
$$ -533129 -719000 -713020 -568430 -475335 -474481 -416507 -244391 -121972 -186121 -328912 -350973
37173c50973J27486J51896J04492R9759J22793P8961l2455r0885k4449M9233m5695
$$ -350973 -223487 -71591 32901 132660 255453 334414 301959 211074 186625 235858 190163
37162A90163k50472k64387L7408L28949K18858j80623l81386j96991O0835J17576
$$ 190163 -60309 -324696 -287288 41661 260519 79896 -301490 -498481 -437646 -320070
37152c20070Q1822J04298P4302q7620j64700J055J52965n566k72828k03799J87743
$$ -320070 -238248 -133950 -59648 -147268 -311968 -310913 -157948 -163514 -436342 -640141 -452398
37141d52398M07561J88284j53807j87467Q6385L17299K62128K837k13366k36427
$$ -452398 -44837 143447 -10360 -197827 -111442 205857 467985 470822 257456 21029
37131B1029j22140k0439J6367O1735J47438J74423O1242j07771j76496j00182
$$ 21029 -101111 -121550 -105183 -43448 103990 278413 339655 231884 55388 -44794
37121d4794L9378J38953J29935L597j50057j94872r8881K5535N9043j8676j55222
$$ -44794 -5416 133537 263472 267069 117012 -77860 -176741 -151206 -92163 -110839 -266061
37110b66061k50082j75276P5747K82233K33629N3423L9215J84335J78518n2695
$$ -266061 -516143 -691419 -615672 -333439 -99810 -46387 -7172 177163 355681 302986
37100C02986j75969J4106K31619J30662j68222k81745j18905N2205N580j86006
$$ 302986 127017 141123 372742 503404 335182 53437 -65468 -13263 -7683 -193689
37090a93689k57632k7523L58015M74994J09745l57584l77646n898J87686O193
$$ -193689 -451321 -478844 -120829 354165 463910 106326 -271320 -277218 -89532 -83339
37080h3339j33681J1153J12550m7193j30979Q8133K17488o4511l57301j97108
$$ -83339 -217020 -205867 -93317 -140510 -271489 -183356 34132 -30379 -387680 -584788
37070e84788J29063J18043n3465N9928K60088P3152k64079j24591L66153M69849
$$ -584788 -455725 -337682 -391147 -331219 -71131 2021 -262058 -386649 -20496 449353
37060D49353P3759j68706M201J12589q8530j99654k0033M8047k08437l78800j72572
$$ 449353 523112 354406 358607 471196 382666 183012 162979 211026 2589 -376211 -548783
37049e48783R0423J19778J31361K91849L23175Q2663p0029P5971J56817q2329
$$ -548783 -458360 -338582 -207221 84628 407803 490466 420437 496408 653225 570896
37039E70896k70933r1767J00265q0617l16614j37385K37033K78631K3894j03869
$$ 570896 299963 208196 308461 227844 -88770 -226155 10878 289509 313403 209534
37029B09534n5707p7729j01045J25045M36353M13417N8646k27870k68089k06898
$$ 209534 153827 76098 -24947 100098 536451 949868 1008514 780644 512555 305657
37019C05657j03181P9469J76855J7748j81777j04922J00139N7686j53788j39828
$$ 305657 202476 281945 458800 476548 294771 189849 289988 347674 193886 54058
37009E4058O2738J6366l14124m36351j41789J61388J40914K1016R0581K01770
$$ 54058 116796 133162 -180962 -617313 -759102 -597714 -456800 -435784 -345203 -143433
36999a43433R7185j20454j83671p3774M2458R1453Q8387L8642J3129J20733K65439
$$ -143433 -46248 -166702 -350373 -424147 -381689 -290236 -201849 -163207 -150078 -29345 236094
36988B36094J78962j41301l08755q9418K05955J70235q8923j55497K2866R0805
$$ 236094 415056 273755 -35000 -124418 81537 251772 162849 7352 30218 121023
36978A21023j02995k65805j52013N3000N7099q2845j05192J1048N3179l0155n8336
$$ 121023 18028 -247777 -399790 -346790 -289691 -372536 -477728 -466680 -413501 -443656 -501992
36967e01992K5055L7848q5671j23224O2764K54801K34651J46241J76636J29466
$$ -501992 -476937 -439089 -524760 -647984 -585220 -330419 -95768 50473 227109 356575
36957C56575k29645n85893m05201J91820M98559K48108n6393l1134K1730k05229
$$ 356575 126930 -458963 -864164 -672344 -173785 74323 17930 -13204 8526 -196703
36947a96703l88916j46282K36914K54457J4092p143J95520K08418k5592j23540
$$ -196703 -585619 -731901 -494987 -240530 -226438 -233581 -38061 170357 144765 21225
36937B1225M8278J73121M7856j33963j64627q6632J2225J19211J56510M3670q2202
$$ 21225 69503 242624 290480 156517 -8110 -94742 -82517 36694 193204 236874 154672
36926A54672l1694P3792l4523k76547l01539o4329J12047Q8783P9583J88814K28285
$$ 154672 122978 196770 162247 -114300 -415839 -480168 -368121 -279338 -199755 -10941 217344
36915B17344J13066J1979k8512j80282m02604l61634J5270L30009K94162J15063
$$ 217344 330410 342389 313877 133595 -269009 -630643 -615373 -285364 8798 123861
36905A23861N1613m42j70130k51368n9399J69761J27658p0978j14788M104Q1383
$$ 123861 175474 175032 4902 -246466 -305865 -136104 -8446 -79424 -194212 -190108 -108725
36894a08725Q7972R9957L1708j78601k85716m9576K92123K88995m8669k63530
$$ -108725 -20753 79204 110912 -67689 -353405 -402981 -110858 178137 129468 -134062
36884a34062j34735N7871K0577j57712k23607j15998K3444L6148j18299k93842
$$ -134062 -268797 -210926 -190349 -348061 -571668 -687666 -664222 -628074 -746373 -1040215
36874a040215k50076M6452K99457K55116P5739P1430J83607J08019j29998j71000
$$ -1040215 -1290291 -1243839 -944382 -689266 -613527 -542097 -358490 -250471 -380469 -551469
36864e51469O4193K24355J40188J17273L46489M53335N0775n55213o96368k48969
$$ -551469 -487276 -262921 -122733 -5460 341029 794364 845139 289926 -406442 -655411
36854f55411K39466L06945O1947j37183j39326j9509R8462J07136j6839j21960
$$ -655411 -415945 -109000 -47053 -184236 -323562 -343071 -244609 -137473 -154312 -276272
36844b76272k1832K15441K98392J01093j62103k33728j09819M9430J30638R0436
$$ -276272 -298104 -82663 215729 316822 154719 -79009 -188828 -139398 -8760 81676
36834H1676n7961j73909q0779J58046K43244M9945j71387j64766k1180M2116L3385
$$ 81676 23715 -150194 -230973 -72927 170317 220262 48875 -115891 -137071 -94955 -61570
36823f1570N9744N0599q4958j86767o3612J40229J38981m4165j70090k05730k57448
$$ -61570 -1826 48773 -36185 -222952 -286564 -146335 -7354 -51519 -221609 -427339 -684787
36812f84787k06117J11559M30570L15266j03897k36667M4203K11393j4213k25620
$$ -684787 -890904 -779345 -348775 -33509 -137406 -374073 -329870 -118477 -132690 -358310
36802c58310q8694J07050O9197O2952L21427M44965L9673m75705m22659P3842
$$ -358310 -447004 -339954 -270757 -207805 113622 558587 598260 122555 -300104 -226262
36792b26262L08785R1698j22426j05514j16406k51416k25359M9576K41985J39039
$$ -226262 82523 174221 51795 -53719 -170125 -421541 -646900 -597324 -355339 -216300
36782b16300o2157j43686j23298k3886J82372L16091J29420k03210k04488J75240
$$ -216300 -278457 -422143 -545441 -569327 -386955 -70864 58556 -144654 -349142 -173902
36772a73902M30075K57317m4628j36008j04669j17189o7340J02625J31817j47834
$$ -173902 256173 513490 468862 332854 228185 110996 43656 146281 278098 130264
36762A30264m45308l94583n0184K79913M32787L67707M6530l66970m73241j30064
$$ 130264 -315044 -709627 -759811 -479898 -47111 320596 367126 156 -473085 -603149
36752f03149K57700K54227k6134j65647n3086Q5319Q8238k4721j90727k80682
$$ -603149 -345449 -91222 -117356 -283003 -336089 -250770 -162532 -187253 -377980 -658662
36742f58662j09685K56030M05341J10693k49090j63483K66044M62619J80626k20752
$$ -658662 -768347 -512317 -106976 3717 -245373 -408856 -142812 319807 500433 279681
36732B79681l20495j16901R5956R3444r4383k22987q0476K09943K69128j9251
$$ 279681 -40814 -157715 -61759 31685 -62698 -285685 -366161 -156218 112910 93659
36722I3659k80132j63659J36638J99667J3862r2732k5366R273m7750l2531N3500
$$ 93659 -186473 -350132 -213494 -13827 35 -92697 -118063 -108790 -156540 -189071 -135571
36711a35571J1055j33257r3413J55880K33634n9956l65398k62723J08368K54819
$$ -135571 -124516 -257773 -351186 -195306 38328 -21628 -387026 -649749 -541381 -286562
36701b86562J9771k48949k01985Q7173K72163J72119m3398r5547N0477J65183
$$ -286562 -266791 -515740 -717725 -630552 -358389 -186270 -229668 -325215 -274738 -109555
36691a09555R9883K434N7315J47488K1219k54013l08410j0864K92760K51119r728
$$ -109555 -9672 -7238 50077 197565 218784 -35229 -343639 -354503 -61743 189376 179648
36680A79648j12600J0085P2720p7589k24858j34289Q5577J61669P3458N1830J73710
$$ 179648 67048 77133 149853 72264 -152594 -286883 -201306 -39637 33821 85651 259361
36669B59361K12017M913k34421j93849O9739J99601M8095j50102j54792j3096
$$ 259361 471378 476291 241870 48021 117760 317361 365456 215354 60562 47466
36659D7466J19540K05091K21104N9959k58634m44034k48283J68101M03842K96058
$$ 47466 167006 372097 593201 653160 394526 -49508 -297791 -129690 274152 570210
36649E70210M1067j16535j25177p0254m0527o6054r2512l6663O9527P4982n8344
$$ 570210 611277 494742 369565 299311 258784 192730 100218 63555 133082 208064 149720
36638A49720j35671J2680K47866K67844j0484l55218m72267k60453J19924L56838
$$ 149720 14049 26729 274595 542439 531955 176737 -295530 -555983 -436059 -79221
36628g9221K64602J3557o6625M2439K7286k04200k99661l8394K27281R4177k24977
$$ -79221 185381 198938 132313 174752 202038 -2162 -301823 -340217 -112936 -18759 -243736
36617b43736k42316J4157J07742l0465m0725J56190K07532o975j45516k4623P8402
$$ -243736 -486052 -471895 -364153 -394618 -435343 -279153 -71621 -78596 -224112 -248735 -170333
36606a70333j8607p1571O9644J19642r6933k36877j9569K13030M2793k70894j83282
$$ -170333 -188940 -260511 -190867 -71225 -168158 -405035 -424604 -211574 -168781 -439675 -622957
36595f22957K25728L67259O9465k20056j69516M4365J58351J60332R1320p2316
$$ -622957 -397229 -29970 39495 -180561 -350077 -305712 -147361 12971 104291 31975
36585C1975k14921j32571J01675J82651P2873N9793J99229J55759j86874m07322
$$ 31975 -182946 -315517 -213842 -31191 41682 101475 300704 456463 269589 -137733
36575a37733j69732K11829K36326m2212j83091q1765m7785k15061l16565j21884
$$ -137733 -307465 -95636 140690 98478 -84613 -166378 -214163 -429224 -745789 -867673
36565h67673K24029M12566L20390P2870j07802r7734l610m0511j95713j83204
$$ -867673 -643644 -231078 89312 162182 54380 -43354 -46964 -87475 -283188 -466392
36555d66392J01748L10120J16442k31000k39527P4054K32693O9987o8112K4176
$$ -466392 -364644 -54524 61918 -169082 -408609 -334555 -101862 -31875 -99987 -75811
36545g5811Q3936q7396k36388j06458J10882J13925k8083p2414j9204N560M3373
$$ -75811 8125 -79271 -315659 -422117 -311235 -197310 -225393 -297807 -317011 -311451 -268078
36534b68078J40449J24920r1978k20422o850K57198J12273l13253m33035n9249
$$ -268078 -127629 -2709 -94687 -315109 -321959 -64761 47512 -265741 -698776 -758025
36524g58025L60445M14459J93615j6429j19113j43090j07680q1431j29397j43192
$$ -758025 -397580 16879 210494 194065 74952 -68138 -175818 -257249 -386646 -529838
36514e29838J9837K19343J71891p1642j54585J6640J23558k3403j86982j32552
$$ -529838 -510001 -290658 -118767 -190409 -344994 -328354 -204796 -228199 -415181 -547733
36504e47733O90p584q8284m9834J09292K60758L25435K46849M793k25708j87961
$$ -547733 -547043 -554627 -642911 -692745 -583453 -322695 2740 249589 254382 28674 -159287
36493a59287O3693J76033K6461j00285k3894L3150j04165k11206q0646P2261j625
$$ -159287 -95594 80439 106900 6615 -17279 15871 -88294 -299500 -380146 -307885 -309510
36482c09510j14963J3011K20931J83181O110L8809K27440J90692r3784j95355
$$ -309510 -424473 -411462 -190531 -7350 -1240 37569 265009 455701 361917 166562
36472A66562R3218M18768L69589Q669k64304k01246O0971J68456o1947l78284
$$ 166562 259780 678548 1048137 1056806 792502 591256 652227 820683 758736 380452
36462C80452l40476P8027L67845J66459k08206k43521q079K4619k07470k58444
$$ 380452 39976 118003 485848 652307 444101 200580 192501 217120 9650 -248794
36452b48794P3338M02897L33393j6147k59871k37280p1983M8502O491j66480k60779
$$ -248794 -175456 227441 560834 544687 284816 47536 -24447 24055 30546 -135934 -396713
36441c96713j03741J65999K41418Q0146n1855n803N9357n67p4986k2294Q9351
$$ -396713 -500454 -334455 -93037 -12891 -64746 -70549 -11192 -11759 -86745 -109039 -19688
36430a9688J19811O6178L363l9892m4665J5344P4663J6390j12871j05704R0072
$$ -19688 100123 166301 169664 129772 85107 100451 175114 191504 78633 -27071 63001
36419F3001K36956J24374j26813k29826j03740O5977Q7313l5446j47787j27512
$$ 63001 299957 424331 297518 67692 -36048 29929 117242 81796 -65991 -193503
36409a93503j1570O0921L7804K1754R3270J61868J12407P694k0642o836p3743
$$ -193503 -205073 -144152 -106348 -84594 8676 170544 282951 290645 270003 263167 189424
36398A89424j77112j65602p2732p8860j58501o1298K55781M61573K97003l3548
$$ 189424 12312 -153290 -226022 -304882 -463383 -524681 -268900 192673 489676 456128
36388D56128j43039J3816J42686O9008n2118k1418J01156R7164r1802k80685k85710
$$ 456128 313089 326905 469591 538599 486481 465063 566219 663383 571581 290896 5186
36377E186j43259j1622O1554J38491J98381J31992m0416j39983r6426n0326q2326
$$ 5186 -138073 -149695 -88141 50350 248731 380723 340307 200324 103898 53572 -28754
36366b8754n8482R2361J76501M7705q5026L2772K42769J86603j11030k64407j28007
$$ -28754 -87236 5125 181626 229331 144305 177077 419846 606449 495419 231012 103005
36355A03005J8750k8420q3689O5329K69463K33813m3294k65862k06355P0775L17271
$$ 103005 121755 93335 9646 74975 344438 578251 534957 269095 62740 133515 450786
36344D50786L43680J76691J9081L9893K11509L77988M30222L58573K10933Q7473
$$ 450786 794466 971157 990238 1030131 1241640 1619628 2049850 2408423 2619356 2706829
36334B706829R8533K31078L47914M16192O02417J001949J430681J684477J867825
$$ 2706829 2805362 3036440 3384354 3800546 4402963 5404912 6835593 8520070 10387895
36325A0387895K237964K859385L672557M722281N874915O332792M982297J590026
$$ 10387895 12625859 15485244 19157801 23880082 29754997 36087789 41070086 42660112
36317D2660112k537903n427202o054161n049945l837055l201152k828615k171597
$$ 42660112 40122209 34695007 28640846 23590901 19753846 16552694 13724079 11552482
36309A1552482j387301j062356j214617j187332o64263j82114k72407o19964o04382
$$ 11552482 10165181 9102825 7888208 6700876 6036613 5854499 5582092 4962128 4357746
36300D357746k75609j51924l06820l50519k07220k13777m24128m70147k32767
$$ 4357746 4082137 3930213 3623393 3272874 3065654 2851877 2427749 1957602 1724835
36291A724835n6568j17238j23655J08711K78952R9122k24900l33749k28973j35312
$$ 1724835 1668267 1551029 1427374 1536085 1815037 1914159 1689259 1355510 1126537 991225
36281I91225r0966J2166J34956J24900j6604j12033n2339N8666L6333j38496k53403
$$ 991225 900259 912425 1047381 1172281 1155677 1043644 991305 1049971 1086304 947808 694405
36270F94405j23371J12807J41891m8998j23297O2821K06570P0499j09976o0167
$$ 694405 571034 683841 825732 776734 653437 716258 922828 993327 883351 823184
36260H23184L8925q9470k70376j76572Q2787J91646K06821L44720M10644Q3448
$$ 823184 862109 772639 502263 325691 408478 600124 806945 1151665 1562309 1645757
36250A645757l78174l94709K8714L18155K32596Q8764O4971m6348k89033l67403
$$ 1645757 1267583 872874 901588 1219743 1452339 1541103 1606074 1559726 1270693 903290
36240I03290j69958N4823J52433K08262J97906j003k22234j53853J17353K14717
$$ 903290 733332 788155 940588 1148850 1346756 1345753 1123519 969666 1087019 1301736
36230A301736J00798O6813J48797J19279m207j9011l088j23849j49031J82860
$$ 1301736 1402534 1469347 1618144 1737423 1733216 1714205 1711117 1587268 1438237 1621097
36220A621097N12090L40184n4964l7042K75509K64541j9924k67K68733K10295
$$ 1621097 2133187 2473371 2418407 2381365 2656874 2921415 2901491 2901224 3169957 3380252
36210C380252r5708k4712L57590L99551J56198K74629O24943M56581p6865o8450
$$ 3380252 3284544 3259832 3617422 4016973 4173171 4447800 5072743 5529324 5452459 5384009
36200E384009M18003M06645j01615n8987O16225Q26862L84502L51135R50630J211572
$$ 5384009 5802012 6208657 6107042 6048055 6664280 7491142 7875644 8226779 9177409 10388981
36190A0388981J064234J541318K499193K666631K409761L553135N894965P289551
$$ 10388981 11453215 12994533 15493726 18160357 20570118 24123253 30018218 37307769
36182C7307769P934144J0502500J5011660J8837826K3675818L5097297M9852753
$$ 37307769 45241913 55744413 70756073 89593899 113269717 148367014 198219767
36175A98219767N0964982K5540569j5284952m4484546m7749788l5311221k4331441
$$ 198219767 249184749 274725318 259440366 214955820 167206032 131894811 107563370
36168A07563370j9597416j6128172j1842870r172322q293848o654731m159777
$$ 107563370 87965954 71837782 59994912 50822590 42528742 35874011 31714234
36161C1714234l171459l804698l718827k345247j478582j719766j698610r51044
$$ 31714234 28542775 24738077 21019250 18674003 17195421 15475655 13777045 12826001
36153A2826001o13021r98546j051688n07725l53057q33896j004180n44013k40651
$$ 12826001 12212980 11214434 10162746 9655021 9301964 8468068 7463888 6919875 6679224
36144F679224m03193m21976j23162o2289k85944k04782J47438P0449m37449n55673
$$ 6679224 6276031 5854055 5730893 5668604 5382660 5177878 5325316 5395765 4958316 4402643
36134D402643o7510K79184M5806l28245m22161l50719k38317j9229J56224N5554
$$ 4402643 4335133 4614317 4660123 4331878 3909717 3558998 3320681 3301452 3457676 3513230
36124C513230j31752r9174l5909k34128m11012k03282O4135l9717j76264R6972
$$ 3513230 3381478 3282304 3246395 3012267 2601255 2397973 2462108 2422391 2246127 2343099
36114B343099L21777q1976n62848k48067M45497M27988j80392l09208J28304J77552
$$ 2343099 2664876 2582900 2020052 1771985 2217482 2645470 2465078 2155870 2284174 2461726
36104B461726l09687m21049N4006K25303j96065l49119J38154M26746N053l90084
$$ 2461726 2152039 1730990 1784996 2010299 1814234 1465115 1603269 2030015 2035068 1644984
36094A644984j12074L21996K59779k4160n0211O424j00916r1321J82965K76642
$$ 1644984 1532910 1854906 2114685 2090525 2040314 2046738 1945822 1854501 2037466 2314108
36084B314108j6297j68933J23121L17062J1197k71801k3939L15922J77001j14857
$$ 2314108 2297811 2128878 2251999 2569061 2580258 2308457 2284518 2600440 2777441 2662584
36074B662584Q413K99607K02668r6561m5030K53896K92590J27996K19572N10957
$$ 2662584 2670997 2970604 3173272 3076711 3031681 3285577 3578167 3706163 3925735 4436692
36064D436692N20386K38833J54537M06830O18331O03934O22436Q32546J023551
$$ 4436692 4957078 5195911 5350448 5757278 6375609 6979543 7601979 8434525 9458076
36055I458076J011690R01639Q48450Q60403Q91556Q99021Q20738O82510O27145
$$ 9458076 10469766 11371405 12219855 13080258 13971814 14870835 15691573 16374083 17001228
36046A7001228O41368M26257j97909r26111j308542j318081j271311j303679j257856
$$ 17001228 17642596 18068853 17870944 16944833 15636291 14318210 13046899 11743220 10485364
36037A0485364j045406q11989p14560p36108p47958o51382m81498m03103m98201
$$ 10485364 9439958 8627969 7913409 7177301 6429343 5777961 5296463 4893360 4395159
36028D395159n67759l60589m987J01910j03200k42467j27290n4304k27570l43027
$$ 4395159 3827400 3466811 3461824 3563734 3460534 3218067 3090777 3036473 2808903 2465876
36018B465876j20595J65497J62077Q8973L38112O64761M47105k97555q04696n94980
$$ 2465876 2345281 2510778 2672855 2761828 3099940 3764701 4211806 3914251 3109555 2514575
36008B514575p2276J32415k8799j75966j51931j38685k41782l00606j71184J4879
$$ 2514575 2442299 2574714 2545915 2369949 2218018 2079333 1837551 1536945 1365761 1380640
35998A380640J9397j46920k07136j2986J95276J01191k02263l04871p0930J66140
$$ 1380640 1400037 1253117 1045981 1032995 1228271 1329462 1127199 822328 751398 917538
35988I17538J21424l7572l5257L7742o1784k25512j31741J56599J89165j60812
$$ 917538 1038962 1001390 966133 1003875 942091 716579 584838 741437 930602 769790
35978G69790m07456j49917K73339K49583j63231k86252J32176M72660J68421l85999
$$ 769790 362334 212417 485756 735339 572108 285856 418032 890692 1059113 673114
35968F73114m04219P6802K64149j13885l73980k849N04910M71832J30278J64702
$$ 673114 268895 345697 609846 495961 121981 119132 624042 1095874 1226152 1390854
35958A390854N16656M73385j46447o85336o30667k43950j3386k6741j18340j88666
$$ 1390854 1907510 2380895 2234448 1549112 918445 674495 661109 634368 516028 327362
35948C27362j51784O7269L12996L15768J22618L7532Q7897J6608j39383l7675
$$ 327362 175578 242847 555843 871611 994229 1031761 1119658 1136266 996883 959208
35938I59208K61692K20964k69674n62680k37009J99675J21505k39937k70287l152
$$ 959208 1220900 1441864 1172190 609510 372501 572176 693681 453744 183457 180305
35928A80305M6789j71929k07270O8023K56866J26409n4304j212J74714J99438
$$ 180305 227094 55165 -152105 -84082 172784 299193 244889 243677 418391 617829
35918F17829M404k40683k94025m2038L22070M13858J18392k16639k44154o7981
$$ 617829 622233 381550 87525 45487 367557 781415 899807 683168 439014 371033
35908C71033J9713Q797M5072N8752q2462k26254j59417k1700n5888j04117J33652
$$ 371033 390746 399543 444615 503367 420905 194651 35234 13534 -42354 -146471 -12819
35897a2819M54767L59161j11962l57637j35925R9102k3218k41204j91355N759
$$ -12819 441948 801109 689147 331510 195585 294687 271469 30265 -161090 -155331
35887a55331O4852M3234J19971J80881N3247p9178N8316K99077K21760j75660
$$ -155331 -90479 -47245 72726 253607 306854 227676 285992 585069 806829 631169
35877F31169m19011k34771Q6555J46401l1768j33088k6709J20340J34193L3278
$$ 631169 212158 -22613 63942 210343 178575 45487 18778 139118 273311 306589
35867C06589p9800j67561k24144j95484m5918J33629J97571J28448M5701K3547
$$ 306589 226789 59228 -164916 -360400 -406318 -272689 -75118 53330 99031 122578
35857A22578K4258L9187J28563K35221J51336j54046l48023j39181K42460L04022
$$ 122578 146836 186023 314586 549807 701143 547097 199074 59893 302353 606375
35847F06375N75j96796k6591J84480J04223l2591J56230M90563N02562L20425
$$ 606375 606950 410154 383563 568043 672266 639675 795905 1286468 1789030 2109455
35837B109455N90930J329409J530748M66748j087207j664232r81666k05800k46599
$$ 2109455 2700385 4029794 5560542 6027290 4940083 3275851 2294185 2088385 1841786
35828A841786o19440m38661J66097L74461K0166k46716o7225J68982J32040J01268
$$ 1841786 1222346 783685 949782 1324243 1344409 1097693 1030468 1199450 1331490 1432758
35818A432758L57516N83271L31775k60891o77948p02099n01635k33794L8086J62953
$$ 1432758 1790274 2373545 2705320 2444429 1766481 1064382 562747 328953 367039 529992
35808E29992L3370j53185j02629J39981K70566K00573J21394J03072j2972k46454
$$ 529992 563362 410177 307548 447529 718095 918668 1040062 1143134 1130162 883708
35798H83708l41286j55032P8441P3091j10285j95307r4526K7696L9664n721j5132
$$ 883708 542422 387390 465831 538922 428637 233330 138804 166500 206164 200443 185311
35787A85311Q61j2911m2597k3598O0327J49157J70261J00291k4796j32776j64647
$$ 185311 186172 173261 130664 107066 167393 316550 486811 587102 562306 429530 264883
35776B64883j35980j22978j37890o9086J49260L52954L09910O9439p6460l9679
$$ 264883 128903 5925 -131965 -201051 -51791 301163 611073 680512 604052 564373
35766E64373o2004k43997k72709P5205M35273K98872j98745m26576j58941J71216
$$ 564373 502369 258372 -14337 60868 496141 795013 596268 169692 10751 181967
35756A81967J83300K2521l9425k8971n2015k1880J11523J51666m1783k65560k49275
$$ 181967 365267 387788 348363 319392 267377 245497 357020 508686 466903 201343 -47932
35745d7932l9878J15172J12723L0857l8586m3173J4779K9590q2022j81100o6772
$$ -47932 -87810 27362 140085 170942 132356 89183 103962 133552 51530 -129570 -196342
35734a96342J53656J67871l8567j53696o5344J2630J9046J50043L48424K50100
$$ -196342 -42686 125185 86618 -67078 -132422 -119792 -100746 49297 397721 647821
35724F47821j38778l05030o7548P2400j87288l70852n7373L26915K06125j82162
$$ 647821 509043 204013 136465 208865 21577 -349275 -406648 -79733 126392 -55770
35714e5770k44228j2046Q2972M3550J42955K50174R9391n8671J27696L32799M8492
$$ -55770 -299998 -312044 -229072 -185522 -42567 207607 306998 248327 376023 708822 757314
35703G57314m02265k88142K69620M48210O1589k44147j41635P607O180J03770
$$ 757314 355049 66907 336527 784737 846326 602179 460544 468151 474331 578101
35693E78101L18276L48217K24215K11001J60218q5579P0563J057862J821856J270038
$$ 578101 896377 1244594 1468809 1679810 1840028 1754449 1825012 2882874 4704730 5974768
35683E974768Q69367L217866P305253Q074904K728536m719589p859636n506658
$$ 5974768 6844135 10062001 17367254 25442158 28170694 23451105 15591469 10084811
35675A0084811k061398j063296j631013j562204q20642n09208n56262k35656K20768
$$ 10084811 8023413 6960117 5329104 3766900 2946258 2437050 1880788 1645132 1865900
35666A865900J08446l52769l89579M992J83825k4018j93454j25552m4208q1547
$$ 1865900 1974346 1621577 1231998 1236990 1420815 1396797 1203343 1077791 1033583 952036
35656I52036j49519k18830k69153j25296K38772M41648J78348k39691k88304n067
$$ 952036 802517 583687 314534 189238 428010 869658 1048006 808315 520011 514944
35646E14944J21604o9826k39087j38808O0790J21910O6705L6975O1797O7000j6407
$$ 514944 636548 566722 327635 188827 249617 371527 438232 475207 537004 604004 587597
35635E87597j75259k54508n8815L42805N45448K70700k02874l55316j18098P3323
$$ 587597 412338 157830 99015 441820 987268 1257968 1055094 699778 581680 655003
35625F55003n6247k53525j81471O3841J41759J082p7720N5602J95009J06573j15696
$$ 655003 598756 345231 163760 227601 369360 370442 292722 348324 543333 649906 534210
35614E34210j90678n3669O7673j3370j89382k14330k2653J96021K13747O233k10188
$$ 534210 343532 289863 357536 344166 154784 -59546 -82199 113822 327569 333802 123614
35603A23614j82396R6624L30041K31972j12264l28700k06429R1092K97634L30362
$$ 123614 -58782 37842 367883 599855 487591 158891 -47538 43554 341188 671550
35593F71550K24622J392k48631l35153k01171l3017J8440M0810J13687J00613
$$ 671550 896172 897564 648933 313780 112609 79592 98032 138842 252529 353142
35583C53142o3693j31585P1246K43294J6683l95439m50238r1718K01805J77721
$$ 353142 289449 157864 229110 472404 489087 93648 -356590 -448308 -246503 -68782
35573f8782P8927Q8747N8385n5636j7076J95585K24100n2249k16141J8087K86039
$$ -68782 10145 98892 157277 101641 84565 280150 504250 452001 235860 253947 539986
35562E39986J51703j90236k76288j13327k9154m0027O6718J89420M0548k54678
$$ 539986 691689 501453 225165 111838 82684 42657 109375 298795 339343 84665
35552H4665k67110J9319J59158m311q9702J40433L53090J89424j61272k73232
$$ 84665 -182445 -163126 -3968 -8279 -97981 42452 395542 584966 423694 150462
35542A50462r0751J16265K07970K44974K06177l1400m04749n97169l67649J39538
$$ 150462 59711 175976 383946 628920 835097 803697 398948 -198221 -565870 -426332
35532d26332M90918L77365o9144l97198l06621M8375K85545K39233N0404j05477
$$ -426332 64586 441951 372807 -24391 -331012 -282637 2908 242141 292545 187068
35522A87068j76459j43009J319J37068R5717q4363j69272o4518O1121O8745M6860
$$ 187068 10609 -132400 -131081 5987 101704 17341 -151931 -216449 -155328 -86583 -39723
35511c9723R1190J06971R801o6775J6151J29650N9562j35772k03123q0098M6958
$$ -39723 51467 158438 168239 101464 117615 247265 306827 171055 -32068 -112166 -65208
35500f5208O4816O8151J27569J46909M9736o6266q3410n0020q8587j96086k45535
$$ -65208 -392 67759 195328 342237 391973 325707 242297 192277 103690 -92396 -337931
35489c37931j41727R7267L54734M46070K29966j90802m55660l03284P8574K46892
$$ -337931 -479658 -382391 -27657 418413 648379 457577 1917 -301367 -222793 24099
35479B4099P1037j08726P802K39641K22615j0484p9025J33742K70531L5468l47072
$$ 24099 95136 -13590 -5788 233853 456468 445984 366959 500701 771232 806700 459628
35468D59628m43730k04155K5518Q315j16427r2945J07650K78266K34066L1832
$$ 459628 15898 -188257 -162739 -154424 -270851 -363796 -256146 22120 256186 288018
35458B88018q0903K6377J59763N2440k04857k54462m9891J9846k15706l32923
$$ 288018 207115 233492 393255 445695 240838 -13624 -63515 -43669 -259375 -592298
35448e92298K3472M57878L58293j18037k61853O3878K55560K1023j65101M5395
$$ -592298 -568826 -110948 247345 129308 -132545 -68667 186893 207916 42815 88210
35438H8210K44122J4083k92359j46060K32547K42686p7859j41469J79033L46699
$$ 88210 332332 346415 54056 -92004 140543 383229 305370 163901 342934 689633
35428F89633M8525l32727l42103o9671J13716R5441L6524O3449J52664K05886
$$ 689633 738158 405431 63328 -6343 107373 202814 239338 302787 455451 661337
35418F61337J35855l0552j28792o2969J9340n5892j75434r3784J56409K99891
$$ 661337 797192 766640 637848 574879 594219 538327 362893 269109 425518 725409
35408G25409K36353J16616J8886j14628k09786r8471J20797J38063o0122j28180
$$ 725409 961762 1078378 1097264 982636 772850 674379 795176 933239 873117 744937
35398G44937N6924J61088m5091k82544k22084j5395p031j60461j62769L8302J78002
$$ 744937 801861 962949 917858 635314 413230 397835 390804 230343 67574 105876 283878
35387B83878J12249m446k770P0303N7981r8990k91193l28685j36969J20098K12045
$$ 283878 396127 391681 388911 459214 517195 418205 127012 -201673 -338642 -218544 -6499
35376f499J37780Q7475J06141L9211j30185j82516l2843R2602L5502k7494P0820
$$ -6499 131281 218756 324897 364108 233923 51407 18564 111166 146668 119174 189994
35365A89994J59510L7034j40544j13246M3042Q3088K8342O0143J12534j9916k41976
$$ 189994 349504 386538 245994 132748 175790 258878 287220 347363 459897 439981 198005
35354A98005k43354j8534R8057l4989j69559j02241K9324L2219k9323J5409J59808
$$ 198005 -45349 -63883 34174 -815 -170374 -272615 -243291 -211072 -240395 -224986 -65178
35343f5178K43201J58380n0468k25982k20058o2522L3437m6678j11943P1176L74871
$$ -65178 178023 336403 285935 59953 -160105 -222627 -189190 -235868 -347811 -276635 98236
35332I8236M14306O5186l46357m28620j43643J98291K57166j6668l02921k29902
$$ 98236 512542 577728 231371 -197249 -340892 -142601 114565 97897 -205024 -434926
35322d34926J47212L57156J42619j64351j51175N2983M9035j49247j92295l7971
$$ -434926 -287714 69442 212061 47710 -103465 -50482 -1447 -150694 -342989 -380960
35312c80960J9671n8125J1479K49365L17333J29090J2396Q8259N1673j84935k16232
$$ -380960 -361289 -419414 -407935 -158570 158763 287853 300249 388508 440181 255246 39014
35301C9014J29979L54743N7087l49544k71069J09912J75616r2281j43843J64851
$$ 39014 168993 523736 580823 231279 -39790 70122 245738 153457 9614 174465
35291A74465L43281R6127k41384k93822j60460q5034k6717J31858K50893J36451
$$ 174465 517746 613873 372489 78667 -81793 -166827 -193544 -61686 189207 325658
35281C25658j01114j86893q6178j0760m6570j2221K30233M79216L81117q4862
$$ 325658 224544 37651 -48527 -59287 -105857 -118078 112155 591371 972488 887626
35271H87626m75496l78342N2437K77150Q1231j75632j25217R0465J00800j22258
$$ 887626 412130 33788 86225 363375 444606 268974 143757 234222 335022 212764
35261B12764k82676k17214k9367J50515K51144J79573m7051j55421O6915L53914
$$ 212764 -69912 -287126 -316493 -165978 85166 264739 217688 62267 129182 483096
35251D83096K43701k09182m34418j72007J40144M4141k57145k55239R0141L48042
$$ 483096 726797 517615 83197 -88810 51334 95475 -161670 -416909 -326768 21274
35241B1274K73893P1826j1242j3831p4968j67426j75001j00207m4498l8531j2821
$$ 21274 295167 366993 355751 341920 266952 99526 -75475 -175682 -220180 -258711 -271532
35230b71532O8128J30360Q3691n0736j53184j42173n4473K9765R3517J64759K24579
$$ -271532 -203404 -73044 10647 -40089 -193273 -335446 -389919 -360154 -266637 -101878 122701
35219A22701K06318R1306m8148j15978p7609J0597L3165q2344k45587k40851K3175
$$ 122701 329019 420325 372177 256199 178590 189187 222352 140008 -105579 -346430 -323255
35208c23255L33555L64474O4464k56612k78704l2124J63605Q8250j28042j81053
$$ -323255 10300 374774 439238 182626 -96078 -128202 35403 123653 -4389 -185442
35198a85442P424J65017L1635k34366k19311J50163M29111K34601k12800l88510
$$ -185442 -178018 -13001 18634 -215732 -435043 -284880 144231 378832 166032 -222478
35188b22478j65271R6919J07353l5973j12531o2838P7105K63228L65495K41358
$$ -222478 -387749 -290830 -183477 -219450 -331981 -394819 -317714 -54486 311009 552367
35178E52367j0430j07446j466K7010j62153k95977j15586J81754K28781K8472
$$ 552367 541937 434491 433025 460035 297882 1905 -113681 68073 296854 325326
35168C25326j19375j03121o4925m8466N8293K10298J72582r9899l17064k26823
$$ 325326 205951 102830 37905 -10561 47732 258030 430612 330713 13649 -213174
35158b13174N3450K10287J12835q6643j50385N377K13011K06414n0483k59566
$$ -213174 -159724 50563 163398 76755 -73630 -68253 144758 351172 300689 41123
35148D1123j60755Q2461J08334q9682j60536J8207J22276q2133l17852j97160
$$ 41123 -119632 -37171 71163 -18519 -179055 -160848 -38572 -120705 -438557 -635717
35138f35717J89840M14804L08536R5105j6095n9437j09916j21058n6567L411j3433
$$ -635717 -445877 -31073 277463 372568 356473 297036 187120 66062 9495 12906 -527
35127e27n9269m9773K1086Q9388Q2401k9287j73843k03686p1088O6461M0015p5027
$$ -527 -59796 -109569 -88483 905 83306 54019 -119824 -323510 -394598 -328137 -288122 -363149
35115c63149n8068J18135K35377J48646k3604r8840o1867j014N2794J02452R4694
$$ -363149 -421217 -303082 -67705 80941 57337 -41503 -103370 -104384 -51590 50862 145556
35104A45556j4845j47333j61556l0752J05904Q6850r0650k41885j75680Q0387
$$ 145556 130711 -16622 -178178 -208930 -103026 -16176 -106826 -348711 -524391 -444004
35094d44004K91720K92516J61448M6289n9633k08961k87001j48063R0000J60146
$$ -444004 -152284 140232 301680 347969 288336 79375 -207626 -355689 -265689 -105543
35084a05543N1585J2018J12096J31413k3555j28620m6065J0293j29142k25518
$$ -105543 -53958 -41940 70156 201569 178014 49394 3329 13622 -115520 -341038
35074c41038l784L28279L25785l4655l19058k37330M5865K22694J88097K8933
$$ -341038 -344822 -16543 309242 274587 -44471 -281801 -235936 -13242 174855 203788
35064B03788j14573j35489o1989n1016j41044j20757J44020L92175K86815m6384
$$ 203788 89215 -46274 -108263 -159279 -300323 -421080 -277060 115115 401930 355546
35054C55546j77863l4180K8446j40786k36959n5448J27105J2811k09822j69034
$$ 355546 177683 143503 171949 31163 -205796 -261244 -134139 -121328 -331150 -500184
35044e00184R7253K16655M8740j52815j36459M3419J61813R5031r1691k34111
$$ -500184 -402931 -186276 -137536 -290351 -426810 -383391 -221578 -126547 -218238 -452349
35034d52349k15473o1305J10226K17758K40067J47862n5775k30246j96300K2415
$$ -452349 -667822 -729127 -618901 -401143 -161076 -13214 -68989 -299235 -495535 -473120
35024d73120K06194K18249J18106j5395j65953k50523j53100L5732O3795r9568
$$ -473120 -266926 -48677 69429 54034 -111919 -362442 -515542 -479810 -416015 -515583
35014e15583j89466o8484P7140J17538K06723L90495L56081n9405m27794k71402
$$ -515583 -705049 -773533 -696393 -578855 -372132 18363 374444 315039 -112755 -384157
35004c84157J72348K65882n8071k27862L0359K79184J04287k41138k69440J8547
$$ -384157 -211809 54073 -3998 -231860 -201501 77683 181970 -59168 -328608 -310061
34994c10061K36205K22004J52040J33908O1230r9634j85502j08105k2304o9349
$$ -310061 -73856 148148 300188 434096 495326 395692 210190 102085 79781 10432
34984A0432j20004J7916K28254J90707j12843k77941l6335L01492K60035r4742
$$ 10432 -109572 -91656 136598 327305 214462 -63479 -99814 201678 461713 366971
34974C66971k62231r4763m614k33846l94350q8310L77529L85781o9007l64192
$$ 366971 104740 9977 5363 -228483 -622833 -711143 -333614 52167 -16840 -381032
34964c81032j30976L09214M69780K70935n2148k94157l53849j96859P4231K53271
$$ -381032 -512008 -202794 266986 537921 485773 191616 -162233 -359092 -284861 -31590
34954c1590K46176J36234J306j55385k57166j65990O6500J77803M8847j11903
$$ -31590 214586 350820 352126 196741 -60425 -226415 -159915 17888 66735 -45168
34944d5168p4369R5696J72250P6106r6167k23584k15002m1773J64253J87019K1939
$$ -45168 -119537 -23841 148409 224515 128348 -95236 -310238 -352011 -187758 -739 21200
34933B1200p2502L2972R6073j15191l77418k79300J38675L78190J74314j37155
$$ 21200 -51302 -18330 77743 -37448 -414866 -694166 -555491 -177301 -2987 -140142
34923a40142j10219K00085L58593J58777j42607k04429k1200J26632N1644j21979
$$ -140142 -250361 -50276 308317 467094 324487 120058 98858 225490 277134 155155
34913A55155j36430N9378K26533J32494j33289k54479r7270J21678J50960M2913
$$ 155155 18725 78103 304636 437130 303841 49362 -47908 73770 224730 267643
34903B67643J9944J05295J12637j8164j24356j11908r3777j25598o3742J23455
$$ 267643 287587 392882 505519 487355 362999 251091 157314 31716 -32026 91429
34893I1429J62362j13103l66259j70149K98635M35250Q2441k42714j28913J70069
$$ 91429 253791 140688 -225571 -395720 -97085 338165 420606 177892 48979 219048
34883B19048K03518k0454j72619j35038n9910n7455j07704j63027j29773R0199
$$ 219048 422566 402112 229493 94455 34545 -22910 -130614 -293641 -423414 -333215
34873c33215L50253K84064j70830n24975l32909J84858M71245L74907J62696j4747
$$ -333215 17038 301102 130272 -394703 -727612 -542754 -71509 303398 466094 451347
34863D51347j96709k81435j28286O8295N198j71203o4181K37088K31158j17593
$$ 451347 254638 -26797 -155083 -86788 -81590 -252793 -316974 -79886 151272 33679
34853C3679k43753P0522K87983J8533k98165j26912K60909K52766r0854j83712
$$ 33679 -210074 -139552 148431 166964 -131201 -258113 2796 255562 164708 -19004
34843a9004R1838K31438k5967k93014j76620J41441K33201L4980j45424q5829
$$ -19004 72834 304272 278305 -14709 -191329 -49888 183313 218293 72869 -12960
34833a2960J07490J83939N1268j32818j55981j4576Q6117J0581j38900j90465
$$ -12960 94530 278469 329737 196919 40938 26362 112479 123060 -15840 -206305
34823b06305j13792J9839J51148K02859R0180j06292j42749M8836J99416Q7608
$$ -206305 -320097 -300258 -149110 53749 143929 37637 -105112 -56276 143140 230748
34813B30748r6267m8087J38924J10841j65619l34407j95531K7589O9390k4321
$$ 230748 134481 86394 225318 336159 170540 -163867 -359398 -331809 -262419 -286740
34803b86740o8236k4687M0089J02205J36237Q0037l1648n3899L0435L6362j15007
$$ -286740 -354976 -379663 -339574 -237369 -101132 -21095 -52743 -106642 -76207 -39845 -154852
34792a54852k05250m0746K01418K14208L4258l3694P4445Q7818j23982l06922
$$ -154852 -360102 -400848 -199430 14778 49036 15342 89787 177605 53623 -253299
34782b53299k14954J8112J15990O3383K0694k295r1287j48145L98K38882K49672
$$ -253299 -468253 -450141 -334151 -270768 -250074 -252369 -343656 -491801 -491403 -252521 -2849
34771b849J0528j30585J2931J88951J34877k6320n7156M96p024j4779R1993J67618
$$ -2849 7679 -122906 -109975 78976 213853 187533 130377 130873 123849 109070 201063 368681
34759C68681L2734j35694n0744J43952M0327l35183m74322j47574K39668K54875
$$ 368681 401415 265721 214977 358929 399256 64073 -410249 -557823 -318155 -63280
34749f3280J8310q8505J1840J17036J19856O9856Q29n9008j6522J36814K14361
$$ -63280 -44970 -133475 -121635 -4599 115257 185113 185942 126934 110412 247226 461587
34738D61587P5099j26502j37772K5048J17831L2671q4156q3485r592M672p2072
$$ 461587 536686 410184 272412 297460 415291 447962 363806 280321 270729 275401 203329
34727B03329j49162j39591n7297J7376M1659L0949j6447j11878j62635k5645K24203
$$ 203329 54167 -85424 -142721 -125345 -83686 -52737 -69184 -181062 -343697 -369342 -145139
34716a45139K76914K9470j64806J5059L08221K22361j79432l43643q4760J58613
$$ -145139 131775 161245 -3561 11498 319719 542080 362648 19005 -65755 92858
34706I2858O0124j26419q4500N2894M8616K4914J81832L49466K43105l0857j23198
$$ 92858 152982 26563 -57937 -5043 43573 68487 250319 599785 842890 812033 688835
34695F88835K3254J41207P4490n6562r8645l8278N9777J24877J09267L8126j0801
$$ 688835 712089 853296 927786 871224 772579 734301 794078 918955 1028222 1066348 1055547
34684A055547n54P7018K54672M66684M81020K26632N4815K91577O81430P89848
$$ 1055547 1054993 1132011 1386683 1853367 2334387 2561019 2615834 2907411 3588841 4378689
34674D378689P91952J163485J726338J930625K051944K934694M434828N641892
$$ 4378689 5170641 6334126 8060464 9991089 12043033 14977727 19412555 25054447
34666B5054447P048606J0379457J4801910J5367285Q078938m118643j3262045
$$ 25054447 32103053 42482510 57284420 72651705 80730643 76612000 63349955
34659F3349955j4641647j0877589p294478n839516n042421l803527k698891k216838
$$ 63349955 48708308 37830719 30536241 24696725 19654304 15850777 13151886 10935048
34651A0935048j872168j282313p76513o53058p19211p57627p87245p60945n48373
$$ 10935048 9062880 7780567 7004054 6350996 5631785 4874158 4086913 3325968 2777595
34642B777595k61336j39342j39699o2498J2041j33947l67596l38119n8102J00457
$$ 2777595 2516259 2376917 2237218 2174720 2186761 2052814 1685218 1347099 1288997 1389454
34632A389454j6231j85818k33332k16526j63052j060J82466J49341j24841l55590
$$ 1389454 1373223 1187405 954073 737547 574495 573435 755901 905242 780401 424811
34622D24811l10871o3418J78564L06958L17227K27379P0767r6331k10115k18894
$$ 424811 113940 50522 229086 536044 853271 1080650 1151417 1055086 844971 626077
34612F26077j40847r4166j51685j79819j2241K21392K16305j0366q3158J42115
$$ 626077 485230 391064 239379 59560 47319 268711 485016 474650 391492 533607
34602E33607L18842J57932j16486j51039N383Q1286K6800n8582j93274l60940
$$ 533607 852449 1010381 893895 742856 748239 829525 856325 797743 604469 243529
34592B43529l37540m6836J52476m7029l48902k52130J73165M10115K75793N9260
$$ 243529 -94011 -140847 11629 -35400 -384302 -636432 -463267 -53152 222641 281901
34582B81901n7333j80203k91604j76994J36854L22204K50526J54428J77376J53503
$$ 281901 224568 44365 -247239 -424233 -287379 34825 285351 439779 617155 770658
34572G70658k2435j72602j55769r5518j19889j48062r1471j7758K2607R4450J81756
$$ 770658 748223 575621 419852 324334 204445 56383 -35088 -52846 -30239 64211 245967
34561B45967J34884o1061j95666j36083p306M0572L3224L6634L2440K8629Q7989
$$ 245967 380851 319790 124124 -11959 -19265 21307 54531 91165 123605 152234 240223
34550B40223J59934J01239n7115j02378J5216Q9450J4118m6759J4985M2219p7140
$$ 240223 400157 501396 444281 341903 357119 446569 460687 413928 428913 471132 393992
34539C93992j55407n680K11234K05298j8666k00964j93313o7705O7931J62864
$$ 393992 238585 232905 444139 649437 630771 429807 236494 168789 236720 399584
34529C99584J67779M8528j40794k80064k66710p4652J84920K79956R2075j65977
$$ 399584 567363 615891 475097 195033 -71677 -146329 38591 318547 410622 244645
34519B44645j71870M9224J45165k6523j86035r0752J01241J39537P6165Q5020
$$ 244645 72775 121999 267164 240641 54606 -36146 65095 204632 280797 365817
34509C65817J16864L6246o9889k6326J12551J62511J12269N1095p8405l41630
$$ 365817 482681 518927 449038 422712 535263 697774 810043 861138 782733 441103
34499D41103n31546l81229j2863J79048R3961K5334J51976K78696J95880m447
$$ 441103 -90443 -471672 -484535 -305487 -211526 -186192 -34216 244480 440360 435913
34489D35913j19580j03524r341J19053J75767L5462k00106k27719K0585J97052
$$ 435913 316333 212809 203468 322521 498288 533750 333644 105925 126510 323562
34479C23562J4391k99412l04169K2943K71959J79962o7311j60526n0052R5575
$$ 323562 337953 38541 -265628 -242685 29274 209236 141925 -18601 -68653 26922
34469B6922J36648M9967j10871k31037j92077j4129J19888P6404m3160l6368J07381
$$ 26922 163570 213537 102666 -128371 -320448 -334577 -214689 -138285 -181445 -217813 -110432
34458a10432J77255L5672j74339k08592m1999J14580J11724M1962N8989J27301
$$ -110432 66823 102495 -71844 -280436 -322435 -207855 -96131 -54169 4820 132121
34448A32121Q3788r2255k22008j71301k5990M9492L2646K2658O3700J04540J08228
$$ 132121 215909 123654 -98354 -269655 -295645 -246153 -213507 -190849 -127149 -22609 85619
34437H5619Q7935L5280p3309j77635j54140J3949J81740K16435J35276R451j49369
$$ 85619 173554 208834 135525 -42110 -196250 -182301 -561 215874 351150 360601 211232
34426B11232k94652k62153K4114L25046L01897k2299k50260j37460R9687J45824
$$ 211232 -83420 -345573 -321459 3587 305484 283185 32925 -104535 -4848 140976
34416A40976L5706Q381P3304K7048j50156k28517j01645N3872Q7075Q3780J24437
$$ 140976 176682 185063 258367 285415 135259 -93258 -194903 -141031 -53956 29824 154261
34405A54261P5195j54387l32148j74634J87187L18927P2344k14033j88561P7624
$$ 154261 229456 75069 -257079 -431713 -244526 74401 146745 -67288 -255849 -178225
34395a78225K70269K57689J47609M4725l1561m0889M8674J16471j7342k87663
$$ -178225 92044 349733 497342 542067 510506 469617 518291 634762 617420 329757
34385C29757l66077p9970K98037L64080R6857j60352j99947j71002k28645k30757
$$ 329757 -36320 -116290 181747 545827 642684 482332 282385 111383 -117262 -348019
34375c48019L09K88229K77107l5196k35061n1717K66558L03594L2491j98757j63529
$$ -348019 -347710 -59481 217626 182430 -52631 -104348 162210 465804 498295 299538 136009
34364A36009r200R761j31680k47065j89018Q077J89744K25495J19040J1867M8658
$$ 136009 126809 136570 4890 -242175 -431193 -423116 -233372 -7877 111163 123030 171688
34353A71688K10360L13395K08107m9529k60897k98689k14006j34111j04322o6450
$$ 171688 382048 695443 903550 854021 593124 294435 80429 -53682 -158004 -224454
34343b24454K8254J41803K07026K11989J71887O0569j29003k69974j95397L9635
$$ -224454 -196200 -54397 152629 364618 536505 597074 468071 198097 2700 42335
34333D2335J47603j6290k11399j32823J32733K24142L6087j55552j31075M145
$$ 42335 189938 173648 -37751 -170574 -37841 186301 222388 66836 -64239 -60094
34323f0094Q3426J15939J03199q3066l98427m71300p8187M22788M98523J49792
$$ -60094 23332 139271 242470 159404 -239023 -710323 -788510 -365722 132801 282593
34313B82593j63876k05531j42060r0996L5835J79325J00345j54025j96006R0587
$$ 282593 118717 -86814 -228874 -319870 -284035 -104710 -4365 -158390 -354396 -263809
34303b63809L07541J62243q1104q2146L3284r429j20590q4491j6502j10464j79600
$$ -263809 43732 205975 124871 42725 76009 66580 -54010 -138501 -155003 -265467 -445067
34292d45067L9841L30752K90518K8695j9300J31605P5327j76067j49915K13969
$$ -445067 -405226 -74474 216044 244739 225439 357044 432371 256304 106389 320358
34282C20358L58643K1672l08559j95111P9754P2716j10062j41987q0951j27403
$$ 320358 679001 700673 392114 197003 276757 349473 239411 97424 16473 -110930
34272a10930j37066Q1315K68011P3868k90866l32653n6905Q6460l6325r1347J07458
$$ -110930 -247996 -166681 101330 175198 -115668 -448321 -505226 -418766 -455091 -546438 -438980
34261d38980L41093M05749L43117J83281j15790l86868l30881l795J56876n5296
$$ -438980 -97887 307862 650979 834260 718470 331602 721 -3074 153802 98506
34251I8506l25186l06156p8384P6136P7186J6938m7979p9501j2772J12872J42543
$$ 98506 -226680 -532836 -611220 -535084 -457898 -440960 -488939 -568440 -581212 -468340 -325797
34240c25797M9366O599R5057J38931j4864k32750k76369j08559J27375L04411
$$ -325797 -276431 -269832 -174775 -35844 -50708 -283458 -559827 -668386 -541011 -236600
34230b36600L55511K48707N5576n8056k5745K8420j9074j17452j48782j04057
$$ -236600 118911 367618 423194 365138 339393 367813 348739 231287 82505 -21552
34220b1552o3224q0013j39952j55790r922K72431M29088K44945q7185j61127N7449
$$ -21552 -84776 -164789 -304741 -460531 -470453 -198022 231066 476011 388826 227699 285148
34209B85148J66576m4012k58365j49270R7230R7338j22446k08191n0528R4271
$$ 285148 451724 407712 149347 77 97307 194645 72199 -135992 -186520 -92249
34199i2249L7804r8782j24043k5202Q4315J08078K1530r9402j07620M8628K19533
$$ -92249 -54445 -153227 -277270 -302472 -218157 -110079 -88549 -187951 -295571 -246943 -27410
34188b7410K28494J03393K542l1394q0463j49246j34311j1726R7149R2035K0804
$$ -27410 201084 304477 307019 275625 195162 45916 -88395 -100121 -2972 89063 109867
34177A09867l961M7455Q8057J2201j57735k36643p7954J81851K27299k2719k70188
$$ 109867 105906 153361 241418 253619 95884 -140759 -218713 -36862 190437 167718 -102470
34166a02470k22999L5802K20109K29125J62454P3190n3589j46672j10632r818
$$ -102470 -325469 -289667 -69558 159567 322021 395211 341622 194950 84318 74500
34156G4500J9549L516O0734J38348O5196j34288k32677j38672k610O5357J34913
$$ 74500 94049 97565 158299 296647 361843 227555 -5122 -143794 -146404 -81047 53866
34145E3866K30036K09339J1117j79636j69557j9985P0492K8017p7588j65543j77929
$$ 53866 283902 493241 504358 324722 155165 135180 205672 233689 156101 -9442 -187371
34134a87371q4249L9477M3489p9201j32685J970J60918J35654j894j9547J03886
$$ -187371 -271620 -232143 -188654 -267855 -400540 -398570 -237652 -101998 -103892 -123439 -19553
34123a9553J58912M4954r3486j11731n3860k5746l9574o6585j01841r0212O2102
$$ -19553 139359 184313 90827 -20904 -74764 -100510 -140084 -206669 -308510 -398722 -336620
34112c36620K85597L12768K4629k89949k56789O3363K50952J32127n287Q1749
$$ -336620 -51023 261745 286374 -3575 -260364 -197001 53951 186078 180791 262540
34102B62540J84207M203l01665l10076J7109K50250J12888j55955k05552n8758
$$ 262540 446747 450950 149285 -160791 -143682 106568 219456 63501 -142051 -200809
34092b00809K2992l1721n6277O0034K32025L02914J83203q2743k94651k36133
$$ -200809 -177817 -209538 -265815 -205781 26244 329158 512361 429618 134967 -101166
34082a01166N0769K43120J26429j14759j65823j8642Q4678N6908M6087J22439
$$ -101166 -50397 192723 319152 204393 38570 19928 104606 161514 207601 330040
34072C30040J45342M846j98981k93120k18599m6475Q3892N5174q2982j18898K4649
$$ 330040 475382 480228 281247 -11873 -230472 -276947 -193055 -137881 -220863 -339761 -315112
34061c15112J14435m0923j99471q725L58082L66314l2559k60654k2670K06597
$$ -315112 -200677 -241600 -441071 -449796 -91714 274600 242041 -18613 -41283 165314
34051A65314j4059l21343j57617K37132J79931k85556l83686J57811O40157M48639
$$ 165314 151255 -170088 -327705 -90573 89358 -196198 -579884 -422073 218084 666723
34041F66723q2231k92039j59146j03160j92988j54984J9073N8276m6285j6899
$$ 666723 584492 292453 133307 30147 -162841 -317825 -298752 -240476 -286761 -303660
34031c03660J66221J87343l7625j72012j0972J79300J08769r0020j37230m8242
$$ -303660 -137439 49904 12279 -159733 -170705 8595 117364 27344 -109886 -158128
34021a58128M322N1794K15618L68596K51965j04685l63400k93945q326K22715
$$ -158128 -153806 -102012 113606 482202 734167 629482 266082 -27863 -36189 186526
34011A86526K24522J0726k26490k46124j3388K19429K04795q921j99148k54622
$$ 186526 411048 421774 195284 -50840 -64228 155201 359996 351075 151927 -102695
34001a02695j85026o077J78240J51079j00505k22556L2010L45011K52385j23698
$$ -102695 -287721 -293798 -115558 35521 -64984 -287540 -255530 89481 341866 218168
33991B18168k51953k3882J49715Q6695O7605J91083J22212k47058m65319k16658
$$ 218168 -33785 -57667 92048 178743 246348 437431 559643 312585 -152734 -369392
33981c69392J54055K17944J02844J07985J17059q0309k58348j22931R4545P503
$$ -369392 -215337 2607 105451 213436 330495 250186 -8162 -131093 -36548 -29045
33971b9045k18202j56178R1362P7199j50174j09961K31053L60450Q4134j84880
$$ -29045 -247247 -403425 -312063 -234864 -385038 -494999 -263946 96504 180638 -4242
33961d242j52708l7302m3270k8363P8570P2735o7254l5003K31410L47674J32838
$$ -4242 -156950 -194252 -237522 -265885 -187315 -114580 -181834 -216837 14573 362247 495085
33950D95085o2075L551K4937k37470m27398j78204K01244J93231r8819j72393
$$ 495085 433010 436561 461498 224028 -203370 -381574 -180330 12901 -85918 -258311
33940b58311M0604J40440m6009k54369k44804o7111J22557J96031O4090j79545
$$ -258311 -217707 -77267 -123276 -377645 -622449 -689560 -567003 -370972 -306882 -486427
33930d86427k44100k4823J85315J39523L3770J10487J64489q1999l68245k36601
$$ -486427 -730527 -755350 -570035 -430512 -396742 -286255 -121766 -203765 -572010 -808611
33920h08611J71002K79334p837j87225N039K37546K07208P3398O2803J03764Q1675
$$ -808611 -637609 -358275 -366112 -553337 -548298 -310752 -103544 -30146 32657 136421 218096
33909B18096P0498R9124L1371j38230j98358q9888k3870p8899m3796J54912K39408
$$ 218096 288594 387718 419089 280859 82501 -7387 -31257 -110156 -153952 960 240368
33898B40368L0892k19155k11550l2609N3133o14p5804j25976j41156p1425M2807
$$ 240368 271260 52105 -159445 -192054 -138921 -139535 -215339 -341315 -482471 -553896 -511089
33887e11089P0973M8370J65682L78080L61708M2372j96453q0476J39160J31091
$$ -511089 -440116 -391746 -226064 152016 513724 556096 359643 279167 418327 549418
33877E49418o401k9556j3616j28435k31867j24196K5754l7171j46759K4516L43475
$$ 549418 543017 513461 499845 371410 139543 15347 41101 3930 -142829 -118313 225162
33866B25162L63226K8092k55443k48084j27902p8807m7569J2124J1784o3882j02955
$$ 225162 588388 616480 361037 112953 -14949 -93756 -141325 -129201 -117417 -181299 -284254
33855b84254p0362k5312M6885J65311J85017K28j70599n7205J85444J76868o8100
$$ -284254 -354616 -379928 -333043 -167732 17285 17513 -153086 -210291 -24847 152021 83921
33844H3921j68699j8898P9947k3220j18603q4204q1847j65549j32110P4416K12543
$$ 83921 -84778 -103676 -23729 -46949 -165552 -249756 -331603 -497152 -629262 -554846 -342303
33833c42303J51679M6198j4565j14056j71644J9286L03292K62530m4341p2149
$$ -342303 -190624 -144426 -158991 -273047 -444691 -425405 -122113 140417 96076 23927
33823B3927K58847L22790j32667m37222r0569L31998J23421l35180k21885L14920
$$ 23927 282774 605564 472897 35675 -54894 277104 400525 65345 -156540 158380
33813A58380M22226k4777l03775j10983O1706p4840j66595q063O5467j11333j78081
$$ 158380 580606 555829 252054 141071 202777 127937 -38658 -46721 18746 -92587 -270668
33802b70668M4704J72221l9731k33533j01242R3220Q0826J00039L39333M15171
$$ -270668 -225964 -53743 -93474 -327007 -428249 -335029 -254203 -154164 185169 600340
33792F00340J1358m19481k76463K03257L00075n2679k31074L0743K70313J02863
$$ 600340 611698 192217 -84246 119011 419086 366407 135333 166076 436389 539252
33782E39252k02554k05949O7273K53992J63263p0767k07261j29241O3348J44330
$$ 539252 336698 130749 198022 452014 615277 544510 337249 208008 271356 415686
33772D15686J8317j45728j43091j6029M8201J6087L097K7061j7060j50335k63623
$$ 415686 434003 288275 145184 129155 177356 193443 196540 223601 206541 56206 -207417
33761b07417k71950j70185K4292K42279L43841K77620J70197J08596k1694k81026
$$ -207417 -479367 -649552 -625260 -382981 -39140 238480 408677 517273 495579 214553
33751B14553m35078k61660M5594J30495K8754O4129K38145J97455j16877k72894
$$ 214553 -220525 -482185 -436591 -306096 -277342 -213213 24932 222387 105510 -167384
33741a67384j6016K83021J70563k05216l33192q6185J68721J67292Q3762J60456
$$ -167384 -183400 99621 270184 64968 -268224 -354409 -185688 -18396 65366 225822
33731B25822K78217J33494k46893m28210j13811L94721N13809J26625k61403k16063
$$ 225822 504039 637533 390640 -37570 -151381 243340 757149 883774 622371 406308
33721D06308O3522J13515j02259k26787j16573j0537q3778k01212k03784j32485
$$ 406308 469830 583345 481086 254299 137726 127189 43411 -157801 -361585 -494070
33711d94070n5668O1061J93944K04925O3518p6708j09389q2461k6146Q1701J32420
$$ -494070 -549738 -488677 -294733 -89808 -26290 -102998 -212387 -294848 -320994 -239293 -106873
33700a06873l2178k72223k18773J68776M58148L51514R3287K0333M6230p1953
$$ -106873 -139051 -411274 -630047 -461271 -3123 348391 441678 462011 508241 436288
33690D36288k44882k29389q8152n5295q1774O2744L05180L06413j917k85073k75445
$$ 436288 191406 -37983 -126135 -181430 -263204 -200460 104720 411133 409216 124143 -151302
33679a51302p8697O2461O6843J1765K3267J93126M34558M60175J18919l01515
$$ -151302 -229999 -167538 -100695 -88930 -65663 127463 562021 1022196 1141115 839600
33669H39600l75935j04786J30717J52937J50097K01640P3137l08745n54194l14323
$$ 839600 463665 358879 489596 642533 792630 994270 1067407 758662 204468 -109855
33659a09855J58692L23044Q9793j17066k2148J43298O2554j74437k35419n8513
$$ -109855 48837 371881 461674 344608 322460 465758 528312 353875 118456 59943
33649E9943P7978N552p7886N0289K35333J52798j54065k70043j1548K76353K09051
$$ 59943 137921 143473 65587 115876 351209 504007 349942 79899 68351 344704 553755
33638E53755j09780l02670k56995j44210m6217Q9670J89241R6978j13088j88693
$$ 553755 443975 141305 -115690 -259900 -306117 -216447 -27206 69772 -43316 -232009
33628b32009q3597J0166L0257J11226K36484J85628o1251k21363j61413j00326
$$ -232009 -315606 -305440 -275183 -163957 72527 258155 196904 -24459 -185872 -286198
33618b86198j73075j61835P0672K35158O5211j77111p8160K40952K88470k8679
$$ -286198 -459273 -621108 -550436 -315278 -250067 -427178 -505338 -264386 24084 -4595
33608d595k68891j24861J78407K65838P5750j86269l14173k17293K6789J68449
$$ -4595 -273486 -398347 -219940 45898 121648 -64621 -378794 -596087 -569298 -400849
33598d00849M1318j43646j7522L75013N38291K10230k23922k51615P5077K79874
$$ -400849 -359531 -503177 -520699 -145686 392605 602835 378913 127298 202375 482249
33588D82249J42369j01008j80946r3477N3345K00554K56850J00784k00233l61757
$$ 482249 624618 523610 342664 249187 302532 503086 759936 860720 660487 298730
33578B98730k28195l328K5990j24919k15635j51819n7861j3703L9380R7020L7534
$$ 298730 70535 67207 93197 -31722 -247357 -399176 -457037 -470740 -431360 -334340 -296806
33567b96806j24514j49246Q8079L37732K84352N614j40039l9584N2118l9951j33554
$$ -296806 -421320 -570566 -482487 -144755 139597 145211 5172 -34412 17706 -22245 -155799
33556a55799j3704J93786K01790j0020j83461j58672m9840k1583o5838p6737l2488
$$ -155799 -169503 24283 226073 216053 32592 -126080 -175920 -197503 -263341 -340078 -372566
33545c72566m211k5060k8709O7301K42678L65431L19341J27188q4633k26192k89426
$$ -372566 -376777 -401837 -430546 -363245 -120567 244864 564205 691393 606760 380568 91142
33534I1142k70460j52416L360N9889k5269j12816m9493J34792K72898K50778Q8784
$$ 91142 -179318 -331734 -328374 -268485 -293754 -406570 -456063 -321271 -48373 202405 291189
33523B91189j01980j80927p8892Q4599Q2815j19713k63562j34004J03292J10108
$$ 291189 189209 8282 -70610 13989 96804 -22909 -286471 -420475 -317183 -207075
33513b07075j33560k77200o4603L43915N81453M66606J23686j77243k45351j16025
$$ -207075 -340635 -617835 -682438 -338523 242930 709536 833222 655979 410628 294603
33503B94603m075n3436j63846j56237m2335K5618J6411K5995M9571j2456j10170
$$ 294603 290528 237092 73246 -82991 -125326 -99708 -83297 -57302 -7731 -20187 -130357
33492a30357o9550Q6640J22934j3559q1672K9861Q9184n2177j48355R004J47085
$$ -130357 -199907 -113267 9667 -3892 -85564 -55703 33481 -18696 -167051 -158047 -10962
33481a0962o9074l88285k72353K27667M60226J30076k68446k08694J38449K82077
$$ -10962 -80036 -468321 -740674 -513007 -52781 77295 -191151 -399845 -261396 20681
33471B0681J65493J05314J83356J65346k4526j70173j59053j50853k28476j93366
$$ 20681 186174 291488 474844 640190 615664 445491 286438 135585 -92891 -286257
33461b86257Q8402L68562L05610m9544l13993k78752j10490k2932J3635J14272
$$ -286257 -197855 170707 476317 426773 112780 -165972 -276462 -299394 -285759 -171487
33451a71487K14541J58561k9465j58306j43413r1299q5593o3848J9876P1939K0528
$$ -171487 43054 201615 172150 13844 -129569 -220868 -306461 -370309 -350433 -278494 -257966
33440b57966k7585N6267J99746K29848J35031M8243M806q1167j92453j76450p255
$$ -257966 -285551 -229284 -29538 200310 335341 383584 388390 307223 114770 -61680 -68935
33429f8935J10387J5974j72823k34002j38502k7873L0709J06406K32216L04480
$$ -68935 41452 57426 -115397 -349399 -487901 -515774 -485065 -378659 -146443 158037
33419A58037K02907m3716k52541k55972q1368O6898M3517o8288j04105o6048o4851
$$ 158037 360944 317228 64687 -191285 -272653 -205755 -162238 -230526 -334631 -400679 -465530
33408d65530o0369R9547L44617L62098M7191k79085l03085j43493q9371j21827
$$ -465530 -525899 -426352 -81735 280363 327554 48469 -254616 -398109 -487480 -609307
33398f09307l3134J20672Q7310j02236j32688O6954J90269P2730l6015P4673J92147
$$ -609307 -642441 -521769 -434459 -536695 -669383 -602429 -412160 -339430 -375445 -300772 -108625
33387a08625M0637k33797k77979o8668J08257J28192J39235K16823K25493R0397
$$ -108625 -67988 -301785 -579764 -648432 -540175 -411983 -272748 -55925 169568 259965
33377B59965n2247q1095o9776j25745j97654j65251k6900J04433J36436O6253
$$ 259965 207718 126623 56847 -68898 -266552 -431803 -458703 -354270 -217834 -151581
33367a51581l4328o6944J08O8259J7627j07241j31918j0136Q6575K6587n9509
$$ -151581 -185909 -252853 -252745 -184486 -166859 -274100 -406018 -416154 -329579 -302992 -362501
33356c62501L5671K58596L24627R7422k19886l39298k15440k3033J03752J71834
$$ -362501 -326830 -68234 256393 353815 133929 -205369 -420809 -443842 -340090 -168256
33346a68256J97317J29918l2422j66527j61170o7655r339J1308Q2246J75255J39712
$$ -168256 29061 158979 126557 -39970 -201140 -268795 -278134 -266826 -184580 -9325 130387
33335A30387m0493j47991k1729J70256J28870j51040l48436k34527N4248K41986
$$ 130387 89894 -58097 -79826 90430 219300 68260 -280176 -514703 -460455 -218469
33325b18469K59186K26508J99761J21158O848j2094R1030J32792l0755k45823
$$ -218469 40717 267225 466986 588144 594992 582898 673928 806720 775965 530142
33315E30142k30794K2382K12793J41344l6843q2527j0707L1639P5514K37125L80375
$$ 530142 299348 321730 534523 675867 639024 556497 545790 577429 652943 890068 1270443
33304A270443K13285k17503m65461k88865j8388n7703k67916k20617Q0763J84236
$$ 1270443 1483728 1266225 800764 511899 493511 435808 167892 -52725 28038 212274
33294B12274q4515l22224j57911J94372K84907Q9905l0907O9879J46643J2899
$$ 212274 127759 -194465 -352376 -158004 126903 216808 185901 255780 402423 415322
33284D15322j52848j11653N2350P3267q9860k18648j76855o3825J3760J11260
$$ 415322 262474 150821 203171 276438 186578 -32070 -208925 -272750 -258990 -147730
33274a47730K64063L08866Q8849k48269l81843k36033m8568P405L5969J54565
$$ -147730 116333 425199 514048 265779 -116064 -352097 -400665 -393260 -357291 -202726
33264b02726K46391J61819K089k2880P3100Q1807q3643k95868m01091l25054n0578
$$ -202726 43665 205484 207573 184693 257793 339600 255957 -39911 -441002 -766056 -816634
33253h16634L04371M47384K09910j38967j71811Q7168J73393j01138l19299q1042
$$ -816634 -512263 -64879 145031 6064 -165747 -78579 94814 -6324 -325623 -406665
33243d06665L65968M61941J05484k77928l44602j59411O3153K11904K26794Q3978
$$ -406665 -40697 421244 526728 248800 -95802 -255213 -192060 19844 246638 330616
33233C30616p7882n7206R1038O9520k05382l96845j94042K11653L46440O9927
$$ 330616 252734 195528 286566 356086 150704 -246141 -440183 -228530 117910 187837
33223A87837k74212l25765j13247P8741R1062J8398K1412J23648K13475K00273
$$ 187837 -86375 -412140 -525387 -446646 -355584 -337186 -315774 -192126 21349 221622
33213B21622J25261R3135J09371N5375j29641l10488l02078j26856K503k2711
$$ 221622 346883 440018 549389 604764 475123 164635 -137443 -264299 -261796 -284507
33203b84507p0421K453J20307J25094M0668J4694M4161k1058j80065k18486m1331
$$ -284507 -354928 -352475 -232168 -107074 -66406 -51712 -7551 -28609 -208674 -427160 -468491
33192d68491J43846J35412M7348R4836K09358J43134r9882k33019j18292M2884
$$ -468491 -324645 -189233 -141885 -47049 162309 305443 205561 -27458 -145750 -102866
33182a02866M3953l9366m0613Q741l3378j59922k21969j43438O672J23872J51639
$$ -102866 -58913 -98279 -138892 -130151 -163529 -323451 -545420 -688858 -682186 -558314 -406675
33171d06675R0590L218k2891L3306J14581J79562K19274J72028k8016k67178k95231
$$ -406675 -316085 -312867 -335758 -302452 -187871 -8309 210965 382993 354977 87799 -207432
33160b07432n6639J88009K01371O5128j4786k0770m0346l3752O6702J47095O5451
$$ -207432 -264071 -76062 125309 190437 175651 154881 114535 80783 147485 294580 360031
33149C60031p9807j03972o6281j44744k59727j73144O9914J78445J05174R2402
$$ 360031 280224 176252 109971 -34773 -294500 -467644 -397730 -219285 -114111 -21709
33139b1709J75877R9081j40732j51379J91563M14546J54109k26955k12208L3648
$$ -21709 154168 253249 112517 -38862 152701 567247 721356 494401 282193 315841
33129C15841n947k77336k53356J18405K84021J3096k21959o3885J46973J4613
$$ 315841 309894 32558 -220798 -102393 181628 194724 -27235 -91120 55853 70466
$$ [...]
##END NTUPLES=NMR SPECTRUM
##END=
