##TITLE=31Pdec_LR-742-RM6
 , 24 sc
 15.11.2021
##JCAMPDX= 6.0         $$ Bruker NMR JCAMP-DX V2.0
##DATA TYPE= NMR SPECTRUM
##DATA CLASS= NTUPLES
##ORIGIN= UXNMR, Bruker Analytische Messtechnik GmbH
##OWNER= root
$$ XWIN-NMR		Version 3.5
$$ Tue Nov 16 11:52:32 2021 Russian Standard Time (UT+4h)  she@DPX200
##.OBSERVE FREQUENCY= 81.013821
##.OBSERVE NUCLEUS= ^31P
##.ACQUISITION MODE= SIMULTANEOUS
##.ACQUISITION SCHEME= undefined
##.AVERAGES= 24
##.DIGITISER RES= 16
##SPECTROMETER/DATA SYSTEM= spect
##.PULSE SEQUENCE= zgpg30
##.SOLVENT NAME= CDCl3
##.SHIFT REFERENCE= (INTERNAL, CDCl3, 0, 248.564)
##AUDIT TRAIL= $$ (NUMBER, WHEN, WHO, WHERE, WHAT)
$$ ##TITLE= Audit trail, XWIN-NMR		Version 3.5
$$ ##JCAMPDX= 5.01
$$ ##ORIGIN= Bruker BioSpin GmbH
$$ ##OWNER= she
$$ F:/spectra/data/she/nmr/P31/1/pdata/1/auditp.txt
$$ ##AUDIT TRAIL=  $$ (NUMBER, WHEN, WHO, WHERE, WHAT)
(   1,<2021-11-16 11:51:01.03 +0400>,<she>,<DPX200>,
      <created by zg, POWCHK disabled, PULCHK disabled
       configuration hash MD5:
       00 E9 B6 7A A2 85 ED C7 34 08 36 98 17 FE 4E 26
       data hash MD5: 32K
       7B EE C3 DC 04 DF 53 64 41 CC 8D DD 82 37 0A CA>)
(   2,<2021-11-16 11:51:30.54 +0400>,<she>,<DPX200>,
      <Start of raw data processing
       efp BC_mod = 2 LB = 1 FT_mod = 6 PKNL = 1 PHC0 = -9201.077 PHC1 = 110.8695 SI = 64K 
       data hash MD5: 64K
       25 C7 EB 8C 43 85 A2 B4 68 29 61 0C D4 C1 3B 1A>)
(   3,<2021-11-16 11:51:49.34 +0400>,<she>,<DPX200>,
      <pk PHC0 = -17.28172 PHC1 = 38.4 
       data hash MD5: 64K
       4E 0D BC A9 6A 2C 10 77 50 5D EA FC 15 68 FE 0F>)
$$ ##END=
$$ 
$$ hash MD5
$$ 47 17 7F E4 D9 29 9F 18 2E FC 8D E8 01 DE 9E 46
##$RELAX= 
##$RELAX= 
##$RELAX= 
##$RELAX= 
##$RELAX= 
##$RELAX= 
##$RELAX= 
##$RELAX= 
$$ Bruker specific parameters
$$ --------------------------
##$DU= <F:/spectra>
##$EXPNO= 1
##$NAME= <P31>
##$PROCNO= 1
##$TYPE= <nmr>
##$USER= <she>
##$AMP= (0..31)
100 100 100 100 100 100 100 100 100 100 100 100 100 100 100 100 100 100 
100 100 100 100 100 100 100 100 100 100 100 100 100 100 
##$AQSEQ= 0
##$AQ_mod= 1
##$AUNM= <au_zg>
##$AUTOPOS= <>
##$BF1= 81.014009
##$BF2= 200.13
##$BF3= 200.13
##$BF4= 200.13
##$BF5= 200.13
##$BF6= 200.13
##$BF7= 200.13
##$BF8= 200.13
##$BYTORDA= 1
##$CFDGTYP= 0
##$CFRGTYP= 5
##$CHEMSTR= <none>
##$CNST= (0..31)
1 1 145 1 1 1 1 1 1 1 1 1 1 1 1 1 1 1 1 1 1 1 1 1 1 1 1 1 1 1 1 1 
##$CPDPRG= <waltz16>
##$CPDPRG1= <>
##$CPDPRG2= <waltz16>
##$CPDPRG3= <>
##$CPDPRG4= <mlev>
##$CPDPRG5= <mlev>
##$CPDPRG6= <mlev>
##$CPDPRG7= <mlev>
##$CPDPRG8= <mlev>
##$CPDPRGB= <>
##$CPDPRGT= <>
##$D= (0..31)
0 1 0 0 0 0 0 0 0 0 0 0.03 2e-05 3e-06 0 0 0 0 0 0 0 0 0 0 0 0 0 0 0 0 
0 0 
##$DATE= 1637049060
##$DBL= (0..7)
120 120 120 11 120 120 24 19 
##$DBP= (0..7)
150 150 150 150 150 150 150 150 
##$DBP07= 0
##$DBPNAM0= <>
##$DBPNAM1= <>
##$DBPNAM2= <>
##$DBPNAM3= <>
##$DBPNAM4= <>
##$DBPNAM5= <>
##$DBPNAM6= <>
##$DBPNAM7= <>
##$DBPOAL= (0..7)
0.5 0.5 0.5 0.5 0.5 0.5 0.5 0.5 
##$DBPOFFS= (0..7)
0 0 0 0 0 0 0 0 
$$ [...]
##$SUBNAM2= <"">
##$SUBNAM3= <"">
##$SUBNAM4= <"">
##$SUBNAM5= <"">
##$SUBNAM6= <"">
##$SUBNAM7= <"">
##$SUBNAM8= <"">
##$SUBNAM9= <"">
##$SW= 501.771253377433
##$SWIBOX= (0..15)
0 1 3 0 0 0 0 0 0 0 0 0 0 0 0 0 
##$SW_h= 40650.406504065
##$TD= 32768
##$TD0= 1
##$TE= 0
##$TE2= 300
##$TE3= 300
##$TEG= 300
##$TL= (0..7)
0 120 53 12 22 120 120 120 
##$TP= (0..7)
150 150 150 150 150 150 150 150 
##$TP07= 0
##$TPNAME0= <>
##$TPNAME1= <>
##$TPNAME2= <>
##$TPNAME3= <>
##$TPNAME4= <>
##$TPNAME5= <>
##$TPNAME6= <>
##$TPNAME7= <>
##$TPOAL= (0..7)
0.5 0.5 0.5 0.5 0.5 0.5 0.5 0.5 
##$TPOFFS= (0..7)
0 0 0 0 0 0 0 0 
##$TUNHIN= 0
##$TUNHOUT= 0
##$TUNXOUT= 0
##$USERA1= <user>
##$USERA2= <user>
##$USERA3= <user>
##$USERA4= <user>
##$USERA5= <user>
##$V9= 5
##$VALIST= <valist>
##$VCLIST= <CCCCCCCCCCCCCCC>
##$VD= 0
##$VDLIST= <DDDDDDDDDDDDDDD>
##$VPLIST= <PPPPPPPPPPPPPPP>
##$VTLIST= <TTTTTTTTTTTTTTT>
##$WBST= 1024
##$WBSW= 4
##$XGAIN= (0..3)
0 0 0 0 
##$XL= 0
##$YL= 0
##$YMAX_a= 14218
##$YMIN_a= -17819
##$ZGOPTNS= <>
##$ZL1= 120
##$ZL2= 120
##$ZL3= 120
##$ZL4= 120
##$ABSF1= 0
##$ABSF2= 0
##$ABSG= 0
##$ABSL= 0
##$ALPHA= 0
##$AQORDER= 0
##$ASSFAC= 0
##$ASSFACI= 0
##$ASSFACX= 0
##$ASSWID= 0
##$AUNMP= <proc_1d>
##$AZFE= 0.1
##$AZFW= 0.5
##$BCFW= 0
##$BC_mod= 2
##$BYTORDP= 0
##$COROFFS= 0
##$CY= -3
##$DATMOD= 1
##$DC= 0
##$DFILT= <>
##$DTYPP= 0
##$F1P= 0
##$F2P= 0
##$FCOR= 1
##$FTSIZE= 65536
##$FT_mod= 6
##$GAMMA= 0
##$GB= 0
##$INTBC= 1
##$INTSCL= 5.30512e-09
##$ISEN= 30
##$LB= 1
##$LEV0= 0
##$LPBIN= 0
##$MAXI= 10000
##$MC2= 0
##$MEAN= 0
##$ME_mod= 0
##$MI= 50
##$NCOEF= 0
##$NC_proc= -4
##$NLEV= 6
##$NOISF1= 182.463
##$NOISF2= 159.3651
##$NSP= 0
##$NTH_PI= 0
##$NZP= 0
##$OFFSET= 248.5645
##$PC= 4
##$PHC0= -9218.358
##$PHC1= 149.2695
##$PH_mod= 1
##$PKNL= yes
##$PPARMOD= 0
##$PSCAL= 0
##$PSIGN= 0
##$REVERSE= no
##$SF= 81.014009
##$SI= 65536
##$SIGF1= 159.3651
##$SIGF2= -187.1042
##$SINO= 113.3802
##$SIOLD= 16384
##$SREGLST= <1H.CDCl3>
##$SSB= 0
##$STSI= 65536
##$STSR= 0
##$SW_p= 40650.406504065
##$SYMM= 0
##$S_DEV= 0
##$TDeff= 32768
##$TDoff= 0
##$TI= <>
##$TILT= no
##$TM1= 0
##$TM2= 0
##$TOPLEV= 0
##$USERP1= <user>
##$USERP2= <user>
##$USERP3= <user>
##$USERP4= <user>
##$USERP5= <user>
##$WDW= 1
##$XDIM= 65536
##$YMAX_p= 273086095
##$YMIN_p= -12001482
$$ End of Bruker specific parameters
$$ ---------------------------------
##NTUPLES= NMR SPECTRUM
##VAR_NAME=  FREQUENCY,     SPECTRUM/REAL,   SPECTRUM/IMAG
##SYMBOL=    X,             R,               I
##VAR_TYPE=  INDEPENDENT,   DEPENDENT,       DEPENDENT
##VAR_FORM=  AFFN,          ASDF,            ASDF
##VAR_DIM=   65536,         65536,           65536
##UNITS=     HZ,            ARBITRARY UNITS, ARBITRARY UNITS
##FACTOR=    0.620285442955139, 1,           1
##FIRST=     20137.2065510759, 0,            0
##LAST=      -20513.1999529892, 0,           0
##MIN=       -20513.1999529892, -12001482,   0
##MAX=       20137.2065510759, 273086095,    0
$$ Real data points
##PAGE= N=1
##DATA TABLE= (X++(R..R)), XYDATA
$$ [...]
41685 -621306 -564934 -639407 -587761 -388470 -242018 -178023 -38410 188190 331681 322966 235295
41674 235295 70087 -217393 -490780 -526701 -368283 -302300 -418089 -465809 -272327 -46021
41664 -46021 -79700 -323171 -468736 -385854 -268836 -334582 -514529 -537004 -288764 -11103
41654 -11103 -61063 -483004 -916405 -986473 -699754 -365315 -210246 -209382 -246393 -276759 -304997
41643 -304997 -319014 -294409 -209818 -58673 103200 158025 49741 -130595 -260300 -329617
41633 -329617 -381033 -387379 -324138 -282882 -337632 -358180 -164028 164798 358588 342201 306608
41622 306608 362283 382142 274824 154385 106077 35081 -73598 8060 397837 771556
41612 771556 688439 161738 -364489 -549213 -409759 -105339 229934 427700 362602 172010
41602 172010 145227 301424 334264 106708 -70208 119117 481089 543472 205289 -148747
41592 -148747 -189683 -27719 34847 -77637 -194768 -187384 -121370 -142380 -291806 -438568 -370451
41581 -370451 3423 502829 780428 639972 227612 -143112 -317933 -375962 -409338 -366947
41571 -366947 -182768 46329 146137 103832 81900 158326 184321 61 -296823 -436162
41561 -436162 -304584 -67769 38678 -66709 -299667 -504169 -537063 -381772 -216061 -243661
41551 -243661 -412320 -439175 -187499 133503 251527 165700 61308 30587 44828 75962
41541 75962 57961 -142223 -491097 -661774 -431783 -99858 -143239 -507233 -662120 -409731
41531 -409731 -158641 -222790 -322639 -116947 161633 55186 -381864 -678600 -664650 -617047
41521 -617047 -698624 -696616 -432646 -84761 65982 -16026 -155795 -183721 -36383 206366
41511 206366 341395 253304 110870 162513 344317 345325 95946 -106688 -76419 -49379 -309063
41500 -309063 -716858 -871365 -626770 -233848 -15831 -68526 -248063 -334033 -235447 -106732
41490 -106732 -189948 -486814 -716061 -694621 -607597 -727245 -981260 -1029171 -735538 -343764
41480 -343764 -139487 -129751 -152099 -159738 -240568 -395117 -461468 -333394 -152695 -150292 -318570
41469 -318570 -400865 -255669 -63613 -48661 -146942 -148249 -53294 -36578 -104824 -77887 66771
41458 66771 111734 -52817 -246581 -278477 -192342 -115114 -68853 -63188 -164294 -318280 -309119
41447 -309119 -71281 143141 106998 -46508 -52701 74272 116853 39213 29919 182612 345967
41436 345967 301213 -43459 -599765 -1119820 -1331876 -1182822 -893321 -689058 -582369 -499302
41426 -499302 -445725 -403253 -247595 34002 216028 145345 11502 61315 211618 231521
41416 231521 150294 145289 151085 -30585 -296552 -331874 -142407 -90720 -323920 -545369 -491624
41405 -491624 -303844 -244974 -310409 -311404 -163652 57950 219523 203381 19519 -136291 -104925
41394 -104925 -22193 -124519 -338179 -385348 -296688 -406969 -738842 -836554 -451512 1591
41384 1591 9788 -320900 -498472 -385723 -294672 -431692 -635359 -687828 -587257 -436649 -268026
41373 -268026 -69708 112758 164742 -9730 -345115 -574581 -470806 -149111 53730 48160
41363 48160 89299 298010 388570 108368 -311591 -458043 -300426 -121864 -32268 78149
41353 78149 180536 96498 -143582 -282643 -229461 -161093 -182346 -193531 -163411 -200811 -244737
41342 -244737 -42116 367354 491586 23478 -623383 -796876 -466268 -185815 -258316 -388951
41332 -388951 -264587 -43332 -7800 -57100 82991 318531 273977 -97822 -391305 -346392
41322 -346392 -226479 -383508 -710637 -819439 -609060 -356153 -298322 -397190 -499993 -500850
41312 -500850 -346213 -101725 -5079 -218201 -530051 -567225 -320414 -170180 -323116 -531366
41302 -531366 -505622 -316258 -195314 -187796 -218832 -307546 -485910 -651762 -700079 -672467 -624065
41291 -624065 -507344 -341884 -295233 -404180 -432829 -238495 -57094 -142690 -330702 -298971
41281 -298971 -100905 -59853 -229775 -345484 -272413 -143288 -52244 43736 105932 31022 -81357
41270 -81357 -2588 235038 337572 200776 52679 67443 142461 157241 152955 131261 -37071
41259 -37071 -349671 -569427 -537844 -374087 -234286 -100138 60349 151026 114741 39163
41249 39163 -27464 -150998 -293033 -271253 -73908 51191 -22076 -109628 -91114 -156682 -423838
41238 -423838 -612853 -444697 -127859 -77098 -313780 -514001 -525511 -462866 -373755 -188488
41228 -188488 26173 107089 83513 115829 165327 51053 -168718 -222080 -73540 -4619 -157082
41217 -157082 -317371 -278942 -126786 -14543 76235 180865 177872 -40563 -374904 -635019
41207 -635019 -724441 -634830 -426666 -275619 -326419 -432751 -295488 50982 196805 -45312
41197 -45312 -329060 -296505 -92794 -47191 -128166 -105720 -27434 -86039 -173263 -54299 104079
41186 104079 -87958 -534922 -682359 -364850 -81793 -206593 -436705 -360086 -114830 -63922
41176 -63922 -179294 -227164 -280943 -521159 -723520 -522296 -93544 20146 -218523 -256984
41166 -256984 118774 379786 87473 -390301 -441792 -111388 80031 -12234 -34468 186250
41156 186250 352169 196519 -112384 -261021 -233022 -254153 -424270 -581570 -514712 -226942
41146 -226942 32203 17042 -230397 -429179 -426330 -368252 -402649 -399375 -188295 79009 116940
41135 116940 -14888 29175 325445 542785 459535 276817 240544 258765 144496 -3544
41125 -3544 36670 217328 288043 182013 69274 57337 78496 76826 96438 151112 170981
41114 170981 117402 32659 -39416 -87571 -106551 -130222 -239964 -424849 -506635 -361763 -152943
41103 -152943 -144064 -319264 -399717 -237171 25372 202691 253584 184555 13455 -96287
41093 -96287 75750 449333 615714 351879 -49203 -187308 -109237 -168953 -447064 -634701
41083 -634701 -498743 -181059 37909 57015 -59404 -240653 -429557 -541611 -517105 -386854
41073 -386854 -241874 -161635 -169680 -214727 -215519 -178018 -217576 -380454 -515841 -464243 -312073
41062 -312073 -267880 -308346 -180494 193360 537506 559128 283708 -61620 -328475 -470341
41052 -470341 -446185 -288302 -171782 -247144 -459397 -647819 -734505 -702608 -523605 -268471
41042 -268471 -156119 -284294 -426446 -331784 -122919 -108022 -267490 -276816 -56551 70743
41032 70743 -108617 -369448 -424346 -341440 -327198 -323095 -145435 99612 93320 -202260 -434336
41021 -434336 -335056 -76205 -3085 -164808 -287849 -163608 105746 278794 265374 158084
41011 158084 53557 -20580 -16101 129417 327672 337222 62536 -260188 -341852 -213836 -131859
41000 -131859 -183403 -224514 -174966 -125786 -143868 -209175 -353713 -597064 -730223 -486799 1977
40989 1977 272391 168310 42559 141617 207043 -12484 -258148 -202648 -73720 -306881
40979 -306881 -767553 -885701 -509979 -92227 6454 -112476 -292824 -598419 -980452 -1101397
40969 -1101397 -777181 -300807 -63260 -79723 -125629 -134342 -195848 -285535 -241260 9286 332050
40958 332050 491535 349800 23540 -192088 -181737 -211726 -549859 -963835 -943727 -429866
40948 -429866 81431 249950 274137 372985 346334 -812 -374547 -381650 -149905 -92476 -223258
40937 -223258 -198716 30791 109144 -139505 -447376 -542097 -486433 -432607 -351995 -196481 -82818
40926 -82818 -112007 -174498 -119016 3107 16884 -135996 -351891 -490011 -461269 -275427 -77213
40915 -77213 -54976 -236710 -439602 -471767 -312700 -68299 139497 191734 23323 -244254
40905 -244254 -342092 -159674 75403 69976 -146435 -277187 -179952 -37902 -54563 -151956 -109305
40894 -109305 92870 230932 132695 -118648 -313246 -352936 -307056 -296956 -382150 -514495
40884 -514495 -560932 -428348 -212927 -143072 -288993 -415498 -260708 95222 312350 229640
40874 229640 32190 -53843 -33798 -17347 -1831 59520 97393 15194 -124610 -171316 -118124
40863 -118124 -110092 -214907 -321513 -304480 -189545 -104981 -125651 -203596 -224083 -118025 54820
40852 54820 136582 19749 -228583 -413962 -394349 -209955 -41259 -37438 -176227 -304806
40842 -304806 -327984 -308436 -335823 -361879 -271177 -86194 26517 -32174 -185264 -296882 -296052
40831 -296052 -184714 -45212 -34070 -211672 -371302 -235321 127711 299445 37309 -393283
40821 -393283 -567382 -421353 -247805 -283557 -479767 -623754 -561358 -341464 -195270 -276411
40811 -276411 -404631 -259437 122232 315959 111620 -165160 -169453 -62964 -169758 -367251
40801 -367251 -289880 -3270 43941 -248329 -438010 -204785 206793 399841 347165 275775
40791 275775 283168 304337 294251 241369 110666 -77730 -206056 -199562 -116723 -33058 49316
40780 49316 121243 127619 64944 -10911 -107814 -276095 -439926 -438052 -275049 -124187 -24768
40769 -24768 178140 486482 602614 320614 -130233 -344356 -215931 20540 114728 6081
40759 6081 -196144 -299412 -188786 -6979 -46796 -360630 -642657 -631592 -441967 -319818
40749 -319818 -267383 -150780 -16508 -13376 -99476 -110655 -53734 -51394 -51042 99415 294834
40738 294834 227550 -127908 -390698 -272094 47659 202334 102374 -58735 -106491 -13897
40728 -13897 162974 305534 256514 -28271 -392362 -644901 -744707 -716283 -497936 -62419
40718 -62419 371134 479677 231255 -54463 -119738 -72732 -158879 -380465 -531639 -532124 -506970
40707 -506970 -526387 -473993 -261612 -17621 73031 25797 15515 119505 226071 196773 26431
40696 26431 -170577 -273405 -247567 -156775 -71722 27747 184773 299183 188921 -96973
40686 -96973 -215028 28979 320304 192549 -327451 -743796 -763927 -610898 -567602 -545409
40676 -545409 -332276 -27763 66013 -109675 -288971 -239540 -28845 90179 -32642 -281308
40666 -281308 -377725 -191349 76879 139713 24880 17393 180257 230739 27411 -138541
40656 -138541 1979 223016 147325 -115951 -99866 305674 675816 636574 283729 -69704
40646 -69704 -259089 -269661 -149186 -61128 -194141 -475844 -583338 -377694 -121225 -103467
40636 -103467 -256136 -343903 -360843 -476168 -676047 -723611 -484767 -105983 165649 215621
40626 215621 100160 -44369 -109218 -96258 -96765 -154869 -200500 -170930 -124728 -140611 -163158
40615 -163158 -69425 137494 320023 390176 395546 403962 395994 314581 164141 17013 -57548
40604 -57548 -49434 -202 51543 102625 145655 130086 29103 -73481 -67702 -1 -43174 -236396
40592 -236396 -395586 -370198 -247158 -171183 -99837 81311 299894 364094 237971 48543
40582 48543 -139928 -340906 -460607 -345853 -42726 221432 344218 399979 370406 137110
40572 137110 -171277 -180346 187548 501587 418141 179195 175461 301850 208248 -8672 74914
40561 74914 444701 582200 268091 -90203 -149121 -144141 -378824 -625332 -489746 -97341
40551 -97341 80247 -51035 -126957 58472 286956 328612 247297 165749 34580 -184143
40541 -184143 -329369 -243100 -32307 44210 -118803 -405929 -658878 -801921 -817187 -704733
40531 -704733 -499596 -286870 -162594 -161915 -230016 -293158 -356460 -473923 -613772 -650368 -540608
40520 -540608 -405792 -353103 -310291 -147187 114266 323655 372218 248252 16066 -159652
40510 -159652 -97175 152308 274979 91023 -166476 -189201 -49701 -24644 -101810 -48094
40500 -48094 90720 -4224 -366246 -608902 -484722 -210345 -71488 -48760 -25322 -31600 -57878
40489 -57878 59966 313412 385535 130186 -113147 -26437 148082 -1015 -348366 -419507
40479 -419507 -178570 -95427 -384774 -666257 -549657 -175229 58851 40396 -25448 35194
40469 35194 203143 381627 511552 574324 553550 413756 142422 -162684 -320909 -260246
40459 -260246 -108520 -8868 50029 109857 100689 4451 4497 215799 395069 244913 -67861
40448 -67861 -76117 300609 633416 639976 561551 688025 859971 736417 319356 -90645 -307513
40437 -307513 -354134 -265797 -82398 22364 -126277 -431644 -599275 -521708 -421783 -549748
40427 -549748 -851496 -1014205 -805600 -332516 42303 54304 -210273 -464217 -572279 -617593
40417 -617593 -629481 -463212 -60958 342822 446512 216609 -136521 -417875 -542257 -479229
40407 -479229 -290084 -160230 -214668 -330572 -292362 -102691 25556 -30785 -183281 -314486
40397 -314486 -416022 -508076 -556620 -517971 -378725 -151134 75231 115849 -121160 -440958
40387 -440958 -527499 -316582 -29562 172110 333014 439857 287523 -194556 -679789 -763118
40377 -763118 -450404 -104980 29726 21778 -6559 -71337 -199876 -314489 -347487 -336599 -314747
40366 -314747 -220156 -12846 207687 296137 217440 47583 -117870 -206057 -197653 -171834 -233276
40355 -233276 -339109 -315566 -130145 -1364 -87220 -199300 -55954 248532 301948 -66130
40345 -66130 -530527 -672815 -435189 -56453 249197 377888 260269 -65804 -363341 -385749
40335 -385749 -165809 28342 16380 -151659 -349779 -495171 -499796 -303565 -44368 -26070
40325 -26070 -370732 -801230 -917529 -634689 -214353 84189 211653 198607 36926 -194106
40315 -194106 -241996 78042 586666 858232 673833 238276 -92098 -172926 -96693 11093
40305 11093 80624 55485 -77553 -219644 -241790 -138906 -1234 144343 322606 444005
40295 444005 336316 10523 -273263 -321116 -249342 -271544 -360076 -312351 -102357 41315
40285 41315 -59399 -304407 -452885 -379363 -138062 129846 281375 239091 59557 -99607
40275 -99607 -144750 -145462 -206316 -282067 -225696 -21396 149550 132120 -13702 -136003 -205613
40264 -205613 -264380 -235011 -3086 304461 372800 127805 -126541 -156116 -138835 -312855
40254 -312855 -507106 -388448 -52062 65051 -142983 -299923 -167649 2442 -66230 -234894
40244 -234894 -248807 -171258 -192132 -233597 -104105 97478 85095 -166767 -382445 -373815 -222047
40233 -222047 -88100 -56001 -141422 -267021 -268775 -97023 64464 54588 -14644 11610 1878
40222 1878 -243598 -554513 -559365 -276793 -136122 -334218 -549610 -443782 -119230 115277
40212 115277 167749 135801 66276 -33357 -82886 -25033 54273 37719 -77038 -231803 -388729
40201 -388729 -473689 -388691 -187828 -89237 -187019 -299164 -243656 -120947 -148588 -331383 -488082
40190 -488082 -529005 -511649 -454564 -283440 14722 312025 443267 319703 -34576 -462970
40180 -462970 -717369 -648106 -388004 -256541 -430214 -762418 -970158 -942446 -795459 -660816
40170 -660816 -538858 -403503 -330897 -387186 -446553 -303419 19303 257848 257942 143503 45254
40159 45254 -114100 -395435 -620352 -620877 -548295 -643178 -810058 -739003 -397367 -82088 10583
40148 10583 -34625 -111500 -226083 -327626 -298825 -185404 -175477 -292204 -363586 -337439 -339171
40137 -339171 -365962 -241902 34490 217757 200735 154913 169103 89143 -132244 -279021
40127 -279021 -251506 -247492 -350901 -315271 -26252 202291 133969 46057 246680 485090 341433
40116 341433 -41880 -169768 7641 69635 -148267 -356821 -393580 -475899 -719672 -855116
40106 -855116 -653469 -302428 -116755 -117153 -115762 -43448 3798 -63538 -244905 -459572 -575539
40095 -575539 -522075 -400090 -366899 -414202 -411320 -357476 -388043 -500907 -498107 -286798 -46067
40084 -46067 24522 -27381 -17615 104402 220997 226007 150393 127032 250616 436554 449642
40073 449642 166906 -212197 -350017 -174265 38837 20264 -183262 -320232 -249788 -63411
40063 -63411 52507 5815 -137791 -251356 -293505 -324019 -367746 -347482 -210124 -34142 77135
40052 77135 132631 182220 185955 78882 -93199 -228377 -308757 -371542 -405162 -396323 -402467 -438745
40040 -438745 -383372 -165737 39364 13133 -172380 -246383 -133885 -23553 -45671 -121887
40030 -121887 -165540 -199926 -217793 -139657 1509 25710 -136496 -306065 -288579 -132192 -49159
40019 -49159 -152651 -348772 -455326 -403009 -333424 -437598 -644665 -605999 -146301 399546
40009 399546 547880 289779 58709 95649 189745 126669 43649 139698 305376 309699 196721
39998 196721 223723 458245 662185 598499 306779 25994 -80494 -67897 -89020 -187693
39988 -187693 -296119 -428602 -703797 -1064874 -1170824 -810125 -299044 -154808 -416170 -631295
39978 -631295 -539014 -379366 -406225 -469876 -324361 -54820 96798 130694 216030 351076
39968 351076 379849 270408 122888 -46977 -290372 -517403 -543342 -362944 -174647 -87314
39958 -87314 11964 215309 376736 286182 4067 -136950 67595 376422 329369 -179434
39948 -179434 -706609 -765486 -407423 -96580 -82510 -177168 -169160 -140762 -234488 -373143 -416186
39937 -416186 -388993 -339379 -155629 208585 481028 365312 22738 -74312 207662 475819
39927 475819 374949 62749 -59995 98002 256611 165136 -134951 -425299 -525600 -384578
39917 -384578 -99558 111510 72885 -150974 -311375 -293178 -267693 -415579 -603530 -534000
39907 -534000 -187372 112101 124544 -25543 -105118 -106375 -155955 -252799 -304752 -318435 -343583
39896 -343583 -308705 -121279 128766 265344 261770 179963 -29695 -403475 -708050 -628507
39886 -628507 -224321 95552 85669 -125451 -353702 -561262 -679056 -578109 -346623 -267656
39876 -267656 -364114 -295267 92843 442106 378349 55021 -108153 -8201 144222 234365
39866 234365 305480 323141 211931 75213 82001 161421 78000 -198325 -440704 -482630 -363115
39855 -363115 -154431 127890 406587 533619 469197 338438 264646 242862 191822 49891
39845 49891 -162274 -298476 -168153 224743 582820 595663 293615 2118 -30195 150689
39835 150689 322356 308969 106974 -124751 -224606 -221206 -285455 -448024 -520993 -412834 -343601
39824 -343601 -541407 -846163 -865032 -486538 -14657 221909 204472 122477 83579 14343
39814 14343 -186554 -443543 -515217 -296043 -50713 -144970 -527437 -746162 -580231 -350857
39804 -350857 -402761 -579651 -529023 -282653 -139723 -130370 -30585 148326 125231 -150367 -349568
39793 -349568 -229386 54884 219132 181919 20760 -178655 -318092 -310684 -201553 -129272
39783 -129272 -134547 -152981 -187659 -297861 -419262 -406349 -267273 -153367 -113078 -68803 -27572
39772 -27572 -75406 -165028 -162019 -99939 -120519 -172573 -82880 74697 45825 -132309 -135496 73843
39760 73843 119779 -156290 -377561 -220648 71390 101691 -96047 -261260 -392284 -599516
39750 -599516 -710339 -490476 -112782 56454 43925 173214 429453 428776 91540 -144949
39740 -144949 19557 289085 242041 -41652 -152007 25595 188308 84721 -161779 -263232
39730 -263232 -136296 44579 101742 53998 23608 11685 -111593 -366131 -547381 -468477
39720 -468477 -229588 -100215 -178793 -317131 -358170 -295343 -197612 -124152 -125084 -188968 -185686
39709 -185686 -16918 167555 95757 -227224 -444419 -290384 54923 212071 81066 -104600
39699 -104600 -133074 -36240 36775 8063 -109187 -273434 -442401 -584112 -682698 -711705 -627529
39688 -627529 -438120 -245468 -149925 -133713 -108348 -46444 21193 104308 224018 295435 193071
39677 193071 -31746 -159197 -105603 -60043 -185331 -330298 -243897 11614 113353 -49969
39667 -49969 -203319 -72962 247278 451435 397763 180134 -61475 -224259 -206798 8428
39657 8428 232023 202530 -98390 -388390 -407116 -205563 -49383 -111001 -335435 -560012
39647 -560012 -677937 -689639 -658006 -633576 -603835 -517409 -368355 -229574 -170570 -169590 -162875
39636 -162875 -163515 -241996 -365963 -371524 -190862 -23212 -121310 -436012 -663561 -672574 -656643
39625 -656643 -749518 -731701 -364738 149378 368365 215680 51795 108914 188406 44907
39615 44907 -221671 -352817 -297539 -194872 -154960 -233897 -465290 -735067 -787370 -558423
39605 -558423 -348642 -431348 -633805 -580252 -249350 10323 -20410 -206708 -339169 -371596
39595 -371596 -341572 -284943 -278111 -366845 -421198 -263051 30109 162876 19014 -183509 -206034
39584 -206034 -64094 98713 230289 346830 422535 411475 301555 102334 -131832 -268904
39574 -268904 -225224 -119684 -136012 -238124 -232033 -123526 -155348 -411827 -646736 -634632 -457942
39563 -457942 -294326 -155138 -25776 -33259 -217517 -321598 -114464 191806 172569 -196086
39553 -196086 -470856 -333575 24289 212805 120523 -61933 -142353 -89933 26579 122569
39543 122569 136227 78312 45288 122963 275194 371582 325396 165757 -23233 -179632 -259489
39532 -259489 -221811 -91470 -5553 -92527 -285448 -358648 -209964 -17310 -25270 -241957 -452409
39521 -452409 -490020 -384894 -264222 -210444 -216296 -202073 -93565 50077 39710 -207507 -485316
39510 -485316 -493496 -205777 91609 139707 -33722 -211476 -233820 -114055 19329 68536
39500 68536 73785 135650 217619 149712 -97716 -299965 -270750 -107442 26638 173310 387497
39489 387497 472602 256386 -11253 50390 341958 420816 226672 154059 325252 346190
39479 346190 1248 -333430 -303600 -154764 -281318 -551073 -546536 -244589 4424 31541
39469 31541 -38215 -130160 -275961 -370331 -240845 31539 167199 80311 -36160 -20396 87181
39458 87181 170921 139798 -58435 -329206 -411928 -188980 67848 9102 -302838 -486294
39448 -486294 -378438 -198872 -178750 -288734 -361867 -275358 -10464 278993 311641 13321
39438 13321 -277355 -216495 21584 -9496 -299878 -348690 52542 450688 376955 545
39428 545 -178325 -40920 97961 35301 -60744 37458 281586 422921 320257 82105 -90961
39417 -90961 -145516 -178093 -197819 -42299 337186 641879 514705 23709 -386124 -432003
39407 -432003 -247272 -75605 14776 27248 -76690 -227480 -210680 26852 213241 101330
39397 101330 -161456 -237457 -70297 91037 94190 53947 75247 25505 -272956 -724744 -992013
39386 -992013 -859336 -481718 -217760 -255326 -465480 -606325 -572430 -414673 -222858 -72418
39376 -72418 -11147 -9079 16525 55241 -19474 -233137 -398548 -366792 -261818 -278232 -375218
39365 -375218 -411457 -460310 -670811 -883021 -760955 -333509 -21917 -36573 -124479 -68580
39355 -68580 -52109 -271670 -520356 -491845 -271553 -182470 -293038 -397955 -376245 -264040
39345 -264040 -62352 218891 384011 228639 -123620 -348986 -379895 -435691 -578465 -567360
39335 -567360 -268403 73376 147672 -28511 -198360 -200390 -66975 91322 156954 55903
39325 55903 -136207 -222681 -130942 -32066 -93586 -223878 -232651 -160258 -226026 -460052 -612153
39314 -612153 -495190 -238239 -94992 -142238 -287668 -453979 -603201 -663432 -603506 -541393
39304 -541393 -612263 -745947 -742328 -561417 -353755 -195990 -24327 115089 22035 -296760
39294 -296760 -474625 -237398 175567 319947 134770 -84353 -185848 -267262 -325038 -215649
39284 -215649 -27634 -80561 -398854 -567956 -340916 -39658 -54072 -247110 -237818 -51644
39274 -51644 -47290 -302798 -521384 -548092 -560050 -654365 -622892 -309386 96734 321260 349386
39263 349386 322654 265264 110954 -108773 -274346 -304863 -165990 136534 447073 477521
39253 477521 121145 -326428 -448760 -185845 125754 170137 -40712 -271095 -324297 -173991
39243 -173991 51895 180565 149742 48077 -44185 -170809 -345088 -390769 -149929 201977
39233 201977 309066 120360 -51048 -21282 15149 -117695 -237246 -125789 47661 -28040
39223 -28040 -286642 -380046 -230686 -113433 -174030 -235314 -173789 -151518 -312794 -517367 -553507
39212 -553507 -412706 -206922 -11108 84359 -10993 -174915 -119391 170906 307493 39693
39202 39693 -326956 -351941 -78709 118202 132061 172703 313830 396989 361072 292692 156566
39191 156566 -146184 -440610 -407251 -117631 -31003 -330881 -663664 -713378 -640204 -696497
39181 -696497 -768680 -629140 -364664 -202335 -116773 41635 196736 188223 142537 319469
39171 319469 631816 689067 354622 -64666 -266404 -309409 -393590 -500718 -431440 -109648
39161 -109648 275605 427356 231449 -83235 -134076 185384 538742 529049 172734 -159184
39151 -159184 -200155 2887 287406 545734 680293 610201 392333 174854 -11880 -252793
39141 -252793 -504278 -553799 -309808 36909 240379 248187 142910 -10820 -158454 -233367
39131 -233367 -249878 -299854 -377531 -358537 -239300 -200042 -286060 -240383 115888 510135 523254
39120 523254 174052 -122326 -158724 -163473 -351585 -560668 -512497 -228989 14865 43392
39110 43392 -74989 -165467 -107158 87947 263622 243974 39928 -139278 -140372 -36018 29881
39099 29881 47812 84680 129303 134075 130947 164538 171931 66304 -117290 -291472 -453996
39088 -453996 -593994 -547428 -178532 313315 514684 283327 -84876 -239918 -145831 9409
39078 9409 82649 34932 -123717 -306696 -367553 -261427 -110909 -30154 11292 62992 62056
39067 62056 -43024 -143637 -100667 39666 101261 11758 -136629 -223846 -197382 -75943 42247
39056 42247 30623 -95226 -121498 108324 428968 519125 334416 188271 322497 550190
39046 550190 482507 56055 -344094 -354003 -95264 -9286 -261244 -529157 -487936 -290279
39036 -290279 -321471 -594406 -716874 -481438 -168607 -133430 -345231 -515493 -493363 -350235
39026 -350235 -213133 -178750 -270171 -338999 -148220 302528 679448 699573 470126 280056
39016 280056 208061 136133 20216 -70255 -96891 -57669 62942 204168 216504 81658 -21612
39005 -21612 -22182 -98775 -311289 -366310 -66719 256154 169099 -183082 -281720 -19516 196597
38994 196597 116391 -43089 -29053 105173 197568 197163 107694 -13371 12727 258032 431409
38983 431409 219629 -154412 -169666 183357 355819 114085 -100147 71269 311011 171998
38973 171998 -197855 -322672 -120566 75593 66199 -24658 -37094 38305 132527 165950 90368
38962 90368 -29041 -79821 -113352 -295302 -561461 -585976 -249660 121931 191141 34559
38952 34559 -89651 -156066 -269307 -345196 -221578 18205 133028 92313 105351 284659
38942 284659 473778 444237 166434 -130983 -167561 67184 248933 121127 -117778 -94219
38932 -94219 128465 109696 -244804 -478263 -298244 -53305 -174667 -513157 -628886 -459703
38922 -459703 -268950 -122036 133675 450756 556469 359339 73133 -92716 -138176 -161571
38912 -161571 -228618 -351883 -474058 -507108 -467192 -471001 -526040 -480266 -270401 -34634 121232
38901 121232 251395 351294 268832 -10103 -241631 -257209 -166456 -82253 57186 235331
38891 235331 278622 219347 336637 606324 581652 147443 -122419 176668 561899 403590
38881 403590 -42413 -68090 315527 439700 87381 -247258 -235950 -132395 -174026 -185195
38871 -185195 21188 330003 585994 767740 791079 536321 165326 31156 197197 403860
38861 403860 526937 659784 736431 551528 217612 116409 293868 390668 299355 366303
38851 366303 726975 950739 668245 141900 -142849 -140180 -150504 -301942 -457060 -492268
38841 -492268 -408409 -257929 -131701 -113951 -148798 -96440 14767 -131 -143244 -158321 80087
38830 80087 356362 463635 526914 753133 1041160 1105026 904442 712885 753878 950977
38820 950977 1098827 1158569 1254130 1391595 1347542 972076 498139 317764 468656 608635
38810 608635 530084 389224 343695 325270 328863 533726 897675 1027095 756606 465020
38800 465020 463711 497256 293448 162123 457702 823203 671979 175133 32760 389728
38790 389728 700823 638722 452483 388951 380348 381709 478786 599079 583192 534284 644847
38779 644847 770762 680149 581605 817910 1170256 1121779 718437 486516 563198 610538
38769 610538 537999 575885 656319 474456 170877 204513 538524 703419 655504 781757
38759 781757 1071080 1123476 979652 1062462 1294694 1207657 934915 1094049 1630485 1829662
38749 1829662 1562926 1429124 1558810 1445602 1112323 1209604 1742234 1963724 1774978 1899163
38739 1899163 2410026 2530042 2223875 2446542 3365117 3940720 3805679 3881453 4540282 4949449
38729 4949449 4940607 5601788 7162929 8331256 8720534 9773543 12137445 14485898 16269291
38720 16269291 19001384 23221938 27192268 30681055 36695437 46905412 59544585 75676546
38712 75676546 102105991 140153442 174250710 181877055 157279593 118158396 86060966
38705 86060966 66817316 53721913 42255782 33934188 29370104 25795493 21703238 18462250
38697 18462250 16596591 14535848 11746661 9692088 8920049 8082626 6585211 5620902
38689 5620902 5744700 5722218 4728438 3706614 3549092 3620659 3114520 2471531 2425626 2726913
38679 2726913 2732051 2425818 2114832 1809087 1495749 1406049 1554535 1580510 1361513 1203391
38669 1203391 1209483 1105410 875877 880181 1125279 1130055 755704 483792 599346 752929
38659 752929 623313 402784 329904 308476 274886 406059 683188 753288 493142 243207
38649 243207 246149 317122 290356 319261 498994 645210 679210 791084 996665 985725 663821
38638 663821 410471 518212 768454 846730 810783 847532 888182 772369 550037 368203
38628 368203 267482 267601 415323 597133 575609 366875 298304 527924 794036 814212 645324
38617 645324 469513 319162 215430 286298 514987 640371 550235 511171 735173 970636
38607 970636 866790 568895 567893 1007776 1486730 1599889 1419676 1320533 1482015 1709392
38597 1709392 1718229 1493965 1299119 1332604 1479996 1479487 1261660 1002484 882245 932286 1103103
38586 1103103 1333080 1527737 1590930 1507102 1326181 1104519 954201 1067078 1508641 2017727
38576 2017727 2216596 2060077 1909980 2103305 2583783 3039253 3301580 3510954 3913997
38567 3913997 4571048 5295373 5876056 6310090 6765257 7377167 8192142 9240034 10462364
38558 10462364 11576846 12246253 12428738 12345030 12076991 11484606 10579154 9631299 8771667
38549 8771667 7838953 6807417 5979885 5494146 5022734 4307539 3639621 3398615 3418473
38540 3418473 3259314 2859447 2460207 2111337 1734957 1484837 1536974 1677877 1593387 1403734
38530 1403734 1397758 1424696 1156700 811487 921058 1421502 1691059 1545134 1459155 1649505
38520 1649505 1677813 1273880 887418 1002357 1423533 1677998 1702602 1704546 1692398 1589304
38510 1589304 1565579 1852840 2378382 2890939 3309636 3705869 4101133 4522963 5129615 6065108
38500 6065108 7272788 8582179 9894829 11245416 12838067 15058203 18286297 22698243
38492 22698243 28338495 35068422 41940307 46835220 47602054 43954339 37805895 31491665
38484 31491665 26087018 21588508 17948047 15262040 13331992 11722972 10212942 8831406
38476 8831406 7604392 6569499 5851800 5425434 5000738 4416674 3894459 3620038 3376145
38467 3376145 2929994 2470393 2243343 2046363 1576932 1055167 955823 1249419 1445503 1335189
38457 1335189 1177527 1146641 1088289 902821 744860 733740 807485 936730 1160590 1361602
38447 1361602 1339643 1162338 1097640 1135506 952477 471618 79903 89362 307766 390253
38437 390253 342880 381770 489847 448850 237365 93465 158192 290252 309683 252109 262844
38426 262844 344272 360248 271458 212038 268731 315448 206706 50756 88383 311321 435910
38415 435910 332137 246402 428725 720680 757840 503225 324498 504795 868678 1006351
38405 1006351 787070 523967 590022 939136 1136428 900140 457740 224597 275487 371846
38395 371846 408108 503892 671164 757227 786396 980107 1295401 1330458 930048 541444
38385 541444 654005 1152732 1560324 1696390 1735837 1780933 1759724 1679268 1653394 1708056 1809162
38374 1809162 2025589 2434624 2936531 3367773 3695000 3908309 3899502 3700972 3654671 4013690
38364 4013690 4517780 4711206 4566094 4427107 4432078 4379779 4132930 3774688 3372847 2935466
38354 2935466 2585353 2433901 2305700 1950193 1502349 1338287 1473851 1528030 1322175 1083539
38344 1083539 979299 891108 773137 793090 946849 952514 729674 580361 665876 709432
38334 709432 498986 292811 372613 533075 426958 160486 103791 267680 306185 86534
38324 86534 -125949 -79583 153281 330066 313197 159980 47267 82122 132934 -27874
38314 -27874 -343933 -451108 -183586 135168 141438 -53185 -103641 -4437 -36185 -227200 -276560
38303 -276560 -42437 248192 364627 349244 315259 224475 18627 -209440 -320660 -291039
38293 -291039 -179195 -45452 31935 -17676 -147386 -218670 -190291 -162615 -182951 -147242 18680
38282 18680 206286 266299 213704 174071 183524 157116 37028 -118393 -199680 -148997 3222
38271 3222 169656 266262 248775 100782 -167615 -466959 -629668 -566250 -405535 -360446 -439274
38260 -439274 -423659 -188281 91766 155100 -30249 -290613 -498021 -634058 -650485 -469326
38250 -469326 -165353 21405 -44593 -218208 -261378 -120763 76673 214423 241278 105670
38240 105670 -187293 -459012 -481727 -279418 -148797 -283452 -510551 -537415 -359187 -244331
38230 -244331 -351380 -541155 -593702 -455075 -209618 54927 254354 279041 89259 -187724
38220 -187724 -354158 -332473 -198714 -56150 35727 23217 -125954 -320446 -362268 -165063
38210 -165063 94135 150002 -31303 -210854 -177453 12502 152914 154963 98285 68411 57532
38199 57532 16623 -94194 -305865 -583892 -759158 -644147 -284229 11478 -12711 -277136
38189 -277136 -498118 -541051 -509915 -499061 -419891 -170143 119786 169695 -89852 -359856
38179 -359856 -285771 115736 469281 484482 246789 14049 -115157 -194524 -221610 -140867
38169 -140867 -6084 59942 63250 118956 237503 314940 334974 371546 376846 211565 -58116
38158 -58116 -157078 -1849 153918 118420 41851 98966 150486 1553 -197299 -134179 182494
38147 182494 433631 431120 273632 90639 -95971 -236761 -220821 -36964 186967 327508
38137 327508 332340 190993 -14048 -96565 10597 87290 -114464 -498952 -737330 -704311
38127 -704311 -562731 -443307 -315390 -199747 -234032 -432529 -589956 -526180 -278650 9747
38117 9747 250016 399889 427321 339679 176023 -27369 -198413 -222953 -80235 92987
38107 92987 171893 161218 59072 -182310 -413592 -300094 161990 451443 208624 -186639
38097 -186639 -174996 151831 346443 436413 738067 1053602 914739 550962 674225 1258337
38087 1258337 1557848 1492271 1844527 2757080 3407454 3884100 5861810 9992917 13755998
38078 13755998 13818420 10172114 6122077 4159888 3609903 2744826 1455029 753507 848610
38069 848610 1038852 975981 909043 889769 639277 175294 -113851 -65506 86794 162149
38059 162149 232847 344348 389254 317554 207926 99347 -26232 -86468 55418 346626
38049 346626 519840 374265 -14972 -399246 -605636 -662673 -694340 -706408 -560906 -242204
38039 -242204 -24052 -156374 -453525 -488422 -206897 -16249 -172894 -430366 -472134 -360618
38029 -360618 -298249 -234738 -46465 102477 -49235 -409418 -610729 -507122 -310057 -241210
38019 -241210 -296248 -359114 -341143 -196508 30222 181318 160001 89517 147266 299112 365470
38008 365470 285258 132260 -57822 -268621 -378279 -288154 -133749 -123342 -197102 -115478
37998 -115478 116207 208257 27847 -206192 -275596 -251596 -292048 -376153 -408479 -400954 -373170
37987 -373170 -225987 93619 412895 508049 392091 263703 217877 167761 43098 -74822
37977 -74822 -58039 95409 237902 232118 130660 123428 238837 219083 -109829 -436664 -264495
37966 -264495 360915 814930 748532 567378 756932 1155587 1415001 1838957 2980249 4438320
37956 4438320 4926515 3883076 2323219 1553599 1574393 1442172 837692 388218 478724
37947 478724 640234 414193 101340 163796 412128 381775 172659 255074 592668 628366
37937 628366 183171 -240302 -231826 -29079 -27522 -176735 -216046 -162113 -160568 -112103 126870
37926 126870 358699 308962 155016 312485 733660 915186 662283 359266 334786 421885
37916 421885 377577 307518 351960 311768 -21468 -424868 -535805 -394298 -303060 -305004 -214183
37905 -214183 -55713 -35961 -117260 -55197 132817 163753 4076 -39734 148726 292838
37895 292838 209171 96905 128674 127707 -73305 -275466 -229372 -48649 6630 -64928 -136765
37884 -136765 -277480 -580398 -828942 -721951 -356542 -128645 -195274 -371333 -524141 -706032
37874 -706032 -872027 -830434 -576870 -367773 -325832 -244843 35942 291160 183811 -230539
37864 -230539 -511906 -364205 5678 152741 -45875 -246822 -127784 139751 144605 -103156
37854 -103156 -134328 246695 582845 403353 -75816 -282109 -96456 111608 130312 113785
37844 113785 167332 169241 56339 -85752 -251472 -472285 -539926 -194987 353043 539539
37834 539539 199589 -210559 -283970 -121762 51368 265432 523507 558047 220458 -193756
37824 -193756 -338823 -280184 -272305 -339219 -372860 -394018 -411791 -270482 52487 243350 79195
37813 79195 -179005 -176400 -18681 -35741 -180569 -113749 204954 440571 392623 228724 185639
37802 185639 304221 465540 491768 268653 -58747 -143841 112680 356775 265531 20806
37792 20806 -9134 151085 195336 61833 -43587 -27648 60942 255639 542650 642676
37782 642676 338418 -99596 -250394 -188217 -313502 -633880 -744188 -501463 -198609 -50563
37772 -50563 -12363 -119736 -467321 -795625 -666581 -164267 129521 -7234 -171209 -98668
37762 -98668 -94379 -417767 -797549 -908752 -853352 -804052 -613527 -167842 262556 418244
37752 418244 451281 559350 565048 254380 -177441 -414785 -473642 -492916 -379158 -66084
37742 -66084 166712 80752 -73410 47148 277467 241025 43421 120838 504846 780737
37732 780737 753681 653350 641331 572883 339179 67726 -121551 -261550 -373070 -417443
37722 -417443 -446800 -555678 -678990 -677172 -592232 -564223 -548451 -409530 -245123 -280373 -453846
37711 -453846 -459576 -232660 -49214 -73300 -131771 -50290 76627 88882 2341 -82887 -134526
37700 -134526 -153568 -147489 -195592 -378273 -603955 -673932 -543069 -351688 -207911 -130189 -175833
37689 -175833 -377722 -549250 -426053 -58097 190964 111508 -112360 -207252 -138653 -51066
37679 -51066 -71265 -241384 -476785 -561578 -379747 -154329 -215599 -519479 -680912 -529379
37669 -529379 -317554 -292352 -388713 -483540 -617171 -767311 -718108 -401476 -100024 -50175
37659 -50175 -93011 1709 115737 25366 -149930 -139010 -15993 -73964 -264196 -218209 121603
37648 121603 330465 119368 -242436 -353654 -237686 -185258 -243398 -196911 13984 176245
37638 176245 143025 38962 29077 74032 53729 -784 28641 118404 118550 -7895 -130895
37627 -130895 -177601 -245086 -398546 -506713 -426106 -242932 -149490 -141506 -48455 142398 221365
37616 221365 81069 -109485 -189463 -284206 -594582 -1008894 -1161393 -885807 -422702 -122353
37606 -122353 -86730 -175122 -231033 -189480 -47903 130727 213773 118920 -60266 -147520 -101522
37595 -101522 -33682 -8956 26261 77510 33991 -123818 -204164 -62402 134642 110623 -121258
37584 -121258 -286487 -246225 -122737 -18023 128108 322455 411007 320972 206971 207403 231500
37573 231500 148283 28372 16582 83792 82754 -33612 -194840 -329682 -380744 -309834 -208845
37562 -208845 -275881 -539903 -742587 -654880 -385457 -209472 -221650 -334605 -475559 -573496
37552 -573496 -486741 -187646 82404 85492 -75866 -137504 -88610 -123241 -247991 -258292 -105898
37541 -105898 11656 -19331 -65277 12044 148009 183938 48741 -189154 -341124 -217127
37531 -217127 137138 403532 356646 155534 74184 88839 5715 -137485 -138282 -10578 62046
37520 62046 95791 245442 409836 322167 48000 -53478 65615 36092 -294533 -579026
37510 -579026 -532158 -358488 -351842 -430279 -375383 -237535 -183899 -172723 -82493 14161 -20348
37499 -20348 -132913 -190756 -214498 -296221 -419101 -535248 -673304 -802991 -764621 -516753
37489 -516753 -290410 -307772 -490287 -615060 -616573 -576514 -560601 -606877 -725434 -798557 -667742
37478 -667742 -421905 -363930 -566582 -731233 -645821 -489262 -478160 -514522 -439382 -347642 -356551
37467 -356551 -326738 -134350 23000 -64978 -227859 -190963 -47480 -74885 -247857 -324802
37457 -324802 -283392 -279315 -287232 -176824 -49219 -98863 -218508 -144491 68367 130621 27874
37446 27874 11138 96316 35471 -171942 -204234 39201 253576 235517 165278 194044 137621
37435 137621 -160575 -475385 -495735 -248957 28716 250596 444989 517454 336749 2784
37425 2784 -212717 -202136 -130812 -190184 -373970 -547254 -644367 -706933 -746375 -686058 -521873
37414 -521873 -444912 -626900 -916639 -988778 -826231 -762136 -931606 -1022543 -797009 -515415
37404 -515415 -496410 -560076 -359147 -29138 26094 -139937 -86873 248004 449231 347385
37394 347385 248705 292098 175224 -206885 -400679 -58907 468263 631930 434242 248750
37384 248750 172314 21436 -205343 -317494 -301957 -309419 -317368 -162638 105636 234687 150989
37373 150989 47515 50590 61508 -3559 -48465 19285 105739 56073 -118026 -230857 -129617
37362 -129617 119060 260841 110803 -220430 -439194 -423626 -342587 -367368 -417448 -314723
37352 -314723 -71901 121834 134098 -11338 -198300 -275584 -142775 93279 136213 -174354
37342 -174354 -615483 -804323 -620029 -267471 18046 162381 183403 119978 64979 125047
37332 125047 282994 380629 282581 13408 -275079 -432528 -424247 -367647 -429615 -633258 -798205
37321 -798205 -733457 -458162 -170413 -33085 -55820 -148023 -205932 -168938 -66354 1345 -17271
37310 -17271 -53775 -36517 -40089 -214332 -555608 -842564 -853489 -610025 -360412 -326503 -495233
37299 -495233 -670469 -703975 -623252 -525076 -429824 -320094 -256914 -321595 -449319 -463821 -317933
37288 -317933 -171238 -160323 -208607 -167295 -57865 -39049 -155464 -243756 -132269 127764
37278 127764 291354 184900 -94419 -286388 -260982 -126447 -26891 46905 150310 204046
37268 204046 92186 -113364 -219654 -199633 -217400 -334794 -392196 -266285 -75125 -8459
37258 -8459 -81795 -180223 -245241 -290420 -297082 -217536 -65640 71735 112098 49171 -21670 35206
37246 35206 231843 368927 230987 -116928 -364831 -338027 -205083 -221434 -382194 -454566
37236 -454566 -304751 -77569 -28265 -215290 -401213 -308436 28085 269960 193824 -37881
37226 -37881 -146083 -117802 -114898 -139047 -73485 17696 -43504 -196493 -188211 -2586 88273
37215 88273 -37156 -195133 -256938 -300413 -292907 -32863 398194 537948 183285 -241126
37205 -241126 -295779 -169845 -295660 -595154 -608123 -237969 111838 126405 -98397 -342380
37195 -342380 -520529 -601666 -553690 -443686 -395173 -415937 -415308 -350645 -210521 37371 293468
37184 293468 278938 -89781 -423835 -299241 115827 238379 -153188 -686978 -955741 -938833
37174 -938833 -798868 -611120 -432581 -359703 -369448 -312332 -165754 -95107 -187678 -332091 -427532
37163 -427532 -495118 -512752 -368610 -73167 186868 293117 304712 267145 133946 -49902
37153 -49902 -122865 -61673 -33877 -96725 -86000 68539 165357 42965 -144463 -161463 -33680
37142 -33680 37958 -23695 -128903 -169460 -79469 128321 273045 109285 -343891 -736811
37132 -736811 -799202 -650074 -537449 -462099 -290442 -83910 -32189 -133401 -208761 -207538 -247493
37121 -247493 -341679 -318778 -81843 222828 370043 280916 42997 -195953 -311069 -244901
37111 -244901 -11156 340352 711526 903204 719926 240232 -144935 -137906 103869 195654
37101 195654 33981 -159013 -251312 -357546 -527478 -585157 -436421 -286400 -338002 -470960
37091 -470960 -467065 -387694 -419173 -454150 -214061 201650 305395 -78798 -475503 -398402 -36186
37080 -36186 79654 -107684 -169206 46818 148846 -152614 -564970 -651847 -434786 -234231
37070 -234231 -142180 -24175 86180 -4156 -245225 -305023 -29558 321198 420288 264414
37060 264414 99819 108793 282696 484948 528118 283887 -166109 -539396 -605491 -406781
37050 -406781 -173427 -59574 -34060 -10824 4119 -53488 -169814 -241495 -225667 -209809 -255514
37039 -255514 -266463 -149737 -26424 -74579 -208730 -185536 -34940 -57028 -306867 -457851
37029 -457851 -362324 -350579 -659245 -932378 -733984 -276669 -116766 -299707 -376912 -204328
37019 -204328 -132687 -346037 -567970 -580046 -542819 -598056 -583336 -377708 -162994 -109217 -131197
37008 -131197 -171589 -383661 -783410 -1036431 -871888 -457323 -119217 59864 141685 106318
36998 106318 -20480 -70857 -16370 -83648 -337227 -448455 -197571 86003 -25361 -398588
36988 -398588 -558310 -405193 -280870 -394351 -591068 -681330 -650987 -528045 -325634 -139197
36978 -139197 -78821 -113613 -156736 -230663 -365290 -444739 -359790 -188205 -28440 166458 362804
36967 362804 296433 -124755 -495334 -396734 -34388 57348 -181506 -322041 -174483 -8669
36957 -8669 -13457 -37092 19831 -3133 -185420 -350977 -383523 -383866 -387192 -254346 22360 220464
36945 220464 228362 190824 199999 143120 -27675 -177921 -254233 -357697 -458798 -383151 -193118
36934 -193118 -203886 -465579 -626001 -509974 -425716 -622841 -836525 -719485 -402027 -236222
36924 -236222 -237428 -179161 -59334 -76814 -244817 -367605 -348593 -263298 -193238 -193134 -315993
36913 -315993 -481934 -469774 -236687 -65768 -167034 -325509 -220507 76478 224046 99060
36903 99060 -134003 -338750 -510166 -638791 -711068 -763436 -751326 -518896 -98404 177056
36893 177056 114411 -29220 14186 47600 -220516 -578677 -590445 -307653 -167733 -271819
36883 -271819 -318973 -217671 -176741 -158676 141713 635940 753498 260264 -339735 -496581
36873 -496581 -266245 2834 196206 316699 231711 -82970 -338275 -315595 -202148 -239765
36863 -239765 -314730 -222696 -66994 -31339 -12698 117671 118814 -285999 -825214 -922279 -489307
36852 -489307 -27673 89951 17425 27683 95284 63057 -57623 -158070 -233308 -343459
36842 -343459 -476146 -568582 -603749 -605732 -577811 -490645 -326498 -145335 -94310 -257959 -469667
36831 -469667 -415793 -28437 356940 371302 29571 -358588 -575746 -627435 -591269 -526511
36821 -526511 -475183 -402564 -212442 47081 121673 -127101 -462950 -542574 -330721 -47255
36811 -47255 157995 233864 85575 -279653 -569364 -510946 -279876 -279146 -539724 -716345 -659812
36800 -659812 -571734 -543313 -385527 -60200 133713 19496 -158609 -133385 -12374 -30267
36790 -30267 -169238 -286725 -391211 -523797 -565607 -434132 -297541 -320223 -349722 -146300
36780 -146300 195079 349657 217216 -9934 -189102 -358466 -523814 -571385 -451184 -261143
36770 -261143 -100221 11169 34125 -108427 -388263 -617850 -614989 -381538 -93999 56107
36760 56107 20198 -77032 -74691 50873 180488 196078 54661 -238530 -582277 -725388 -482903
36749 -482903 -62852 62470 -262968 -655922 -720453 -559947 -511568 -578245 -482648 -199781
36739 -199781 -48224 -190774 -364944 -263545 33983 196648 89347 -103239 -180612 -191822
36729 -191822 -309682 -519382 -595989 -442691 -280878 -328729 -422154 -242810 122658 221299
36719 221299 -85594 -367402 -256752 18598 42393 -155398 -260737 -245066 -317964 -432404
36709 -432404 -315681 9103 172020 1360 -255263 -352352 -345350 -343870 -284169 -112148 65907
36698 65907 174704 284853 393321 323209 15942 -284073 -328942 -182507 -51410 37108
36688 37108 175445 319304 332795 242515 230419 362356 493115 484207 388292 342247 347527
36677 347527 257347 5189 -223571 -155299 211326 523599 461732 138442 -25185 204493
36667 204493 637679 909618 821878 426239 -74368 -440452 -522181 -365235 -167303 -100505
36657 -100505 -182576 -285533 -234145 37519 359559 436907 181376 -154900 -290261 -245068
36647 -245068 -203329 -166619 6841 266567 347066 132559 -159326 -231276 -11139 326371
36637 326371 524012 430848 147597 -41300 6674 113356 73375 -5044 105456 325747
36627 325747 361074 183957 81383 180861 265930 168139 42165 94178 262442 323173 159891
36616 159891 -168437 -486399 -586775 -419551 -215081 -242006 -453431 -575352 -501428 -347073
36606 -347073 -174564 14094 66344 -142396 -336894 -108608 402965 600104 305762 5131
36596 5131 20228 39264 -203660 -367388 -109117 236236 169047 -138153 -142400 165767 295845
36585 295845 83276 -122562 -89788 13076 21781 -1686 -40006 -205715 -440599 -472992 -201504
36574 -201504 145648 326260 330493 261077 191691 182321 227668 178629 -77696 -372556 -411769
36563 -411769 -158808 159338 380732 485850 405436 74406 -320164 -470777 -373095 -312508
36553 -312508 -385124 -370081 -170453 -26983 -115444 -239249 -155910 32647 75503 -17997 -38984
36542 -38984 49506 69827 -53064 -154685 -72406 118875 204393 103388 -44197 -74420 -7635
36531 -7635 16785 -27850 -30937 26921 6175 -120338 -117264 184922 550625 600974 354574
36520 354574 213855 397404 670225 717298 529967 296083 125147 45168 102242 275595
36510 275595 395631 315859 110834 -22657 -2022 116866 278083 447941 549296 530386
36500 530386 487331 566900 736294 805763 719765 654719 732775 808291 707939 551527 600531
36489 600531 852985 1057421 1126969 1240618 1461025 1570102 1450736 1334004 1423407 1533180
36479 1533180 1403506 1166114 1161014 1456862 1895362 2442551 3105758 3659296 3911633 4141653
36469 4141653 4782916 5754545 6641647 7484395 8769513 10626392 12725170 15089537 18288292
36460 18288292 22643876 28063867 34898598 43810149 53878542 61648484 63407880 58503915
36452 58503915 49740074 40649270 33069714 27139504 22494133 18889024 16143485 14043586
36444 14043586 12355970 10898287 9664516 8776335 8163663 7472516 6509527 5567175 5020938
36435 5020938 4799887 4558413 4161175 3670305 3082960 2456564 2075649 2096073 2231517 2184376
36425 2184376 2126755 2297737 2416032 2076583 1510210 1295854 1448338 1476762 1300988 1385677
36415 1385677 1869294 2241717 2114166 1757647 1611492 1691869 1749131 1681483 1559016 1451281
36405 1451281 1366811 1225371 914353 543332 487199 893080 1337472 1350158 1081603 997460
36395 997460 1109568 1064180 849024 787174 888777 857924 752057 963750 1448719 1635251
36385 1635251 1308947 1000504 1217425 1761289 2085211 1963161 1576865 1236865 1184707 1428716
36375 1428716 1693550 1739709 1685602 1759620 1881583 1849823 1778807 1913468 2150868 2206446
36365 2206446 2113880 2097666 2131593 2112265 2232762 2633219 2957925 2881372 2756664 3025403
36355 3025403 3339788 3138484 2771491 3037678 3820908 4275178 4245546 4369212 4797996 4998333
36345 4998333 4899134 5076951 5640642 6033037 6102746 6299217 6676011 6794144 6708555 6915877
36335 6915877 7279612 7228526 7023856 7474819 8396503 8850318 8937946 9706000 11213135 12506479
36325 12506479 13619680 15611888 18503762 21390936 24747179 30092047 37226294 44793628
36317 44793628 53802728 66975115 84480331 105509302 134880435 179823035 234286652
36310 234286652 273086095 271839678 232208599 180018625 138673207 111708313 91318723
36303 91318723 73721598 60452981 51230991 43304919 36059796 30971792 27778304 24551124
36295 24551124 20967462 18336084 16820636 15304387 13616852 12540810 11928843 10888349
36287 10888349 9535851 8709710 8280241 7495220 6638918 6605732 7105637 6981321 6123963
36278 6123963 5476692 5273734 4846141 4144953 3935742 4346155 4574218 4247846 3897592
36269 3897592 3876882 3872405 3689313 3576398 3583050 3423036 3106611 2954704 2933384 2707041
36259 2707041 2351156 2271285 2431162 2402299 2158309 2084129 2223444 2255047 2189366 2331660
36249 2331660 2550296 2349314 1740231 1324686 1401596 1636984 1717866 1723891 1745068 1687942
36239 1687942 1564087 1502055 1456512 1354312 1438005 1934566 2492669 2551205 2189105 1978015
36229 1978015 2054856 2025593 1778754 1665988 1786041 1796956 1609766 1612901 1978008 2326417
36219 2326417 2342653 2211765 2196718 2241213 2244104 2320910 2544232 2761614 2870064 2964783 3072625
36208 3072625 3062414 2954769 2996015 3287974 3653010 3985529 4414801 4976590 5433974 5611318
36198 5611318 5675588 5922217 6447482 7135745 7828193 8452169 9106560 10001453 11177414
36189 11177414 12365113 13299090 14052711 14844293 15658515 16333447 16864419 17278241 17334648
36180 17334648 16752074 15678745 14562775 13578121 12532027 11313941 10070587 8930088
36172 8930088 7891373 7001094 6334935 5811233 5311844 4934273 4801147 4691104 4248605
36163 4248605 3548906 3060640 2998675 3066609 2916557 2559707 2231506 2085787 2097661 2131282
36153 2131282 2129915 2326939 3060249 4173415 4884083 4609217 3704306 2989862 2756939 2687186
36143 2687186 2543138 2383940 2204260 1914201 1649600 1614238 1665946 1538003 1368915 1466683
36133 1466683 1648463 1446292 930767 653356 738997 740498 496033 396858 595026 664721
36123 664721 367221 99679 201959 396447 333584 177738 203956 260343 97078 -136002
36113 -136002 -165097 -56157 888 74033 257355 343015 146909 -74855 34732 349664
36103 349664 430391 174559 -70580 -2741 321149 646616 790803 779482 838022 1158957
36093 1158957 1600394 1777801 1540396 1146025 865336 674178 483072 385040 457669 560568
36083 560568 564492 581685 749575 975573 1113160 1216140 1406303 1639566 1784225 1782338
36073 1782338 1594331 1176911 663008 343875 301640 276170 61901 -207148 -348078 -422108
36063 -422108 -497521 -402080 -24508 366710 452795 341477 361515 516185 526463 356314
36053 356314 292574 448774 542872 324308 -29199 -156385 -27234 23120 -206744 -459711
36043 -459711 -365813 -7017 151301 -55807 -214334 38649 421459 428922 114954 -45987
36033 -45987 41188 8040 -249234 -361993 -161100 12493 -84075 -196677 -95518 -21174
36023 -21174 -235701 -532268 -590124 -473965 -387294 -254217 38707 279547 244051 116290
36013 116290 166454 255429 118239 -85337 -9748 251439 307247 146157 146681 420468 634539
36002 634539 551725 331508 204391 196649 263392 392394 497601 462195 336451 280729 324255
35991 324255 399335 547210 817005 1031163 967912 729678 601412 591176 478779 291712
35981 291712 319796 634139 1015864 1407819 1964297 2566706 2872868 3101524 4126631 6219488
35971 6219488 8135058 8222149 6365701 4138760 2929399 2571327 2123348 1378137 946649
35962 946649 1116264 1380175 1241973 914652 882469 1148124 1344047 1387992 1565765 1984016
35952 1984016 2335902 2294704 1855159 1211819 561428 103103 -28727 51074 69810 -44175
35942 -44175 -106661 -31934 28901 -12329 -41760 -30332 -149144 -423991 -576587 -422161 -145080
35931 -145080 38278 190972 377254 398063 145523 -60330 110227 456208 543287 375621
35921 375621 324891 488661 580838 457672 331277 384880 507852 507298 345128 113883 -38407
35910 -38407 22226 239791 339881 179482 -10918 6206 50228 -161185 -421782 -254521
35900 -254521 305266 657800 466924 74238 -73402 22550 147115 256361 331342 176093
35890 176093 -282995 -706757 -695882 -314818 25655 111012 64929 18232 -54111 -141977 -122574
35879 -122574 24580 128693 79835 10657 75539 180103 131454 -25263 -73015 -9258 -62779
35868 -62779 -245985 -232672 107913 388658 253403 -43135 -56054 86849 -74789 -462360
35858 -462360 -517942 -162706 32646 -193223 -393426 -263640 -160834 -352599 -456227 -174011
35848 -174011 65343 -150783 -428071 -252547 61602 -68937 -445655 -486462 -296569 -386333
35838 -386333 -610976 -404169 117344 313698 174753 266984 589025 575482 261137 311505
35828 311505 797800 1092110 1116649 1481741 2206724 2636540 2870964 3778668 5290441 6567263
35818 6567263 8506239 13650256 21825653 27928574 26809260 19496550 11991390 8285276
35810 8285276 7175017 5969747 4366318 3457275 3200662 2754574 2148340 1999420 2191046
35801 2191046 2096267 1699507 1461801 1394860 1163648 849040 796187 890148 716890 327635
35791 327635 186888 417808 668172 703791 644429 608380 536924 395456 242367 112372
35781 112372 50246 152912 377264 500358 490033 631478 993742 1126407 723445 247318
35771 247318 307395 668657 583348 5747 -300403 38890 461199 408913 155471 249112
35761 249112 637664 873745 858730 843541 871441 732156 424271 230600 294960 453925
35751 453925 538313 566006 580896 545842 471066 451861 509340 552774 536933 494645 399062
35740 399062 192403 -18857 -32365 108399 87264 -227618 -524222 -438960 -30740 346570
35730 346570 487035 416016 185805 -114189 -240750 -27181 291530 318345 80327 22032
35720 22032 329956 634019 561944 251284 51346 6143 -40474 -48830 123292 349883 343155
35709 343155 106525 -54434 12963 144824 178678 138864 53644 -115812 -274906 -210941
35699 -210941 60774 226544 107811 -70694 -26486 184921 333307 384622 456256 530336
35689 530336 477029 308922 184536 181203 248739 353863 483552 532099 382849 109754
35679 109754 -77690 -104272 -80341 -75206 -24875 87807 140700 51962 -82264 -128619 -95912
35668 -95912 -81618 -114036 -131830 -73036 69152 231134 294103 192332 34650 13769 143134
35657 143134 206039 59636 -131993 -118841 62396 131682 -24688 -190390 -147866 -9525
35647 -9525 -60325 -337885 -553820 -472784 -222087 -102440 -166402 -158750 94025 400166 435296
35636 435296 159398 -167943 -348940 -426393 -476373 -440085 -284653 -156228 -188140 -269102
35626 -269102 -209271 -63896 -49505 -152969 -98625 213456 490221 433225 151202 -27513
35616 -27513 -20383 -16515 -98451 -114659 26115 168417 132204 -41580 -195126 -283816 -364491
35605 -364491 -433699 -421308 -314558 -172437 -36993 63666 46832 -155746 -432461 -519048
35595 -519048 -276074 118390 333588 229086 -23128 -159564 -115850 -57420 -133617 -264079
35585 -264079 -230475 36457 347912 468175 359038 157645 -12113 -114224 -148142 -144673
35575 -144673 -187072 -309026 -382518 -248753 25925 177064 70327 -143977 -267404 -289004
35565 -289004 -288188 -258678 -178368 -140469 -250508 -463388 -659404 -798678 -862813 -761399 -491359
35554 -491359 -283094 -340106 -501502 -446053 -198795 -104491 -264010 -361148 -182744 37952
35544 37952 19342 -124859 -119442 36705 184678 353438 624221 785758 551091 94682
35534 94682 -49021 294178 689940 709759 464214 319096 356534 388342 326624 256494 219064
35523 219064 168250 124140 172941 306704 415176 447153 450910 445905 382966 263294 182516
35512 182516 197060 226517 159198 10986 -90916 -73319 -6042 -4585 -88147 -185982 -267570
35501 -267570 -386547 -561261 -687371 -650406 -484434 -324036 -212622 -59443 195643 461412
35491 461412 577629 469572 206115 -50568 -156534 -102248 -10477 26885 62644 165466
35481 165466 248499 174079 -10011 -122782 -133679 -180506 -266759 -191339 94885 296968 151096
35470 151096 -172232 -287511 -124179 20085 -65861 -243849 -268803 -101991 103831 202981
35460 202981 158733 34292 -53809 -35157 27043 15678 -52640 -14518 216665 505979 652737
35449 652737 617869 499913 345780 127870 -93903 -154549 -17547 102904 6772 -174933
35439 -174933 -124589 199660 465366 416213 212630 155240 238831 222655 50970 -71318
35429 -71318 -19908 82137 90596 27551 -19352 -4273 124398 390968 645236 642212 361757
35418 361757 73347 -7221 57695 137728 249829 413026 491831 390114 261020 322148
35408 322148 555602 755382 779219 615383 319819 34068 -66878 -2531 -19091 -226698
35398 -226698 -379553 -235436 43841 130810 22438 -38377 -29940 -162093 -435080 -567879
35388 -567879 -435932 -242944 -147266 -31516 196971 357118 262437 33490 -89127 -106483
35378 -106483 -210062 -451670 -680627 -781977 -782124 -702691 -496973 -220954 -121944 -380263
35368 -380263 -792521 -906112 -555525 -107093 -3515 -187335 -235956 -19722 121704 -51152
35358 -51152 -289323 -268376 -97189 -87417 -213300 -178946 62044 223235 131695 -44471 -62170
35347 -62170 126523 383843 473774 188402 -378527 -748234 -540462 -10802 213708 -66342
35337 -66342 -433952 -496128 -321044 -118987 115627 410397 578582 466798 237230 140845
35327 140845 156391 88723 -93787 -246687 -299853 -327142 -404846 -536889 -675759 -721697 -576132
35316 -576132 -288095 -58238 -2837 -10194 69074 193473 216581 121912 37455 47836 96718
35305 96718 75821 -42068 -162904 -166309 -56256 36193 54843 120448 298467 377827 113642
35294 113642 -357080 -612289 -475976 -188768 -4405 95153 178402 148748 -61695 -298274
35284 -298274 -385154 -366628 -369422 -358052 -208733 58995 277154 313595 182771 28934 22150
35273 22150 174943 273345 137214 -83297 -90682 97188 156971 -28024 -196024 -161411 -109685
35262 -109685 -255433 -503931 -671165 -772048 -851757 -782439 -499957 -235174 -232524 -404203
35252 -404203 -511925 -518935 -508534 -431919 -224653 -36564 -63824 -253030 -410390 -483736 -507356
35241 -507356 -422259 -217037 -95551 -204791 -323587 -145982 216084 350089 128158 -137603
35231 -137603 -136426 98699 303969 240771 -141993 -627561 -869256 -767326 -598704 -605240
35221 -605240 -638900 -463321 -201657 -138862 -237390 -250673 -213820 -373256 -649324 -633942 -216904
35210 -216904 181316 150490 -235262 -607778 -711620 -524564 -214802 -60280 -187180 -341050
35200 -341050 -155715 324142 662867 612307 368458 186654 67350 -52745 -110972 -102348
35190 -102348 -197825 -479357 -745913 -762350 -560799 -362948 -329206 -468669 -654845 -672699
35180 -672699 -412495 -57648 101145 54790 54172 189376 278227 228850 190391 226304 162208
35169 162208 -65806 -208845 -63390 222112 407321 480809 506309 405552 155186 -28946
35159 -28946 5584 52251 -146480 -457770 -540282 -345149 -123012 -25965 -14725 -89734 -288848
35148 -288848 -481220 -475950 -341705 -325987 -441814 -437782 -228174 -42362 -41388 -81630 -25219
35137 -25219 -22276 -246858 -534269 -555516 -276674 3888 64407 -16543 -84349 -149178 -283103
35126 -283103 -419752 -429431 -340925 -310922 -356338 -291754 -22179 253626 292478 161354 133014
35115 133014 254404 255926 -45172 -461979 -682710 -634018 -459407 -290965 -227607 -404658
35105 -404658 -826289 -1175170 -1062274 -514674 9010 161287 48214 -69542 -166824 -323808
35095 -323808 -396807 -152400 301654 541252 364636 44421 -87400 -62389 -87044 -145036
35085 -145036 -73061 88690 138187 62009 28825 32305 -109231 -324078 -246159 195909 505869
35074 505869 260186 -243592 -376764 -58538 196275 73597 -141081 -67354 235444 436468
35064 436468 383056 172624 -54532 -197713 -183365 -46022 44222 -24418 -134033 -83023
35054 -83023 130547 290407 230307 33280 -65572 67127 332704 509877 468796 262287
35044 262287 31923 -119283 -163384 -141090 -150250 -256104 -372565 -333121 -131274 40880
35034 40880 77713 121065 284673 375167 124762 -376357 -731574 -716415 -494149 -341698
35024 -341698 -354792 -456817 -528786 -482792 -332795 -214251 -227331 -281159 -219259 -62589 22358
35013 22358 -33016 -141297 -212962 -221056 -161369 -97260 -161819 -341474 -374930 -98181 235720
35002 235720 275472 96830 49345 158798 120251 -106671 -171204 79884 326144 276598
34992 276598 67506 -54520 -95519 -130290 -87476 26430 -8172 -266454 -463579 -365281
34982 -365281 -143650 -50353 -20370 86383 132185 -40269 -240695 -222008 -129698 -234313
34972 -234313 -396139 -273258 57022 199095 118838 182613 455549 502585 94779 -343063
34962 -343063 -298396 126918 393725 206919 -252070 -632900 -710398 -462767 -77254 156371
34952 156371 118274 3956 91978 413933 752311 901788 821189 589170 347278 256896
34942 256896 366068 503094 426852 122955 -153237 -179491 -12064 144054 203016 206948
34932 206948 148470 -20978 -210245 -228028 -69405 39024 -13762 -50732 47482 64373 -193434
34921 -193434 -451777 -292390 152156 290565 -74072 -440386 -348843 -15583 70544 -139689
34911 -139689 -312440 -288260 -206894 -184356 -201003 -256887 -352236 -359412 -180094 18888 -917
34900 -917 -161599 -168984 10065 86330 -91281 -326952 -429355 -473650 -556216 -562722 -408638
34889 -408638 -296155 -448725 -719464 -770010 -592452 -528834 -709839 -787084 -423681 163130
34879 163130 429594 192830 -194380 -369364 -376249 -440634 -580972 -671373 -734058 -886878
34869 -886878 -1040984 -929027 -504167 -102799 -81321 -397070 -658718 -549074 -134995 220417
34859 220417 223133 -73205 -363558 -445555 -390312 -351335 -357341 -379952 -442156 -511896 -437636
34848 -437636 -174345 62751 79246 2685 62708 202723 201455 82373 78252 233024 346704
34837 346704 291024 102986 -173148 -439242 -433177 -22333 470955 622828 508390 525287
34827 525287 709292 741783 606066 662186 1007515 1315936 1407382 1446592 1502686 1478246 1545076
34816 1545076 2023941 2742662 3197400 3457714 4148164 5389631 6618105 7664099 9078026
34807 9078026 11141082 13631721 16892648 21869448 28704274 36937628 47729716 63377196
34799 63377196 82396586 96937485 98541167 86621270 68882107 53286511 42015770
34792 42015770 33434042 26602931 21775720 18460683 15544812 12836081 10865855 9537263
34784 9537263 8243647 6981790 6195456 5754601 5103235 4237920 3633197 3346254 3027850
34775 3027850 2688139 2642840 2773442 2610006 2142691 1846943 1866822 1828736 1553819 1350613
34765 1350613 1435287 1559479 1420566 1084597 828877 807675 962353 1075438 918670 535186
34755 535186 303653 509581 957718 1239828 1245007 1134254 970688 713644 468507 396734
34745 396734 443786 454731 458279 527128 498877 222832 -25858 168433 682787 918751 613154
34734 613154 172907 77347 310893 551431 607641 474040 202555 -68704 -132803 47733
34724 47733 233060 185818 -28630 -143170 -20521 222936 382182 363278 228844 108346
34714 108346 92922 204941 413073 613792 639157 410563 96710 -22881 104707 247440
34704 247440 215063 73011 -43559 -130992 -208078 -195572 -64564 57277 86549 125319 235618
34693 235618 260041 77086 -140444 -165692 -60508 -10101 40542 262971 541953 546455 219185
34682 219185 -104871 -133257 66689 252774 309364 284250 276673 362616 532048 665817 655057
34671 655057 539456 440003 374319 235112 -54426 -427114 -691058 -646026 -277930 126332
34661 126332 203128 -70494 -333827 -300466 -74117 100694 171579 183932 86708 -118160
34651 -118160 -219890 -68594 145934 159694 41726 47254 189604 272468 252120 240115 210314
34640 210314 35067 -217359 -338124 -312233 -289898 -244453 4874 402942 621253 489039
34630 489039 189549 -44632 -181146 -264974 -283945 -240201 -172140 -64686 92917 174565
34620 174565 49386 -175550 -270889 -216965 -179344 -190539 -129636 3651 80143 90721 117736
34609 117736 90189 -114273 -357347 -382809 -242147 -191855 -203571 -38857 192865 102511
34599 102511 -263519 -369353 -46670 196050 24754 -151539 107735 523953 593873 408028
34589 408028 384065 507710 462943 295124 309278 430632 289056 -89862 -266222 -103223
34579 -103223 32495 -113512 -347333 -438185 -439399 -446014 -403650 -306174 -250316 -175519 102927
34568 102927 477691 540486 167782 -236356 -298404 -154686 -131525 -242749 -287788 -214097
34558 -214097 -95973 64166 251401 318483 195642 67360 109548 211646 194027 124163
34548 124163 147978 177172 53456 -112762 -97467 46847 94283 55427 123435 265208 260108
34537 260108 147236 224293 531309 733049 642625 491302 507945 574858 510458 385768
34527 385768 328571 286202 215176 239063 372163 363025 100701 -96309 60020 329428 309626
34516 309626 91869 80940 294411 361572 192178 113022 254422 309117 93504 -95257
34506 -95257 41262 308512 312427 9583 -324112 -501968 -538803 -476051 -332149 -161302
34496 -161302 6117 210554 429247 505548 346634 87524 -71592 -94014 -60993 -10138
34486 -10138 61326 131431 192982 262494 293997 232244 198549 396137 724573 758612 312595
34475 312595 -217724 -340734 -97620 92679 52758 -39223 -64612 -118806 -235825 -285337
34465 -285337 -222059 -181271 -237277 -277622 -208208 -106156 -76544 -102641 -128186 -172668 -275996
34454 -275996 -400197 -448999 -351997 -126717 96073 141094 -36406 -268650 -351095 -274242
34444 -274242 -199106 -235666 -332597 -360252 -234873 -3754 141374 22510 -283497 -478624
34434 -478624 -415477 -293474 -346178 -496824 -537344 -509579 -619624 -828303 -833561 -503434 -76256
34423 -76256 151256 143268 54367 5830 21529 62272 39425 -123855 -387611 -606591 -669626
34412 -669626 -586220 -453260 -387428 -446544 -553505 -555750 -423255 -299670 -283726 -286649 -216675
34401 -216675 -157296 -205343 -275538 -254642 -211334 -238333 -227778 -59816 115913 87825 -29304
34390 -29304 52479 314340 459289 397337 324048 289384 91507 -283586 -488257 -274811
34380 -274811 143486 378823 297137 13467 -312229 -507764 -419283 -92415 211203 300205
34370 300205 222509 84780 -93597 -248305 -216838 25013 247181 238512 57768 -103033
34360 -103033 -155020 -108001 2702 72697 -17244 -186368 -169414 125512 450383 545313 456309
34349 456309 373057 324475 219063 50474 -117620 -263382 -352318 -292322 -100953 3203
34339 3203 -143879 -389285 -423884 -149516 246750 523169 566688 408300 180123 35356
34329 35356 40046 159033 332645 473684 428231 128268 -206277 -243199 27587 269700
34319 269700 288607 278427 450868 695336 807330 808655 800469 706639 431650 118187 -13794
34308 -13794 32049 110199 178205 232486 155077 -107443 -343094 -335788 -214721 -248651 -399410
34297 -399410 -414122 -286174 -246602 -301225 -167814 237420 598488 631015 429842 223023
34287 223023 34287 -205912 -414616 -460442 -403472 -418946 -533049 -606603 -557357 -452579
34277 -452579 -378719 -335286 -279203 -192870 -85371 15680 56003 -10384 -155361 -287544 -351717
34266 -351717 -371450 -360454 -259936 -51899 118255 84752 -63334 -35950 238046 428951
34256 428951 216066 -263774 -597527 -621846 -509451 -395393 -225347 3596 150210 162827
34246 162827 159191 190397 160902 59278 17087 57306 63026 89820 370437 836132 989529
34235 989529 538831 -122254 -382800 -139486 251760 518951 606643 454170 62580 -298145
34225 -298145 -335500 -156231 -101705 -207250 -193262 14851 153738 80413 -3682 75729 181232
34214 181232 127650 -17905 -96901 -134405 -245197 -377727 -353772 -141345 59121 46324
34204 46324 -123246 -179789 19792 259867 211664 -94124 -250536 -18791 342079 466967
34194 466967 379024 325679 309663 138194 -150595 -284646 -185143 -63740 -52737 -43371 45235
34183 45235 121989 127305 117081 69724 -116420 -341242 -309616 34370 346219 335769 149168
34172 149168 88852 159846 151954 38213 11433 149365 269286 167116 -121459 -351584
34162 -351584 -321103 -76401 141506 179323 146486 217114 328828 272328 72008 24716 262064
34151 262064 508361 451102 169828 -30507 -89588 -223948 -516188 -740121 -676416 -407545
34141 -407545 -175880 -84246 -81930 -149733 -303839 -429974 -323456 19072 312706 326837
34131 326837 187290 164602 274903 328481 303456 364103 491914 434886 139559 -81600
34121 -81600 3232 213475 290393 292284 382341 464827 356976 131992 -43231 -233257 -531927
34110 -531927 -708014 -488232 -82417 47968 -101969 -106884 134485 214051 -70541 -328271
34100 -328271 -169915 216321 394482 273608 57986 -147905 -359918 -495712 -430965 -212312
34090 -212312 -25323 -5447 -174429 -441130 -585609 -414000 -29356 229235 209383 103595
34080 103595 94287 96139 498 -84612 -50643 -29079 -182061 -414076 -506320 -404855 -199074
34069 -199074 37149 215830 214463 59876 -39367 -9890 -53789 -279532 -437565 -291342
34059 -291342 -27947 24932 -93567 -120236 -78409 -223352 -517761 -593643 -320608 -49094
34049 -49094 -126956 -437578 -603662 -480891 -271012 -221295 -343065 -423413 -270063 64462
34039 64462 327160 339584 161431 -37014 -147012 -118562 49828 208904 114647 -252025
34029 -252025 -569824 -566102 -376912 -298852 -320392 -187977 128136 340900 242250 -59658
34019 -59658 -348769 -531271 -583763 -449839 -106664 330337 633109 607597 280900 -40113
34009 -40113 -33959 243363 403355 260895 89121 158278 293297 197975 -13116 -12701 157671
33998 157671 157907 -59675 -197373 -161191 -186893 -328697 -291519 48686 373849 398527 254100
33987 254100 159934 56620 -148410 -277498 -158323 27578 1903 -181168 -273253 -245744
33977 -245744 -254708 -316782 -332189 -340696 -450042 -572039 -525331 -359159 -283514 -302573 -225046
33966 -225046 -58805 -79782 -404022 -744590 -743044 -382283 49184 280288 244748 43345
33956 43345 -184430 -381616 -584398 -782752 -841647 -675348 -429780 -317813 -315833 -232600
33946 -232600 -60551 -1049 -99239 -137830 -17404 33127 -165447 -386562 -309147 -39672
33936 -39672 14189 -239515 -422680 -236871 112441 220036 27096 -155952 -96125 106820
33926 106820 232569 239953 260138 371176 487267 473105 302787 80376 -63611 -71911 15665
33915 15665 98596 78979 -75519 -309616 -519335 -611667 -540020 -327848 -84592 49516
33905 49516 34408 -19697 7017 86616 109313 71057 70013 121190 127717 73815 80662 184251
33893 184251 215997 34539 -252685 -439922 -472980 -402404 -237732 -50316 -65212 -367452
33883 -367452 -633698 -505758 -168110 -136286 -451930 -573369 -225993 135761 39382 -261267
33873 -261267 -214149 153707 322010 98855 -178010 -245835 -224448 -239606 -183110 -2728
33863 -2728 132583 130112 129213 197383 169080 -28374 -176337 -116994 -51392 -228721 -538484
33852 -538484 -680828 -597241 -475778 -434567 -433733 -419612 -351278 -161523 125994 329072 326239
33841 326239 233290 191915 139088 9647 -8017 263456 589630 563718 214415 -13684
33831 -13684 67767 129077 -127144 -506891 -644825 -514184 -345827 -223717 -56546 132542
33821 132542 168989 207 -188929 -192254 -10203 169782 157879 -71871 -342785 -414172
33811 -414172 -209773 105079 306884 339899 322965 378090 502978 580152 479165 200732
33801 200732 -49951 -15450 324722 696574 842328 797494 742584 678675 451074 72818
33791 72818 -205082 -219570 -100021 -26611 47951 254505 501161 542873 335942 108665
33781 108665 44696 85696 110196 119990 139251 95794 -43945 -147531 -92806 25235 41668
33770 41668 -5465 49240 203028 284318 230214 142231 60402 -80907 -237510 -252584 -154020
33759 -154020 -198121 -477200 -716836 -644212 -358574 -138177 -66090 -74696 -184408 -412150
33749 -412150 -563994 -437139 -180426 -143813 -368267 -530536 -444789 -314651 -361606 -471112
33739 -471112 -411083 -224238 -168945 -337516 -536541 -561495 -446494 -371318 -389789 -358088 -171032
33728 -171032 20372 -26801 -270591 -371903 -160511 86881 31610 -228994 -325847 -180130
33718 -180130 -69733 -149266 -254791 -258372 -273109 -351762 -295575 3944 279384 219660 -80161
33707 -80161 -280565 -293335 -324395 -469644 -555883 -428329 -180907 -20743 -35418 -151522
33697 -151522 -237635 -223385 -173899 -221576 -362899 -402394 -216289 12841 3493 -225376 -367987
33686 -367987 -252225 -37205 63415 51638 28268 -25062 -189000 -427407 -612892 -683315
33676 -683315 -660049 -558580 -398005 -268595 -265904 -348049 -354566 -192578 61420 264142 352998
33665 352998 366710 358321 318100 185208 -49765 -255570 -240896 14701 263489 224834 -91368
33654 -91368 -391949 -432575 -238608 16915 218961 325591 303108 169448 33454 -26930
33644 -26930 -76135 -196841 -309961 -269611 -116001 -60040 -182651 -309814 -259150 -74511
33634 -74511 80444 146293 165125 139880 39071 -89185 -135558 -74332 -7763 -49977 -211623
33623 -211623 -392424 -450600 -305134 -16365 254567 398053 429899 387044 230877 -63022
33613 -63022 -377359 -527894 -461390 -299921 -189460 -167385 -175646 -148805 -84807 -52904 -111214
33602 -111214 -210747 -246035 -216776 -231311 -301167 -277086 -99728 36753 -49039 -219679 -215987
33591 -215987 -82385 -105801 -329744 -444043 -263061 -30352 -56384 -264184 -332697 -164707
33581 -164707 34104 89430 37010 -48958 -202245 -451253 -683325 -731392 -560523 -304403
33571 -304403 -126660 -79744 -94750 -81973 -27675 -56 -74987 -249352 -402994 -366681 -107652
33560 -107652 136085 33331 -424264 -793896 -649479 -125490 227232 138183 -85494 -62136
33550 -62136 117797 83162 -228201 -471089 -393063 -182632 -200121 -503140 -791252 -791024 -569876
33539 -569876 -411522 -440646 -481616 -326627 -37604 146099 146515 109466 112329 28271 -201889
33528 -201889 -363641 -246788 -2825 33480 -168731 -305883 -226222 -157602 -313563 -521315
33518 -521315 -479504 -235791 -122974 -257472 -382753 -274962 -61957 2815 -96951 -195196
33508 -195196 -247311 -353387 -503841 -519723 -302092 16065 234120 274791 154068 -100318
33498 -100318 -405981 -612896 -634851 -510169 -269830 112029 530592 692444 454672 109808
33488 109808 87640 414860 703996 667270 404438 155556 5171 -89259 -169491 -272369
33478 -272369 -411393 -507241 -478889 -417610 -473431 -548972 -371864 39764 274108 64812
33468 64812 -322290 -472405 -375044 -318197 -395790 -435901 -336500 -170133 21294 267544 503460
33457 503460 601923 592372 635727 767012 862509 867149 844566 795610 658546 513722 535184
33446 535184 679995 695164 547357 574663 1011061 1564889 1716084 1328548 758632 421408
33436 421408 428738 605530 689538 527904 208606 -13880 -14304 39953 -68265 -285425 -383162
33425 -383162 -322491 -302481 -420465 -501075 -369684 -129409 -9675 -37124 -37413 52903 51296
33414 51296 -217121 -633978 -874790 -766576 -459826 -221343 -154779 -200792 -320272 -515962
33404 -515962 -685337 -646695 -400843 -207681 -253430 -357656 -204540 196893 506104 509936
33394 509936 368638 338318 444145 537388 512851 341091 30964 -288314 -378851 -171960
33384 -171960 61370 13715 -257841 -443896 -437115 -422845 -519806 -599925 -537953 -404014 -297193
33373 -297193 -185213 -28684 110846 201600 303191 384154 284526 12064 -146853 -23834
33363 -23834 132652 19983 -240382 -306749 -158968 -69799 -115767 -114563 -34579 -48660 -125603
33352 -125603 1603 323689 431861 130735 -200649 -149118 149218 292008 203740 80638
33342 80638 -29791 -183230 -233182 -11894 262365 194716 -188436 -471733 -488110 -474481
33332 -474481 -530184 -420969 -112904 -13417 -345542 -677779 -504072 -10003 212445 35970
33322 35970 -124567 -41072 51672 -10259 -10014 196430 315391 34024 -450393 -662013 -466241
33311 -466241 -151156 18629 30504 -47929 -169306 -217187 -83562 116447 149253 31784
33301 31784 33413 227229 336169 192527 56734 205326 432535 323107 -92562 -338325
33291 -338325 -150607 204547 347538 226332 24384 -124883 -179600 -134614 -81005 -180347
33281 -180347 -443043 -646574 -588024 -315051 -25644 134558 106422 -78511 -227303 -112976
33271 -112976 183094 256424 -95372 -521671 -554850 -253701 -94577 -280066 -491158 -378353
33261 -378353 -22314 210689 94502 -273254 -592360 -611479 -361792 -148620 -196329 -337978
33251 -337978 -233024 137468 436336 461092 392870 430792 434378 158209 -310303 -603704
33241 -603704 -529383 -273174 -131822 -183583 -268670 -214818 -30108 119104 111455 18188 -9786
33230 -9786 25153 -33469 -238945 -416983 -378464 -151985 88557 234725 272145 182399 -37143
33219 -37143 -280997 -393062 -333469 -211171 -148541 -171946 -219243 -194829 -43447 162877 241749
33208 241749 85628 -189154 -359022 -338944 -224416 -113965 -15638 53670 12780 -159106
33198 -159106 -331149 -354939 -251852 -180438 -230409 -322038 -312675 -145370 109690 298412 258627
33187 258627 -61289 -499885 -760309 -682758 -420985 -257708 -250909 -180977 109446 445639
33177 445639 500661 184449 -256939 -504725 -440041 -184839 28965 49225 -46857 -26757
33167 -26757 176333 295854 66508 -330529 -427476 -111168 198515 151492 -50277 -25652
33157 -25652 180091 220310 37068 -80573 -11262 22280 -126843 -289268 -304396 -273336 -302870
33146 -302870 -285311 -166066 -167663 -449108 -743472 -675214 -316865 -89986 -179569 -377398
33136 -377398 -470010 -443701 -306733 -56758 139606 91038 -31172 162415 629320 815466
33126 815466 449157 -2165 -2570 293898 387846 244099 230292 413015 485627 379188 396774
33115 396774 636368 768390 577394 320248 316583 511591 675458 750388 770109 697491
33105 697491 575857 591088 738762 683871 240326 -244697 -325482 -89685 22738 -96885
33095 -96885 -143926 26827 165097 53620 -161341 -216141 -74635 110264 214305 214364 168068
33084 168068 184656 302304 375469 228800 -63049 -224173 -146678 -32824 -95144 -271729
33074 -271729 -335159 -170917 132150 380516 416670 251062 82741 96897 238477 296944
33064 296944 195808 46204 -68527 -162805 -194882 -78785 89635 64615 -177317 -330352
33054 -330352 -180757 80241 159368 81277 60143 98495 3964 -247393 -432672 -383146 -161896
33043 -161896 76412 227707 225505 58731 -155952 -257689 -235991 -231934 -332232 -476458
33033 -476458 -568150 -546620 -353422 6176 342199 401963 185504 -21919 -18565 77123 73019
33022 73019 8591 23054 51282 -93816 -371136 -498061 -335758 -75563 48185 46454 50297
33011 50297 59049 -4030 -84002 -49696 72031 116114 53534 56338 216321 367615 322074
33000 322074 171350 191401 474070 789450 839911 572080 208112 7134 12142 24403
32990 24403 -158381 -484501 -686479 -594205 -328349 -131031 -94066 -145198 -220111 -306453 -350012
32979 -350012 -275588 -136510 -122501 -346838 -682981 -868786 -759085 -463923 -246582 -261267
32969 -261267 -375534 -314741 -25747 204824 108869 -177881 -274197 -67963 146762 101358
32959 101358 -87038 -126588 17357 87118 -102060 -409378 -520137 -287932 106187 325625
32949 325625 205144 -103004 -317138 -314306 -181738 -47009 23380 -14969 -165314 -299900
32939 -299900 -239244 11923 238715 299452 292503 334245 323896 112517 -189683 -301801 -166288
32928 -166288 -50555 -188094 -471378 -606004 -472356 -214150 -12605 98393 166674 175877
32918 175877 64091 -130301 -248990 -203853 -124617 -213030 -455592 -592683 -426167 -79102
32908 -79102 131060 42670 -204352 -368371 -379253 -368960 -454625 -560588 -520724 -340103 -235046
32897 -235046 -332015 -432295 -249141 150765 358155 143780 -222444 -318941 -97795 123791
32887 123791 113936 -43128 -156039 -168020 -137899 -127389 -173707 -264997 -293000 -144016 109619
32876 109619 239053 160342 67211 138761 252090 175044 -54091 -184601 -155696 -157970 -246818
32865 -246818 -200363 78426 294374 157089 -153432 -241418 -98147 -81838 -312999 -476930
32855 -476930 -333649 -84380 -39611 -182530 -284355 -262812 -205159 -175540 -195117 -286768 -367168
32844 -367168 -247447 66559 248508 69571 -222953 -248047 -79639 -120774 -436791 -621425
32834 -621425 -405107 -36364 102743 -21558 -191928 -306167 -427999 -587142 -712161 -722377
32824 -722377 -590349 -358847 -140943 -30275 16076 113908 255826 293978 145256 -100516
32814 -100516 -302984 -390100 -339426 -161603 74430 295662 488043 604982 494539 102973
32804 102973 -313687 -420002 -220589 -6848 84250 160639 230643 135637 -86375 -139181
32794 -139181 66779 227882 132622 9915 128427 333662 303412 52398 -146623 -196000
32784 -196000 -216151 -266852 -317494 -409561 -574440 -660332 -504681 -222181 -69254 -75216 -64311
32773 -64311 -1875 -39370 -200610 -278701 -112099 217845 514082 645305 581890 393194
32763 393194 230839 197403 225337 183485 73960 6679 10140 -3395 -94941 -226261 -319156
32752 -319156 -316092 -221966 -136985 -161919 -216453 -94350 203306 364704 162210 -203788 -359177
32741 -359177 -228162 -30843 79595 123062 102602 -22859 -170986 -162714 46026 306153
32731 306153 449718 402529 166562 -171034 -447473 -556233 -517347 -353326 -46698 272245
32721 272245 315103 13495 -300541 -338509 -266852 -372688 -538980 -454226 -185273 -73042
32711 -73042 -128758 -28906 266772 382419 126870 -205302 -296129 -193263 -63700 91811
32701 91811 270456 308261 107355 -198680 -463458 -686445 -831943 -759953 -493687 -294557
32691 -294557 -300641 -337776 -251203 -154237 -155371 -112754 103576 349126 452360 490688 547877
32680 547877 427535 -48890 -614729 -798593 -540734 -250098 -250262 -443710 -555068 -468833
32670 -468833 -256450 -41137 79053 62537 -66763 -255372 -432166 -478376 -304613 -23991
32660 -23991 89292 -69823 -273156 -263220 -99072 -24009 -87004 -110636 -1911 118212 133351
32649 133351 117652 221592 448660 612488 508723 124202 -323116 -579100 -593485 -531745
32639 -531745 -563538 -704067 -847133 -865138 -691948 -415744 -271262 -404962 -660737 -750661
32629 -750661 -616280 -429973 -264177 -25817 246941 330184 178168 55118 127286 185291
32619 185291 -1509 -278892 -328504 -144142 -14350 -105456 -287919 -342608 -186428 62902
32609 62902 163930 2 -200057 -91707 258886 369128 20999 -388167 -440098 -295150
32599 -295150 -314306 -396381 -212635 98005 74132 -267860 -382771 -45271 303249 258139
32589 258139 18567 -25733 125180 237670 266674 277100 177678 -115422 -401145 -407130 -190066
32578 -190066 -37453 -41105 -44944 24343 54036 -10298 -60017 -19186 45140 66994 74009 80540
32566 80540 42429 -17870 2935 88056 42237 -221503 -462574 -381434 -50507 155223 84766
32555 84766 26082 261058 608355 648955 310366 -51084 -156709 -115979 -130156 -142625 4991
32544 4991 230962 281965 89355 -161282 -304715 -347041 -338435 -292390 -273338 -377018 -546102
32533 -546102 -575511 -407405 -262913 -334288 -482061 -437318 -221585 -124541 -268160 -447235
32523 -447235 -487051 -516618 -705976 -925464 -930318 -771329 -701877 -701308 -464606 26694 305525
32512 305525 55962 -354279 -352402 22438 220927 26475 -185792 -106117 54298 -15356
32502 -15356 -210915 -227073 -57452 32905 -77760 -240453 -271214 -126620 110383 279969
32492 279969 241197 30864 -150602 -196395 -214963 -306801 -390079 -381587 -369042 -428629 -450382
32481 -450382 -356272 -318546 -502768 -736768 -727078 -500210 -315304 -207978 27272 392210
32471 392210 572630 373690 -5938 -261591 -328989 -317265 -280321 -206386 -124459 -90598 -110176
32460 -110176 -131637 -89376 33909 131881 25666 -295639 -557811 -495026 -216287 -80473
32450 -80473 -218106 -391951 -361521 -173441 -17288 24387 -15995 -97080 -188145 -266790 -340292
32439 -340292 -389423 -302502 -500 369035 521951 359211 67593 -121187 -136815 -34582
32429 -34582 78448 60047 -151375 -404894 -490500 -444610 -503451 -722376 -884016 -864335 -826550
32418 -826550 -897020 -892061 -601016 -176072 25576 -77306 -200490 -90093 165061 262276
32408 262276 38724 -335816 -506291 -301880 50997 175363 -1506 -191126 -171608 -64803
32398 -64803 -70113 -130122 -74059 43050 -629 -242282 -472836 -530894 -461164 -354409 -212041
32387 -212041 -32686 105118 119767 6220 -178785 -318528 -245728 87931 438430 468010
32377 468010 192814 20420 202329 464784 413064 121208 -4963 146588 296283 307614
32367 307614 385569 595870 615143 254129 -124555 -99669 168892 239024 112829 139970
32357 139970 318265 284615 7756 -119394 12770 44616 -134771 -121163 231309 405377
32347 405377 64675 -271149 -8555 526187 582435 137442 -205711 -253294 -353870 -577519
32337 -577519 -563855 -253706 -38538 -37626 103426 512441 821570 808215 701400 627118 366543
32326 366543 -65014 -233188 -20388 82687 -163010 -229895 284990 836316 687459 54073
32316 54073 -261699 -90464 28366 -146195 -238914 10565 351647 498721 489195 412852
32306 412852 212216 -76128 -212062 -43385 308825 613321 685867 428587 -36716 -341030
32296 -341030 -261817 -65188 -132519 -349808 -282251 98288 340662 210450 -23854 -122084
32286 -122084 -220940 -443404 -576886 -420818 -135446 33744 114986 226094 270534 107241
32276 107241 -151446 -285344 -282646 -275313 -278846 -226625 -164384 -184867 -235519 -192515 -76062
32265 -76062 -13743 -31901 -44124 -13227 14149 1192 -63413 -190538 -328896 -358704 -260849
32254 -260849 -188190 -224754 -199010 50561 320351 234088 -214341 -596869 -605329 -405761 -299659
32243 -299659 -276764 -145882 44094 19999 -286244 -587502 -607892 -414726 -267039 -261161
32233 -261161 -262914 -127148 129982 347266 339039 58915 -290233 -403049 -229937 -79739
32223 -79739 -213177 -447487 -399015 -54602 199445 147131 20968 78819 199844 138259
32213 138259 -33249 -24898 222244 450485 421920 144969 -212073 -466367 -504711 -374055
32203 -374055 -265377 -290123 -339506 -295679 -266646 -402510 -569208 -480733 -149790 67327
32193 67327 -59462 -352559 -513682 -492354 -433553 -409304 -368847 -291954 -250049 -303602 -408108
32182 -408108 -455374 -404920 -344137 -367495 -417130 -353462 -192482 -106407 -128505 -69205 139588
32171 139588 250626 74570 -172345 -191993 -79507 -98850 -146299 79271 430429 387240
32161 387240 -129007 -547694 -456428 -138123 -33400 -115036 -143308 -141428 -195757 -120539 196345
32150 196345 378701 31126 -549174 -704183 -388944 -214231 -465393 -688229 -470811 -99053
32140 -99053 -66166 -315103 -398049 -163743 127763 263281 271838 191209 -19054 -274679 -351323
32129 -351323 -187477 -17652 -79950 -308314 -428559 -292989 -27148 125572 42718 -180391
32119 -180391 -336817 -315660 -210714 -213727 -420711 -770893 -1128352 -1346257 -1292591 -953314
32109 -953314 -538173 -343693 -428341 -535654 -439893 -250907 -220790 -340627 -352748 -155344
32099 -155344 41550 39564 -75877 -120622 -101978 -145351 -244845 -292525 -305353 -416235 -629070
32088 -629070 -762761 -691505 -506931 -382218 -374904 -412106 -386979 -238743 -23831 75772 -73079
32077 -73079 -344457 -452228 -315778 -176450 -245289 -386399 -326245 -73039 102736 83949
32067 83949 57091 174184 281814 150820 -159406 -365330 -334843 -204575 -121634 -65587
32057 -65587 2892 -6131 -166371 -348056 -345233 -156230 11919 21947 -39741 -17553 104525
32046 104525 192262 105296 -158906 -423766 -471659 -293070 -136314 -197207 -338242 -297869
32036 -297869 -118063 -98702 -303805 -413455 -200949 107448 161761 -15071 -103773 50674
32026 50674 282924 357313 198101 -83812 -264001 -180091 50918 106204 -127230 -366827
32016 -366827 -327228 -113775 657 2913 43444 69228 -75403 -259874 -180942 126388 276484
32005 276484 97836 -151159 -235122 -255606 -346848 -380769 -211457 19028 61995 -101106
31995 -101106 -300604 -433610 -506272 -525529 -499577 -468707 -429855 -317357 -136450 -3387
31985 -3387 27725 57059 168746 279540 248927 57882 -180134 -312024 -241373 -37963 67781
31974 67781 -60297 -254003 -264666 -131887 -75277 -76630 80949 339840 330317 -75382 -538444
31963 -538444 -740330 -742855 -692582 -550566 -350957 -341273 -556859 -612566 -275292 89352 52750
31952 52750 -199004 -201620 15435 30908 -236666 -447590 -445877 -426811 -479064 -443583 -304501
31941 -304501 -283678 -439232 -558272 -555374 -604195 -754271 -785583 -598547 -412997 -409440 -473836
31930 -473836 -459665 -403373 -311694 -52485 323983 454304 127625 -352530 -554062 -469859
31920 -469859 -399256 -449031 -481589 -459758 -500745 -593747 -564688 -374569 -204852 -165348 -134707
31909 -134707 -12158 57087 -107912 -393165 -490770 -335560 -230844 -426119 -725092 -715338
31899 -715338 -329540 58175 130442 -17215 -132846 -188055 -286986 -367920 -283883 -114541
31889 -114541 -108803 -299457 -427720 -317247 -112949 -52841 -165796 -304740 -371693 -409890
31879 -409890 -518476 -719272 -885915 -835625 -547031 -224243 -57253 -461 94184 224577
31869 224577 279837 242135 163928 35911 -116838 -114196 143019 402644 327413 -23184 -299191
31858 -299191 -402766 -545719 -759490 -775727 -503651 -229075 -176307 -230730 -269098 -397082
31848 -397082 -635643 -726071 -526917 -298986 -298546 -369552 -266182 -120430 -206577 -426599 -433239
31837 -433239 -175931 38622 2540 -179072 -332055 -430247 -543312 -710066 -851017 -765993
31827 -765993 -369364 27465 -40716 -520803 -770054 -423945 44268 32834 -278182 -280530
31817 -280530 52429 179409 -67998 -252311 -124645 -7410 -165423 -347248 -251133 -4154
31807 -4154 136955 189919 235350 134995 -192102 -480806 -465084 -312199 -366764 -610030 -712063
31796 -712063 -535811 -281594 -162161 -184437 -242699 -234896 -105140 80203 148958 48491
31786 48491 -33469 74864 257203 282237 162617 126366 271552 454398 514755 440848 311363
31775 311363 220824 248112 356413 350232 89445 -269690 -412694 -248101 12069 163323
31765 163323 218266 250510 208432 15983 -238914 -362043 -290567 -175772 -193190 -316901
31755 -316901 -343404 -149515 139553 305354 307812 286466 313843 310020 235374 191373 243292
31744 243292 305724 312176 331006 380775 316816 85157 -94951 -38235 88444 44074 -47939
31733 -47939 93407 366565 398061 185116 141548 391100 506383 197815 -176268 -144703
31723 -144703 171863 304551 140136 -55248 -149597 -224299 -224587 288 299455 316506 74410
31712 74410 39472 427164 820403 734803 276141 -58149 -33545 165271 308649 350171
31702 350171 306635 164215 -43305 -215902 -295982 -313143 -313383 -310595 -297340 -249649 -147781
31691 -147781 -34823 -4488 -81615 -172162 -179136 -101274 22141 167277 269466 225666 41033
31680 41033 -131680 -193759 -235605 -370170 -548186 -655442 -669071 -584187 -332193 42401
31670 42401 257829 84617 -319173 -591703 -618769 -562880 -512428 -396567 -239423 -192260
31660 -192260 -257773 -259149 -163359 -173269 -391316 -633074 -703454 -643928 -573614 -488912 -369128
31649 -369128 -300953 -342456 -406278 -401309 -347087 -257388 -97752 38230 -62020 -390636 -614481
31638 -614481 -505295 -265823 -201785 -266001 -202976 1909 119201 47492 -80138 -129243
31628 -129243 -85942 21492 140649 179702 123083 80847 92400 29066 -145592 -220356 -73717
31617 -73717 49909 -91002 -292657 -211479 52609 116896 -52289 -152261 -132456 -238654
31607 -238654 -443280 -393462 -61377 95269 -160473 -480206 -537624 -510347 -616091 -638027
31597 -638027 -357665 -73046 -169307 -452866 -452523 -193721 -116929 -317436 -422419 -244176
31587 -244176 -43356 -30574 -46265 89251 255685 254893 92921 -117572 -309321 -385031 -226728
31576 -226728 66126 164754 -86166 -432194 -548708 -448205 -351997 -306295 -177359 40836
31566 40836 173009 138555 72778 104855 178701 191317 173192 187824 140699 -116632 -492018
31555 -492018 -668604 -513643 -301445 -361546 -630816 -779323 -703960 -611031 -602792 -505177 -224878
31544 -224878 22427 46568 -913 98066 235671 163811 -67967 -197077 -199768 -305415 -548828
31533 -548828 -650082 -439363 -125197 -934 -84662 -178247 -127824 77387 326844 427717
31523 427717 259739 -41899 -202863 -164412 -150182 -307586 -484134 -489075 -390518 -370087 -416833
31512 -416833 -370869 -203688 -68048 -85291 -221105 -363603 -419062 -347645 -198892 -94416
31502 -94416 -93230 -98414 19978 231149 358853 289705 101909 -18410 46960 242084 376473
31491 376473 298043 56311 -140612 -155429 -55709 13067 15320 16445 40885 32733 -52753 -192919
31479 -192919 -338331 -451663 -493240 -420059 -239124 -45258 38463 -19925 -126743 -182456
31469 -182456 -205988 -264979 -301737 -165846 130206 338552 275841 65966 -68394 -124069
31459 -124069 -213414 -258857 -92050 178693 241511 74328 17430 219556 358596 147924
31449 147924 -188392 -276567 -198267 -329248 -686649 -874415 -704457 -467423 -446996 -504550
31439 -504550 -376546 -141570 -100780 -306266 -489631 -452821 -294161 -184650 -111703 26437
31429 26437 188889 215494 52363 -180827 -356825 -455527 -487778 -434157 -331559 -309476 -434323
31418 -434323 -591820 -622089 -501096 -301745 -86754 32541 -127564 -572069 -952843 -914709
31408 -914709 -573291 -359480 -398258 -378713 -107442 167131 156931 -38630 -131496 -41081
31398 -41081 128365 303283 409401 309638 10316 -221017 -164079 67293 237138 308519
31388 308519 345395 304125 179429 145543 254608 216261 -159607 -511464 -363930 134392
31378 134392 410116 311940 206945 243471 130055 -222432 -441041 -333762 -251814 -454508
31368 -454508 -588729 -260647 235618 285555 -156244 -545193 -518186 -235557 13156 124127
31358 124127 63261 -193888 -506050 -631342 -544222 -457731 -464507 -404605 -190242 -12337 -54075
31347 -54075 -192091 -192427 -78236 -69512 -207872 -288745 -215018 -191211 -405654 -664651 -582263
31336 -582263 -119152 305187 323395 42838 -187259 -250927 -284570 -344587 -340986 -274891 -259862
31325 -259862 -272038 -147682 95268 197504 41647 -152695 -179125 -157192 -281347 -454563
31315 -454563 -443616 -283942 -245852 -422429 -595724 -551507 -350886 -228002 -322429 -559970
31305 -559970 -747547 -766190 -672520 -578904 -468105 -247468 21674 139201 67359 7191
31295 7191 67421 80234 -92475 -300051 -376635 -452868 -687016 -859418 -626571 -117275 134093
31284 134093 -95236 -429351 -452743 -243938 -149159 -248753 -297815 -109320 202939 366110
31274 366110 235880 -65466 -271248 -241160 -90331 -11193 -29941 -39146 -17101 -65256 -226645
31263 -226645 -397753 -447148 -340227 -153671 -31561 -70374 -167753 -94104 158420 249057
31253 249057 -70424 -519954 -598283 -257624 67972 94561 -27478 -117136 -244200 -439094
31243 -439094 -491640 -295563 -100193 -128967 -184820 41203 437420 587399 336718 -56284
31233 -56284 -295193 -305523 -147528 69450 170889 45117 -170683 -216535 -54810 80740
31223 80740 15072 -158743 -262466 -279323 -321794 -433455 -510105 -409538 -121764 173149
31213 173149 261579 133064 -14796 -49213 -64311 -178504 -297325 -237310 -5918 210307
31203 210307 282789 205833 -12473 -330745 -577454 -575834 -372758 -175004 -72237 -4272
31193 -4272 30353 -27403 -86906 28942 243369 227565 -124083 -475221 -491932 -293495 -229811
31182 -229811 -366545 -454295 -339132 -160613 -136823 -323077 -598960 -781566 -760136 -605513
31172 -605513 -514536 -580073 -688954 -715586 -691653 -670841 -574657 -350968 -155527 -152978 -234817
31161 -234817 -180288 -19572 38685 -14063 3710 90758 55990 -70591 -6513 276273 407718
31150 407718 202224 5471 141704 355193 230564 -82243 -82703 255108 428052 216433
31140 216433 20267 199077 527973 600193 425572 282531 215099 56794 -166219 -223699
31130 -223699 -62055 103367 112956 32251 -55528 -187162 -340252 -319069 4808 447864
31120 447864 689238 651755 549463 546505 523054 265268 -207578 -623164 -734268 -520558
31110 -520558 -137442 213917 364408 283653 173648 300531 622234 740878 399603 -110367
31100 -110367 -278432 -25514 253939 271271 145554 73287 22595 -93215 -209246 -267829
31090 -267829 -360038 -505369 -494383 -183555 219791 404278 339898 186154 -11498 -239584
31080 -239584 -286759 23929 429786 451311 59382 -245717 -122214 182755 248745 31978
31070 31978 -214481 -337182 -344056 -219578 53064 329851 386631 190445 -43202 -98440
31060 -98440 13777 107201 61390 -27510 27238 224028 313200 105746 -243750 -419495 -361839
31049 -361839 -304338 -394768 -504880 -486717 -409010 -415008 -504223 -586094 -623865 -603637 -479555
31038 -479555 -277104 -145022 -172625 -243802 -200005 -70115 -13260 -100013 -266699 -421837
31028 -421837 -485423 -391351 -174105 -42 2062 -108044 -200304 -266955 -365551 -439504 -367751
31017 -367751 -181914 -77588 -177637 -386872 -500816 -383149 -50126 325979 510145 409726
31007 409726 193141 106868 173009 182519 9404 -200057 -231874 -106076 -56153 -224755 -481768
30996 -481768 -584206 -456521 -243816 -105812 -50160 -10897 -1302 -76102 -178451 -166276 -19552
30985 -19552 103107 79139 -7388 3056 112830 161032 20975 -266978 -543605 -663808
30975 -663808 -597603 -433568 -280301 -175730 -118889 -135002 -211281 -212328 -20953 226957 234587
30964 234587 -58928 -349559 -344221 -102425 134192 288631 422529 479564 310714 -45918
30954 -45918 -317761 -291652 -41301 171500 144015 -115766 -398508 -457574 -238516 60285
30944 60285 201809 141273 -2277 -110312 -107872 46326 255063 248513 -139163 -671488 -890197
30933 -890197 -639294 -244732 -110387 -285803 -526241 -645609 -652774 -586184 -391299 -53161
30923 -53161 229689 167144 -248485 -601001 -457963 93870 516058 471368 194520 87055
30913 87055 168176 170686 32456 -24395 113895 264246 212927 -34744 -329133 -523925 -501857
$$ [...]
##END NTUPLES=NMR SPECTRUM
##END=
