##TITLE=31Pdec_LR-742-RM5
 , 24 sc
 11.11.2021
##JCAMPDX= 6.0         $$ Bruker NMR JCAMP-DX V2.0
##DATA TYPE= NMR SPECTRUM
##DATA CLASS= NTUPLES
##ORIGIN= UXNMR, Bruker Analytische Messtechnik GmbH
##OWNER= root
$$ XWIN-NMR		Version 3.5
$$ Thu Nov 11 10:49:13 2021 Russian Standard Time (UT+4h)  she@DPX200
##.OBSERVE FREQUENCY= 81.013821
##.OBSERVE NUCLEUS= ^31P
##.ACQUISITION MODE= SIMULTANEOUS
##.ACQUISITION SCHEME= undefined
##.AVERAGES= 24
##.DIGITISER RES= 16
##SPECTROMETER/DATA SYSTEM= spect
##.PULSE SEQUENCE= zgpg30
##.SOLVENT NAME= Acetone
##.SHIFT REFERENCE= (INTERNAL, Acetone, 0, 248.564)
##AUDIT TRAIL= $$ (NUMBER, WHEN, WHO, WHERE, WHAT)
$$ ##TITLE= Audit trail, XWIN-NMR		Version 3.5
$$ ##JCAMPDX= 5.01
$$ ##ORIGIN= Bruker BioSpin GmbH
$$ ##OWNER= she
$$ F:/spectra/data/she/nmr/P31/1/pdata/1/auditp.txt
$$ ##AUDIT TRAIL=  $$ (NUMBER, WHEN, WHO, WHERE, WHAT)
(   1,<2021-11-11 10:47:58.34 +0400>,<she>,<DPX200>,
      <created by zg, POWCHK disabled, PULCHK disabled
       configuration hash MD5:
       00 E9 B6 7A A2 85 ED C7 34 08 36 98 17 FE 4E 26
       data hash MD5: 32K
       6E D3 5E 5E D7 38 E7 94 00 2F 90 0D 6A 60 DC 43>)
(   2,<2021-11-11 10:48:06.84 +0400>,<she>,<DPX200>,
      <Start of raw data processing
       efp BC_mod = 2 LB = 1 FT_mod = 6 PKNL = 1 PHC0 = -8826.971 PHC1 = 134.2694 SI = 64K 
       data hash MD5: 64K
       C2 16 84 B2 6D D1 8C B3 80 59 A8 FB 67 15 B6 CF>)
(   3,<2021-11-11 10:48:30.25 +0400>,<she>,<DPX200>,
      <pk PHC0 = 11.28412 PHC1 = -62.00001 
       data hash MD5: 64K
       FB 14 8C C4 09 37 89 B9 13 5B 9B F2 D4 F2 5F A2>)
(   4,<2021-11-11 10:48:37.00 +0400>,<she>,<DPX200>,
      <abs ABSG = 5 
       data hash MD5: 64K
       9D 84 E4 C3 9C 9D 11 02 D9 4C 18 68 5C CD F6 37>)
$$ ##END=
$$ 
$$ hash MD5
$$ 3B 6F 33 AA 3C F0 BC 29 56 D4 43 D2 52 6A AF F8
##$RELAX= 
##$RELAX= 
##$RELAX= 
##$RELAX= 
##$RELAX= 
##$RELAX= 
##$RELAX= 
##$RELAX= 
$$ Bruker specific parameters
$$ --------------------------
##$DU= <F:/spectra>
##$EXPNO= 1
##$NAME= <P31>
##$PROCNO= 1
##$TYPE= <nmr>
##$USER= <she>
##$AMP= (0..31)
100 100 100 100 100 100 100 100 100 100 100 100 100 100 100 100 100 100 
100 100 100 100 100 100 100 100 100 100 100 100 100 100 
##$AQSEQ= 0
##$AQ_mod= 1
##$AUNM= <au_zg>
##$AUTOPOS= <>
##$BF1= 81.014009
##$BF2= 200.13
##$BF3= 200.13
##$BF4= 200.13
##$BF5= 200.13
##$BF6= 200.13
##$BF7= 200.13
##$BF8= 200.13
##$BYTORDA= 1
##$CFDGTYP= 0
##$CFRGTYP= 5
##$CHEMSTR= <none>
##$CNST= (0..31)
1 1 145 1 1 1 1 1 1 1 1 1 1 1 1 1 1 1 1 1 1 1 1 1 1 1 1 1 1 1 1 1 
##$CPDPRG= <waltz16>
##$CPDPRG1= <>
##$CPDPRG2= <waltz16>
##$CPDPRG3= <>
##$CPDPRG4= <mlev>
##$CPDPRG5= <mlev>
##$CPDPRG6= <mlev>
##$CPDPRG7= <mlev>
##$CPDPRG8= <mlev>
##$CPDPRGB= <>
##$CPDPRGT= <>
##$D= (0..31)
0 1 0 0 0 0 0 0 0 0 0 0.03 2e-05 3e-06 0 0 0 0 0 0 0 0 0 0 0 0 0 0 0 0 
0 0 
##$DATE= 1636613277
##$DBL= (0..7)
120 120 120 11 120 120 24 19 
##$DBP= (0..7)
150 150 150 150 150 150 150 150 
##$DBP07= 0
##$DBPNAM0= <>
##$DBPNAM1= <>
$$ [...]
##$SUBNAM3= <"">
##$SUBNAM4= <"">
##$SUBNAM5= <"">
##$SUBNAM6= <"">
##$SUBNAM7= <"">
##$SUBNAM8= <"">
##$SUBNAM9= <"">
##$SW= 501.771253377433
##$SWIBOX= (0..15)
0 1 3 0 0 0 0 0 0 0 0 0 0 0 0 0 
##$SW_h= 40650.406504065
##$TD= 32768
##$TD0= 1
##$TE= 0
##$TE2= 300
##$TE3= 300
##$TEG= 300
##$TL= (0..7)
0 120 53 12 22 120 120 120 
##$TP= (0..7)
150 150 150 150 150 150 150 150 
##$TP07= 0
##$TPNAME0= <>
##$TPNAME1= <>
##$TPNAME2= <>
##$TPNAME3= <>
##$TPNAME4= <>
##$TPNAME5= <>
##$TPNAME6= <>
##$TPNAME7= <>
##$TPOAL= (0..7)
0.5 0.5 0.5 0.5 0.5 0.5 0.5 0.5 
##$TPOFFS= (0..7)
0 0 0 0 0 0 0 0 
##$TUNHIN= 0
##$TUNHOUT= 0
##$TUNXOUT= 0
##$USERA1= <user>
##$USERA2= <user>
##$USERA3= <user>
##$USERA4= <user>
##$USERA5= <user>
##$V9= 5
##$VALIST= <valist>
##$VCLIST= <CCCCCCCCCCCCCCC>
##$VD= 0
##$VDLIST= <DDDDDDDDDDDDDDD>
##$VPLIST= <PPPPPPPPPPPPPPP>
##$VTLIST= <TTTTTTTTTTTTTTT>
##$WBST= 1024
##$WBSW= 4
##$XGAIN= (0..3)
0 0 0 0 
##$XL= 0
##$YL= 0
##$YMAX_a= 14413
##$YMIN_a= -19213
##$ZGOPTNS= <>
##$ZL1= 120
##$ZL2= 120
##$ZL3= 120
##$ZL4= 120
##$ABSF1= 248.5645
##$ABSF2= -253.2056
##$ABSG= 5
##$ABSL= 3
##$ALPHA= 0
##$AQORDER= 0
##$ASSFAC= 0
##$ASSFACI= 0
##$ASSFACX= 0
##$ASSWID= 0
##$AUNMP= <proc_1d>
##$AZFE= 0.1
##$AZFW= 0.5
##$BCFW= 0
##$BC_mod= 2
##$BYTORDP= 0
##$COROFFS= 0
##$CY= -3
##$DATMOD= 1
##$DC= 0
##$DFILT= <>
##$DTYPP= 0
##$F1P= 0
##$F2P= 0
##$FCOR= 1
##$FTSIZE= 65536
##$FT_mod= 6
##$GAMMA= 0
##$GB= 0
##$INTBC= 1
##$INTSCL= 5.30512e-09
##$ISEN= 30
##$LB= 1
##$LEV0= 0
##$LPBIN= 0
##$MAXI= 10000
##$MC2= 0
##$MEAN= 0
##$ME_mod= 0
##$MI= 50
##$NCOEF= 0
##$NC_proc= -5
##$NLEV= 6
##$NOISF1= 182.463
##$NOISF2= 159.3651
##$NSP= 0
##$NTH_PI= 0
##$NZP= 0
##$OFFSET= 248.5645
##$PC= 4
##$PHC0= -8815.687
##$PHC1= 72.26938
##$PH_mod= 1
##$PKNL= yes
##$PPARMOD= 0
##$PSCAL= 0
##$PSIGN= 0
##$REVERSE= no
##$SF= 81.014009
##$SI= 65536
##$SIGF1= 159.3651
##$SIGF2= -187.1042
##$SINO= 113.3802
##$SIOLD= 16384
##$SREGLST= <1H.CDCl3>
##$SSB= 0
##$STSI= 65536
##$STSR= 0
##$SW_p= 40650.406504065
##$SYMM= 0
##$S_DEV= 0
##$TDeff= 32768
##$TDoff= 0
##$TI= <>
##$TILT= no
##$TM1= 0
##$TM2= 0
##$TOPLEV= 0
##$USERP1= <user>
##$USERP2= <user>
##$USERP3= <user>
##$USERP4= <user>
##$USERP5= <user>
##$WDW= 1
##$XDIM= 65536
##$YMAX_p= 407825965
##$YMIN_p= -54277621
$$ End of Bruker specific parameters
$$ ---------------------------------
##NTUPLES= NMR SPECTRUM
##VAR_NAME=  FREQUENCY,     SPECTRUM/REAL,   SPECTRUM/IMAG
##SYMBOL=    X,             R,               I
##VAR_TYPE=  INDEPENDENT,   DEPENDENT,       DEPENDENT
##VAR_FORM=  AFFN,          ASDF,            ASDF
##VAR_DIM=   65536,         65536,           65536
##UNITS=     HZ,            ARBITRARY UNITS, ARBITRARY UNITS
##FACTOR=    0.620285442955139, 1,           1
##FIRST=     20137.2065510759, 0,            0
##LAST=      -20513.1999529892, 0,           0
##MIN=       -20513.1999529892, -54277621,   0
##MAX=       20137.2065510759, 407825965,    0
$$ Real data points
##PAGE= N=1
##DATA TABLE= (X++(R..R)), XYDATA
$$ [...]
41372 -336131 -89057 153891 -6002 -347003 -245478 353667 703283 262795 -517347 -828884
41362 -828884 -567543 -287348 -363194 -704425 -1088847 -1247208 -812713 187231 919533 551683
41352 551683 -520471 -1002696 -388485 453897 629722 350777 265157 378228 288889 -20777
41342 -20777 -323293 -703102 -1284214 -1653675 -1262157 -319150 318869 174768 -384271 -691217
41332 -691217 -409842 304312 897089 764507 -116978 -1013956 -1240036 -964298 -826240 -985559
41322 -985559 -1086490 -981930 -867634 -773139 -552710 -361030 -479050 -637427 -232770 641067
41312 641067 1120492 807843 360055 427713 678079 463622 -68155 -259462 -37026 23826
41302 23826 -327992 -635005 -449051 43704 331825 228830 9710 20229 271603 406958
41292 406958 90226 -546766 -968075 -843069 -436259 -210236 -190343 -8185 469650 874391
41282 874391 795361 283135 -251614 -491931 -408538 -112980 260665 522283 486618 188736
41272 188736 -82784 -101692 36819 112354 114961 154442 130953 -155429 -554190 -632268 -332875
41261 -332875 -148740 -384045 -663606 -568193 -373019 -599528 -1088719 -1180908 -746624 -377791
41251 -377791 -474347 -754100 -854892 -860206 -935760 -916634 -626111 -278145 -210709 -431595 -687117
41240 -687117 -777398 -602887 -140741 416172 742170 798849 897677 1138092 1131568 608010
41230 608010 -30234 -203526 13115 47962 -273132 -504788 -309891 54502 168397 10411
41220 10411 -183928 -382371 -720034 -1072941 -1048786 -560279 -126571 -275451 -757701 -777715
41210 -777715 -82662 627980 644139 168067 -154955 -266389 -589770 -1066181 -1092794 -541382
41200 -541382 -92045 -234356 -563898 -498976 -172099 -87234 -273720 -340987 -154551 43363
41190 43363 65261 -70199 -306201 -531463 -532723 -277393 -81063 -174134 -287432 -29695
41180 -29695 488112 791242 674918 319349 -108068 -553435 -846656 -790523 -500132 -314917
41170 -314917 -345966 -393008 -312330 -194049 -155252 -178877 -169245 -21344 305020 667233 840894
41159 840894 839308 875341 880392 481259 -260643 -587462 -35866 734595 770448 172707 -147987
41148 -147987 123236 399906 291273 141992 274622 439537 330908 65925 -136159 -247380
41138 -247380 -184062 204596 678233 683237 139600 -396136 -601822 -809157 -1229239 -1432608
41128 -1432608 -1101309 -700838 -779902 -1069949 -952659 -468360 -164875 -188915 -227783 -218535
41118 -218535 -420199 -777739 -836579 -408578 151410 445653 415085 135209 -374389 -965890
41108 -965890 -1269119 -987311 -211394 601023 926020 574675 -85425 -457323 -388287 -298192
41098 -298192 -490975 -690459 -568618 -364445 -486667 -764465 -679770 -222406 81004 -21702
41088 -21702 -226911 -254345 -181441 -104839 34049 152132 16882 -311151 -463026 -344198
41078 -344198 -299050 -523308 -759284 -788649 -777434 -851958 -749355 -233018 469371 960294
41068 960294 1124287 1031487 722667 370086 296438 510056 571894 258767 -42034 1291
41058 1291 61265 -244040 -585151 -475178 -242158 -572031 -1244687 -1293005 -486446 297961
41048 297961 427480 316120 477196 665587 565687 544865 941162 1233035 823179 177189
41038 177189 165591 556378 280628 -819653 -1626759 -1375352 -644709 -310989 -397517 -514013
41028 -514013 -654242 -879164 -852342 -442248 -254057 -744299 -1251090 -838598 184038 610646
41018 610646 120390 -331864 -43380 515053 643414 394841 131242 -158349 -521453 -628479
41008 -628479 -314695 -64103 -333479 -776012 -755729 -312938 24414 140502 362958 724447
40998 724447 856502 622574 293701 51685 -192893 -440691 -518166 -427551 -389229 -462026
40988 -462026 -456057 -266729 -1362 220851 324820 218910 -29533 -114414 65878 115021
40978 115021 -250844 -564551 -209109 542098 846782 568501 384583 585813 688490 442383
40968 442383 281835 399097 283849 -276927 -589397 -128703 512206 541254 215023 279724
40958 279724 643296 586444 42034 -303392 -139174 92773 38075 -59975 152540 670354
40948 670354 1256458 1625567 1497854 889162 315176 286656 653079 850277 690264 461908
40938 461908 374559 387583 480668 609335 531428 177031 -16620 274121 558355 196984
40928 196984 -446158 -451833 113962 165257 -708437 -1564471 -1547399 -1054061 -856076 -867930
40918 -867930 -556987 -21082 149514 -189290 -586496 -649813 -393161 -63496 66190 -82831
40908 -82831 -174443 229432 931280 1114408 418727 -446546 -588639 -48538 429573 427047
40898 427047 149103 -102350 -285552 -504195 -811274 -1067272 -945341 -353219 148536 -135551
40888 -135551 -979205 -1339561 -787964 -127167 -156256 -559484 -637147 -449192 -441977 -497896
40878 -497896 -244151 96836 56514 -191877 -172462 -56368 -341622 -784948 -645380 60813
40868 60813 518259 385228 199506 377122 647344 672741 478666 104643 -438195 -737633
40858 -737633 -306513 486445 649631 -5096 -518042 -230950 265677 163003 -337901 -503178
40848 -503178 -226210 -797 -59008 -173284 -179178 -209880 -419805 -717561 -758770 -223609
40838 -223609 692495 1200734 775892 -7283 -100465 589885 1142037 1029454 682610 425936
40828 425936 -95664 -904211 -1125929 -282151 656086 496469 -447006 -874932 -373656 273285
40818 273285 449711 349626 234493 -12257 -366628 -433508 -39607 436927 564401 329180
40808 329180 -12164 -227943 -195048 10519 83762 -178123 -556395 -697350 -618420 -615616
40798 -615616 -787598 -995247 -1159196 -1224878 -989900 -400586 124367 155021 -83010 -48585
40788 -48585 188099 6519 -704546 -1213114 -942442 -271386 37867 -158224 -363064 -220382
40778 -220382 70729 115645 -147670 -391897 -330645 -101383 -83163 -344858 -514566 -298557
40768 -298557 151803 576300 974669 1325048 1273538 589423 -277126 -615352 -332093 67665
40758 67665 263654 348463 352696 162070 -43225 117685 534253 573619 -14444 -650721
40748 -650721 -676075 -154218 354383 480350 238993 -161678 -439046 -394707 -154639 -26135
40738 -26135 -3102 252076 773654 1045935 696725 110832 -24683 410895 901602 966577
40728 966577 605036 146481 -104658 -113647 -139257 -420803 -768838 -684377 -34206 647986
40718 647986 785456 472152 249704 319888 356726 86819 -307281 -487828 -413842 -312639
40708 -312639 -338468 -443167 -534695 -588470 -576423 -442025 -235851 -142391 -228245 -290923 -171715
40697 -171715 -81803 -268548 -453885 -139877 459240 464071 -365427 -1070523 -837936 -267508
40687 -267508 -416493 -1046940 -970194 15411 794849 733875 551390 881931 1135917 638734
40677 638734 -40541 12667 466228 242282 -702424 -1285939 -965257 -399047 -262677 -375495
40667 -375495 -362433 -346821 -500586 -588758 -518057 -766657 -1607682 -2325468 -1969470 -713313
40657 -713313 273643 318391 -68846 -142374 98100 226761 169291 138079 88002 -200092
40647 -200092 -593627 -690366 -452700 -286750 -383511 -435521 -209443 21629 -80396 -391423
40637 -391423 -597251 -706009 -872166 -931110 -606265 -96435 43206 -338470 -765738 -790541
40627 -790541 -527734 -388915 -552554 -859327 -1045884 -955210 -650792 -398209 -417960 -629475
40617 -629475 -758423 -688731 -573325 -610569 -831002 -1070728 -1070660 -705353 -199555 60798 41028
40606 41028 118320 467460 731255 570224 170840 -130019 -313017 -364544 -12697 647167
40596 647167 817775 83182 -698377 -592762 -208165 -810072 -2086963 -2383913 -1296894
40587 -1296894 -372873 -681586 -1271769 -946574 -172349 -4506 -208954 148259 952917
40578 952917 1255961 819572 243789 -148842 -456083 -488665 -498 545623 455543 -80341
40568 -80341 -297139 -125894 -158621 -455497 -454541 -110143 -79644 -588216 -1032060 -958910 -636001
40557 -636001 -399273 -174038 118284 337950 499328 740956 823149 349511 -406634 -655640
40547 -655640 -236115 157041 82988 -105386 -93700 -151526 -457997 -642988 -466642 -294734
40537 -294734 -432029 -600054 -536378 -481428 -554540 -291575 527914 1121172 564568 -847702
40527 -847702 -1821764 -1562094 -514396 337257 456375 11315 -514486 -844001 -1090406
40518 -1090406 -1411957 -1627441 -1464812 -1091377 -939679 -1014478 -912825 -591323 -486559 -712638
40508 -712638 -814505 -588573 -455267 -636017 -650045 -140744 409411 371320 -136255 -613030
40498 -613030 -943411 -1200102 -1158364 -666608 -119650 56944 21953 44791 -105157 -610686
40488 -610686 -947938 -619327 -133207 -304460 -880803 -898843 -246311 219906 126387 63365
40478 63365 409514 688188 466933 45770 -187568 -377818 -736406 -1061497 -1148300 -1154758
40468 -1154758 -1179189 -980894 -498287 -151089 -219521 -365297 -179905 190839 372616 343464
40458 343464 291572 230861 147645 223181 544431 884090 1081857 1292157 1530918 1423332
40448 1423332 847355 376214 504183 830499 707160 373340 589011 1266339 1412672
40439 1412672 603557 -342729 -532729 -132078 161715 202089 318817 540489 590099 508666
40429 508666 617672 830933 614967 -171905 -914996 -1036595 -760496 -679137 -843584 -797543
40419 -797543 -408991 -105195 -168772 -301073 -161082 64120 27711 -120082 45507 440374
40409 440374 458871 -129095 -731999 -682035 -125791 200503 -35017 -366895 -212218 328518
40399 328518 592532 233544 -278835 -249815 248863 348757 -463100 -1482216 -1521440 -423463
40389 -423463 668536 704222 -46075 -479349 -77910 600043 773468 363364 -80643 -133809
40379 -133809 64177 112535 -78435 -183309 50098 395463 429146 124650 -109491 5699
40369 5699 309652 526976 578675 416362 -101018 -862273 -1310124 -996218 -206267 339840
40359 339840 338560 90662 -101810 -287698 -539490 -689686 -607817 -453604 -417241 -401354
40349 -401354 -191215 180473 450871 461541 321142 235115 248248 168112 -225315 -839250
40339 -839250 -1231544 -1084817 -641895 -414932 -505646 -564658 -453624 -485607 -794638 -925863
40329 -925863 -464413 251119 533861 269523 -77530 -251807 -423488 -615201 -524339 -109205
40319 -109205 173946 20057 -261477 -278618 -185456 -348082 -640848 -580139 -89764 325474
40309 325474 263180 -26249 76624 842573 1820444 2166979 1449835 178848 -647595 -638291
40299 -638291 -396906 -623600 -1173182 -1406156 -1193267 -983474 -962942 -795190 -321284 72546
40289 72546 60924 -126807 -166302 -201774 -527220 -966090 -1032398 -633295 -232055 -266793 -635124
40278 -635124 -828147 -509247 47779 168170 -414158 -1056264 -877347 69820 789127 647312
40268 647312 123439 -63994 29016 -13786 -72081 210195 548504 330932 -280189 -441185
40258 -441185 86480 577100 496652 232669 302610 530221 494598 242004 32837 -172159
40248 -172159 -462709 -602069 -404525 -146685 -104523 -27465 370171 712674 410846 -382923
40238 -382923 -920252 -874982 -614674 -495447 -467981 -401696 -269608 17263 472801 752106
40228 752106 524262 93976 68078 416151 521896 212184 -1105 147908 280160 164504
40218 164504 133219 340998 382248 115338 92512 570266 850487 364793 -274751 -211952
40208 -211952 254200 242481 -193016 -272812 70549 214575 203964 746481 1692250 1866785
40198 1866785 886698 -76799 -22257 466925 388151 -123 268155 1182258 1697399 1166630
40188 1166630 38 -1001496 -1325190 -894626 -122702 297552 117534 -153240 -58423
40179 -58423 77487 -206976 -595161 -507303 -181469 -300113 -710660 -543203 342496 1022041
40169 1022041 858779 303860 5744 -66031 -163962 -150465 107610 285669 95242 -192928
40159 -192928 -220105 -151941 -312483 -521661 -322980 309185 917980 1090491 738387 52415
40149 52415 -549506 -678936 -459824 -459916 -848226 -1009947 -434302 387998 546243 -41278
40139 -41278 -601478 -642457 -465278 -469696 -551352 -438747 -200209 -103838 -210626 -362028 -441650
40128 -441650 -455004 -405406 -233857 82496 412759 546467 487622 587992 1133438 1798681
40118 1798681 1880465 1221696 515596 410358 678371 673330 297868 4002 31640 209288
40108 209288 431805 771554 1086176 1045300 664235 360259 345664 378231 252624 122617
40098 122617 145279 192009 150255 180650 416348 680267 748545 652424 489002 193746 -215418
40087 -215418 -397732 -45000 636308 1117565 1171901 1026832 923678 822687 614121 372663
40077 372663 247018 239240 261045 331638 517805 664949 426996 -259390 -899713 -935200
40067 -935200 -459654 -101171 -157760 -264692 -80011 166858 157653 90471 286035 499027
40057 499027 253835 -288971 -472602 -128055 248960 376478 553224 937800 1116944 752746
40047 752746 148573 -201961 -208240 -8664 338788 633783 474033 -133862 -525757 -242126
40037 -242126 235563 161338 -385267 -700310 -514999 -199242 -13217 200663 543337 803468
40027 803468 758114 356939 -355243 -1112689 -1341933 -699602 344671 943043 837423 412545
40017 412545 -80715 -696422 -1238060 -1328068 -1187987 -1567738 -2589902 -3386018 -3285025 -2685827
40007 -2685827 -2261181 -1955199 -1410138 -831074 -662066 -774409 -731807 -590255 -686865 -859748
39997 -859748 -686379 -368955 -516046 -1030022 -1102102 -494242 42733 -25585 -212031 61991
39987 61991 435245 235392 -321020 -378047 262577 832963 670794 42078 -308637 -69857
39977 -69857 403095 585392 327457 -68372 -232849 -118424 67629 223953 408176 531833
39967 531833 326942 -264886 -968660 -1560923 -2021376 -2162841 -1624211 -577841 75461
39958 75461 -225016 -832360 -748872 -52795 282802 -174545 -880757 -1286508 -1392260 -1206267
39948 -1206267 -509442 511144 1139322 1064047 813060 832760 767568 198724 -453699 -441911
39938 -441911 226787 818198 765714 75598 -890270 -1580423 -1498608 -770211 -194534 -278023
39928 -278023 -555411 -380793 29722 39077 -287966 -356019 -140427 -203956 -626347 -816620
39918 -816620 -536561 -277977 -362247 -410657 -57182 428506 580225 296109 -288566 -958075
39908 -958075 -1238957 -706199 230338 518244 -136860 -720048 -302101 622460 886251 267329
39898 267329 -429381 -616251 -436278 -138241 277983 691496 772382 479599 207827 245326
39888 245326 418356 430569 267463 98709 871 -51102 -48299 52933 238804 412825
39878 412825 459302 336411 115424 -86161 -174554 -50698 348225 824095 917000 438920
39868 438920 -137634 -253348 -117522 -412048 -1141225 -1490951 -1025934 -280886 180549 500686
39858 500686 791334 499445 -629951 -1609248 -1317475 -204716 244689 -362774 -882560
39849 -882560 -433032 446001 807825 553277 146638 -210855 -535082 -684950 -590800 -528208
39839 -528208 -712005 -877778 -648428 -109330 287822 227401 -250444 -811995 -988327 -572056
39829 -572056 26967 186730 -57365 -31054 501734 877347 548638 9726 115484 856985
39819 856985 1455834 1445676 1031591 521641 50073 -160565 109184 623467 864329 776361
39809 776361 815091 1084963 1004231 193572 -778997 -1072947 -720371 -504298 -763640 -929735
39799 -929735 -432486 439333 954943 890574 595992 279163 -221372 -882402 -1246514 -1026380
39789 -1026380 -600930 -543883 -881952 -1174151 -1150051 -900032 -573716 -285727 -216256 -384237
39779 -384237 -401682 75762 696764 754796 224565 -137272 98621 423057 207304 -396536
39769 -396536 -806973 -851660 -775549 -709674 -609635 -526076 -512493 -425909 -198016 -123445 -471656
39758 -471656 -961163 -1040956 -600911 -16268 416168 682619 768535 602408 300438 112217
39748 112217 99214 149761 253449 429423 462937 127805 -340774 -429562 -65504 258006
39738 258006 182775 -68175 -107514 78842 203554 54885 -338546 -720986 -718548 -181272
39728 -181272 512896 766735 463874 83798 29873 160481 131638 -116657 -423962 -673710
39718 -673710 -750464 -482239 84950 524425 428936 -109213 -626785 -798163 -617648 -195224
39708 -195224 362212 877974 1136149 1058296 764392 440073 191492 16889 -115902 -167239
39698 -167239 -52435 160181 179370 -183152 -658803 -752703 -361092 106387 288411 257001
39688 257001 207750 86853 -218712 -561726 -711129 -700322 -711961 -724525 -570872 -296494
39678 -296494 -160705 -246543 -312231 -130823 159796 150509 -407443 -1268234 -1814313 -1626493
39668 -1626493 -966554 -545577 -736542 -1185667 -1322168 -1060177 -791733 -822196 -1053719 -1176929
39658 -1176929 -983848 -520117 -67134 80572 -64229 -180034 -78723 -1125 -274409 -793163
39648 -793163 -1078561 -809165 -111922 612500 986680 866506 440141 52464 -190156 -481794
39638 -481794 -845670 -894685 -389085 221611 283003 -167998 -502599 -459222 -447961 -797136
39628 -797136 -1234207 -1359022 -1200555 -1007428 -827329 -610595 -467348 -499348 -550742 -400849
39618 -400849 -79980 205897 315691 171356 -279146 -885957 -1285191 -1301625 -1177633 -1157310
39608 -1157310 -1073064 -698174 -320148 -466372 -1044948 -1247007 -535089 591777 1130767
39599 1130767 727437 -7311 -312633 -103815 177626 313676 544011 1004939 1300950
39590 1300950 951716 112586 -509289 -462621 18525 428603 540455 449422 334334 314126
39580 314126 357937 258772 -111106 -503276 -538586 -288534 -238333 -549145 -781085 -593751
39570 -593751 -312847 -433157 -871531 -1128652 -982888 -630666 -299727 -99212 -125471 -349461
39560 -349461 -473853 -213151 336186 813732 952500 665801 58815 -426875 -273707 356483
39550 356483 573909 -32592 -619087 -242265 604937 576730 -550029 -1527792 -1392319 -571253
39540 -571253 83802 446887 758879 863572 488473 -153199 -622630 -812937 -814963 -565370
39530 -565370 -62751 367632 441826 298813 177761 11561 -318229 -635668 -732490 -672315
39520 -672315 -524454 -184961 178804 -14111 -928141 -1762128 -1676603 -964363 -611520 -911941
39510 -911941 -1250988 -1160500 -823596 -476762 -36306 456228 599282 165631 -484117 -774249
39500 -774249 -487893 124376 579810 483599 -119376 -686692 -701927 -225678 280681 520302
39490 520302 445518 5585 -712866 -1237437 -1156615 -775707 -779016 -1235727 -1505662 -1181772
39480 -1181772 -553475 -48100 205542 153018 -210425 -466388 -35408 924996 1525540 1349810
39470 1349810 982185 965409 983660 649350 376221 666096 1069897 791668 16957 -302145
39460 -302145 133820 662611 789317 781797 979171 1245374 1363558 1373403 1273943 924986
39450 924986 458292 259738 334864 242745 -121116 -301191 -141971 -175946 -678001 -1021649
39440 -1021649 -650958 -83977 -82911 -303749 154891 1089702 1289833 409780 -424889 -282432
39430 -282432 358187 650525 674504 854381 882129 277071 -490409 -558927 -103239 -97557
39420 -97557 -738669 -1203576 -1048454 -747152 -606335 -251638 378929 595844 143043 -133869
39410 -133869 405755 1049046 808331 -31021 -462650 -334535 -272664 -388367 -226212 142984
39400 142984 122784 -277577 -379477 -51080 26311 -435203 -813612 -642867 -348044 -469649
39390 -469649 -872739 -1169462 -1287157 -1205644 -761067 -136727 63646 -322136 -662749 -478501
39380 -478501 -132729 -107458 -220701 -132319 -38969 -230322 -476104 -503428 -579458 -935450
39370 -935450 -1121429 -714565 -206535 -304030 -715996 -601886 14264 294011 -37928 -380148
39360 -380148 -385456 -429078 -725511 -864119 -580783 -263375 -291903 -463430 -449743 -326553
39350 -326553 -293690 -299900 -269341 -325627 -510193 -625652 -603337 -690549 -1047060 -1462039 -1646332
39339 -1646332 -1506316 -1045042 -393379 -21906 -402500 -1266915 -1731638 -1419905 -913166
39330 -913166 -759309 -645816 -96728 542081 564496 75064 -85357 438778 1063252 1170399
39320 1170399 873116 581104 278510 -286592 -900638 -929937 -219865 458069 260006 -583632
39310 -583632 -979080 -407016 396569 518188 92372 -142091 -104068 -352229 -946055 -1248184
39300 -1248184 -999921 -730816 -800549 -843196 -585784 -447561 -763177 -1101660 -1027347 -928695
39290 -928695 -1319173 -1823301 -1724156 -1150215 -812382 -808087 -620501 -188797 -44289 -364253
39280 -364253 -753792 -1019534 -1302535 -1380340 -799206 97883 292507 -363008 -714677 -20578
39270 -20578 829643 641538 -272376 -607103 66931 974277 1443507 1540674 1404682 894029
39260 894029 133009 -322703 -208365 56041 -17338 -344696 -472179 -116162 649446 1458368
39250 1458368 1798349 1393122 546253 -149341 -459862 -563261 -525609 -224210 159025 148511
39240 148511 -308710 -672209 -628374 -542932 -734508 -853330 -506262 -27899 13066 -267895
39230 -267895 -336308 -170773 -176500 -297325 -24614 657530 1112222 1024650 837998 948583
39220 948583 1119290 1047191 910476 902512 748757 219720 -291611 -280815 74502 191647
39210 191647 -71675 -401887 -678796 -1046207 -1408638 -1446840 -1177806 -982141 -983585 -872531
39200 -872531 -473142 -40156 188418 321925 457925 359664 -163672 -782212 -928797 -511874
39190 -511874 -50538 -25833 -277553 -202025 467309 1241065 1399958 877583 340990 309576
39180 309576 515410 382641 -142514 -612050 -733995 -580256 -248583 202509 485268 242467
39170 242467 -394682 -811539 -642892 -185106 56479 -78364 -425627 -741581 -768517 -372309
39160 -372309 194610 434853 180328 -224139 -426215 -427215 -282781 153368 864312 1350312
39150 1350312 1077527 139630 -806708 -1193679 -965875 -500023 -269366 -433210 -623122
39141 -623122 -331919 367519 779694 461620 -168270 -396525 -132463 111397 1320 -239197
39131 -239197 -212082 178091 666901 906899 800432 584943 497492 419091 115030 -231159
39121 -231159 -176192 226839 388812 113128 -49398 256562 534777 290102 -58588 121500
39111 121500 535444 428635 -104079 -283547 -17627 -53993 -636017 -1020240 -674364 -68053
39101 -68053 190297 225117 351859 362404 40593 -145716 337750 1082078 1131187 314819
39091 314819 -502882 -593728 -215094 -66561 -307372 -461681 -165991 303843 385037 3088
39081 3088 -253118 119436 817107 1094523 774697 456047 621717 992692 1019690 651129
39071 651129 262448 60264 -84303 -328572 -669738 -985209 -1067580 -747811 -168894 229946
39061 229946 221471 118420 344697 825268 1089480 898312 492383 239766 260417 397164
39051 397164 394383 120901 -265588 -429113 -236591 52059 82237 -195235 -515930 -593749
39041 -593749 -350858 19448 177349 -7446 -209116 -496 531280 866766 803934 678840
39031 678840 701628 621702 344640 289241 654551 894230 563493 188654 474127 1023649
39021 1023649 846462 -17497 -450865 65998 773165 922084 764628 760861 687539 230521
39011 230521 -222857 -176981 62483 -129121 -612694 -663364 -79036 590671 872317 819602
39001 819602 654325 501431 491384 655401 743259 584165 511090 889162 1360322 1256239
38991 1256239 721481 588201 992102 1042131 279993 -433027 -184314 572209 766078 350473
38981 350473 145211 330606 266565 -157388 -173830 497334 1000763 698883 280219 645565
38971 645565 1346626 1199974 132133 -702652 -642208 -296504 -346998 -526927 -337075 -33820
38961 -33820 -175059 -618575 -717557 -333163 3859 -82062 -370949 -492252 -360344 -55061
38951 -55061 365857 793281 1082883 1267074 1520761 1823248 1887065 1532387 920251 302935
38941 302935 -239792 -667831 -795510 -475213 124525 637593 883678 972689 1019571 928340
38931 928340 575828 118781 -76417 126303 423253 463502 333512 393805 683069 838058
38921 838058 681709 493704 476059 342401 -177495 -724443 -698220 -117192 402929 489076
38911 489076 372030 398376 618110 912308 1126069 1005968 402158 -374256 -768340 -650242
38901 -650242 -418987 -387898 -464930 -503174 -516999 -442399 -150215 162046 74745 -386734 -681409
38890 -681409 -538423 -299868 -277443 -333321 -347813 -491870 -738348 -764412 -672659 -1027162
38880 -1027162 -1718141 -1707102 -615536 358161 97070 -693690 -645785 52850 94522 -695303
38870 -695303 -1200364 -1039702 -1043165 -1444163 -1293920 -294428 345741 -190044 -895808 -529224
38860 -529224 447413 772622 425870 412818 995939 1446674 1357436 1044543 701577 178266
38850 178266 -358638 -459039 -193733 -133251 -402304 -481636 -98890 355393 481919 345476
38840 345476 123227 -148215 -288015 2931 575571 789808 347961 -216786 -195225 430809
38830 430809 1029642 1027318 408894 -306231 -500654 -58911 449857 408974 -85518 -425089
38820 -425089 -375725 -301482 -471518 -672664 -693394 -701647 -850756 -920902 -705090 -434774 -451091
38809 -451091 -687793 -841189 -864451 -910764 -899455 -543550 159833 778801 893660 513366
38799 513366 -36186 -497649 -841523 -1097700 -1161470 -870553 -284802 230904 339905 122455
38789 122455 -7961 205863 577233 711144 438742 -10774 -214733 55902 599224 978540
38779 978540 1010727 952153 1096109 1333808 1305038 866259 184255 -524826 -1075067 -1225136
38769 -1225136 -871008 -331455 -89344 -173918 -133323 259857 620996 501842 60063 -138937
38759 -138937 117512 434194 361351 -9483 -167296 150154 608287 727867 532441 441014
38749 441014 544942 436126 -54198 -412561 -163581 322739 317443 -173306 -436949 -119320
38739 -119320 398015 747703 1016275 1205518 920845 45961 -750350 -717978 18329 668360
38729 668360 777316 589554 494066 518909 442712 128340 -376599 -931203 -1380712 -1573745
38719 -1573745 -1384637 -815847 -109598 366611 461576 358585 227437 -55560 -596853 -1075282
38709 -1075282 -1012961 -396458 318302 770483 903775 687716 105773 -533340 -748729 -503791
38699 -503791 -282808 -406504 -638812 -637172 -448557 -357932 -498173 -759086 -890802 -664773
38689 -664773 -153355 213894 168255 38002 252058 583629 477608 20484 -149160 78394
38679 78394 97347 -340957 -673766 -463277 -45106 149609 231617 379638 385728 163403
38669 163403 114381 480291 869886 920298 891845 1119266 1423638 1572563 1753766 2062105
38659 2062105 2122693 1815687 1745790 2306824 2897993 2847710 2521664 2619195 2905886 2685313
38649 2685313 2142094 2066713 2393905 2161662 1045796 -49658 -226685 325813 810074
38640 810074 831318 598244 433704 364193 161110 -231556 -425743 -79540 399598 273014
38630 273014 -295950 -278929 584925 1174533 680757 -54814 132181 892955 1048727 504647
38620 504647 198392 500453 898201 1066039 1130922 1038792 672940 389067 475295 429948
38610 429948 -194414 -703533 -244392 610926 709954 338852 722042 1724580 1917028 1029141
38600 1029141 451147 895671 1368199 1104615 860900 1417234 2232821 2533755 2539679 2684819
38590 2684819 2671047 2217836 1867513 2154275 2655832 2614010 1950497 1142412 621417 633256
38580 633256 1134410 1663723 1900504 2242531 3056919 3703857 3450250 2983431 3531479 4753365
38570 4753365 5248935 5007482 5360724 6504313 7273149 7574333 8669299 10654818 12183975
38561 12183975 13238147 15489772 19212776 22737492 25824604 30365389 36709633 43031286
38553 43031286 49786170 60603120 77036283 97839875 126117543 169241922 223754736
38546 223754736 265875839 268819226 230664167 176785152 133265817 105709034 85863451
38539 85863451 68835574 56272215 48450116 42192042 35891993 30793411 27242892 23823994
38531 23823994 20246815 17704421 16202534 14307333 11701942 9648043 8753472 8273304
38523 8273304 7726899 7446443 7419138 7102224 6455240 5898585 5351833 4481755 3677461 3613176
38513 3613176 4077555 4313295 4199991 4060325 3729296 2942974 2219317 2183674 2430224 2233867
38503 2233867 1948197 2392302 3204975 3213030 2287309 1489239 1379429 1417514 1122757 706790
38493 706790 403115 131666 -27593 165307 583661 900701 1171801 1558905 1751471 1485193
38483 1485193 1308703 1860790 2668452 2739198 2136947 1814735 1998779 1963789 1444240 1035994
38473 1035994 1003650 849583 371102 84295 233398 343767 143455 29985 221417 303741
38463 303741 70729 19266 507356 1098399 1241857 1039689 896549 917478 1041081 1299483
38453 1299483 1602841 1694134 1577592 1553091 1647377 1533541 1194212 1076603 1362097 1681893
38443 1681893 1801971 1957039 2231383 2303910 2176463 2432865 3261729 3883424 3577276 2738054
38433 2738054 2248895 2270281 2365954 2436504 2700956 2948802 2654122 1878943 1365550 1568857
38423 1568857 2143134 2577441 2857221 3207016 3526362 3464444 2973862 2524993 2691114 3569164
38413 3569164 4644956 5267412 5278855 5137492 5404555 6192232 7152334 7901774 8384845
38404 8384845 8910003 9914445 11601583 13699562 15628453 16999859 17917305 18718124 19486229
38395 19486229 19938955 19779811 19026845 17918918 16588475 14985554 13154779 11416778
38387 11416778 10099061 9148170 8217276 7163426 6257219 5804272 5709624 5544368 4982522
38378 4982522 4117247 3394058 3202816 3441474 3573256 3274316 2860538 2779919 2884738 2718149
38368 2718149 2414327 2598478 3262011 3519096 2887471 2123174 2189468 2922800 3390977 3191834
38358 3191834 2716753 2412135 2456006 2954869 3797178 4460616 4576734 4516544 4799161 5158829
38348 5158829 4973061 4462493 4562563 5558969 6748715 7667506 8797439 10656411 12892732
38339 12892732 14817335 16394863 18259421 21050251 25058243 30269899 36510196 43699040
38331 43699040 51891871 60537691 67628013 70374389 67388418 59997004 51073079 42808469
38323 42808469 35846259 30054214 25374547 21836687 19258755 17296081 15707644 14380185
38315 14380185 13088460 11475509 9508671 7795673 6989343 6841880 6422181 5483091 4896615
38306 4896615 5217503 5567000 4854688 3564058 3140901 3828348 4387114 4049799 3470566
38297 3470566 3348350 3288140 2691922 1857443 1435526 1459512 1584654 1720115 1813647 1563824
38287 1563824 963698 619377 921942 1393069 1445253 1264612 1282430 1311987 1003734 711216
38277 711216 1015438 1675494 1937567 1710297 1555400 1598238 1365375 806848 622311 1257842
38267 1257842 2207357 2657399 2393474 1797451 1311221 1164044 1366246 1736315 2050688
38258 2050688 2239422 2318301 2187132 1719186 1016563 351184 -109946 -318131 -190591 271172
38248 271172 776063 958356 798813 601966 585251 705644 838865 910194 897316 890239
38238 890239 1060163 1388045 1560120 1348798 961206 791894 974252 1370492 1793468 2011082
38228 2011082 1805224 1341715 1213719 1747454 2518712 2951471 3098018 3336534 3608476
38219 3608476 3605258 3494883 3703829 4053110 3929398 3397851 3305469 4004638 4751517 4804203
38209 4804203 4449629 4404023 4765710 5212151 5788241 6714492 7626140 7823791 7345756 7088440
38199 7088440 7606482 8320267 8257741 7221633 5865170 4870597 4433565 4391698 4435273 4211589
38189 4211589 3610289 3012205 2908051 3171195 3093650 2352371 1550898 1442253 1925053 2280699
38179 2280699 2199583 2014512 1977269 1888624 1553211 1109562 751522 531696 548145 872865
38169 872865 1175232 935771 229946 -238961 -139598 37778 -121806 -238735 148714 694317
38159 694317 741080 333629 41449 27135 -29874 -245751 -411012 -443977 -371579 18098
38149 18098 871945 1688626 1686272 788577 -300891 -999451 -1266360 -1164283 -665704 -14617
38139 -14617 306748 159602 -145063 -392917 -636120 -777399 -556479 -87384 129074 -94247
38129 -94247 -391841 -435498 -268902 55137 608012 1178119 1282812 806698 137621 -458342
38119 -458342 -994354 -1177803 -484158 819589 1535230 998913 19421 -289935 1162
38110 1162 70764 -285082 -617811 -801137 -1070497 -1238258 -817596 31556 527068 367275
38100 367275 51448 -52920 -175268 -399639 -249420 489842 1164518 1091003 570580 420364
38090 420364 758793 917396 474518 -226051 -642218 -623697 -326804 26188 138098 -232911
38080 -232911 -909328 -1355888 -1325369 -1161859 -1214110 -1261060 -911106 -341092 -118048 -330792
38070 -330792 -436707 -109337 241947 91589 -407651 -620885 -245838 407921 880177 1010411
38060 1010411 925416 794990 660153 423108 9018 -449300 -687780 -605102 -345757 -64430
38050 -64430 200680 385909 398682 342682 447503 652346 611009 286250 120874 334061
38040 334061 494164 208847 -183005 -156854 110674 54549 -316127 -478577 -296832 -131279
38030 -131279 -73554 182661 630324 850072 790026 906049 1256456 1205410 466236 -231368
38020 -231368 -117146 478128 637670 195856 -165005 -59713 54129 -355385 -1081810 -1455270
38010 -1455270 -1187892 -628939 -236314 -97151 -101347 -321287 -833225 -1230770 -870417 155764
38000 155764 820268 421104 -366923 -354166 514735 1137770 795976 -75488 -722290 -891745
37990 -891745 -615162 85460 922618 1360381 1236087 870455 362726 -571125 -1769359
37981 -1769359 -2383231 -1977491 -1244204 -1030321 -1201288 -1131899 -851096 -906676 -1348352 -1626526
37971 -1626526 -1462792 -1178474 -1080940 -1010772 -650870 -11794 505599 464964 -123572 -669436
37961 -669436 -576902 13581 380808 165956 -257007 -431263 -322639 -34576 393808 690519
37951 690519 491299 49189 92488 633038 745360 43276 -526758 -129272 567034 432972
37941 432972 -351852 -693255 -273607 312382 801475 1453178 2117173 2244564 1892593 1766873
37931 1766873 2181972 2774141 3225793 3563749 3994672 5290541 8808087 14671408 20086042
37922 20086042 21211960 17264942 11461274 7371560 5615736 4750788 3902575 3231431
37914 3231431 2748386 2137967 1491873 1172960 1065330 721905 137981 -244671 -204009 68946
37904 68946 311525 360996 176594 -21969 100133 474702 608492 290878 -126484 -366848
37894 -366848 -554662 -621851 -132161 801033 1181321 450440 -484642 -411650 481665 1008138
37884 1008138 756898 454340 659744 1075437 1262632 1233136 1133066 977984 885791 1042912
37874 1042912 1298957 1262020 885574 523940 381450 373775 525410 957417 1433033 1485180
37864 1485180 1109457 784516 678908 427491 -95457 -389348 -67582 521792 835111
37855 835111 883456 983411 1075433 814926 211505 -282857 -335536 -85341 72866 -141579
37845 -141579 -679799 -1118994 -916568 45465 1179845 1660855 1201870 253699 -526721
37836 -526721 -846003 -845815 -814825 -917868 -1118618 -1293120 -1405496 -1512797 -1557788 -1296408
37826 -1296408 -617295 137056 439095 225534 14756 217415 576206 576719 247025 140490
37816 140490 515735 955528 982017 708102 590384 772051 1006725 1106268 1132188 1173506
37806 1173506 1193567 1089939 749501 169201 -286156 7271 1186595 2467528 2990581
37797 2990581 3032882 3741138 5516398 7275650 7661382 6540242 4927722 3786080 3315470
37788 3315470 3174942 2934398 2358758 1567312 932380 696798 780485 1012815 1313203 1532444
37778 1532444 1434179 1045902 729797 660546 544470 156894 -165539 24121 581521 965529
37768 965529 977677 863871 778636 611853 355961 224815 298514 352342 172967 -129360
37758 -129360 -211827 170180 900176 1512855 1579171 1152027 668501 352082 -13720 -594411
37748 -594411 -1147475 -1400526 -1428029 -1330842 -920538 -168600 377990 220536 -258850 -222849
37738 -222849 430590 922595 688920 53361 -348745 -351280 -243511 -305676 -567490 -846504
37728 -846504 -925366 -800210 -702582 -741186 -701725 -432048 -174016 -150133 -68845 467978 1223481
37717 1223481 1521284 1115145 393841 -182339 -375418 -77871 474060 549355 -299191 -1372597
37707 -1372597 -1526912 -755734 -215561 -528330 -975934 -735396 -58834 308171 205458
37698 205458 -14156 -119317 -58151 181045 367539 147807 -304750 -325257 209570 558246
37688 558246 268904 -92550 44702 309254 240201 318114 1109034 1980860 1883598 1048143
37678 1048143 642259 906210 962370 538421 494428 1226248 1789435 1308434 299991 -194605
37668 -194605 -63389 107930 154103 332198 527511 310868 -288773 -758585 -865800 -881153
37658 -881153 -978493 -918261 -487161 127498 593427 803744 827527 703163 478569 336343
37648 336343 464464 788960 984103 849979 618002 719159 1193791 1507183 1148316 320799
37638 320799 -228608 -78929 453675 865159 1096437 1337495 1433665 961942 -23908 -742876
37628 -742876 -529706 238367 481740 -242254 -1136752 -1176175 -401814 260030 311082 180144
37618 180144 309535 419167 101139 -372865 -449766 -202107 -175340 -451503 -538778 -241034
37608 -241034 -1350 -177948 -509812 -592140 -466981 -413400 -453092 -388681 -143927 180945
37598 180945 441316 472210 168047 -314994 -635496 -663999 -570257 -430372 -97857 362398
37588 362398 528390 242495 24157 419271 1178828 1570305 1373256 1067951 1058021 1187436
37578 1187436 1128318 847814 513299 221819 14458 -35052 72350 169258 73848 -196364
37568 -196364 -416803 -355660 -5979 370665 520097 527645 689341 988685 1000298 531284
37558 531284 41783 47708 363787 453365 359570 626052 1272437 1591050 1254536 957658
37548 957658 1424150 2232933 2283183 1235759 -97943 -765606 -576997 25510 537122
37539 537122 686017 489203 203124 74469 92339 117094 172937 363927 572321 570684
37529 570684 411200 326331 221309 -277839 -1122591 -1652469 -1401812 -728278 -297776 -264128
37519 -264128 -353162 -472769 -734765 -1018383 -1026005 -751383 -455369 -197273 157231 464920
37509 464920 368519 -55638 -241952 42323 307548 101907 -276120 -264327 91886 267243
37499 267243 83674 -91130 64068 448770 776248 854223 624924 225617 2808 173931
37489 173931 494323 557695 369611 245493 178395 -195355 -899279 -1402506 -1351436 -1055495
37479 -1055495 -902006 -718274 -201850 347021 355855 -80248 -254730 69910 273379 -138982
37469 -138982 -701996 -630556 38563 531074 454624 240095 363685 673978 788313 726810
37459 726810 713934 637890 250090 -208645 -170743 385002 770685 523882 12660 -223807
37449 -223807 -274550 -502794 -747780 -529020 76597 414028 178895 -187899 -200180 52107
37439 52107 206386 156295 13989 -151028 -292178 -359002 -478919 -873828 -1389613 -1442804
37429 -1442804 -733712 270296 887045 992522 889262 687581 320996 24008 207836
37420 207836 790709 1145467 901102 418630 241382 389069 512512 541997 766887 1237029
37410 1237029 1449531 914736 -86887 -657873 -310403 432015 711321 398040 74814
37401 74814 60697 14867 -328148 -573346 -214813 588263 1235003 1448068 1371084 1093573
37391 1093573 594533 99051 -21434 219995 408424 342253 294914 526968 878768 1055221
37381 1055221 1061411 1106516 1197119 1053794 472635 -300566 -654082 -210693 633978 999360
37371 999360 497557 -292255 -534328 -83979 560394 994063 1164199 1053980 621264 62307
37361 62307 -286401 -357305 -325746 -191167 243285 959915 1629791 1921784 1651251 808258
37351 808258 -174180 -462251 246750 1029961 733674 -429601 -1136513 -808268 -215075
37342 -215075 -38184 72719 515813 831464 516970 -49752 -283809 -330966 -558705 -736224
37332 -736224 -556617 -405985 -705308 -983305 -582723 108953 156095 -496317 -1112978 -1425547
37322 -1425547 -1705268 -1768929 -1127502 -135113 228797 -102770 -148074 430122 691701 -11163
37312 -11163 -923695 -1046939 -530481 -164444 -187279 -336947 -512479 -676384 -571647 -173235
37302 -173235 26822 -216183 -320603 290726 1209575 1577646 1254020 777028 471684 275206
37292 275206 190452 229606 114250 -307483 -545964 -58038 822384 1265482 1133547 1012879
37282 1012879 1105112 945833 383925 16958 271610 675564 506719 -236962 -926382 -1094427
37272 -1094427 -815537 -477106 -411188 -625973 -774839 -518334 68942 642851 1059091 1347280
37262 1347280 1280938 527734 -603315 -1123570 -486331 609480 994866 406325 -360377
37253 -360377 -569508 -345530 -262915 -509517 -720499 -523210 -22819 308770 142931 -391867
37243 -391867 -902246 -1135256 -1114913 -957249 -709538 -399078 -131434 -77967 -369046 -939351
37233 -939351 -1427702 -1371331 -697587 46921 214601 -180917 -492998 -314752 -7242 -109307
37223 -109307 -475520 -437302 198655 783871 699887 240318 182053 629337 840225 317812
37213 317812 -453728 -691151 -308929 209960 576773 736678 426555 -508113 -1402327 -1263447
37203 -1263447 -196025 492469 -6195 -982576 -1420362 -1426936 -1657803 -1968833 -1699728 -986115
37193 -986115 -699640 -1083942 -1403620 -1106340 -513285 -109174 145290 471906 798708 934171
37183 934171 817597 424984 -170054 -564496 -349105 247295 572808 501215 548179 892642
37173 892642 987097 455596 -268233 -597860 -523447 -287549 106454 610390 882843 814837
37163 814837 823382 1136739 1293116 890696 310788 48172 -175286 -848429 -1631032 -1763750
37153 -1763750 -1264675 -800581 -504002 95071 904209 1040086 107118 -1083901 -1516690
37144 -1516690 -1114575 -493748 -86613 59934 20668 -25294 187698 644122 899856 592968
37134 592968 -86594 -672502 -956852 -1021854 -960117 -828322 -720424 -658909 -541954 -353773
37124 -353773 -243524 -244693 -155949 102880 274923 148284 -112894 -308200 -573845 -1011813
37114 -1011813 -1223904 -788840 -85391 11342 -665207 -1296468 -1233808 -841678 -799933 -1066879
37104 -1066879 -1076462 -631231 -13603 568294 1016673 962257 77038 -1162598 -1737311 -1344405
37094 -1344405 -764458 -671539 -733251 -360041 264167 559703 507720 487323 463416 125427
37084 125427 -337445 -414099 -182563 -244260 -697867 -974490 -831307 -701165 -807327 -730658
37074 -730658 -223804 297575 527008 808899 1367514 1692592 1375716 946954 1063048 1335278
37064 1335278 891979 -150325 -720176 -268451 609953 1121942 1126355 868682 503737 181056
37054 181056 163006 532649 992090 1133403 807056 213185 -245274 -272797 19306 259501
37044 259501 364057 643260 1173367 1477828 1193207 651250 346594 223258 18608 -115798
37034 -115798 -14263 -109607 -790550 -1422734 -989146 360556 1356707 1257580 539847 -137995
37024 -137995 -667584 -943659 -592612 264887 782982 458044 -192422 -450505 -277555 40383
37014 40383 467505 935983 1078885 778000 475524 460882 367094 -134388 -680515 -807212
37004 -807212 -681812 -661024 -599214 -226873 205720 306755 194661 158895 56795 -310605
36994 -310605 -623592 -555903 -474887 -829099 -1178419 -763764 154713 530380 102725 -231700
36984 -231700 198102 946184 1241029 950448 421392 -34498 -154397 241731 872492 1084822
36974 1084822 634897 -11221 -403899 -674974 -1054682 -1294553 -1046597 -503570 -169203
36965 -169203 -175919 -285284 -433476 -773205 -1152625 -1044868 -241133 688753 959886 500864
36955 500864 13181 70368 458726 607063 422091 316511 472061 528230 165623 -364716
36945 -364716 -570300 -341257 23709 237226 213227 -8219 -267363 -328289 -132085 105538
36935 105538 210126 281289 445491 633287 825097 1207615 1759581 1985604 1490219 592082
36925 592082 -69484 -325842 -408087 -320532 106011 638149 758566 401232 7545 -204084
36915 -204084 -451874 -770303 -781128 -331076 154329 267610 166177 211412 412380 571697
36905 571697 710649 966501 1199326 1048679 405299 -371363 -777770 -653814 -291520 -29214
36895 -29214 164701 492862 770373 509727 -252061 -716229 -333966 385459 634737 458371
36885 458371 408961 411785 -48338 -720687 -663038 279786 1080235 989232 480806 243278
36875 243278 96392 -394732 -925955 -893330 -385700 23468 186396 402039 731934 910749
36865 910749 819948 557097 167661 -267710 -460335 -247354 92858 248852 347706 590163
36855 590163 709869 339141 -303033 -665243 -670314 -709268 -921125 -1028917 -854902 -491841
36845 -491841 -1844 547849 791035 368314 -418170 -781821 -407684 199435 410204 90506
36835 90506 -545019 -1228450 -1630089 -1473497 -871153 -251020 166052 498774 750940 645607
36825 645607 93818 -540785 -869585 -879341 -730470 -481101 -232548 -236405 -566490 -901133
36815 -901133 -901560 -651455 -501816 -616648 -845221 -905344 -581511 50144 494350 256511
36805 256511 -413855 -584409 198492 1167364 1274037 612232 218172 527616 846680 589228
36795 589228 228066 431133 873492 762531 233965 233551 958967 1402167 833781 -106333
36785 -106333 -443078 -306819 -474618 -924141 -905022 -360776 -202201 -892362 -1655960 -1569773
36775 -1569773 -765456 -33909 219649 88069 -296212 -727684 -771175 -238292 387908 510354
36765 510354 192255 -92178 -207909 -301172 -241904 194477 694371 657840 122134 -213755
36755 -213755 -12337 253737 87666 -319370 -447185 -122536 440389 968558 1249111 1156830
36745 1156830 777013 345940 -27668 -392369 -672827 -642428 -280034 101699 215170 100035
36735 100035 -6745 73308 358941 673534 723200 419835 73051 12299 109828 2853
36725 2853 -296600 -412193 -191604 127528 337215 435271 398461 227153 198608 570911
36715 570911 1032465 1007650 532055 184113 99605 -157306 -559596 -374413 586332 1338771
36705 1338771 1044051 251373 17127 348331 445317 105078 -119645 -2383 91045 51418
36695 51418 241461 668669 738531 178539 -410450 -335972 283332 776006 766335 412489
36685 412489 8137 -309969 -498627 -470775 -99061 616292 1364224 1651591 1291360 677528
36675 677528 395931 647925 1200580 1704665 1823267 1300376 297940 -501440 -561598 -154868
36665 -154868 55231 -73083 -184255 -193416 -326144 -415233 20344 793390 972845 215225
36655 215225 -564978 -448469 187671 365877 36290 12267 575579 1060875 916332 392236
36645 392236 -71833 -482255 -939605 -1166806 -868024 -268977 137856 232345 285460 438718
36635 438718 513038 329582 -54559 -456988 -700409 -621480 -182013 357528 567899 262020
36625 262020 -342353 -918274 -1316644 -1482154 -1321569 -883671 -513166 -511822 -677928 -507144
36615 -507144 81038 547356 454275 94227 69770 418580 580041 245282 -184743 -193951
36605 -193951 113821 204573 -110296 -444895 -393769 -12858 357903 516741 486934 357298
36595 357298 232141 233394 357823 410531 284934 232279 579884 1191385 1519639 1280735
36585 1280735 783511 465904 413579 515597 737024 924140 682616 -83426 -752385 -669374
36575 -669374 -130664 -57038 -671423 -1177694 -937754 -300786 88125 194632 312505 395559
36565 395559 320128 454021 1210235 2167368 2379015 1628883 736247 441414 564044 550392
36555 550392 353423 329298 548633 677525 483769 114574 -181890 -391514 -679637 -1079369
36545 -1079369 -1343532 -1177098 -609246 -14258 316081 481099 693709 851218 689716
36536 689716 322974 246965 665196 1110973 995759 382566 -34994 299792 1205247 1911441
36526 1911441 1738803 702907 -448399 -858783 -350474 420916 680010 358898 88084
36517 88084 379942 1013006 1345878 1103590 633232 405444 517349 773532 991266 1012618
36507 1012618 653891 -1463 -394125 -20800 806997 1185685 733063 57898 -86787
36498 -86787 297264 700423 863086 871886 779870 594234 485539 583996 673444 475970 136773
36487 136773 28766 166618 247512 235425 446342 981693 1464610 1472446 979709 309320
36477 309320 -149723 -193452 9255 40121 -249819 -503181 -404732 -212636 -321587 -553617
36467 -553617 -476114 -260003 -491463 -1118464 -1351115 -805089 -37582 361826 564019 967464
36457 967464 1427275 1530599 1263332 920859 626582 358657 225757 323411 485760 511030
36447 511030 483734 589787 754722 722835 399549 -44944 -299830 -90341 549175 1148446
36437 1148446 1251155 1015906 977990 1190633 1137665 623442 128968 25161 79417 121259
36427 121259 512780 1378547 1978513 1619513 798452 638431 1398978 2287988 2628491 2487491
36417 2487491 2162786 1734530 1263053 917054 755610 732859 939753 1472644 2061719 2211882
36407 2211882 1758022 990999 264281 -226577 -347019 -61250 430847 854065 1113022
36398 1113022 1201894 1048429 721975 574600 819132 1157270 1199302 1061243 1142844 1494363
36388 1494363 1831572 2023117 2137801 2153348 2023337 1869369 1730899 1379259 812759 600128
36378 600128 1147857 1921873 2082734 1670530 1413569 1525120 1523362 1223524 1074968 1384200
36368 1384200 1907625 2341802 2584991 2458171 1851795 1217769 1198212 1668537 1878168 1627833
36358 1627833 1490952 1719727 1843701 1658687 1697927 2251838 2756034 2726480 2546451 2656822
36348 2656822 2641645 1938069 995876 859676 1763506 2858963 3326735 3204201 3032389
36339 3032389 3085559 3153261 2980604 2758432 2956994 3584728 3986699 3768706 3537706 4065949
36329 4065949 5028872 5466427 5330786 5485000 6118936 6391745 5975607 5727901 6251035
36320 6251035 6919937 7083218 7185235 7815201 8589960 8988235 9476592 10712987 12307555
36311 12307555 13507478 14562503 16267925 18612054 21052160 23790601 27596162 32558681
36303 32558681 38125676 44268518 51669525 60954950 72662783 87677855 106798456 130369865
36295 130369865 159185279 194183339 232472466 263955455 275658999 262028431 230055626
36288 230055626 193020070 160218920 133561543 111661390 93752292 79493837 67863466
36281 67863466 57984027 50049230 44314508 39857162 35380051 30858274 27349976 25214153
36273 25214153 23478549 21259213 18974486 17528894 16832410 15931504 14391646 12726754
36265 12726754 11442542 10456701 9651363 9207674 9037939 8627369 7909106 7570812 7892914
36256 7892914 8016242 7185127 6083570 5900815 6497761 6670717 6061845 5582039 5810949
36247 5810949 6132853 5876041 5377986 5339012 5751312 6037542 5865268 5384419 4914945 4697447
36237 4697447 4750653 4813274 4638119 4396863 4510813 5046017 5594864 5809934 5760383 5716267
36227 5716267 5832578 6058088 6173305 6005500 5742739 5776613 6049535 5993749 5459725 5169523
36217 5169523 5692901 6485665 6665069 6305008 6136660 6315597 6388651 6245487 6200392 6290401
36207 6290401 6332374 6491031 6978878 7470142 7667081 8039968 8984453 9729454 9371837 8587112
36197 8587112 8794683 9892521 10546273 10662416 11630475 13773143 15477839 15578087 14943696
36188 14943696 14893739 15524514 16460290 17831388 19531091 20734153 21097272 21356587 21969989
36179 21969989 22349534 22188799 22235167 22851179 23121716 22413740 21595848 21622899 22035977 21962435
36169 21962435 21583084 21569639 22003888 22749873 23967860 25568464 27200354 29243478 32507853
36160 32507853 36692577 40928647 46077022 54154814 65173965 77557165 92246115 112643686
36152 112643686 139781332 172910836 216483534 277818335 350096957 403863612 407825965
36145 407825965 359704642 288629216 225899757 181054226 147480899 120059253 99213202
36138 99213202 84037606 71172831 59780950 51577022 46225478 41273123 36252968 32780171
36130 32780171 30745334 28058285 24227888 20963228 19014776 17273564 15241170 13760139
36122 13760139 12959449 11858017 10376828 9575253 9546583 9142357 8144210 7698658 8145956
36113 8145956 8347845 7742520 7256000 7474047 7561925 6833610 5992834 5934834 6422649 6727607
36103 6727607 6663407 6345532 5744624 5019240 4583205 4462373 4257609 3938363 3890798 4052087
36093 4052087 3903898 3486005 3437398 3807219 3850339 3327832 2989362 3328390 3809205 3831139
36083 3831139 3590009 3448472 3256148 2866985 2613519 2687993 2696526 2397483 2272293 2746113
36073 2746113 3365422 3407703 2930357 2590598 2677629 2883037 2882213 2661037 2311212 1878799
36063 1878799 1478188 1357499 1744068 2597766 3535166 4153599 4489568 4888568 5302042
36054 5302042 5177697 4398970 3810182 4188952 5111388 5596453 5553831 5697849 6204587 6450533
36044 6450533 6142875 5802753 5949382 6565672 7500625 8645173 9590677 9896224 9853438
36035 9853438 10232172 11145531 11978886 12569919 13531282 15142629 16858123 18295431 19822263
36026 19822263 21679516 23326708 24203557 24484839 24617009 24733362 24895466 25185014 25151134
36017 25151134 23965846 21644883 19349755 17916720 16837511 15297976 13441889 11868733
36009 11868733 10585172 9285191 8108412 7307297 6632082 5801904 5136649 4995417 5041275
36000 5041275 4782432 4377272 4179807 3998441 3595918 3396482 3809347 4360811 4501095
35991 4501095 4807287 6198497 8204691 9249145 8665220 7359135 6403277 5979985 5833512
35982 5833512 5778319 5513649 4755184 3767686 3089361 2720947 2383139 2461986 3577562 5114810
35972 5114810 5459750 4130394 2494632 1781946 1549587 943864 358750 643201 1442793
35963 1442793 1687610 1332463 1282068 1705478 1728616 995269 355741 524543 997665 966655
35953 966655 620799 749025 1417371 1836845 1492557 765623 319851 363303 728918 1289532
35943 1289532 1924997 2258229 1853351 798893 -149542 -242990 475341 1239296 1470723
35934 1470723 1448322 1862791 2767157 3305055 2700736 1305374 286837 302880 887612
35925 887612 1284248 1441832 1794495 2348940 2582899 2286772 1992331 2284225 2951458 3140078
35915 3140078 2330177 992951 184883 455956 1232202 1476506 950885 438868 547002
35906 547002 819064 543803 -27440 -74107 421000 638621 274399 -50391 66263 228108
35896 228108 177272 329585 818743 959433 411212 -15853 343759 723928 108282 -924431
35886 -924431 -914408 225526 1087743 880943 297270 71287 -14216 -240974 -242367 184719
35876 184719 479468 199613 -239706 -335355 -316705 -543101 -702481 -331083 340038 741080
35866 741080 782448 706119 511324 159960 -18579 194739 349228 -37144 -542415 -332143
35856 -332143 545005 1158149 1015321 632044 623312 887133 963737 706419 299988 -38202
35846 -38202 -138620 70548 423079 638940 668072 688568 762954 789316 784640 868049 960366
35835 960366 893462 823967 1063095 1440126 1403239 927934 711905 1143554 1684137 1749627
35825 1749627 1638807 1943427 2499379 2708846 2610177 2791813 3411632 4166034 5122138 6612042
35815 6612042 8366055 9993185 12475232 17504944 24364609 28960116 27728049 21850853
35807 21850853 15872306 12468848 10462733 8019089 5538411 4312052 4066117 3534526
35799 3534526 2589014 2177427 2516880 2797060 2640168 2605276 3046960 3491202 3464073 3143376
35789 3143376 2834242 2425021 1733747 953532 446443 371502 640221 957854 904471 330106
35779 330106 -349803 -614444 -489796 -313480 -51065 519311 1081020 1047622 596023 565941
35769 565941 1115794 1352186 703443 -141304 -240392 303550 720765 767567 831667 1111964
35759 1111964 1337938 1234949 836584 393818 232528 533679 1036570 1201330 878514
35750 878514 520413 505678 613452 461483 123359 -33312 135525 477259 757416 774064
35740 774064 544905 459590 822894 1203738 858032 -78239 -600067 -309055 11530 -237499
35730 -237499 -475714 -25623 683812 898680 788422 923325 1144344 1013962 828302 1043572
35720 1043572 1196051 632036 -98927 68331 903340 1169118 594438 99009 39164 -245128
35710 -245128 -905989 -1115726 -563553 -65789 -156313 -319251 -158354 -79490 -216427 52723
35700 52723 818197 1135688 629593 339870 984245 1584970 1014031 -150713 -629005 -411045
35690 -411045 -339845 -455731 -224591 118533 -59057 -419668 -107243 638428 743587 123864
35680 123864 -129011 504363 1294177 1551117 1462855 1358539 1141582 788229 578039 545852
35670 545852 416683 260666 532952 1351713 2352957 3243277 3920958 4322820 4866495
35661 4866495 6524058 9440196 12235645 14318139 18120456 26310908 36426678 41281781
35653 41281781 36526822 25863864 16791697 12678269 11205593 9366093 7010713 5367673
35645 5367673 4651441 4256996 3886368 3479614 2866512 2183202 1989322 2436133 2860228
35636 2860228 2655989 2096604 1881422 2219346 2713044 2910402 2707593 2352639 2175834
35627 2175834 2207842 2106866 1642188 1098486 891774 941367 840768 558985 503457 880571
35617 880571 1417631 1762272 1801907 1585445 1276233 1145734 1246656 1170157 560532 -212459
35607 -212459 -425994 -36388 254285 63728 -154602 82525 512990 555221 135175 -319930
35597 -319930 -481489 -348425 -19718 423377 822434 958978 733227 269670 -164372 -359077
35587 -359077 -320127 -203161 -94586 14195 30398 -189492 -479560 -404233 103626 526112
35577 526112 531340 535445 978067 1457928 1321513 812859 745488 1150596 1239507 792674 547868
35566 547868 880227 1090850 574095 -152724 -306975 -68881 -149191 -591746 -829943 -668498
35556 -668498 -441823 -322841 -154079 73533 159480 108382 101777 70392 -207852 -567918
35546 -567918 -528738 -22645 401875 318522 9171 27745 398585 595281 321691 18976
35536 18976 347010 1237577 1826256 1519703 797836 547550 854452 1065681 943804 965726
35526 965726 1315442 1410141 862460 192461 -8261 -350 -272931 -526252 -150502 607195
35516 607195 893637 565229 356723 671030 1032666 968532 711643 672285 745970 550853
35506 550853 32769 -484045 -667562 -433321 10036 312532 342586 341778 510194 607564
35496 607564 334357 -55699 -37365 355707 557177 371396 256785 535300 870632 817543
35486 817543 455934 169806 116891 180544 191946 14838 -332750 -513695 -130465 722700
35476 722700 1470709 1720939 1588367 1310105 977609 759954 883146 1178005 1147241 727254
35466 727254 446453 516241 379645 -334129 -983099 -755407 47171 384320 -20640 -368416
35456 -368416 -36873 587088 790019 492305 164314 127220 298584 473127 563171 575891
35446 575891 513762 355885 146732 85787 395335 988496 1400953 1253744 721798 342788
35436 342788 398247 686613 888416 928816 927936 972748 1028584 988226 771148 440124 207733
35425 207733 237642 449940 609375 591156 480709 438812 550275 773405 954174 919084
35415 919084 632387 242993 -60405 -181943 -95023 160155 365930 198991 -377901 -901973
35405 -901973 -841920 -235324 334410 440886 271364 260434 462143 540633 359471 298860
35395 298860 789601 1661411 2245865 2172921 1780588 1566285 1520305 1344209 1119203 1232682
35385 1232682 1625819 1676059 1085622 438673 483333 1174283 1888575 2383709 2976580 3762031
35375 3762031 4215822 3849065 2902970 2032275 1466339 866912 25182 -674966 -725379 -226500
35365 -226500 176246 78684 -274847 -477657 -531862 -654854 -742219 -435589 298480 1027051
35355 1027051 1374053 1400854 1356353 1299284 1132929 857027 623732 580913 701699 755569
35345 755569 541146 216987 195120 517884 618351 69012 -679773 -839688 -419390 -187594
35335 -187594 -512636 -916875 -912746 -614487 -294900 26476 274226 228321 66861 350402
35325 350402 1084093 1472718 1078843 523073 453791 552882 323640 171264 720089 1567880
35315 1567880 1799287 1416922 1171263 1178253 856325 186775 -143502 3722 -46251 -504470
35305 -504470 -659780 -146129 316354 47065 -546886 -712132 -466529 -279766 -185149 46481
35295 46481 217520 -76005 -695559 -1035437 -818181 -392451 -228944 -378617 -445211 -34342
35285 -34342 691675 1029857 601466 3330 38830 463992 346862 -310233 -413434 385565
35275 385565 875905 102268 -1043829 -1157661 -447082 -178672 -499829 -351176 504417
35266 504417 895632 100720 -950498 -1010316 -175795 487840 380820 -222877 -775217 -900611
35256 -900611 -546395 -118354 -170978 -622607 -674930 73022 869496 761775 -8539 -283879
35246 -283879 412265 1281295 1422703 980190 714408 825652 756513 133733 -568230 -571431
35236 -571431 196300 968697 1044284 528287 6543 -248704 -398097 -508684 -396404 -79201
35226 -79201 75058 -86973 -161803 217853 709079 640171 -26950 -577054 -448035 121966
35216 121966 501054 421996 130109 -34579 20449 153290 200279 178979 293086 661793
35206 661793 1070728 1156170 851122 453020 218560 145591 225760 556275 971096 921725
35196 921725 144518 -786139 -1076866 -770610 -612690 -866750 -943294 -446170 81860 -21215
35186 -21215 -458896 -412125 175175 488756 60303 -578311 -708376 -375338 -138259 -188969
35176 -188969 -172677 187989 660568 804743 526913 176279 87495 145781 -33827 -482960
35166 -482960 -683210 -210576 595838 954283 599288 59043 -99306 61381 133572 15925
35156 15925 -50128 32576 32895 -229667 -514166 -340942 418954 1229580 1346425 660581 -106509
35145 -106509 -237721 147254 403879 330347 330584 619298 836015 665985 348499 227726
35135 227726 202891 35110 -127299 -6502 245664 241726 -16974 -188419 -177758 -178107 -153052
35124 -153052 167090 662196 734075 110139 -675643 -926780 -600819 -150337 184454 499623
35114 499623 762887 677339 120525 -549169 -788044 -393566 303859 718683 514851 -76632
35104 -76632 -494643 -488716 -396098 -602829 -897406 -733358 -106450 309516 95448 -291630
35094 -291630 -203793 248589 458987 312394 257417 420166 364207 -57572 -294567 37778
35084 37778 450799 303016 -196435 -353573 -62224 205679 315950 593698 1016265 1077397
35074 1077397 667231 374958 563204 748455 359372 -366308 -760325 -669859 -513729 -602031
35064 -602031 -872762 -1184666 -1437579 -1435080 -994687 -248637 381774 542450 195122 -381231
35054 -381231 -736813 -570325 -46631 358461 420990 346432 308676 179860 -81717 -183864
35044 -183864 20516 162064 -125118 -604652 -798834 -687152 -572819 -499295 -338370 -261735
35034 -261735 -523294 -888755 -910689 -721083 -884199 -1423784 -1693444 -1372778 -911384 -719029
35024 -719029 -579307 -266568 -139634 -567053 -1200709 -1424783 -1234873 -1068436 -965559 -560856
35014 -560856 117425 490730 251579 -160814 -175564 183980 485355 524784 449643 415327
35004 415327 455502 603098 804472 751356 180718 -589048 -826670 -310236 268668 140544
34994 140544 -598592 -1279210 -1613834 -1794614 -1806824 -1385679 -736879 -529863 -856949 -909579
34984 -909579 -190313 588012 503591 -161905 -358356 149910 552829 337175 -19339 72198
34974 72198 460095 643855 490652 186883 -131228 -346537 -260518 155143 614223 853277
34964 853277 911253 903544 772847 479050 219376 238536 567579 1084316 1640934 2015370
34954 2015370 1980693 1590992 1185209 957126 753414 449603 241369 324906 541146 632286
34944 632286 651204 779191 877982 626621 110274 -117896 255454 796453 818145 301824
34934 301824 -10037 429018 1210637 1499662 1148967 788323 790370 781307 469940 317742
34924 317742 789067 1420414 1401935 773729 201521 -210018 -863750 -1474931 -1123111 172489
34914 172489 1065980 706729 -11194 166559 1023877 1419563 1086123 760978 780870 651993
34904 651993 81414 -474363 -524196 -162361 228560 407879 292928 -24617 -226531 -130172
34894 -130172 -54974 -363167 -735495 -520187 202375 609249 354618 117004 593100 1500824
34884 1500824 2012352 1802841 1268564 950837 1059918 1392723 1517566 1209963 778155
34875 778155 686493 850771 752969 329173 158610 528337 926256 873592 679967 815308
34865 815308 1041973 863589 451277 349604 514659 452936 158372 50768 47171 -353052
34855 -353052 -964862 -928241 -149134 284052 -311052 -1130185 -1147927 -635805 -445278 -456346
34845 -456346 41631 808075 840883 89768 -318163 168286 720661 539940 17343 -128681
34835 -128681 44498 198252 516370 1168475 1603601 1280268 627069 400794 510809 388299
34825 388299 125652 220321 471155 255920 -221119 -139989 444758 542047 -127942 -641346
34815 -641346 -438351 -189908 -468609 -681322 -215569 295910 -36985 -758485 -647841 408547
34805 408547 1256935 1149458 604179 445030 754936 1048655 973578 603396 324998 500121
34795 500121 1024069 1332184 1108455 755448 773451 941479 671182 19717 -279138 185171
34785 185171 1011550 1586949 1729935 1642521 1590477 1710173 1853756 1651674 1006749 388260
34775 388260 267248 447693 449793 373563 728759 1462984 1891973 1710193 1364529 1206989
34765 1206989 976928 477162 114612 270755 643458 760412 742307 972430 1324259 1366767
34755 1366767 1166835 1220131 1595992 1788728 1549130 1267841 1246237 1118636 500347 -123399
34745 -123399 181303 1474872 2634875 2637661 1738800 1005737 975219 1270392 1413900 1429196
34735 1429196 1512267 1611473 1613845 1598512 1609913 1452712 1009975 540159 358462 405911 416626
34724 416626 335186 268787 172878 -94128 -455035 -585964 -195770 713066 1699247 2013465
34714 2013465 1260987 46075 -506572 -72485 553542 703248 696107 970920 1121340 623625
34704 623625 -43715 5791 695314 1185998 1197299 1115202 975238 460343 -119452 -11307
34694 -11307 673817 966306 595624 418666 927615 1459803 1430085 1279915 1504663 1700644
34684 1700644 1413632 1129544 1500299 2193989 2431103 2214966 2162332 2442785 2699302 2807897
34674 2807897 3001416 3358834 3717765 3966311 4044345 3909004 3803192 4140914 4791316 5029045
34664 5029045 4628570 4378360 4960291 5989457 6838311 7711174 9041001 10447638 11315148
34655 11315148 11957767 13187024 15059064 17051188 19194795 22047945 25790124 30279585
34647 30279585 35728601 42428136 50241580 59396421 71284779 87417671 108332155 134653255
34639 134653255 167342638 203535399 232644881 241243041 224572963 191408687 155793814
34632 155793814 125769405 101565638 81596532 65953149 54567227 45864091 38535844
34625 38535844 32646401 28212819 24404986 20856339 18233179 16753043 15468880 13736039
34617 13736039 12117345 11070383 9983453 8419576 7144022 6817204 6663778 5677491
34609 5677491 4346882 3832075 4014647 3827355 3198031 3113878 3713294 3828434 2859930
34600 2859930 1814864 1774307 2328534 2384804 1809957 1342823 1307624 1342641 1258234 1334790
34590 1334790 1683935 1952247 1852376 1542097 1291164 1122656 965726 864753 826580 694483
34580 694483 412231 251662 506857 1014736 1248141 964330 563775 626553 1177192 1641328
34570 1641328 1579542 1225141 1099598 1278114 1370457 1185123 1006905 1071975 1128984 821964
34560 821964 293711 68810 402706 1005302 1382110 1258904 720339 112014 -227932 -258926
34550 -258926 -176859 -10344 453045 1148942 1497151 1090324 368782 89931 275989 292282
34540 292282 -56186 -188180 308560 1004039 1231883 908316 398294 -38950 -291240 -221667
34530 -221667 117203 335494 179432 -34216 140522 550279 592804 62100 -556916 -707489
34520 -707489 -369902 64648 317107 460409 701729 1037892 1194713 937353 369990 -175322
34510 -175322 -477306 -508722 -298467 30886 175929 -52723 -376917 -365856 -81745 33427
34500 33427 -93815 -97897 78324 46587 -191796 -15929 780033 1415187 1172280 429584
34490 429584 -17616 -121528 -292377 -417178 -99584 389479 368593 -110065 -262652 231231
34480 231231 845384 1131446 1264964 1467042 1543213 1256546 661425 -102321 -906404 -1466068
34470 -1466068 -1545063 -1326334 -1088523 -645557 221781 923981 578740 -564226 -1208250
34461 -1208250 -784234 -163921 -206194 -594997 -726082 -785771 -1098217 -1192483 -547944 274150
34451 274150 336063 -143588 -57165 861433 1623025 1473895 883218 666234 845110 907563
34441 907563 726355 623886 691730 576705 46084 -560623 -677264 -204439 381520 650020
34431 650020 695074 804204 883872 600155 25322 -297302 -46700 463971 722140 594189
34421 594189 341720 292553 577890 981974 1056623 647412 221852 308647 747145 1009572
34411 1009572 1115681 1485137 1917195 1664357 750228 233295 688391 1330106 1256256 709035
34401 709035 362480 179791 -100105 -57985 722874 1572676 1490527 693106 303354 676840
34391 676840 1122395 1186636 1108848 967949 468676 -237354 -501230 -206722 5725 -219992
34381 -219992 -506778 -554432 -573953 -668358 -598483 -426930 -560990 -870789 -655985 139124
34371 139124 600317 223177 -291459 -236185 -11873 -267119 -692148 -592650 -101561 126810
34361 126810 36996 75987 256814 197988 -70406 -160904 -89335 -204324 -400306 -167982
34351 -167982 500147 948859 770635 316001 108343 201298 313256 282616 240530 489599
34341 489599 1156533 1809623 1702381 751739 -55552 209895 1135325 1491405 903738 220368
34331 220368 196141 633990 1033560 1298484 1427406 1203092 693322 500457 942107 1408481
34321 1408481 1134784 312597 -179123 21561 416275 457430 157835 -180135 -387895 -419136
34311 -419136 -241239 60397 248961 167779 -68157 -189497 -54216 189748 222474 -83607
34301 -83607 -420356 -365974 -18144 -3258 -624091 -1298471 -1249587 -568339 -92253 -274158
34291 -274158 -701546 -833467 -685308 -532717 -399827 -230881 -249817 -704929 -1411037 -1920676
34281 -1920676 -2046803 -1900460 -1556744 -1066123 -691276 -687973 -858334 -756273 -375569 -174931
34271 -174931 -311161 -343649 54303 543191 629715 365930 129459 10777 -106616 -89849
34261 -89849 255440 632852 484808 -146243 -524016 -196960 367774 425262 -90382 -583591
34251 -583591 -578923 -165843 247561 348637 99682 -275850 -430716 -156819 383958 712188
34241 712188 416881 -393282 -1040121 -887534 -126609 280581 -288442 -1246042 -1433421 -561598
34231 -561598 445867 607620 -79637 -912836 -1331162 -1222915 -776342 -370793 -342576 -565296
34221 -565296 -537271 -138530 91860 -196732 -491613 -172078 419424 423893 -185646 -555694
34211 -555694 -301703 -29905 -224110 -436287 -128492 326387 203330 -401792 -707792 -404123
34201 -404123 17126 88360 -86508 -228549 -290650 -253832 35748 533116 835861 689871
34191 689871 411450 450348 691304 591114 -6157 -571433 -536863 28903 572336 695107
34181 695107 427848 -14800 -477456 -839003 -973918 -863276 -633530 -397642 -157242 72986
34171 72986 200433 242872 403184 725656 833876 373010 -331313 -503786 68701 702649
34161 702649 759332 490178 514022 818254 899939 706240 688627 881861 711167 17303
34151 17303 -429703 35245 941910 1304922 915042 359124 13330 -241211 -388023 -140073
34141 -140073 428180 773583 645501 412728 390920 366837 89490 -250392 -386029 -397087
34131 -397087 -401155 -228684 185307 463861 305800 17847 45565 268648 289959 164778
34121 164778 252431 525233 638849 577865 611684 673860 438005 25924 -24173 390004
34111 390004 732036 637176 345666 153071 27080 6223 368526 1055553 1462818 1198650
34101 1198650 607130 182613 -65706 -278075 -278977 39529 287769 101335 -221431 -165075
34091 -165075 190244 378792 344993 403177 526797 316673 -293390 -826289 -844641 -372064
34081 -372064 264543 661905 486081 -196088 -780413 -721579 -198116 222716 439259 786809
34071 786809 1237293 1300050 832361 319533 118942 -18039 -372422 -699809 -620221 -195087
34061 -195087 251525 591771 821991 790858 398316 -57485 -83969 442733 1099031 1300786
34051 1300786 822243 19748 -447413 -265402 172402 237656 -157423 -541173 -579384 -390482
34041 -390482 -155821 107318 277547 141218 -131093 -28190 515417 890408 704070 368718
34031 368718 372442 516031 452261 454505 872974 1217676 715412 -375869 -965947 -689515
34021 -689515 -339841 -542737 -899021 -849064 -579385 -481235 -349232 176911 809145 976280
34011 976280 732611 612817 729520 688852 359998 65371 -67522 -309231 -696952 -791965
34001 -791965 -388373 32215 -21620 -293254 -192984 264181 474290 140809 -335419 -442246
33991 -442246 -149573 210183 360035 254487 85580 200436 741062 1285453 1204372 551725
33981 551725 196381 726285 1570933 1705112 1001792 293560 151314 258798 162590 23244
33971 23244 220475 637420 839507 761360 741269 912472 952442 521770 -279637 -974433
33961 -974433 -1117821 -654795 42405 538669 778492 1022368 1307369 1285158 806995 323159
33951 323159 293651 462996 265891 -187922 -208461 329169 654214 244800 -326100 -240249
33941 -240249 316177 456345 -44221 -442788 -193842 237745 85397 -613274 -1067443 -727698
33931 -727698 154209 935638 1233686 1082961 692601 256425 -56552 -115019 78345 356864
33921 356864 536068 582858 576087 516890 304213 -41378 -261850 -131994 193406 277481
33911 277481 -106843 -702174 -1044866 -930476 -544723 -219035 -149006 -314176 -576058 -817625
33901 -817625 -997478 -1083649 -987758 -643698 -155954 217671 292254 143909 42989 190574
33891 190574 489951 580873 210479 -361766 -496657 83296 821992 925346 376185 -65508
33881 -65508 61550 350941 290738 81631 199562 512080 477886 69321 -175942 -39512
33871 -39512 75031 -140159 -452777 -575292 -566518 -488125 -175055 306344 445305 -31790
33861 -31790 -639869 -746462 -397479 -90591 -19892 -28529 -58237 -127156 -53907 280140 559011
33850 559011 434533 123111 43660 49091 -301632 -805944 -731677 49614 782740 878308
33840 878308 575798 323078 142537 -74344 -229215 -311880 -498424 -652874 -322420 417023
33830 417023 759619 293360 -307155 -300884 21247 -619 -178568 139283 792857 942931
33820 942931 441350 125486 567410 1293347 1520253 1095894 452914 60990 91779 271373
33810 271373 47187 -683454 -1112186 -408179 959354 1566406 861243 -175887 -534618
33801 -534618 -473516 -695943 -978865 -571765 390145 861269 316957 -567207 -891494 -617579
33791 -617579 -365725 -508370 -831649 -949437 -753912 -429632 -180882 -51881 403 -17548
33781 -17548 -69134 12157 333610 670108 665175 376694 302298 681073 1074538 926298 307328
33770 307328 -230363 -388452 -356606 -392202 -520784 -664360 -766138 -733562 -494376 -160977
33760 -160977 61527 166182 344805 657046 902571 910098 794238 812128 1044985 1300737
33750 1300737 1312827 1034122 740000 746467 969795 933133 377910 -295530 -468071 -75892
33740 -75892 389476 601666 691804 744201 491394 -178135 -796202 -875299 -690186 -948135
33730 -948135 -1676977 -2010418 -1334578 -201027 341854 87547 -165841 254291 1122244
33721 1122244 1814964 2093684 2036760 1581056 684616 -195210 -392599 87001 482241 295321
33711 295321 -46728 116432 701966 1064338 924942 598450 357085 93606 -277759 -521644
33701 -521644 -401395 -21803 330792 478036 360173 17965 -279644 -170626 301639 570825
33691 570825 227513 -374081 -538907 -134975 326801 480426 513386 654444 683652 288268
33681 288268 -331401 -599633 -273837 274075 518952 315663 -65733 -247944 -29813 468354
33671 468354 863450 857233 589896 474043 601369 573005 126969 -326197 -173153 531201
33661 531201 1119195 1219366 1080632 872675 315455 -559026 -868016 104346 1608257
33652 1608257 2065714 1102954 80879 246369 1152733 1550759 1225301 1054677 1524124
33643 1524124 2130510 2336884 2306027 2403543 2587458 2635543 2521469 2264621 1830072 1454689
33633 1454689 1593794 2179473 2420030 1822247 967824 680825 828997 709746 346068
33624 346068 468510 1215129 1788804 1666754 1338843 1432506 1777172 1836656 1538080 1156536
33614 1156536 819412 628905 842841 1366739 1472950 708104 -219006 -224605 619447 1145172
33604 1145172 707417 -50880 -276801 -37999 49298 -186929 -382170 -303688 -154769 -234078
33594 -234078 -562694 -892705 -986453 -868496 -779627 -843969 -897534 -778631 -621399 -608498
33584 -608498 -584049 -274120 176692 289301 -105571 -657683 -957627 -880609 -496361 -26942
33574 -26942 123198 -249238 -707338 -609648 -40619 235428 -152194 -757510 -1131076 -1367910
33564 -1367910 -1540040 -1308085 -603208 -61040 -152034 -409015 -203462 191105 114216 -282207
33554 -282207 -286295 94870 101112 -453426 -754432 -222756 567737 681969 35868 -654124
33544 -654124 -813997 -475043 22875 402713 540485 433385 163233 -154697 -425493 -634166
33534 -634166 -855526 -1085237 -1063040 -525241 280329 701529 538251 384482 730828 1138072
33524 1138072 879810 103308 -343670 -88101 475655 987295 1451015 1729210 1494040
33515 1494040 871734 431531 319196 95922 -332055 -406114 83391 461481 173934 -354478
33505 -354478 -499553 -456033 -722471 -1083095 -991008 -648531 -769144 -1366208 -1677301 -1366402
33495 -1366402 -971756 -928694 -882251 -371365 343519 620148 313421 -95305 -129159 193958
33485 193958 445620 224646 -414477 -923355 -798751 -206151 133939 -226509 -951585 -1373092
33475 -1373092 -1261385 -932378 -706034 -551526 -342428 -234326 -529842 -1163742 -1581812
33466 -1581812 -1352011 -774900 -572635 -948751 -1305627 -1069597 -473210 -196073 -447141
33457 -447141 -808900 -899928 -751608 -491352 -105509 277712 255773 -325240 -920944 -799763
33447 -799763 -2540 612780 445515 -72861 -104596 411712 682873 183713 -641259 -1050468
33437 -1050468 -965127 -825436 -755682 -431590 258634 945790 1281557 1287948 1080104 656129
33427 656129 152905 -78139 85414 318995 319871 204493 188686 175679 -14831 -245219
33417 -245219 -235659 2281 199115 188931 21780 -161959 -212884 -97980 -45249 -287437
33407 -287437 -565821 -318874 423138 847695 439633 -257627 -464606 -252976 -151778 -106126
33397 -106126 320349 939050 1041421 489245 -123899 -453073 -752179 -1138955 -1308542 -1181654
33387 -1181654 -1085123 -1050589 -694635 -85500 81454 -403880 -776664 -483076 -102919 -362216
33377 -362216 -877440 -786012 -186838 38892 -336314 -586999 -228169 306626 386022 -35560
33367 -35560 -567955 -835162 -611901 44420 646682 678360 272876 68561 260576 307739
33357 307739 -157809 -639953 -456198 224454 555071 112720 -645076 -1054778 -981589 -730384
33347 -730384 -508728 -243726 130424 424189 353089 -86320 -519560 -568133 -281922 -70842
33337 -70842 -187211 -422066 -406433 -90527 232958 323656 223570 65923 -164151 -541607
33327 -541607 -958980 -1146977 -983185 -681164 -585444 -793859 -1035832 -937572 -398899 283984
33317 283984 669434 578618 275701 202375 487961 755494 499423 -313228 -1087150 -1140579
33307 -1140579 -415381 455649 866512 897405 1038894 1327777 1186380 348807 -469974 -357697
33297 -357697 544954 1239888 1327480 1505380 2313195 3123909 3019171 2159110 1496976 1396596
33287 1396596 1362270 1092080 966332 1289510 1739147 1909646 1898286 1994700 2165949 2186665
33277 2186665 2003521 1695062 1302846 918841 712659 692922 666634 563839 538514 637655
33267 637655 679475 573099 418785 197947 -207914 -564657 -386963 258291 606480 219966
33257 219966 -374814 -523741 -385290 -458070 -649393 -534830 -218333 -167204 -363043 -340664
33247 -340664 16362 379224 581008 663955 439091 -248283 -866257 -649150 216057 706632
33237 706632 443258 155184 344460 433308 -156556 -896949 -948890 -485518 -302440 -443016
33227 -443016 -164211 778600 1656723 1732347 1061185 147512 -657063 -1166317 -1225090 -890422
33217 -890422 -485083 -218783 49520 483594 910794 1019012 784690 497718 430390 639122
33207 639122 1017343 1362629 1420005 1057764 481056 155854 388526 964276 1272752 872819
33197 872819 -31000 -714725 -621191 58266 574952 458645 55169 66069 622320 1116748
33187 1116748 1057597 741926 743530 975702 802612 82040 -490423 -325947 264426 613990
33177 613990 632454 670817 738160 501044 1139 -263273 -95806 89505 -71758 -362445
33167 -362445 -372118 -76659 243661 416500 464096 459032 469572 492017 364155 -13947 -333464
33156 -333464 -129488 478387 730106 193283 -589595 -777966 -242934 484138 977541 1166992
33146 1166992 1037303 606578 145003 -39232 -31953 -162169 -459541 -652672 -685813 -816844
33136 -816844 -1151559 -1463355 -1549035 -1411535 -1031103 -353017 367741 606952 194815 -382006
33126 -382006 -536678 -237563 79963 66575 -257000 -609828 -686543 -415003 -83238 -54215
33116 -54215 -283290 -344242 -48474 226147 37471 -489139 -784711 -500181 146880 633728
33106 633728 620075 243786 -2031 212448 643338 756584 415549 -1228 -207038 -338461
33096 -338461 -527516 -589663 -446036 -440773 -807095 -1165618 -1066781 -740142 -696333 -800633
33086 -800633 -473897 234135 559194 171372 -315500 -298202 -21082 -37704 -346170 -547707
33076 -547707 -491860 -288198 27269 385418 513047 320998 204742 475104 747583 474011
33066 474011 -119749 -313142 -38639 13239 -429855 -709739 -292720 291953 168168 -588573
33056 -588573 -1013207 -527791 391107 914067 813410 503829 378041 381324 223013 -182643
33046 -182643 -598278 -751135 -645297 -546071 -694535 -1064933 -1359657 -1235554 -626159 133553
33036 133553 618103 762417 815588 827992 534722 -65450 -426838 -162564 290101 256583
33026 256583 -152011 -274049 -48547 -120570 -665483 -944165 -432231 316652 503820 234503
33016 234503 172777 433364 547977 369544 313999 654202 1093004 1163997 742485 112380
33006 112380 -260773 -99087 330908 398431 -98395 -564360 -387846 175931 382454 47493
32996 47493 -358057 -550900 -728130 -972071 -983864 -611935 -160269 67230 161991 346816
32986 346816 619845 827954 847851 605951 171101 -150427 -118546 38495 -121025 -591191
32976 -591191 -903796 -775184 -321581 371188 1332291 2249707 2525821 2045108 1392701 1061156
32966 1061156 922566 722277 544447 468409 324277 185996 536899 1444266 2120004 1928785
32956 1928785 1353204 1220708 1366627 957494 -32550 -616413 -180467 717900 1205681
32947 1205681 1132705 944903 1003003 1366370 1911354 2342614 2306166 1752108 1063660 682624
32937 682624 721956 1000146 1274556 1367766 1239399 1020769 869156 782039 674222 558438
32927 558438 438879 117248 -571848 -1330323 -1555559 -1058988 -364178 -135628 -488342 -971517
32917 -971517 -1067486 -606741 155992 767080 966512 901362 874579 945135 955234 879319 845547
32906 845547 783380 390645 -377475 -1046533 -1096203 -571298 -8494 194870 166128 298500
32896 298500 715066 1064657 882102 135960 -675847 -1024746 -834878 -406703 -61115 -35529
32886 -35529 -484414 -1204087 -1485506 -737168 670736 1633874 1560385 979930 666391 598348
32876 598348 258713 -325308 -490404 59530 704162 662523 -8398 -537805 -463342 -165308
32866 -165308 -272175 -795273 -1130125 -872757 -350519 -192331 -539458 -918892 -871574 -470466
32856 -470466 -120836 -16276 22785 201524 412891 347298 -99750 -629438 -803199 -475251
32846 -475251 84141 469836 482317 212176 -112186 -323905 -413704 -445887 -385146 -112791
32836 -112791 305998 540064 398768 186871 323491 676979 709205 315840 12518 94705
32826 94705 145649 -238797 -692248 -583070 3499 357844 98499 -467170 -867547 -903393
32816 -903393 -612866 -225198 -110273 -392333 -700121 -682617 -576454 -730848 -787053 -105392
32806 -105392 1016283 1448268 803326 54447 116121 572009 492678 -75249 -304567 24305
32796 24305 235874 -110071 -578992 -619931 -390782 -410320 -709513 -805304 -480812 -183916
32786 -183916 -435260 -1055222 -1333324 -979333 -513457 -475619 -608879 -298991 377299 660627
32776 660627 202832 -445611 -653905 -508049 -488820 -771016 -1182674 -1522653 -1584433 -1171281
32766 -1171281 -428994 115892 183613 123273 325259 573485 417744 -89107 -526345 -757854
32756 -757854 -904390 -825168 -249969 582114 1013885 807522 380486 85564 -211603 -612734
32746 -612734 -765905 -368394 246975 470016 194854 -132121 -151860 68731 297880 381532
32736 381532 178531 -374852 -936129 -810617 278527 1591158 1985776 1228389 300049
32727 300049 192567 764058 1133225 880301 333003 -153865 -554192 -776517 -562655 -6016
32717 -6016 365461 312754 216421 372412 455467 118703 -316131 -318851 14549 173049 71855
32706 71855 90937 371744 644797 760471 886929 1112706 1266116 1206465 967957 594417
32696 594417 143754 -162865 -125208 124180 297364 358910 417465 358241 52081 -178560
32686 -178560 111471 683302 770105 201231 -239685 116437 915080 1331738 1132499 735924
32676 735924 488559 353097 231137 206059 399752 774607 1126775 1234514 1057483 787561
32666 787561 605515 434990 105845 -308694 -572672 -661252 -749304 -846553 -796300 -648792
32656 -648792 -635717 -713931 -568354 -176144 100389 144651 288673 620003 634531 14632
32646 14632 -714579 -859308 -544262 -410492 -544738 -388974 293070 977886 1072370 592862
32636 592862 -33507 -490709 -673493 -521570 -28786 631672 1137254 1215745 859038 376284
32626 376284 143925 216246 290510 156383 8705 122233 370780 350164 -65596 -533364
32616 -533364 -607381 -135867 648396 1258488 1271311 749874 282830 356774 743834 783911
32606 783911 239123 -440752 -719318 -516957 -77202 383162 709606 742406 455040 54119
32596 54119 -229012 -376795 -498919 -593008 -532524 -268567 65343 274515 286224 176137
32586 176137 -862 -343477 -925547 -1467795 -1428888 -631463 364309 800365 561295 174882
32576 174882 23289 -47066 -237451 -340693 -73850 381782 527456 173252 -346583 -601428
32566 -601428 -537777 -478116 -706855 -1071814 -1051210 -357710 543410 785187 98701 -783002
32556 -783002 -943643 -314447 384544 575424 341077 65099 -59234 -51390 36839 146073
32546 146073 203571 217045 273051 376245 402191 267088 46565 -106437 -80455 120345
32536 120345 290263 100739 -490685 -969327 -748336 34151 584504 451881 55689 -19167
32526 -19167 153031 105935 -232770 -495433 -458145 -230967 43859 284372 345925 205670
32516 205670 176885 500866 815967 554479 -161161 -607810 -512402 -382051 -596296 -807357
32506 -807357 -580860 -76796 307770 474678 384982 -174793 -1024038 -1288213 -419263 796597
32496 796597 1059963 243406 -560380 -657175 -534197 -782896 -1057271 -660985 309898 1011041
32486 1011041 873084 154793 -472651 -595195 -303145 41583 217033 316798 490111 624126
32476 624126 501154 236287 261150 762660 1360780 1503562 1062756 416080 6895 -90723
32466 -90723 -169144 -449022 -691016 -423501 378983 1099346 1157483 650851 62375 -397238
32456 -397238 -769502 -913006 -624916 -125654 97211 -48667 -207794 -191338 -163798 -188896
32446 -188896 -110395 18345 -100434 -469775 -707870 -647084 -538959 -512515 -355465 -33022
32436 -33022 118426 -38698 -220563 -324730 -650094 -1177663 -1292802 -724955 -152934 -249117
32426 -249117 -653003 -623465 -266297 -248835 -550433 -434310 312511 937112 740719 -64790
32416 -64790 -780650 -1055754 -1030232 -937169 -810258 -507581 29714 522422 520869 -40059
32406 -40059 -682825 -977504 -994044 -905268 -539331 210535 868792 869073 372041 4559 -68447
32395 -68447 -191529 -445343 -516673 -364029 -342924 -545699 -625049 -434270 -264769 -252052
32385 -252052 -115965 242143 415899 116456 -311566 -379767 -155938 -120933 -519118 -1109804
32375 -1109804 -1428217 -1170602 -509129 -72033 -332500 -978556 -1243036 -909270 -538564
32366 -538564 -562556 -661285 -348445 245252 563052 335092 -218936 -696868 -792134 -489248
32356 -489248 -163143 -214353 -465626 -307097 362847 833467 569545 11736 -118721 110808
32346 110808 126245 -92972 -12257 450533 669211 232395 -471581 -840807 -770699 -532628
32336 -532628 -349157 -367771 -702885 -1177643 -1294040 -801333 -106755 196478 54234 -112147
32326 -112147 -50806 109645 218581 265855 163283 -232135 -757188 -966779 -697219 -289752
32316 -289752 -71153 35166 136440 22210 -401772 -695006 -448400 -8392 95 -307936
32306 -307936 -282193 107197 184060 -235570 -471754 -151537 128112 -163195 -596455 -599273
32296 -599273 -433652 -548754 -597581 -54362 679081 825197 543703 605846 984326 933654
32286 933654 425475 301236 823074 1199185 886140 366885 226317 337771 395234 448742
32276 448742 495298 301385 9653 129107 560613 531083 -53738 -190068 639882 1439829
32266 1439829 1116549 96205 -442181 -262007 21538 152356 272006 178346 -352542
32257 -352542 -786261 -437075 331894 541056 90204 -213250 -52273 56945 -102159 -52735
32247 -52735 359412 518592 33188 -581224 -655664 -220832 263334 517900 460650 86990
32237 86990 -346086 -416711 -88979 180382 78104 -183382 -280072 -198690 -84918 -19313
32227 -19313 -71926 -242643 -277094 84407 633111 879750 728852 485625 192693 -424008
32217 -424008 -1234618 -1597142 -1240647 -679189 -444628 -455498 -471860 -600159 -899159 -981599
32207 -981599 -536060 106978 414020 355769 229574 75359 -239283 -579296 -687051 -626951
32197 -626951 -640152 -676503 -514878 -275397 -359399 -841399 -1283013 -1244938 -752252 -204957
32187 -204957 320 -233793 -625613 -759900 -549165 -368227 -570848 -989088 -1142146 -868272
32177 -868272 -477121 -259142 -107328 234884 698980 865675 450948 -299228 -839345 -942621
32167 -942621 -906165 -1049339 -1237414 -1154092 -863411 -705541 -681405 -394928 277115 870620
32157 870620 919469 539570 161772 -68008 -313868 -629452 -828592 -757842 -488688 -220298
32147 -220298 -103684 -160113 -304599 -440339 -517118 -478913 -255381 85078 296138 249242
32137 249242 144978 193676 228979 -29383 -448327 -646911 -642152 -829058 -1249561 -1401149
32127 -1401149 -974828 -336329 -10498 -54079 -213255 -385125 -619996 -876442 -1018423 -931481
32117 -931481 -562922 -45997 224911 -27534 -503890 -647705 -432891 -336146 -489228 -478438
32107 -478438 -138081 124691 52249 -91425 -177487 -497345 -972494 -892063 -59016 584894
32097 584894 289860 -242436 80997 970936 1186570 433395 -352136 -538110 -474389 -527452
32087 -527452 -508864 -339719 -343159 -517251 -359417 165967 273830 -478125 -1313806 -1177333
32077 -1177333 -147820 690207 588297 -130533 -592523 -313594 347645 559049 -61472
32068 -61472 -928566 -1169200 -738330 -365608 -372417 -233068 376317 783926 229068 -847197
32058 -847197 -1198914 -399459 612134 762103 79667 -593703 -732210 -512540 -251389
32049 -251389 2627 193094 55284 -423114 -658476 -145050 649336 720188 -59845 -679688
32039 -679688 -439733 61723 -74612 -721125 -1143757 -1235054 -1395508 -1487349 -950084 59153
32029 59153 626823 367806 -91871 -159740 -34399 -112273 -334201 -491587 -604559 -651138
32019 -651138 -433146 -6966 246142 216203 199783 243115 -8947 -541268 -756401 -431099
32009 -431099 -191204 -526929 -977481 -892522 -443356 -220959 -295538 -354686 -392131 -562430
31999 -562430 -634511 -271069 320596 610457 490981 304661 270954 332671 426082 517435
31989 517435 532809 533001 674934 757556 284706 -655773 -1159318 -694712 41239 124563 -288917
31978 -288917 -446965 -276028 -222621 -215154 141386 536750 221944 -704712 -1294690 -1120767
31968 -1120767 -725952 -600164 -621860 -669286 -883588 -1097230 -842882 -183636 240424 191722
31958 191722 62484 -28856 -444054 -1096799 -1337986 -1151655 -1414234 -2398742 -3044807 -2479974
31948 -2479974 -1372151 -882405 -1026594 -1049090 -810854 -745050 -832670 -673415 -379337 -453620
31938 -453620 -862361 -1054885 -868896 -666791 -589630 -388027 -36669 124754 -39436 -254266
31928 -254266 -242700 61842 622277 1184513 1241249 648503 91018 297489 943609 1068558
31918 1068558 514660 130019 440656 936768 943772 487847 -52685 -536515 -893123 -878061
31908 -878061 -426938 111978 436822 633520 781172 637913 89046 -455891 -530169 -218765
31898 -218765 57312 123425 70390 -77874 -337385 -553574 -550077 -387826 -233437 -114754
31888 -114754 -28948 -97796 -355786 -573932 -564903 -470615 -466246 -397703 -55603 385766 594109
31877 594109 593231 633659 660293 372304 -208274 -680853 -821557 -773826 -626761 -260950 234078
31866 234078 435547 149567 -248002 -331984 -211392 -274561 -582977 -881576 -1057573 -1193647
31856 -1193647 -1218650 -908411 -314879 131791 111676 -208449 -445595 -482569 -501989 -648586
31846 -648586 -862929 -1040630 -1183816 -1322519 -1379035 -1215448 -821228 -389559 -157794 -187402
31836 -187402 -349857 -513011 -643301 -696169 -552572 -206704 81394 33304 -263596 -443904
31826 -443904 -371295 -308154 -471819 -683773 -665388 -456598 -263545 -77369 200338 381223
31816 381223 185437 -192830 -198720 267119 606719 360071 -127748 -252240 -43610 -40259
31806 -40259 -437755 -856874 -935534 -714392 -381524 -27349 224774 177150 -172662 -543583
31796 -543583 -697237 -674549 -603333 -459971 -156228 261097 588749 574388 94119 -595801
31786 -595801 -869249 -330093 575003 930156 460616 -128185 -133911 240847 338391 46988
31776 46988 -169499 -84544 -5472 -220383 -596175 -854763 -895677 -680831 -111388 717741
31766 717741 1316245 1153396 252286 -723250 -1068664 -703916 -172684 42008 78666 404582
31756 404582 1042515 1430633 1184533 669364 516650 793872 1016512 864786 510489 261523
31746 261523 225198 337258 428420 266801 -170361 -506468 -400946 -136174 -315616 -932169
31736 -932169 -1261594 -873247 -239492 -25543 -217354 -359592 -296769 -205960 -153255 -111232
31726 -111232 -240878 -648529 -958918 -658982 105038 555982 241159 -423148 -730169 -512804
31716 -512804 -218826 -353607 -978670 -1630479 -1694510 -1013152 -116670 337619 309508 297921
31706 297921 569262 848334 852945 719043 657986 522535 50792 -639658 -1127239 -1180579
31696 -1180579 -910182 -473675 84337 633939 847109 503576 -132486 -457951 -187657
31687 -187657 260503 276785 -94252 -200983 195922 429644 -126551 -997267 -1141289 -406839
31677 -406839 261146 124483 -525951 -1034440 -1193935 -1081285 -701682 -224487 -50373 -192058
31667 -192058 -72727 589765 1198090 1109199 545419 55695 -391565 -984962 -1244486 -646587
31657 -646587 223240 276759 -403624 -664275 -134781 251212 -80179 -387479 49171 706717
31647 706717 770899 455321 437400 644195 593684 452323 717858 1160794 1118983 708470
31637 708470 728475 1316364 1629459 1081447 136160 -404885 -316723 74110 321911 100194
31627 100194 -516116 -899401 -502260 296916 578859 199665 -9577 405991 783261 436088
31617 436088 -241426 -477654 -381338 -626075 -1156261 -1139248 -272608 647522 760475 202290
31607 202290 -230467 -130354 203459 354461 326870 400118 621528 643722 154779 -618617
31597 -618617 -1043055 -783477 -205965 48215 -254818 -826521 -1256549 -1308892 -942749 -326078
31587 -326078 177971 278865 56162 -177386 -300347 -453675 -666630 -689843 -369312 6471
31577 6471 -15587 -473685 -914130 -945187 -686926 -536824 -615601 -678839 -578618 -529338 -726531
31566 -726531 -911612 -651387 -9133 424053 274373 -156133 -378203 -381085 -480654 -668893
31556 -668893 -543108 58184 704547 874353 616242 458885 705393 1055245 1031904 640074
31546 640074 385214 615907 1052312 1143153 779365 397764 370731 571411 669677 605061
31536 605061 522544 408476 118489 -261708 -413943 -243901 -60848 -114246 -184639 53993
31526 53993 385977 196975 -620827 -1308176 -1124102 -345538 78910 -206621 -583703 -452452
31516 -452452 -42031 117093 56203 159187 369411 225762 -374781 -1002125 -1301711 -1290648
31506 -1290648 -1024066 -492089 50244 173982 -114585 -303348 -87845 277180 473459
31497 473459 462116 183176 -472436 -1137117 -1096479 -346544 165914 -121654 -531634 -316026
31487 -316026 61878 -194774 -652795 -238561 861555 1267153 496695 -300420 -121842
31478 -121842 518553 637997 258969 26999 28884 -138217 -502449 -701114 -636420 -528879
31468 -528879 -447596 -289216 -100097 11420 145953 401358 546085 302516 -176286 -487207
31458 -487207 -509225 -418555 -340954 -349760 -616125 -1131732 -1440164 -1120152 -440221 -49977
31448 -49977 -84082 -92716 142993 300396 149166 -43040 12697 185947 255369 295459 390185
31437 390185 286997 -229809 -821913 -930723 -586856 -435173 -845765 -1370288 -1305912 -563152
31427 -563152 279654 646449 432573 -110056 -653550 -921824 -808449 -497719 -292573 -226717
31417 -226717 -47449 314886 538871 385499 103967 47589 121987 19285 -191320 -208594
31407 -208594 -123385 -312758 -696216 -716031 -205803 319151 469333 483561 599791 523082
31397 523082 6157 -528556 -513695 -38466 398171 613564 691527 538464 104942 -204713
31387 -204713 6038 436993 507844 291180 323182 613068 649843 393302 385098 694025
31377 694025 621295 -150288 -869312 -732597 -29648 335953 86884 -274863 -339164 -241403
31367 -241403 -283465 -530324 -828924 -962322 -766721 -285927 181432 316846 77686 -277955
31357 -277955 -433814 -305483 -150593 -299928 -668979 -717157 -125336 685628 1058937 940457
31347 940457 775228 740740 653913 543736 639603 766335 468187 -145134 -420350 -218556
31337 -218556 -149803 -451608 -498775 82979 657179 590990 279659 378587 666931 561976
31327 561976 230587 227506 430815 334140 109283 350072 916534 1054035 624355 245023
31317 245023 178039 40709 -271866 -316548 42936 357358 373864 293624 84442 -586878
31307 -586878 -1499385 -1858717 -1464399 -1028293 -973690 -835692 -313282 37382 -204553 -508714
31297 -508714 -313655 2903 -118716 -369829 -143762 415321 799889 1049852 1381194 1405364
31287 1405364 706746 -205471 -555869 -585148 -1081171 -1872084 -1986490 -1264922 -600842 -446908
31277 -446908 -258907 279642 606624 337934 3031 137054 432438 392772 154461 65686
31267 65686 40125 -92956 -130885 55138 139280 -30885 22495 575797 943342 377956
31257 377956 -621283 -814026 75797 1003361 1013910 269581 -511195 -983352 -1204301 -1194403
31247 -1194403 -907314 -493739 -289721 -491205 -904850 -1081341 -804331 -442022 -575013
31238 -575013 -1178705 -1501006 -1007653 -140715 247300 -15410 -354026 -338947 -137539 -66654
31228 -66654 -159706 -301497 -434080 -469084 -254027 217723 718286 996817 981624 769691
31218 769691 517514 297636 -12167 -545717 -1045363 -929349 -51419 871714 1021767 513865
31208 513865 208110 567633 1189259 1468365 1242235 686162 15222 -544520 -804769 -760547
31198 -760547 -485024 44473 697968 948024 422856 -355925 -442077 246448 782773 560291
31188 560291 57204 -54287 145974 282173 472598 981516 1461905 1244481 252586 -868768
31178 -868768 -1427718 -1153492 -241178 688293 949008 526648 181352 420570 753558 495605
31168 495605 -102646 -267674 36000 118048 -238983 -465029 -211965 111821 86307 -94012
31158 -94012 -77121 72265 96949 -24756 -139938 -118185 143339 575698 748010 272732
31148 272732 -519492 -838277 -507827 -200849 -372292 -587376 -296553 283719 561315 409391
31138 409391 124562 -97057 -171567 41647 432263 483308 -55281 -617972 -501410 131484
31128 131484 489720 234751 -228411 -418851 -207131 317160 878234 1018352 603709 203635
31118 203635 374564 701562 288517 -821395 -1558785 -1339510 -823056 -780763 -972145 -733515
31108 -733515 -113673 266101 160283 -127267 -350165 -557537 -793433 -983093 -1079198 -1012608
31098 -1012608 -612388 104268 692160 683270 156605 -405715 -733085 -913835 -1031307 -1031658
31088 -1031658 -943513 -903680 -946349 -1011596 -1106039 -1184347 -977200 -305639 480314 784403
31078 784403 521520 218536 305360 681539 1057372 1301631 1292361 848471 96353 -412032
31068 -412032 -273652 258635 598262 492650 155674 -92169 -86316 141246 375732 377388
31058 377388 155699 -69837 -263522 -634842 -1142006 -1317981 -929274 -458614 -460318 -714735
31048 -714735 -618697 -241633 -255782 -770410 -1022976 -558907 -30946 -254935 -947149 -1118522
31038 -1118522 -516164 86514 104300 -64750 190660 660756 632537 30093 -395641 -122970
31028 -122970 424772 549375 286932 244302 584628 766871 408451 -120408 -260601 -14876
31018 -14876 247074 400809 503329 358390 -255510 -972839 -1062027 -394011 311095 413240
31008 413240 104646 -16824 237894 559272 598957 243798 -366184 -869096 -921277 -585993
30998 -585993 -279891 -216740 -212901 -182020 -371880 -797305 -902068 -300894 471533 561972
30988 561972 -24379 -466419 -292781 106132 191544 -81628 -512619 -1021615 -1467265 -1480320
30978 -1480320 -846784 111995 796179 879081 490277 -5470 -292848 -289550 -148646 -27777
30968 -27777 120713 416432 777307 961828 834507 420250 -186876 -738697 -829484 -334579
30958 -334579 267757 411433 161084 -45291 -212165 -678786 -1226475 -1118712 -268948 421846
30948 421846 308976 -131934 -210487 -95583 -270001 -490954 -181364 497238 880481 914397
30938 914397 1102788 1410328 1215457 519081 223062 773692 1335842 925489 -207166
30929 -207166 -980574 -896414 -409366 -90488 -36539 -86740 -129438 -112164 -78448 -234919 -692898
30918 -692898 -1126240 -1008795 -299059 375585 384617 -214108 -791143 -835889 -389791 123020
30908 123020 327574 160304 -162121 -362317 -331459 -184935 -94864 -97347 -117097 -140954 -231957
30897 -231957 -350783 -348130 -250991 -356889 -800685 -1177568 -956991 -242665 277106 204934
$$ [...]
##END NTUPLES=NMR SPECTRUM
##END=
