##TITLE=31Pdec_LR-742-RM4
 , 24 sc
 9.11.2021
##JCAMPDX= 6.0         $$ Bruker NMR JCAMP-DX V2.0
##DATA TYPE= NMR SPECTRUM
##DATA CLASS= NTUPLES
##ORIGIN= UXNMR, Bruker Analytische Messtechnik GmbH
##OWNER= root
$$ XWIN-NMR		Version 3.5
$$ Tue Nov  9 10:59:06 2021 Russian Standard Time (UT+4h)  she@DPX200
##.OBSERVE FREQUENCY= 81.013821
##.OBSERVE NUCLEUS= ^31P
##.ACQUISITION MODE= SIMULTANEOUS
##.ACQUISITION SCHEME= undefined
##.AVERAGES= 24
##.DIGITISER RES= 16
##SPECTROMETER/DATA SYSTEM= spect
##.PULSE SEQUENCE= zgpg30
##.SOLVENT NAME= Acetone
##.SHIFT REFERENCE= (INTERNAL, Acetone, 0, 248.564)
##AUDIT TRAIL= $$ (NUMBER, WHEN, WHO, WHERE, WHAT)
$$ ##TITLE= Audit trail, XWIN-NMR		Version 3.5
$$ ##JCAMPDX= 5.01
$$ ##ORIGIN= Bruker BioSpin GmbH
$$ ##OWNER= she
$$ F:/spectra/data/she/nmr/P31/1/pdata/1/auditp.txt
$$ ##AUDIT TRAIL=  $$ (NUMBER, WHEN, WHO, WHERE, WHAT)
(   1,<2021-11-09 10:57:53.00 +0400>,<she>,<DPX200>,
      <created by zg, POWCHK disabled, PULCHK disabled
       configuration hash MD5:
       00 E9 B6 7A A2 85 ED C7 34 08 36 98 17 FE 4E 26
       data hash MD5: 32K
       D6 B2 FE F1 23 2B 69 CF 1D 01 C8 C0 ED 89 BD 51>)
(   2,<2021-11-09 10:58:10.89 +0400>,<she>,<DPX200>,
      <Start of raw data processing
       efp BC_mod = 2 LB = 1 FT_mod = 6 PKNL = 1 PHC0 = -8867.128 PHC1 = 170.8694 SI = 64K 
       data hash MD5: 64K
       85 09 DA F6 B5 18 FA 59 0D 64 79 F6 C2 CE 1A 36>)
(   3,<2021-11-09 10:58:30.51 +0400>,<she>,<DPX200>,
      <pk PHC0 = 25.01816 PHC1 = -53.2 
       data hash MD5: 64K
       66 2B CB AA 6A C2 0B A0 8E C0 09 55 65 B7 3A A2>)
(   4,<2021-11-09 10:58:34.18 +0400>,<she>,<DPX200>,
      <abs ABSG = 5 
       data hash MD5: 64K
       5D AD 8B 47 60 00 B3 D4 22 EE 38 95 DD D3 A6 9E>)
$$ ##END=
$$ 
$$ hash MD5
$$ 19 08 57 D3 17 19 5B 96 2B 2F E0 EE 3C D2 F5 1E
##$RELAX= 
##$RELAX= 
##$RELAX= 
##$RELAX= 
##$RELAX= 
##$RELAX= 
##$RELAX= 
##$RELAX= 
$$ Bruker specific parameters
$$ --------------------------
##$DU= <F:/spectra>
##$EXPNO= 1
##$NAME= <P31>
##$PROCNO= 1
##$TYPE= <nmr>
##$USER= <she>
##$AMP= (0..31)
100 100 100 100 100 100 100 100 100 100 100 100 100 100 100 100 100 100 
100 100 100 100 100 100 100 100 100 100 100 100 100 100 
##$AQSEQ= 0
##$AQ_mod= 1
##$AUNM= <au_zg>
##$AUTOPOS= <>
##$BF1= 81.014009
##$BF2= 200.13
##$BF3= 200.13
##$BF4= 200.13
##$BF5= 200.13
##$BF6= 200.13
##$BF7= 200.13
##$BF8= 200.13
##$BYTORDA= 1
##$CFDGTYP= 0
##$CFRGTYP= 5
##$CHEMSTR= <none>
##$CNST= (0..31)
1 1 145 1 1 1 1 1 1 1 1 1 1 1 1 1 1 1 1 1 1 1 1 1 1 1 1 1 1 1 1 1 
##$CPDPRG= <waltz16>
##$CPDPRG1= <>
##$CPDPRG2= <waltz16>
##$CPDPRG3= <>
##$CPDPRG4= <mlev>
##$CPDPRG5= <mlev>
##$CPDPRG6= <mlev>
##$CPDPRG7= <mlev>
##$CPDPRG8= <mlev>
##$CPDPRGB= <>
##$CPDPRGT= <>
##$D= (0..31)
0 1 0 0 0 0 0 0 0 0 0 0.03 2e-05 3e-06 0 0 0 0 0 0 0 0 0 0 0 0 0 0 0 0 
0 0 
##$DATE= 1636441072
##$DBL= (0..7)
120 120 120 11 120 120 24 19 
##$DBP= (0..7)
150 150 150 150 150 150 150 150 
##$DBP07= 0
##$DBPNAM0= <>
##$DBPNAM1= <>
##$DBPNAM2= <>
$$ [...]
##$SUBNAM3= <"">
##$SUBNAM4= <"">
##$SUBNAM5= <"">
##$SUBNAM6= <"">
##$SUBNAM7= <"">
##$SUBNAM8= <"">
##$SUBNAM9= <"">
##$SW= 501.771253377433
##$SWIBOX= (0..15)
0 1 3 0 0 0 0 0 0 0 0 0 0 0 0 0 
##$SW_h= 40650.406504065
##$TD= 32768
##$TD0= 1
##$TE= 0
##$TE2= 300
##$TE3= 300
##$TEG= 300
##$TL= (0..7)
0 120 53 12 22 120 120 120 
##$TP= (0..7)
150 150 150 150 150 150 150 150 
##$TP07= 0
##$TPNAME0= <>
##$TPNAME1= <>
##$TPNAME2= <>
##$TPNAME3= <>
##$TPNAME4= <>
##$TPNAME5= <>
##$TPNAME6= <>
##$TPNAME7= <>
##$TPOAL= (0..7)
0.5 0.5 0.5 0.5 0.5 0.5 0.5 0.5 
##$TPOFFS= (0..7)
0 0 0 0 0 0 0 0 
##$TUNHIN= 0
##$TUNHOUT= 0
##$TUNXOUT= 0
##$USERA1= <user>
##$USERA2= <user>
##$USERA3= <user>
##$USERA4= <user>
##$USERA5= <user>
##$V9= 5
##$VALIST= <valist>
##$VCLIST= <CCCCCCCCCCCCCCC>
##$VD= 0
##$VDLIST= <DDDDDDDDDDDDDDD>
##$VPLIST= <PPPPPPPPPPPPPPP>
##$VTLIST= <TTTTTTTTTTTTTTT>
##$WBST= 1024
##$WBSW= 4
##$XGAIN= (0..3)
0 0 0 0 
##$XL= 0
##$YL= 0
##$YMAX_a= 14491
##$YMIN_a= -18334
##$ZGOPTNS= <>
##$ZL1= 120
##$ZL2= 120
##$ZL3= 120
##$ZL4= 120
##$ABSF1= 248.5645
##$ABSF2= -253.2056
##$ABSG= 5
##$ABSL= 3
##$ALPHA= 0
##$AQORDER= 0
##$ASSFAC= 0
##$ASSFACI= 0
##$ASSFACX= 0
##$ASSWID= 0
##$AUNMP= <proc_1d>
##$AZFE= 0.1
##$AZFW= 0.5
##$BCFW= 0
##$BC_mod= 2
##$BYTORDP= 0
##$COROFFS= 0
##$CY= -3
##$DATMOD= 1
##$DC= 0
##$DFILT= <>
##$DTYPP= 0
##$F1P= 0
##$F2P= 0
##$FCOR= 1
##$FTSIZE= 65536
##$FT_mod= 6
##$GAMMA= 0
##$GB= 0
##$INTBC= 1
##$INTSCL= 5.30512e-09
##$ISEN= 30
##$LB= 1
##$LEV0= 0
##$LPBIN= 0
##$MAXI= 10000
##$MC2= 0
##$MEAN= 0
##$ME_mod= 0
##$MI= 50
##$NCOEF= 0
##$NC_proc= -5
##$NLEV= 6
##$NOISF1= 182.463
##$NOISF2= 159.3651
##$NSP= 0
##$NTH_PI= 0
##$NZP= 0
##$OFFSET= 248.5645
##$PC= 4
##$PHC0= -8842.109
##$PHC1= 117.6694
##$PH_mod= 1
##$PKNL= yes
##$PPARMOD= 0
##$PSCAL= 0
##$PSIGN= 0
##$REVERSE= no
##$SF= 81.014009
##$SI= 65536
##$SIGF1= 159.3651
##$SIGF2= -187.1042
##$SINO= 113.3802
##$SIOLD= 16384
##$SREGLST= <1H.CDCl3>
##$SSB= 0
##$STSI= 65536
##$STSR= 0
##$SW_p= 40650.406504065
##$SYMM= 0
##$S_DEV= 0
##$TDeff= 32768
##$TDoff= 0
##$TI= <>
##$TILT= no
##$TM1= 0
##$TM2= 0
##$TOPLEV= 0
##$USERP1= <user>
##$USERP2= <user>
##$USERP3= <user>
##$USERP4= <user>
##$USERP5= <user>
##$WDW= 1
##$XDIM= 65536
##$YMAX_p= 425025056
##$YMIN_p= -42793900
$$ End of Bruker specific parameters
$$ ---------------------------------
##NTUPLES= NMR SPECTRUM
##VAR_NAME=  FREQUENCY,     SPECTRUM/REAL,   SPECTRUM/IMAG
##SYMBOL=    X,             R,               I
##VAR_TYPE=  INDEPENDENT,   DEPENDENT,       DEPENDENT
##VAR_FORM=  AFFN,          ASDF,            ASDF
##VAR_DIM=   65536,         65536,           65536
##UNITS=     HZ,            ARBITRARY UNITS, ARBITRARY UNITS
##FACTOR=    0.620285442955139, 1,           1
##FIRST=     20137.2065510759, 0,            0
##LAST=      -20513.1999529892, 0,           0
##MIN=       -20513.1999529892, -42793900,   0
##MAX=       20137.2065510759, 425025056,    0
$$ Real data points
##PAGE= N=1
##DATA TABLE= (X++(R..R)), XYDATA
$$ [...]
39819 1345834 924944 792847 984102 1049504 777818 553211 698464 949607 972396 913338
39809 913338 943347 730904 19609 -643860 -523092 185969 640418 641101 768218 1179429
39799 1179429 1211598 524816 -167598 -71151 556692 852097 546970 130560 38075 239100
39789 239100 535167 767170 723781 259432 -416727 -856913 -841791 -530352 -167120 105231
39779 105231 143127 -177856 -709062 -1012620 -786926 -228049 158935 73426 -330181 -665449
39769 -665449 -704483 -540750 -424301 -490926 -661530 -761367 -688372 -487972 -330497 -403339
39759 -403339 -726073 -1041139 -994548 -523377 -14074 51501 -350846 -675920 -364271 490772
39749 490772 1169461 1114943 565602 201718 263185 360533 195569 31781 185500 422861
39739 422861 297515 -127994 -376881 -273491 -82745 40078 234837 487842 471134 17544
39729 17544 -593774 -971995 -926891 -402959 472600 1193965 1242398 829199 743152 1220753
39719 1220753 1565502 1243805 701657 537940 498007 80849 -332284 52609 1027753 1443189
39709 1443189 774103 -235061 -701057 -604851 -368900 -137284 93914 166398 39580 11280
39699 11280 279553 588264 615405 419248 240576 179024 300071 689340 1123519 1084947
39689 1084947 450129 -198696 -308965 -38990 175824 314776 517584 529825 72916 -461712
39679 -461712 -404664 173257 517350 298650 9971 109015 381334 431753 307764 272200
39669 272200 292698 118053 -307862 -760267 -965114 -802635 -405566 -95949 -59394 -96037
39659 -96037 83582 380241 458000 332261 363322 609842 681629 407924 177883 360109
39649 360109 806506 1206230 1496619 1593479 1175690 205270 -708974 -988536 -842864 -832923
39639 -832923 -959104 -798460 -355217 -77451 -64896 53014 362167 437870 77546 -315353
39629 -315353 -370907 -301092 -469820 -784529 -872369 -613219 -198687 147606 279562 155842
39619 155842 -39498 132 301659 518020 386855 30971 -361197 -831460 -1361544 -1596142
39609 -1596142 -1244352 -587533 -209548 -291358 -482538 -429288 -160172 38330 -76702 -503952
39599 -503952 -947701 -1034342 -704516 -278869 -30326 109512 265941 310438 101180 -191297
39589 -191297 -311305 -283612 -236197 -70055 302175 575552 391299 -38414 -154947 96885
39579 96885 157041 -300205 -866303 -955897 -527056 -28627 151832 32849 -25159 317463
39569 317463 956140 1368853 1256904 960323 907442 910358 539166 -9552 -137042 122700
39559 122700 118053 -260432 -330827 160276 476020 70368 -513965 -624769 -599500 -985724
39549 -985724 -1306558 -724610 418189 913701 478155 99411 434271 903217 763105
39540 763105 210932 -109020 -66505 19657 -33437 -209610 -480357 -690984 -567365 -143182
39530 -143182 129081 -21023 -286862 -280994 -111443 -136560 -405085 -663474 -727938 -589987
39520 -589987 -329400 -106933 -32688 72619 474815 986818 1082424 726655 530685 759570
39510 759570 826842 319428 -102100 354420 1205067 1218794 214526 -668426 -595841 -3478
39500 -3478 340992 378628 385136 272639 -89768 -335782 -73065 359182 261934 -362661 -711675
39489 -711675 -252543 551033 804442 211144 -698763 -1245120 -1257849 -1019379 -752940 -419840
39479 -419840 -32453 142071 -65724 -371860 -376989 -154668 -108279 -284446 -311963 -112235
39469 -112235 -143164 -660857 -1184729 -1088233 -404647 350514 878114 1164195 1082539 493667
39459 493667 -294002 -678193 -480718 -127343 -12397 -42939 39923 205005 211832 -44961
39449 -44961 -444937 -770208 -824877 -562217 -176429 52768 48487 -63088 -222234 -469271
39439 -469271 -674703 -536739 -7247 523369 669980 491152 280895 121373 -80309 -253312
39429 -253312 -203181 29449 159075 54605 -112810 -194610 -275081 -416759 -432437 -137326
39419 -137326 316377 602570 640388 593050 477212 87141 -579884 -1101558 -1081430 -674706
39409 -674706 -387356 -401619 -394932 -81860 353960 551499 490059 446150 508162 425954 20268
39398 20268 -479620 -680868 -504808 -227365 -58379 110030 426846 719348 644360 188019
39388 188019 -235206 -294140 -144083 -127181 -240926 -202784 16151 71842 -246600 -687240
39378 -687240 -900003 -920804 -1046502 -1319653 -1380441 -882530 47106 824213 910252 336212
39368 336212 -319508 -551054 -428741 -334058 -352687 -280760 -170161 -360880 -813969 -917541
39358 -917541 -311433 489770 749385 497723 356202 545415 624904 216648 -495307 -1072254
39348 -1072254 -1254476 -1012753 -496381 -10514 223895 322562 501170 632876 383131 -223714
39338 -223714 -750894 -906587 -793491 -559750 -203395 174404 323968 227227 195679 436186
39328 436186 810485 1113275 1238938 996524 212203 -805819 -1364905 -1218178 -887628
39319 -887628 -873105 -966824 -731671 -275917 -79509 -296671 -665258 -916137 -881970 -409375
39309 -409375 395778 980536 854874 242767 -154088 -13276 322709 396826 157760 -105474
39299 -105474 -132504 34663 63831 -285184 -758159 -859749 -608627 -616873 -1147426 -1571330
39289 -1571330 -1243736 -507536 -181193 -332019 -317111 64783 277417 14964 -284719 -193803
39279 -193803 34776 -52582 -370868 -443456 -63618 490448 772617 552782 43222 -196732
39269 -196732 186138 836335 1034180 603741 124083 116758 414504 563912 494751 451576
39259 451576 497829 455194 245159 -2349 -162317 -230780 -228930 -140949 26067 190708 230973
39248 230973 91053 -106013 -108889 190198 567062 671751 407089 5812 -218335 -104781
39238 -104781 262905 581371 586680 423674 532478 959263 1084347 412295 -629063 -1171200
39228 -1171200 -1005137 -648117 -446523 -268798 -77903 -94013 -242303 -118627 259271 326758
39218 326758 -80239 -303223 158218 813200 891394 455936 200205 423150 790231 939658
39208 939658 808765 473670 114478 36183 314336 531340 272456 -225179 -355829 -15360
39198 -15360 270049 122431 -199711 -230548 91767 425495 474950 295043 192508 378008
39188 378008 733234 969727 978197 874414 738127 564590 487011 690969 984183 833285
39178 833285 65051 -798918 -1171899 -1054443 -784729 -487347 -133860 155091 280087 391810
39168 391810 569133 546942 190620 -65685 205046 654949 589039 13073 -397938 -323172
39158 -323172 -117877 -68627 -2607 186801 247349 82535 34441 309978 545108 314748
39148 314748 -230839 -594802 -572949 -343124 -93028 122545 241092 181300 -23786 -227641
39138 -227641 -297981 -193393 11018 131521 13840 -286258 -550096 -634658 -555355 -361938
39128 -361938 -111098 43292 -45475 -273627 -363198 -259784 -239084 -492133 -797755 -789940
39118 -789940 -432449 -36817 143966 161978 195397 276980 309761 276547 262639 241858 43634
39107 43634 -310291 -432016 -35938 526060 604632 141040 -237136 -127982 129344 108336
39097 108336 -21800 119445 440623 569059 462069 356990 325670 325349 465279 744098
39087 744098 754249 193940 -516913 -719981 -468011 -365063 -566463 -626183 -330240 16194
39077 16194 218177 447418 728955 782501 544903 306070 207181 158319 303583 883603
39067 883603 1529190 1473856 697906 59084 -24589 -155797 -766147 -1248024 -982616 -457414
39057 -457414 -477728 -844658 -776898 -260727 6295 -168066 -242697 90417 525215 778287
39047 778287 887048 792900 309675 -342258 -580108 -237996 200616 320925 247284 213846
39037 213846 139792 -99847 -346636 -381771 -236341 -84811 -32158 -122272 -331149 -462183
39027 -462183 -294322 83738 342921 379757 412610 528207 484450 139274 -255138 -428861
39017 -428861 -479383 -590018 -610889 -299431 155361 278031 10141 -123119 253117 743288
39007 743288 627096 -154084 -817359 -688585 -72842 117601 -486817 -1269813 -1400450 -746332
38997 -746332 153466 766390 933660 725322 310037 8831 160437 741245 1261765 1227255
38987 1227255 673248 113230 -53671 44661 10104 -264878 -477283 -348245 45176 466194
38977 466194 817811 1063893 1068098 782682 434909 238422 107320 5845 320293 1311149
38967 1311149 2351566 2451248 1588042 751457 492405 288308 -272811 -597911 -98930
38958 -98930 641755 651443 44753 -256669 -4703 178380 -6713 -142556 -2261 65506
38948 65506 -84721 -36571 409064 776245 647406 293626 157149 200772 210695 299805 601760
38937 601760 799096 501198 -86539 -366032 -149251 164733 219921 147273 274807 634296
38927 634296 917713 859679 555966 348678 412358 575222 627196 631780 722529 750786 484834
38916 484834 103716 82192 510107 907838 868126 546244 328364 321103 399862 505937
38906 505937 631918 684769 599526 477120 440591 463697 456575 376762 160466 -257960 -720197
38895 -720197 -837030 -396857 344552 930973 1156923 1152365 1138974 1183364 1086022 526200
38885 526200 -478859 -1290120 -1169977 -186550 754627 950131 628357 425356 501487 537141
38875 537141 345541 70732 -117986 -178531 -84732 163286 437696 585036 575364 410025
38865 410025 29030 -488300 -796824 -647201 -286081 -200361 -474748 -666905 -380261 220159
38855 220159 556531 248966 -458841 -917764 -765771 -300709 15091 267080 879298 1698440
38845 1698440 1883835 1017199 -176140 -672084 -338479 219840 647236 997524 1110176
38836 1110176 619967 -311146 -938057 -850401 -446224 -255632 -263719 -208124 -127287 -198537
38826 -198537 -296448 -143236 202870 365641 158926 -166522 -222676 96347 495091 517337
38816 517337 -20082 -762846 -1094960 -771945 -160515 254180 424572 600176 787798 706472
38806 706472 316395 42955 243284 652205 658778 79533 -627847 -950397 -843541 -574114
38796 -574114 -329353 -187782 -231090 -394702 -395164 -136119 -1696 -312478 -641645 -276130
38786 -276130 626108 1041044 494974 -197808 -84747 604801 936075 668005 411462 562651
38776 562651 861721 1061958 1318706 1673675 1733753 1237849 577552 375111 720427 1108131
38766 1108131 1044848 534384 7358 -130569 93524 259060 52226 -348140 -513072 -301473
38756 -301473 31846 193908 101545 -181961 -528013 -762995 -790112 -682466 -537506 -335510
38746 -335510 -70275 156030 343320 660204 1059698 1124877 651224 92054 -9511 256421
38736 256421 511512 816014 1366734 1751549 1384814 600373 368737 831028 1057652 512282
38726 512282 -162518 -208761 239040 673561 959964 1038970 634225 -136065 -528997 -195618
38716 -195618 205683 66805 -175472 116947 597234 547231 170327 206818 569261 452048
38706 452048 -301400 -949707 -991182 -656158 -219405 314531 735354 663101 245995 106168
38696 106168 415999 686572 606107 414641 309703 175439 69286 267837 617711 561799
38686 561799 85748 -81373 430856 1016450 1026630 719526 756517 1218544 1647714 1735433
38676 1735433 1520724 1166765 899606 923124 1105159 996363 392015 -381423 -893275 -1009578
38666 -1009578 -773958 -309523 42646 -22470 -232431 -3510 566194 620549 -218138 -1182662
38656 -1182662 -1355168 -736986 117542 904001 1446555 1396603 790801 464342 1133899 2342176
38646 2342176 3007319 2797654 2301987 2027200 1909098 1760598 1622329 1626588 1862521 2295536
38636 2295536 2597553 2364270 1780591 1598058 2031743 2253459 1608318 763762 797419 1580060
38626 1580060 2053409 1847595 1563142 1530870 1375637 943323 660870 685828 562986 96514
38616 96514 -182004 148003 686789 800767 491192 269735 451197 881597 1201002 1209533
38606 1209533 1072071 1130986 1394743 1443423 1093914 797731 947444 1200396 1103210 975062
38596 975062 1366602 1976863 2059676 1685960 1558921 1700363 1470375 901865 775439 1166325
38586 1166325 1167731 443225 -146219 20567 407185 472490 650175 1385161 2132674 2202414
38576 2202414 1865931 1784431 1944338 1926575 1698936 1468020 1244037 1097350 1284901 1667548
38566 1667548 1695393 1407165 1582175 2383014 2854189 2455197 2027193 2374574 2959521 3049535
38556 3049535 3124441 3899851 4852237 5080854 4922400 5344189 6317171 7093191 7564405 8139098
38546 8139098 8857965 9779937 11501118 14121114 16639445 18639552 21350019 25570737
38538 25570737 30171243 34620481 41080069 51383971 64420795 80537747 105602901
38531 105602901 143071166 181448533 198124675 181023054 142014699 104153031 79403615
38524 79403615 63948867 51149950 40554302 33865105 29613466 25391059 21361167 18531780
38516 18531780 16135390 13146742 10401219 9066238 8530554 7615270 6552696 6107064
38508 6107064 5899594 5209389 4464849 4403672 4552350 4020396 3161499 2993104 3413590 3386345
38498 3386345 2655229 2010768 1921150 2006615 1931392 1887116 2037337 2178679 2088548 1729932
38488 1729932 1137683 535227 406413 944077 1576507 1565809 955935 433476 390672 634417
38478 634417 872912 932360 593838 -192996 -935603 -978392 -315973 417843 791683 955779
38468 955779 1150549 1312844 1302707 1149756 946889 783198 823949 1149328 1497460 1508585
38458 1508585 1245062 1098687 1152784 1072405 737598 520919 697023 980339 973875 756184
38448 756184 639680 584133 307151 -113628 -226159 115489 450660 318143 -104892 -263853
38438 -263853 21626 401526 560754 582117 644398 711345 760335 1012414 1561911 1990607
38428 1990607 1816673 1229697 874410 934088 1019777 1044655 1489040 2461701 3187484 3019508
38418 3019508 2451961 2418100 2921616 3141837 2727705 2178026 1918479 1777140 1578562 1599287
38408 1599287 2099932 2859917 3476789 3797051 3851839 3694935 3469806 3323837 3154648 2794714
38398 2794714 2496457 2763925 3595708 4422340 4961482 5549453 6374105 7036201 7304850
38389 7304850 7704075 8771252 10202705 11339822 12097230 12760893 13214603 13091388 12481381
38380 12481381 11793536 11051141 9977702 8663926 7499173 6537981 5584674 4800539 4513626
38371 4513626 4481634 4099182 3346655 2769757 2495306 2117549 1658445 1684050 2190305 2343935
38361 2343935 1794727 1332352 1618010 2088870 1895983 1257108 1008041 1293294 1580359
38352 1580359 1658547 1796282 2086710 2342705 2496308 2521865 2201097 1551460 1173031 1496197
38342 1496197 2009271 1993161 1691879 1849077 2355313 2442967 2145083 2378063 3403093 4361030
38332 4361030 4713713 5053186 5908825 6762550 7057426 7387116 8709719 10864298 12847350
38323 12847350 14363559 16227084 19216756 23282986 28087672 33730713 40424555 47455227
38315 47455227 52765669 54016015 50478414 43859423 36868692 30965757 25906280 21298662
38307 21298662 17620917 15317344 13818475 12289195 10802460 9888099 9276000 8088186
38299 8088186 6248436 4782041 4477192 4933821 5244122 5071848 4683585 4302148 3875344
38290 3875344 3356127 2874388 2586423 2492549 2455958 2365859 2217783 1992442 1568676 944423
38280 944423 458105 466102 795384 909429 680688 509461 527839 309654 -267734 -528155
38270 -528155 20536 740592 691771 58602 -118379 516367 1231451 1358263 1025634 616877
38260 616877 246463 14400 134590 508916 670665 402100 -4792 -246095 -318961 -240400
38250 -240400 46398 382456 532970 685869 1199729 1784407 1705481 1020003 751313 1406241
38240 1406241 2137263 1979683 1199207 687381 628251 584792 439928 382372 279249 -78473
38230 -78473 -327120 26911 657927 759121 270476 -73883 53465 184839 15439 -90216
38220 -90216 156266 457696 547944 672225 1009892 1177060 821214 292785 200501 587119
38210 587119 1017979 1255325 1390018 1475887 1479214 1510468 1728224 2053803 2290092 2470470
38200 2470470 2787481 3200848 3407671 3245717 2935378 2896825 3425587 4449162 5449937
38191 5449937 5776732 5284882 4576250 4345463 4583718 4745204 4612619 4539783 4753480 4900574
38181 4900574 4590013 4024113 3668846 3512766 3157396 2598551 2360117 2650672 2865596
38172 2865596 2340347 1312094 635016 652822 882544 851809 688515 655408 625654 433709
38162 433709 336534 588340 835468 555042 -49263 -270370 -11261 50879 -422778 -891433
38152 -891433 -860174 -663319 -783727 -958888 -661317 -79556 153960 13948 89395 587167
38142 587167 1057594 1174404 1110911 1023981 832485 684282 944489 1422970 1309782 336266
38132 336266 -610317 -600879 108493 597917 603096 563901 644769 562262 341624 420662 841293
38121 841293 1045479 755524 466530 695637 1200983 1363899 1031536 571450 289407 171110
38111 171110 107883 63494 16839 -73265 -237387 -488032 -758910 -829213 -496006 97529
38101 97529 516191 537662 394674 372624 401078 252253 -68632 -393338 -684960 -968268
38091 -968268 -1073210 -771361 -173769 264184 201995 -254028 -676103 -666680 -154845 507632
38081 507632 808308 587467 224708 167449 393616 559467 553354 571650 669080 605216 254097
38070 254097 -140122 -304596 -308356 -379669 -522707 -557061 -441236 -303485 -167442 108031
38060 108031 537858 848054 754602 321951 -97189 -245655 -147044 81953 408354 757484
38050 757484 867564 503967 -183567 -720448 -804453 -610392 -512377 -620094 -718499 -608586
38040 -608586 -365294 -218642 -247122 -276449 -136137 41804 -39217 -336755 -350348 226730
38030 226730 912727 923085 246497 -249511 31835 626509 728829 330492 116754 391151
38020 391151 688178 546243 176196 75271 258116 223772 -356552 -1181837 -1643306 -1470906
38010 -1470906 -924253 -401447 -74599 15810 -221940 -726175 -1059035 -807762 -199696 114491
38000 114491 -48112 -210980 -73098 50100 -57713 22646 588660 1030628 591014 -380652
37990 -380652 -811037 -465688 -206051 -519366 -702025 10611 1189607 1741343 1311607
37981 1311607 547530 147205 201158 442026 670185 801355 780345 622135 447764 389554
37971 389554 461220 526882 431599 208288 81334 158613 238015 124194 3063 155376
37961 155376 371671 145179 -449668 -616409 90726 997947 1117958 460810 -31218 216412
37951 216412 753125 877418 579013 398383 644932 1114426 1452574 1457842 1046380 259263
37941 259263 -572736 -941054 -662341 -131904 127759 53073 -37112 47659 253209 567856
37931 567856 1005221 1305927 1124760 603177 269418 239016 89730 -242531 -140586 676612
37921 676612 1519487 1773156 1929302 2742108 3995560 5228972 7120154 10529486 14194376
37912 14194376 15168083 12277355 7801349 4790495 3786970 3244497 2248969 1392022 1294004
37903 1294004 1600686 1625874 1160782 474875 43402 273853 1035539 1563650 1293204 602517
37893 602517 221337 169243 -45009 -379160 -252016 404638 915484 887375 739013 889028
37883 889028 1060679 855144 523688 585429 915899 813363 34985 -678248 -418413 683074
37873 683074 1432338 940903 -242392 -774443 -191556 642153 878427 763733 912244
37864 912244 1151909 896558 307650 162133 608328 900256 516708 -170899 -566140 -556209
37854 -556209 -294653 149713 595154 668616 279589 -173616 -345103 -353573 -421934 -478014
37844 -478014 -387189 -234653 -89901 181043 578382 777549 604285 388021 472055 650446
37834 650446 512244 133863 -28536 168362 400648 394046 220120 39030 -143518 -376272
37824 -376272 -620319 -766688 -685845 -308171 204586 470393 286487 -52512 -84960 202052
37814 202052 359517 103464 -321170 -503400 -357632 -104258 52512 41558 -140655 -382683
37804 -382683 -406531 -15998 561085 801768 484960 -1786 -121502 154907 355649 128634
37794 128634 -360639 -674490 -559602 -109453 368880 595005 549705 482098 557690 590364
37784 590364 384380 237398 654875 1547365 2281656 2712255 3492990 4908004 6020725
37775 6020725 5731446 4294996 2949305 2236531 1598921 641171 -161624 -314109 -69144
37766 -69144 96868 179145 351598 468621 353864 217747 314183 478657 464112 472609 850315
37755 850315 1406468 1536040 1017367 311163 23893 328789 923119 1343025 1317733 975709
37745 975709 694353 659275 659699 408230 -79678 -546407 -778043 -695779 -333784 99524
37735 99524 276968 47537 -403469 -769877 -860291 -584606 30642 696071 1014958 962787
37725 962787 935803 1129410 1189753 766221 113790 -213137 -55888 298055 563748 618106
37715 618106 405324 50266 -101893 69325 142815 -317271 -1076345 -1509220 -1431929 -1178299
37705 -1178299 -953608 -656650 -325783 -186422 -159722 134318 709198 1036907 771143 226288
37695 226288 -105330 -127963 14232 276057 565921 582676 175874 -321637 -435748 -92889
37685 -92889 393852 695456 632976 229071 -161670 -53533 527904 881858 494814 -197002
37675 -197002 -391372 -55480 128860 -116410 -287852 17777 487523 672521 645736 659796
37665 659796 594879 278334 36981 313644 877198 1044779 696882 449843 668276 911554
37655 911554 695899 293517 267948 544308 539189 113750 -183205 64360 525646 565906
37645 565906 44330 -552165 -644748 -98895 678198 1106882 999837 770025 942942 1507745
37635 1507745 1995932 2177120 2287027 2430389 2201363 1286012 158792 -332087 -10494
37626 -10494 477581 622446 673035 1038292 1453118 1215813 170961 -980231 -1468724 -1248528
37616 -1248528 -810857 -470133 -163566 161790 384924 516871 782395 1167865 1223101 675020
37606 675020 -9346 -144437 219872 416713 228930 187752 586574 855670 424678 -283153
37596 -283153 -404051 76676 347994 67749 -144787 219385 656371 351190 -595472 -1255917
37586 -1255917 -1099174 -572366 -346483 -445487 -437736 -208853 -95487 -265352 -394127 -185283
37576 -185283 82463 -93610 -639482 -878016 -401904 385104 804531 686107 341501 18292
37566 18292 -225225 -244076 125899 689828 998687 962621 992159 1326860 1570464 1226934
37556 1226934 463956 -75944 -150299 -168295 -477133 -796784 -652181 -125889 219003 144311
37546 144311 72316 425122 901831 760055 -224744 -1390248 -1877291 -1492541 -774893 -376940
37536 -376940 -532900 -1000588 -1311044 -1099934 -382510 423671 812143 578040 -53271 -598240
37526 -598240 -628715 -99840 528648 661337 220209 -206690 -63554 460608 681269 291334
37516 291334 -336968 -708636 -705261 -445050 -13553 446869 664899 548303 387759 476574
37506 476574 671019 629270 372203 238320 299730 220130 -198564 -687111 -920839 -946224
37496 -946224 -925498 -736431 -223929 309251 342589 -110132 -439690 -281559 -14247 -160213
37486 -160213 -625940 -899336 -779787 -507667 -292009 -134707 -91199 -268893 -502257 -455514
37476 -455514 -200344 -273660 -886075 -1426606 -1153952 -189389 580912 528448 -129951 -731486
37466 -731486 -821311 -388103 223944 530347 291789 -183916 -329254 -23236 207032 -143908
37456 -143908 -890915 -1393637 -1323313 -921124 -558772 -351453 -247385 -202815 -121538 143892
37446 143892 528443 675522 368313 -99698 -286247 -241415 -404754 -847306 -1067029 -741115
37436 -741115 -275212 -238916 -531068 -552120 -80902 462954 618953 356736 -86372 -473843
37426 -473843 -604172 -421950 -203600 -321326 -712961 -902973 -672056 -359602 -325218 -462955
37416 -462955 -492765 -399850 -281925 -65813 261462 406442 181496 -43537 201648 688066
37406 688066 698062 80225 -456024 -324786 113209 90510 -476436 -884384 -588352 138369
37396 138369 624055 618695 448285 447176 532387 442974 172574 -69944 -217624 -378464 -523080
37385 -523080 -444467 -128814 99485 -24525 -354323 -551742 -508219 -381384 -337300 -403730
37375 -403730 -471269 -342385 66884 491510 519555 175644 25905 451398 1061526 1161472
37365 1161472 642057 55155 -106760 131788 453050 603505 494086 195064 -104123
37356 -104123 -269229 -348954 -430897 -473934 -431310 -412128 -530997 -706296 -785256 -752849 -671324
37345 -671324 -587262 -638027 -980061 -1411549 -1411460 -854334 -305608 -204583 -181247 242093 685622
37334 685622 450792 -223617 -386552 151074 513305 115916 -570611 -939108 -1071794 -1182297
37324 -1182297 -1031591 -541474 -330195 -864040 -1536406 -1406879 -586700 -89289 -408250
37315 -408250 -1003644 -1262185 -1289289 -1504579 -1930294 -2208583 -2112154 -1808053 -1657320 -1803425
37305 -1803425 -1959452 -1726728 -1181937 -899609 -1199908 -1641897 -1577278 -992856 -430249 -241432
37295 -241432 -358807 -689510 -1214972 -1648411 -1486076 -615219 433951 1018986 951001 461727
37285 461727 -91755 -359887 -155621 291194 457583 135624 -274251 -319452 -142291 -214748
37275 -214748 -533019 -545831 -7411 543659 516917 189160 356020 1111200 1579697 1110303
37265 1110303 193370 -284188 -277786 -393577 -686978 -531104 193170 645800 218243 -504141
37255 -504141 -587498 -66535 281905 150394 -74368 -144053 -234663 -374425 -300824 -56764
37245 -56764 -115578 -664561 -1267558 -1488469 -1386305 -1138956 -668814 -5994 406496 226707
37235 226707 -257066 -531452 -533036 -482341 -298945 251685 914230 1031084 396824 -411116
37225 -411116 -739375 -581741 -417002 -580908 -1007563 -1430385 -1628068 -1514485 -1120745 -536323
37215 -536323 102270 565344 624475 336026 94363 179583 359739 223365 -177947 -376759
37205 -376759 -157168 229351 549827 815747 884649 383463 -617455 -1319808 -1092977 -353190
37195 -353190 -21754 -317799 -647299 -561375 -217970 104505 343350 369815 -78333 -926930
37185 -926930 -1619749 -1679860 -1144570 -351230 350490 606365 256464 -309205 -481385 -311546
37175 -311546 -495359 -1190071 -1525506 -847613 148721 318087 -279453 -515971 127779 914880
37165 914880 1017196 553245 137855 -15139 -102968 -196664 -128911 178155 545741 729620
37155 729620 713456 771458 1117103 1461943 1213324 311111 -479424 -493726 -80055 -71670
37145 -71670 -594629 -1039782 -1080876 -983118 -882349 -528516 52396 341435 98398 -216593
37135 -216593 -138960 158564 248226 51374 -234496 -424568 -332280 105154 489401 268309
37125 268309 -386117 -618285 -141171 236324 -147540 -701655 -463992 392432 801230 329708
37115 329708 -359884 -563999 -356716 -224929 -388845 -672744 -790743 -670319 -570423 -756572
37105 -756572 -1025842 -905557 -435980 -224298 -449436 -458995 153294 726790 498921 -175403
37095 -175403 -421328 -196738 -87502 -128154 66054 202907 -423737 -1524429 -1862952 -985994
37085 -985994 150057 619188 590692 541284 395111 40053 -132631 142228 491437 579661
37075 579661 644871 827204 693204 84311 -264422 260070 1107771 1377653 1152122 1110292
37065 1110292 1243545 988549 412886 219796 571452 838365 636011 292588 114222
37056 114222 -62565 -334101 -403972 -121275 154255 39601 -371602 -708488 -723772 -388982
37046 -388982 90147 303241 36054 -341828 -288387 125909 326181 129582 -44372 48415
37036 48415 115477 -49197 -199005 -189196 -299918 -621544 -692359 -244951 191913 30713
37026 30713 -434119 -480166 -77125 145399 -70623 -297742 -179650 99267 259193 367089
37016 367089 610995 945754 1167553 1169240 1015716 869483 826927 732373 305263 -367355
37006 -367355 -703848 -324337 344631 607127 471267 533653 966213 1264991 1102640 790365
36996 790365 656520 552571 313015 183043 365108 570117 482984 321904 449089 717436
36986 717436 715503 435381 175604 -37751 -376008 -669062 -534821 -53321 240216 116950
36976 116950 -82399 -41543 157335 378609 651015 840086 597721 -54812 -514899 -335097
36966 -335097 161921 377465 251027 172603 322336 543089 709987 783227 608531 119859
36956 119859 -341844 -408377 -345652 -757345 -1549839 -1851896 -1262432 -543378 -541003 -931183
36946 -931183 -776439 -26622 432476 222669 28367 382918 739783 376043 -395398 -712141
36936 -712141 -490671 -396783 -631910 -662279 -265116 29610 -124998 -279588 -11646 268148
36926 268148 -25935 -637367 -825617 -500234 -285059 -503608 -743101 -537829 4543 429419
36916 429419 461809 179273 -118737 -164800 -12864 -16610 -345074 -690256 -728427 -656653 -865686
36905 -865686 -1249003 -1341764 -1078635 -871372 -891304 -803669 -359738 205056 552720 635464
36895 635464 511820 114946 -561590 -1279865 -1744748 -1830493 -1565066 -1073245 -562135 -196699
36885 -196699 -18650 -92794 -494135 -923336 -736382 157172 813088 367679 -672255 -1124289
36875 -1124289 -894417 -945415 -1492582 -1509435 -449605 722812 940118 511048 351315
36866 351315 506228 382761 -89261 -471807 -662040 -890613 -1107310 -1082097 -915299 -825956
36856 -825956 -672833 -286179 292 -210236 -648559 -733389 -444352 -215269 -157303 -25506
36846 -25506 197620 292732 246157 167678 -38977 -389669 -467379 40849 716589 961086
36836 961086 904309 1072624 1426941 1508401 1303247 1121658 817932 63804 -713744 -671431
36826 -671431 137944 762516 767820 687015 877214 935530 605270 330456 434574 552991
36816 552991 388640 293747 534319 638849 133351 -584330 -780321 -452089 -223692 -366050
36806 -366050 -492562 -214413 308716 579293 376215 72545 231290 814377 1075359 554125
36796 554125 -146020 -149516 355952 362923 -394648 -996519 -697051 55007 382267 158397
36786 158397 -62914 103091 513359 753895 537649 66604 -1121 666477 1390262 1160289
36776 1160289 18346 -914058 -896229 -343604 30498 86876 -17126 -249098 -467059 -381878
36766 -381878 -78064 28788 -19745 284555 886837 1021079 502577 214961 689067 1112758
36756 1112758 588986 -375617 -602554 46591 618942 430503 -285865 -858423 -723126
36747 -723126 198548 1189431 1243540 345048 -347447 -114529 290617 -40618 -642150 -499322
36737 -499322 251226 656307 544344 535948 715301 558657 115422 42268 387974 475279
36727 475279 141387 15482 333448 515259 250155 36934 228619 413759 239041 83124
36717 83124 357055 748766 729341 358524 85074 81935 182434 208789 80560 -140818
36707 -140818 -155749 267420 759940 606840 -234524 -875715 -620083 90461 312286 -129154
36697 -129154 -537669 -400361 -25684 3755 -325631 -461820 -85655 380640 277799 -417325
36687 -417325 -1076549 -1284928 -1271636 -1309391 -1200595 -756060 -331279 -322295 -446394 -157280
36677 -157280 426007 664512 369378 -37846 -321188 -719828 -1321110 -1717802 -1506509 -757761
36667 -757761 112516 635899 506034 -108825 -538473 -322743 145281 150236 -319052 -643132
36657 -643132 -545616 -321667 -134777 193409 630363 879442 997693 1366217 1883301 1906191
36647 1906191 1246207 538492 311420 325984 188788 10416 30082 101467 -3637 -179916
36637 -179916 -250297 -277933 -305142 -156013 206729 496575 543724 555375 704426 846511
36627 846511 853505 806074 670938 279625 -171302 -172654 271496 482130 127275 -222176
36617 -222176 -16395 406920 448982 196252 88956 99572 -51559 -208826 -32233 309161
36607 309161 394814 324168 536017 965090 1070761 698928 276003 92942 -1345 -79240
36597 -79240 113878 648172 1091183 991798 428187 -120255 -258968 60254 551037 782127
36587 782127 556603 161502 38907 194002 217091 -32583 -128310 282172 822306 796346
36577 796346 168888 -341871 -289203 -155754 -587637 -1288619 -1308508 -411487 524736 721384
36567 721384 474839 458863 608151 397428 -110931 -322353 -135258 -128812 -610812 -1132388
36557 -1132388 -1148891 -649013 33096 565521 673161 332096 2489 167447 580285 535183
36547 535183 -62720 -570872 -656714 -686319 -826077 -604638 184536 926687 1113520 1144632
36537 1144632 1534456 1910894 1573099 625340 -204569 -573698 -637440 -426238 117686 598554
36527 598554 422925 -309853 -754758 -338267 544567 1003688 608908 -223756 -718059 -579829
36517 -579829 -252931 -180299 -62897 628653 1558296 1755769 1071789 501003 683286 999698
36507 999698 749837 332849 422525 731730 611978 310896 531989 1121669 1309049 1029524
36497 1029524 915086 1080234 1013801 693074 722202 1198174 1450497 1180809 923884 1007615
36487 1007615 927420 270598 -437982 -406151 369984 1224437 1657879 1638022 1334919 938997
36477 938997 607399 361644 141283 17628 136856 400902 471242 180414 -272372 -578581
36467 -578581 -578886 -284128 146148 480428 653544 823884 1030498 1039023 786719 652854
36457 652854 887580 1099547 827118 329196 201517 439948 563022 503877 645661 1027217
36447 1027217 1246379 1182827 1130190 1152552 983492 660914 611806 963581 1346673 1495199
36437 1495199 1503774 1425591 1167602 826890 596955 374678 20145 -150420 161346 475393
36427 475393 155180 -364312 -80211 856574 1195953 581997 140167 593340 1136863 951870
36417 951870 612834 993747 1777210 2142959 2134856 2241592 2310243 2020978 1864179 2448345
36407 2448345 3265796 3345931 2818273 2615129 2840850 2707019 2039065 1563713 1550515 1402693
36397 1402693 919204 778757 1241725 1457072 833460 236327 849164 2350776 3220851
36388 3220851 2705565 1624299 1146111 1459179 1914489 2000533 1785549 1595180 1602101 1762167
36378 1762167 1975829 2215088 2501642 2779879 2858707 2583386 2104038 1834170 1988510 2258837
36368 2258837 2179383 1759817 1433581 1366900 1269387 1070078 1259396 2119070 3023109 3106344
36358 3106344 2404060 1734248 1611365 1888560 2329762 2826748 3088764 2849811 2430021
36349 2430021 2382597 2553109 2291033 1675294 1586052 2285308 2888741 2714612 2264181 2261795
36339 2261795 2534347 2571220 2516203 2796815 3267141 3483975 3453236 3438181 3406202 3290892
36329 3290892 3401693 3933649 4464500 4590751 4670648 5241266 6050280 6398131 6186841 5952855
36319 5952855 6067163 6485032 7036713 7422809 7235497 6537377 6075047 6380228 7071670
36310 7071670 7591766 8096120 8938654 9842402 10393670 10857095 11650499 12502941 13035839
36301 13035839 13688958 15088214 16938111 18553330 20072063 22133637 24813242 27920144
36293 27920144 31815794 36812655 42407561 48404723 56081807 66759249 80055561 95390337
36285 95390337 114338898 139293846 170819897 209186121 256908133 313975064 368880775
36278 368880775 400135628 392368954 350267838 293850426 241316073 198954084 164998874
36271 164998874 137199452 114805198 96956515 82457022 70638306 61170860 53492628
36264 53492628 47061004 41631816 36946327 32738997 29216861 26805391 25232678 23577282
36256 23577282 21418556 19280360 17757928 16809220 16047986 15165869 13956695 12462804
36248 12462804 11171778 10561373 10423022 10120307 9466593 8815509 8355618 7908204 7411580
36239 7411580 7045979 6866935 6792420 6887556 7189396 7391764 7223243 6953136 6946362 6941008
36229 6941008 6459120 5755527 5567868 5966975 6229645 5919955 5414484 5254258 5554363
36220 5554363 6114887 6603329 6644982 6226475 5905413 6115604 6479626 6395597 5999105 5804071
36210 5804071 5713647 5315003 4923725 5263800 6163388 6659030 6481842 6382349 6811532 7323724
36200 7323724 7547645 7740677 8030892 8040906 7664647 7401314 7568106 7946224 8451684 9301510
36190 9301510 10267029 10708294 10676878 11022289 12036670 13001823 13509078 14143673 15277547
36181 15277547 16267037 16606632 16893923 17777697 18811312 19300122 19575428 20450437 21939275
36172 21939275 23389506 24423549 24968933 24838890 24077446 23306298 22997539 22791597 22172937
36163 22172937 21335828 20686742 19988796 18805260 17444977 16700217 16827748 17342221 17629251
36154 17629251 17411932 16920702 16825689 17560885 18633563 19256304 19631894 20652196 22396892
36145 22396892 24289364 26759653 30973158 36699685 42699041 49751410 60552906 75716470
36137 75716470 93579378 115869457 148309312 189856528 224426920 231431159 206256353
36130 206256353 165125020 128107148 102265835 83305863 67278322 54678508 45916210
36123 45916210 39125187 33046503 28366540 25531348 23774262 22645071 22292778 21924358
36115 21924358 20011164 16511750 13211625 11345368 10277299 8988108 7565049 6616448
36107 6616448 6203612 5964958 5669285 5257755 4794880 4526991 4576112 4631178 4395777 4128065
36097 4128065 4169039 4220870 3804929 3194843 3108292 3624171 4159111 4369953 4336987 4040950
36087 4040950 3469513 3076541 3264128 3523896 3016055 1963125 1497663 2022707 2653554
36078 2653554 2513079 1765316 1100778 913384 1246603 1909981 2397480 2244214 1640031
36069 1640031 1185969 1020613 811918 593803 798801 1336211 1502262 1095179 808963
36060 808963 1127820 1574580 1535076 1169233 951836 850920 562164 179563 60698 240333
36050 240333 425144 441312 392100 487471 861276 1390816 1696977 1625382 1646349 2275729
36040 2275729 3151794 3392348 2968228 2893054 3722233 4685467 4834836 4321795 3884051 3713245
36030 3713245 3606359 3711886 4238234 4756824 4689054 4313903 4459247 5287269 6189333 6837017
36020 6837017 7497924 8247993 8726179 8891044 9238903 9956699 10576576 10849640 11251339
36011 11251339 12098479 12806524 12696501 12040880 11551137 11211084 10495991 9533196 9032030
36002 9032030 8972792 8373019 6775755 5144296 4647243 5130289 5480970 5108907 4346972
35993 4346972 3644862 3124844 2865886 2920061 2981717 2644211 2085342 1950045 2442497 3059433
35983 3059433 3334621 3323390 3261750 3333493 3862276 5006455 6059836 5891175 4493760
35974 4493760 3286928 3316881 3958894 4129449 3972210 4300686 4968499 5064963 4512043 4221960
35964 4221960 4589237 4930362 4678536 4181105 3924741 3737192 3201806 2317791 1394494
35955 1394494 710989 476900 681581 860185 515437 -133505 -387992 -133810 3710
35946 3710 -278908 -493593 -245894 135611 256512 272332 369826 249678 -306452 -860579
35936 -860579 -910876 -665191 -641677 -819973 -767209 -381847 16065 185779 129230 -92302
35926 -92302 -339203 -357420 -69792 294279 595853 985160 1419203 1415805 737497 -67138
35916 -67138 -342071 -215095 -212376 -268065 150762 1028976 1658546 1626521 1342782 1374745 1731727
35905 1731727 2058013 2171196 2127226 1977457 1727810 1462542 1334494 1408611 1549835 1505268
35895 1505268 1176976 801689 704148 854294 893015 654137 367891 224376 88450 -122912
35885 -122912 -148486 175227 484239 337553 -107848 -323744 -171801 19839 50911 40947
35875 40947 39228 -82063 -268858 -250492 -537 151374 54616 39179 415895 931293 1054392
35864 1054392 697547 322498 298382 438910 349534 48831 -59107 162975 294878 -59212
35854 -59212 -633455 -797440 -400274 76437 239500 242971 346602 383690 20079 -618494
35844 -618494 -946581 -616312 -6213 168457 -264709 -641611 -285788 469072 547006 -411284
35834 -411284 -1390689 -1261565 -261955 425654 283404 -116832 -160352 137514 516478 783280
35824 783280 681690 149441 -284165 -93787 306353 99632 -529499 -610954 -26077 348835
35814 348835 310707 690052 1657229 2261195 2299846 2940177 4534012 5633133 5507888 5791936
35804 5791936 7878637 10642767 13211966 18085957 27703656 38494125 42570929 36530942
35796 36530942 25445315 16649636 12317570 9993793 7788768 6033697 5017128 4048500
35788 4048500 2864144 2060137 1905738 2010861 2212470 2698081 3264909 3437385 3296201
35779 3296201 3306701 3368793 2890197 1812370 790139 291688 152550 35875 -213840
35770 -213840 -614109 -934985 -719001 42900 530443 89981 -649684 -524298 452350 1123245
35760 1123245 964707 712941 896605 870603 19279 -986191 -1122522 -641673 -644725 -1233551
35750 -1233551 -1258547 -143875 1065058 1098646 210014 -289594 99701 535608 187286
35741 187286 -661422 -1159680 -975090 -416347 159723 609095 836305 744712 333152 -300865
35731 -300865 -937272 -1194885 -859309 -345412 -349639 -823947 -893879 -192510 405839 41221
35721 41221 -782527 -1007822 -663847 -567219 -710557 -296150 611883 875377 96181 -640529
35711 -640529 -454567 34478 -86593 -501020 -368023 139603 122625 -557345 -1086283 -902359
35701 -902359 -291423 216641 405810 297049 22374 -169059 -122900 12078 6926 -164686
35691 -164686 -461799 -905116 -1296210 -1161136 -373149 461579 669145 319601 -24362 -104282
35681 -104282 -68529 -24604 13293 -112367 -517277 -952430 -1081642 -982640 -973339 -1032550 -815551
35670 -815551 -241964 296648 402167 138907 -31316 263762 855828 1136521 775633 207427
35660 207427 75684 366075 619458 854853 1492159 2326635 2514470 1849507 1151811 1050181
35650 1050181 1346621 1969392 3367092 5361120 7029708 8738813 12668315 19460947
35642 19460947 25477406 25827146 20020812 12559965 7770578 5998465 5256213 4456875
35634 4456875 3790001 3361238 2944628 2503042 2028962 1343059 644907 648535 1583074 2655468
35624 2655468 3058411 2930586 2812935 2787522 2724017 2785394 3073425 3249549 3039331 2662243
35614 2662243 2344070 1963332 1592094 1683924 2183446 2211026 1352447 529955 689245 1253413
35604 1253413 975724 -79670 -605999 -3183 862149 1008087 523043 94521 51186
35595 51186 227915 330697 166569 -202973 -431964 -255866 153418 472346 710267 1035731
35585 1035731 1307277 1255672 988848 805466 646944 296428 -21437 93708 430444 390524
35575 390524 18310 -11593 417271 565439 77585 -336415 -32262 495869 435511 4112
35565 4112 79660 762228 1228028 1015286 614071 553621 601791 280735 -296134 -592896
35555 -592896 -427643 -129490 33193 199879 575013 987579 1038609 661465 306804 409512
35545 409512 791077 865104 460750 111649 322814 848727 1068706 884149 745995 831049
35535 831049 775900 415823 223404 589756 1078100 950218 228621 -341164 -328916 -55412
35525 -55412 76082 140967 376169 740628 1062244 1287499 1333826 1017149 408542 -35585
35515 -35585 -11773 231080 351362 476844 884338 1359124 1394394 935919 435358 180846
35505 180846 40858 -96306 -94414 96519 265573 254422 146147 30449 -135559 -338458
35495 -338458 -449848 -426545 -318382 -81783 297112 538805 372955 111126 371664 1118205
35485 1118205 1580356 1385465 1132880 1405585 1798816 1569914 844955 436691 637535
35476 637535 904114 754076 379943 252574 558821 1145111 1664644 1708288 1123086 282503
35466 282503 -228298 -230593 -29359 50329 -99534 -476010 -886651 -852145 -124265 683189
35456 683189 598767 -388069 -1118510 -710049 329382 885338 666258 256737 68675 -43123
35446 -43123 -182338 -114208 250326 569831 545174 367726 435947 807559 1147014 1125478
35436 1125478 737085 274351 56106 135159 282232 315212 338140 500011 663686 607178
35426 607178 454020 503258 654924 514859 185114 344285 1177488 1785651 1273924 71341
35416 71341 -557838 -167618 454729 545928 269306 120234 115803 13828 -142885 -174823
35406 -174823 -138142 -132459 1399 406817 866112 1085145 1088238 992697 690036 169632 -157607
35395 -157607 -2395 189277 -197125 -924051 -1163567 -747963 -390432 -515959 -627344 -167086
35385 -167086 626020 1156207 1273060 1187341 994164 746052 673490 860766 954554 651176
35375 651176 264309 336151 813369 1067098 705414 11654 -410904 -170205 667546 1637826
35365 1637826 2315664 2886554 4006108 5776291 7193466 7130032 5664831 3894159 2592932
35356 2592932 1711398 1103163 923965 1085212 1032675 486439 -106510 -265354 -183157 -299177
35346 -299177 -534730 -472313 -73936 282907 393609 422815 534177 665671 687152 544310
35336 544310 275341 65452 168334 554526 784742 503797 -71796 -444209 -464195 -342509
35326 -342509 -193098 8819 107257 -105756 -427833 -391003 51441 442431 534283 597406
35316 597406 835521 992782 829986 537490 328898 55869 -354499 -492705 -38506 570907
35306 570907 658357 310433 231922 668814 1113619 1130456 864553 577652 229834 -226985
35296 -226985 -580205 -643865 -475262 -129812 406327 851539 676200 -142856 -828178 -702850
35286 -702850 -90352 150267 -221912 -639589 -608728 -293155 -134678 -247759 -376694 -309553
35276 -309553 -191005 -368082 -874241 -1183116 -759847 157780 748248 689384 537787 752446
35266 752446 937610 606030 173174 388992 1074530 1328819 916391 514658 475906 319948
35256 319948 -186105 -380561 222971 962728 941440 402141 286009 700056 796895 179325
35246 179325 -504505 -621255 -403962 -299628 -128669 457929 1102620 1087726 456278 75821
35236 75821 440482 992487 947689 373427 26910 342523 986457 1347487 1143747 548938
35226 548938 -34688 -317518 -389307 -565959 -842518 -756810 -111298 463452 223259 -557082
35216 -557082 -843866 -261211 481921 749779 769794 882855 796333 240254 -240746 50441
35206 50441 875736 1385352 1260952 835935 351159 -134653 -300736 127244 709774 753793
35196 753793 396133 381045 765130 795918 228865 -213851 -26741 353049 448070 510410
35186 510410 818459 970240 570332 20352 -87558 110231 124773 -4889 88792 353557
35176 353557 475599 537735 818907 1100022 863546 146124 -413919 -408388 -48640 284325
35166 284325 426720 336057 505 -480168 -950085 -1288970 -1294705 -724540 259160 977596
35156 977596 969471 574605 354863 240970 -182498 -807236 -1106853 -987133 -825709 -702152
35146 -702152 -323359 217911 365779 -4814 -305693 -142269 136198 161792 203911 583236
35136 583236 934117 693428 26020 -382775 -320375 -220262 -355345 -451935 -262270 -14847
35126 -14847 -957 -90386 -44087 -56025 -494018 -1159455 -1335688 -744480 15754 324702
35116 324702 416656 857354 1437577 1376368 646955 238777 729669 1356512 1149583 425006
35106 425006 304503 1034487 1695612 1599353 1129502 939547 1006643 916329 627286 460867
35096 460867 525703 537557 186561 -491919 -1077755 -1072071 -395419 404404 661238 341214
35086 341214 25784 99129 302232 271067 171081 444621 1090957 1564851 1411475 754945
35076 754945 73333 -362111 -696416 -1158697 -1628402 -1667400 -1042697 -105772 499312 469703
35066 469703 41954 -403063 -723070 -954609 -1081215 -1037403 -881639 -805462 -908956 -1024559
35056 -1024559 -867353 -403998 35917 157147 110456 235749 407671 43428 -1024351
35047 -1024351 -2045641 -2120512 -1287919 -450799 -303453 -719133 -1162917 -1282016 -988962
35038 -988962 -341118 420729 904906 860789 411829 -66389 -267927 -179703 -66857 -209928
35028 -209928 -588797 -891474 -895428 -716206 -601306 -659802 -901620 -1284595 -1539451 -1272390
35018 -1272390 -561710 -134277 -483246 -1050473 -870561 68054 735519 403743 -506211
35009 -506211 -1113768 -1117149 -859493 -734348 -853011 -1105419 -1315537 -1426024 -1577587 -1846581
34999 -1846581 -1958271 -1565469 -800323 -183961 43332 101482 123088 -102543 -662157 -1226970
34989 -1226970 -1465589 -1391016 -1103317 -599516 -87791 -44800 -585887 -1133207 -1108810 -663798
34979 -663798 -334126 -281529 -327436 -458797 -754559 -982945 -844961 -548796 -577911 -888891
34969 -888891 -924988 -526332 -221574 -357866 -505653 -171843 316113 224872 -464979 -946982
34959 -946982 -651152 60243 438476 227861 -252415 -649560 -884090 -1013766 -1070886 -1063979
34949 -1063979 -1001172 -909346 -884788 -1009806 -1119673 -847693 -118101 600574 857461 871023
34939 871023 1178913 1728178 1894231 1497185 1161150 1331539 1503354 977861 19446 -399720
34929 -399720 95479 834233 1046812 788793 681257 995171 1302018 1068996 437000 162918
34919 162918 672158 1433056 1638577 1319852 1203440 1505312 1626623 1252614 929419 1071265
34909 1071265 1158280 622480 -87080 -154153 348591 725823 829410 1033808 1272123 1069128
34899 1069128 483671 121951 178493 266449 224595 303287 517355 598854 619917 862399
34889 862399 1064093 681560 -43273 -237299 246230 618264 510088 474841 791190 879603
34879 879603 471316 309879 922780 1571331 1308829 426130 -56453 125177 355122 210945
34869 210945 -92816 -212743 -76878 165405 286247 192064 86054 135528 52002 -433568
34859 -433568 -781672 -218486 858102 1176264 566219 332410 1072818 1541038 695251
34850 695251 -422161 -259510 783380 1093842 412993 -34836 301158 670976 597567
34841 597567 575418 907934 1113047 900085 719693 920987 1186150 1170291 1013051 921741
34831 921741 840644 732436 655317 491611 145936 -39394 293478 787059 808208 503541
34821 503541 542046 880012 804853 277140 125461 644567 1080336 918403 652124 734628
34811 734628 753877 339664 15012 323313 812687 761711 358938 258052 390217 183742
34801 183742 -268656 -240142 412559 915100 674702 65126 -180096 109075 536322 734777
34791 734777 641817 362598 73824 25197 373281 926762 1229925 1054286 700479 598211
34781 598211 676631 471198 -83876 -394525 -4091 717943 1083104 989537 834981 741622
34771 741622 454719 -46481 -418717 -499963 -481304 -440749 -185175 294170 632519 545367
34761 545367 160902 -203575 -296673 51480 775725 1389682 1376289 852580 440795 427610
34751 427610 535410 608657 922084 1534075 1886581 1481739 602846 -30895 -73435 284990
34741 284990 681642 794915 465010 -53896 -176171 348182 1033674 1248556 1017320 858738
34731 858738 952440 912871 436202 -208345 -507253 -291496 188769 629598 898686 953021
34721 953021 782791 534324 498787 780299 1069125 970338 522542 153176 125457 286584
34711 286584 374806 287983 21400 -335603 -500520 -260080 126979 211498 62528 152534
34701 152534 490028 585301 441877 688136 1331920 1376118 373446 -569518 -291554 719752
34691 719752 1241293 1236938 1531855 2056606 1946304 1254025 1046055 1631854 2091261 1890230
34681 1890230 1672112 1950300 2180579 1784184 1147516 915241 1033037 1136084 1273698
34672 1273698 1641208 2071450 2318372 2480463 2749568 3059481 3252070 3287157 3155133 2927019
34662 2927019 2913407 3348343 3946788 4252258 4329821 4581351 5042074 5483796 5994014 6723414
34652 6723414 7301462 7318761 7133812 7343463 7806624 8162655 8836512 10320832 11956946
34643 11956946 12856469 13556830 15155386 17338361 19188386 21416431 25475999 30864467
34635 30864467 36008301 41613392 50053646 61507230 74378766 89844484 111736157
34628 111736157 141456124 178556228 227348211 293879463 369334764 423229196 425025056
34621 425025056 373763157 299134062 232556219 183987311 147216885 117122107 94317945
34614 94317945 78494569 66157595 55113351 46103022 39526755 34078455 29050267 25202163
34606 25202163 22787301 20775982 18473331 16277281 14511857 12857084 11193864 9910225
34598 9910225 9167440 8698724 8343494 8037472 7424789 6265208 5073811 4589550 4724413
34589 4724413 4719414 4206197 3485120 2897373 2518964 2375553 2463342 2631630 2753070 2819477
34579 2819477 2697874 2216681 1704253 1834569 2578582 2968424 2396108 1505644 1216180
34570 1216180 1467893 1588582 1357211 1019745 729350 629428 1018043 1775544 2119964 1611685
34560 1611685 900649 765364 952831 790327 413803 409091 630270 435140 -120196 -357505
34550 -357505 -154307 -52301 -178853 -20976 580177 1073542 1079924 910732 947250 1119309
34540 1119309 1271867 1522231 1954431 2340261 2415551 2190983 1873238 1677300 1703020 1778914
34530 1778914 1535250 889192 276112 90608 147090 82156 -15725 105503 249669 104356
34520 104356 -45824 298232 860508 803013 -23648 -829624 -1016930 -789928 -441824 139543
34510 139543 858821 1060968 388146 -522572 -792162 -398654 8148 86964 38185 47093
34500 47093 57394 68024 196658 406037 510943 490030 496103 537001 444617 216714 99810
34489 99810 217235 361348 308720 133566 14545 -99004 -372510 -723997 -852757 -635463
34479 -635463 -247461 146638 563365 976299 1197687 1146629 991627 841591 558492 113925
34469 113925 -164185 -44035 181042 141382 25855 246565 657421 724225 379081 36207
34459 36207 -211032 -646193 -1105583 -960375 -216528 203304 -245023 -891150 -900095 -496399
34449 -496399 -421508 -698834 -758509 -467918 -238258 -258365 -312641 -275811 -200672 1211 430679
34438 430679 836085 852614 500322 44184 -408480 -725805 -521597 271739 928790 785498
34428 785498 310442 454912 1107762 1222630 519941 -38526 209994 650137 524338 188425
34418 188425 450823 1224808 1678415 1464808 1055346 898264 866314 670084 396241 391295
34408 391295 758407 1160777 1189606 883996 720650 986674 1369309 1396338 1057720 632607
34398 632607 136702 -510553 -913608 -517972 421528 925291 596396 148883 252837 535826
34388 535826 302943 -320805 -691924 -709448 -785871 -946000 -759406 -198808 166562 38790
34378 38790 -140463 109290 593849 793400 610825 383751 323463 328578 335379 508142 927030
34367 927030 1275051 1083921 336992 -339279 -271154 491528 1200167 1277502 944228 785912
34357 785912 904381 872812 495034 165588 287431 683545 895261 813125 628618 337795
34347 337795 -206190 -766599 -811715 -315456 50210 -136508 -373022 -11355 649530 718720
34337 718720 15436 -678600 -704330 -219631 310632 672414 721893 290841 -344921 -447413
34327 -447413 275232 1179791 1548055 1492860 1512082 1602717 1467182 1242207 1274263 1375972
34317 1375972 1075196 531362 446123 1007834 1622247 1820030 1778645 1751313 1604299 1224864
34307 1224864 875217 785111 751732 435935 -222577 -1063862 -1857375 -2242483 -1905720 -1039553
34297 -1039553 -289925 -39211 -63402 -70504 -167384 -507095 -841586 -801055 -396976 57490
34287 57490 342970 407685 256403 13729 -88118 -1339 47768 -61109 -121680 33007
34277 33007 228321 277776 327405 528201 612972 222320 -487281 -991294 -1111786 -1180902
34267 -1180902 -1441796 -1645343 -1406333 -743993 -86851 185978 92577 -61174 -77954 -70316
34257 -70316 -204046 -348127 -204234 201190 413677 74188 -639499 -1237359 -1425291 -1252096
34247 -1252096 -915607 -604109 -427072 -350652 -271488 -224234 -361106 -627062 -668617 -268893
34237 -268893 282745 498336 287739 16323 -4391 135222 142780 -97391 -441620 -702237
34227 -702237 -827251 -833786 -654321 -209433 327907 531073 161633 -487603 -874348 -757541
34217 -757541 -314666 138366 313874 30496 -508887 -653490 14605 969634 1216359 530711
34207 530711 -290172 -534856 -368648 -281088 -323327 -311783 -317895 -429430 -350398 196282 843620
34196 843620 906452 302566 -310712 -372081 -24720 207181 75715 -198289 -253101 4592
34186 4592 303358 307788 -14132 -395417 -595770 -581542 -428227 -248455 -190365 -280745 -315825
34175 -315825 -167137 -78194 -263248 -336867 266912 1287055 1722893 1118137 108518 -565656
34165 -565656 -894326 -1069832 -865195 -145379 577925 764966 583494 437981 250128 -138680
34155 -138680 -356387 -84923 174264 -189513 -743901 -539827 385958 1022556 876184 512092
34145 512092 525351 837587 1160209 1364336 1247024 697951 226717 512246 1257112 1351432
34135 1351432 445241 -509558 -653429 -296661 -118916 -118611 -8587 33182 -235032 -462304
34125 -462304 -200275 277189 329391 -104719 -498298 -476380 -53211 644911 1364983 1624292
34115 1624292 1160241 375497 -122831 -287343 -467661 -657154 -498320 -23112 217924
34106 217924 -57598 -425191 -382703 -89687 -119385 -595441 -937578 -591056 213426 714104
34096 714104 599891 366616 519505 834914 847364 720706 949296 1349182 1189402 424168
34086 424168 -83785 109241 332731 -35359 -498581 -288711 323504 454733 -18896 -406604
34076 -406604 -346339 -181570 -237331 -431179 -614360 -697242 -470573 110139 539069 298443
34066 298443 -285297 -429216 -113130 -111357 -695063 -1141413 -848635 -197617 136588 124708
34056 124708 134786 211501 129814 -114628 -295226 -261978 -21256 257155 193098 -434793
34046 -434793 -1106651 -900176 244872 1157444 844402 -196632 -695326 -276874 315169
34037 315169 469279 389242 463996 632921 633839 446832 243693 152834 200964 269749 83873
34026 83873 -483226 -1068253 -1095474 -474144 247786 491352 157633 -489627 -1130752 -1489163
34016 -1489163 -1438081 -1169320 -1032347 -1092816 -1075367 -827479 -561407 -499542 -550278 -511764
34006 -511764 -361930 -170121 53059 238638 219925 14 -165572 -136872 -82000 -101916
33996 -101916 7730 318393 445928 117890 -221603 49435 741331 1042219 689465 295443
33986 295443 365511 632195 665371 582433 716985 996302 1129897 1139744 1237298 1360984 1276744
33975 1276744 1020036 839316 789130 751489 777161 1012590 1319797 1352616 1038626 663883
33965 663883 458788 392917 374082 347350 218231 8528 51864 626132 1372072 1540910
33955 1540910 955344 302587 283426 847630 1474418 1826238 1860937 1644459 1366293 1271115
33945 1271115 1301494 1093421 599966 367280 796266 1443697 1568085 1180487 998571 1403591
33935 1403591 1970686 2110146 1727629 1104675 490577 12449 -252610 -304402 -209942 -18494
33925 -18494 185984 188433 -169678 -698655 -1000210 -936300 -722222 -514673 -190044 340114
33915 340114 837033 965452 705157 371094 260486 360344 379227 48986 -567893 -1092816
33905 -1092816 -1205266 -949977 -609973 -379462 -275451 -256786 -277437 -318461 -484942 -890875
33895 -890875 -1291619 -1125061 -250397 621537 707033 180385 -120150 95254 302493 126007
33885 126007 -166279 -340783 -647979 -1185993 -1434213 -975457 -232603 97143 1676 -44727
33875 -44727 39806 -69846 -373914 -477281 -289250 -199823 -413600 -609982 -487238 -242665
33865 -242665 -228972 -403014 -417280 -144205 135269 77603 -316833 -714772 -860197 -874000
33855 -874000 -1013580 -1213967 -1153722 -809579 -575172 -661508 -772309 -650775 -531973 -640337
33845 -640337 -650566 -232323 194788 -25389 -700671 -1015137 -786384 -636126 -807590 -745689
33835 -745689 -188435 228667 31334 -200651 252324 1026278 1221999 802409 540664 733492
33825 733492 849900 508109 9967 -294057 -501777 -733166 -763491 -453223 -142766 -227618
33815 -227618 -586981 -768889 -582635 -235760 -8624 -39873 -349710 -832272 -1216542 -1211548
33805 -1211548 -778641 -221517 60834 -34810 -197545 -92931 141211 45106 -409874 -583435
33795 -583435 -33220 684377 635912 -195667 -884284 -866292 -569425 -494871 -384257 178752
33785 178752 876546 1053513 723875 516482 727993 1037196 1130346 1031699 772022 298612
33775 298612 -153888 -145682 293648 561046 334441 73860 292592 737108 805421 517397
33765 517397 472580 902494 1344010 1388785 1273947 1434104 1772563 1744679 1085159 167744
33755 167744 -406541 -420698 -167865 -48486 -150528 -273751 -306067 -414676 -762168 -1151961
33745 -1151961 -1176697 -748336 -289143 -272368 -669666 -975274 -742299 -15767 732647 1032489
33735 1032489 808518 413445 256539 379123 456752 247085 -87383 -214923 -85876 42995
33725 42995 2448 -95756 -108757 -69375 14387 363351 1136655 1983128 2207657 1537802 539453
33714 539453 66792 356984 836667 819601 242448 -358573 -510547 -326492 -328367 -790252
33704 -790252 -1362217 -1442063 -867596 -66049 504283 819765 1055145 1148983 945109 625927
33694 625927 558289 686452 552929 90118 -99049 392023 1041715 1060164 512760 152986
33684 152986 233324 194235 -321641 -822440 -708691 -167195 136156 -61726 -473869 -749289
33674 -749289 -702924 -294427 200260 229428 -336324 -759955 -279164 750642 1246017 905380
33664 905380 540270 732291 1003352 760525 305990 233349 395560 288946 86680 377166
33654 377166 1013521 1156206 570641 33995 157204 530576 470485 36533 -205664 -31882
33644 -31882 316341 558192 507535 78095 -428926 -369521 411146 1100917 897396 243520
33634 243520 343125 1481319 2618656 2836359 2438745 2241881 2403392 2518527 2458097 2476236
33624 2476236 2636682 2658829 2343204 1816924 1357970 1176842 1269279 1311190 915571 232428
33614 232428 304 626150 1496688 1716358 1317225 1098645 1354414 1510173 1156254 686342
33604 686342 546202 491012 125435 -288668 -203995 278418 467011 15968 -705121 -1208295
33594 -1208295 -1435958 -1614542 -1855132 -2012754 -1808036 -1117263 -271807 81039 -345652
33585 -345652 -1080716 -1451403 -1385275 -1315189 -1445923 -1584386 -1636482 -1731038 -1771613 -1412782
33575 -1412782 -708768 -300286 -604299 -1175827 -1277058 -846850 -492841 -631874 -1023917
33566 -1023917 -1175196 -914949 -484454 -218983 -242098 -438172 -674678 -971873 -1367457 -1698043
33556 -1698043 -1719017 -1437387 -1109235 -887028 -706227 -549868 -534545 -643287 -662660 -508739
33546 -508739 -336676 -210553 12313 317183 414577 207092 21915 123470 344259 461182
33536 461182 526736 505411 81298 -688674 -1046216 -554474 -38123 -622669 -2047274 -2898736
33526 -2898736 -2523196 -1723029 -1365455 -1290457 -1037312 -762115 -765612 -776589 -460431 -181508
33516 -181508 -492642 -1157048 -1423733 -1117678 -741731 -553092 -271768 162770 213528 -518854
33506 -518854 -1584576 -2083255 -1612895 -600562 187046 302563 -100966 -488103 -459280
33497 -459280 -110406 138580 39342 -251804 -407977 -266710 84148 433438 609044 586067
33487 586067 477333 392350 312551 138309 -164392 -504127 -734009 -766454 -647290 -501625
33477 -501625 -353252 -60665 431538 841491 790325 312382 -139441 -261955 -172952 -9779
33467 -9779 342866 849340 1041244 616767 83959 231217 997903 1440057 955044 59109
33457 59109 -307720 99634 699411 832097 349685 -402032 -918076 -896967 -471086 -84035
33447 -84035 -42579 -219810 -256768 24037 476104 804214 798363 483281 122287 -6238
33437 -6238 99435 196004 162113 154959 292015 402641 325822 252636 415252 545337 111132
33426 111132 -835815 -1529711 -1449000 -986714 -795301 -836949 -634442 -233244 -208904 -691215
33416 -691215 -1080856 -970882 -724142 -766756 -875571 -670602 -333516 -225620 -185047 86376
33406 86376 245076 -243767 -1025735 -1150331 -493151 46101 -22995 -96549 360738 865004
33396 865004 756685 258022 -47051 -184978 -434391 -497638 37141 705362 605561 -240353
33386 -240353 -838104 -588772 54268 394170 254718 -198952 -733858 -949055 -517729 224474
33376 224474 462215 -93151 -859800 -1238223 -1282629 -1280273 -1201853 -924422 -566095 -239668
33366 -239668 164101 627623 807121 520739 94256 -129750 -293489 -641352 -942050 -775941
33356 -775941 -241029 86465 -123939 -608303 -899159 -831184 -628042 -605394 -790647 -853271
33346 -853271 -538111 -96095 10448 -186644 -164910 289649 754552 844179 733695 702705
33336 702705 615894 278232 -72312 -100793 83369 170562 160720 169067 17768 -429755 -771220
33325 -771220 -536919 -30092 -33744 -675325 -1216184 -1092332 -610881 -412790 -687238 -1137427
33315 -1137427 -1388740 -1247337 -816098 -469098 -483939 -680104 -682232 -476151 -331604 -248922
33305 -248922 5830 302034 185385 -324907 -607254 -420662 -413162 -1146958 -2092935 -2245554
33295 -2245554 -1488787 -690664 -488785 -577863 -324761 369288 1047658 1280470 1081721 868283
33285 868283 1075699 1717682 2350417 2610090 2691624 3034904 3587735 3757453 3218631 2424913
33275 2424913 2050366 2148456 2199691 1890810 1475229 1299323 1292012 1134296 774169 551241
33265 551241 836720 1669563 2699576 3380862 3305827 2534190 1589371 978539 719175 485681
33255 485681 171629 33567 214786 434696 378002 185467 252312 610435 819623 540943
33245 540943 -5880 -306021 -171455 59747 -24500 -368229 -503183 -162416 350167 555515
33235 555515 391499 140221 -90641 -389364 -573503 -251793 468617 879401 611709 179310
33225 179310 135471 191436 -183360 -703846 -662561 -167480 -27587 -377875 -417142 203969
33215 203969 700812 404590 -132275 -38922 472184 490261 -154805 -738178 -807230 -660726
33205 -660726 -601010 -466655 -134330 119874 57260 -168902 -351131 -528350 -705035 -651386
33195 -651386 -277565 108520 213920 148913 103337 -73618 -583768 -1179523 -1378772 -1084591
33185 -1084591 -621494 -245799 -9569 -32969 -432300 -924283 -975205 -516110 -105941 -168551
33175 -168551 -450257 -511329 -381731 -340286 -344363 -162663 104421 155364 69520 230718 631271
33164 631271 777812 449799 68862 46423 167531 -29468 -547240 -960239 -965226 -601059
33154 -601059 -92579 237558 82082 -497939 -959907 -830409 -262946 226627 405052 357771
33144 357771 88992 -416397 -835725 -795422 -549681 -767925 -1485056 -1892019 -1505048 -944729
33134 -944729 -1011817 -1453554 -1357949 -530990 292766 588017 610220 653817 509144 100637
33124 100637 10872 665573 1398492 1173644 133920 -439360 120488 972103 1034699 427546
33114 427546 -4325 -54141 -198042 -551055 -686372 -493476 -373328 -421041 -203009 369962
33104 369962 700039 448091 129942 223477 295096 -290113 -1235671 -1646571 -1235642 -512428
33094 -512428 29878 248960 49741 -539227 -1043201 -959478 -497471 -311452 -538932 -727198
33084 -727198 -671593 -634897 -706781 -649334 -459981 -393939 -345714 46694 577603 593958 134887
33073 134887 30421 518934 732931 108782 -621755 -589706 -118534 -8115 -175274 -29012
33063 -29012 296073 178586 -292207 -424078 -117574 51846 -53167 88541 632869 1030090
33053 1030090 945796 708751 537640 89284 -788835 -1491681 -1377900 -661304 -122473 -184271
33043 -184271 -606243 -877459 -654766 -4882 606057 744133 505317 342828 401713 404158
33033 404158 229414 119935 167955 112167 -112150 -133479 203267 423997 105472 -438915
33023 -438915 -657576 -602992 -693635 -880376 -723654 -245894 -42250 -400432 -852494 -843358
33013 -843358 -425928 -9199 249410 457533 610882 574100 371809 184268 33235 -273968
33003 -273968 -819174 -1396829 -1756672 -1850111 -1731589 -1411292 -987278 -743261 -838998 -1015794
32993 -1015794 -936781 -749643 -894186 -1335353 -1507383 -1209268 -1009728 -1377032 -1896373 -1908153
32983 -1908153 -1544123 -1440520 -1658145 -1674133 -1389754 -1317833 -1626985 -1788044 -1466900 -1052507
32973 -1052507 -897489 -710177 -246293 -16063 -588038 -1555175 -1939109 -1476355 -851415
32964 -851415 -693287 -914923 -1086766 -973338 -589381 -75102 395229 795195 1274624 1786909
32954 1786909 1912965 1456815 996418 1254465 1984701 2140947 1280495 188318 -155715
32945 -155715 300210 939578 1397170 1728153 1921235 1773938 1270627 756768 632285 969719
32935 969719 1443513 1624355 1421985 1207055 1335567 1618591 1555674 1084932 714913 809602
32925 809602 1136649 1293151 1178568 838199 299747 -118949 156910 1120637 1812031 1429515
32915 1429515 509921 260374 882546 1382542 1066420 387701 86240 244946 563104
32906 563104 904327 1120245 899852 314219 33783 451779 1012806 1004153 611915 487184
32896 487184 594799 347416 -258409 -558462 -349146 -215196 -471877 -603391 -192614 297941
32886 297941 255098 -116300 -201608 31970 136130 49312 179490 660955 1109017 1176664
32876 1176664 917493 555932 278593 259873 514107 723074 591818 345994 434361 760823
32866 760823 764539 351852 140475 522504 1047452 1108784 744668 297365 -256863 -1012074
32856 -1012074 -1483473 -1008787 224290 1201021 1261780 769164 460680 598070 959541
32847 959541 1267827 1340031 1082479 601371 162848 -98479 -250983 -291372 -109075 160794
32837 160794 136946 -221350 -416441 -145799 130889 -170953 -837182 -1140262 -888394 -550851
32827 -550851 -353938 56549 851510 1529034 1546272 996183 296032 -390950 -996516 -1172688
32817 -1172688 -644257 207639 633647 385342 -91407 -311844 -226949 -44347 48923 -71426
32807 -71426 -377905 -585461 -425112 -48125 162504 199103 450777 1029785 1513446 1567062
32797 1567062 1427449 1471627 1635552 1611395 1362934 1063997 721602 274094 -56979 45372
32787 45372 463709 711800 598869 457895 569109 690022 418767 -171005 -553869 -384485
32777 -384485 106257 405808 301473 92050 248347 913456 1735983 2147705 1796239 800305
32767 800305 -313750 -968000 -963207 -584922 -228019 3165 186049 224604 -49016 -423870
32757 -423870 -388191 168747 711191 767925 527337 383507 254573 -145128 -618182 -693761
32747 -693761 -428016 -341775 -516914 -431623 95866 460358 167751 -365075 -440594 -107733
32737 -107733 57981 -56920 -27145 261669 387881 172220 66829 446885 988133 1159384
32727 1159384 984298 835849 706022 245831 -494222 -910541 -609602 67617 505167
32718 505167 491502 210904 -151073 -478423 -607902 -494222 -384611 -512742 -716609 -695215
32708 -695215 -547235 -630889 -897780 -843955 -258323 413769 676468 579439 438125 298409
32698 298409 35084 -256537 -354378 -280254 -259024 -379099 -538528 -632989 -576157 -270306
32688 -270306 191360 434626 203847 -259969 -523156 -518931 -485952 -463153 -235793 222411
32678 222411 605950 637218 331671 -84178 -294103 -29117 602912 1011807 724358 30847
32668 30847 -393485 -472081 -779760 -1498759 -1925015 -1389285 -247137 521688 483113 72435
32658 72435 -166780 -238266 -474635 -936750 -1267934 -1142652 -709710 -433188 -502012 -627245
32648 -627245 -557891 -522758 -824307 -1187654 -1016930 -307515 217392 66737 -366959 -414540
32638 -414540 -42072 229569 120977 -89513 -20743 343026 706456 809660 638391 368959
32628 368959 184754 162033 281956 441949 433713 78209 -508190 -956581 -1108801 -1228387
32618 -1228387 -1527407 -1739482 -1520936 -1054810 -787570 -717197 -498624 -195531 -285178 -802782
32608 -802782 -1093743 -679821 104365 611417 625314 367526 124133 96718 314261 532130
32598 532130 521452 502514 863362 1423122 1547301 1093831 586136 279573 -172779 -822122
32588 -822122 -1051659 -624518 -282470 -595260 -953464 -569750 145327 222910 -288950 -479215
32578 -479215 -75725 291368 293289 341840 680286 926241 771234 421755 117880 -154891
32568 -154891 -273851 91703 911113 1638475 1822040 1475593 809279 74325 -320792 -110850
32558 -110850 353566 487288 325138 360209 552860 322875 -333881 -615911 -145155 407597
32548 407597 396267 136691 197065 433125 411657 250105 309790 465904 395360 259003
32538 259003 382291 518320 170164 -500198 -807918 -549504 -207558 -131691 -146873 -77839
32528 -77839 -79969 -259938 -442798 -513400 -584194 -652024 -500276 -150482 5060 -185919 -272557
32517 -272557 150226 711721 683766 17089 -562808 -556429 -287419 -264701 -387826 -230441
32507 -230441 142067 203658 -200961 -610074 -694310 -745955 -1107550 -1549416 -1662596 -1546554
32497 -1546554 -1580755 -1728119 -1640176 -1344287 -1224885 -1327186 -1273287 -937552 -620724 -441632
32487 -441632 -167629 173469 166106 -220821 -387312 -26884 335379 232065 49184 267488
32477 267488 487262 90479 -515773 -345781 590221 1188554 851256 213449 -34596 -128983
32467 -128983 -485080 -741402 -336705 412594 635654 135060 -435142 -591549 -546361 -588574
32457 -588574 -554208 -226629 157687 181674 -193603 -636878 -853447 -751670 -389429 -22142
32447 -22142 -26367 -448316 -764758 -476436 142213 330817 -118107 -605974 -633025 -433731
32437 -433731 -440101 -594231 -598862 -470768 -382946 -258980 -14972 60662 -276148 -628675 -390994
32426 -390994 323438 796519 709822 420495 240610 101835 8828 139447 330619 144077
32416 144077 -326161 -397885 137938 579885 344913 -209177 -472658 -493374 -634035 -845385
32406 -845385 -886017 -824674 -746661 -416815 159138 338908 -261883 -940873 -811309 -142529
32396 -142529 129220 -97171 -142503 84906 -14747 -404113 -225379 680162 1198300 505202
32386 505202 -692065 -1183031 -814615 -291245 14128 256867 494539 614047 700057 876104
32376 876104 930288 611225 131071 -113589 -149465 -261504 -396030 -284510 -65285 -195747
32366 -195747 -717826 -1143758 -1176407 -1070026 -1112337 -1160234 -925026 -437437 -11941 82019
32356 82019 -192902 -590463 -652867 -89097 802342 1328641 1161400 679075 410770 401346
32346 401346 365804 238260 203731 266791 165822 -210780 -616252 -793879 -812723 -874388
32336 -874388 -954995 -883418 -701772 -679478 -927306 -1224676 -1340845 -1343084 -1418177 -1520562 -1421469
32325 -1421469 -1068344 -673048 -406885 -207282 14010 138406 -6549 -330560 -511230
32316 -511230 -384649 -163710 -155598 -337128 -374880 -89712 274081 375925 245328 201443
32306 201443 353664 451636 290933 11510 -131967 -66790 171634 544757 831852 643802
32296 643802 -33463 -540904 -243532 594241 1114407 999539 758643 813217 893549 618626
32286 618626 172014 -18853 50645 43546 -164601 -380378 -412828 -209979 184416 558297
32276 558297 600944 316571 152192 396534 686561 502278 -69267 -525593 -703191 -789013
32266 -789013 -732690 -322081 179781 225400 -51795 154583 1030135 1628634 1198214 353739
32256 353739 192780 714633 955211 436753 -368286 -935622 -1217896 -1208283 -778538 -188559
32246 -188559 -55733 -468973 -709572 -236380 551636 947295 876200 736373 674776 554662
32236 554662 401444 373948 429667 429031 420398 447744 290009 -166056 -503992 -255068 340452
32225 340452 607130 390916 160780 189784 281689 381905 760199 1331500 1429914 672039
32215 672039 -403027 -953636 -753456 -170777 394796 694130 602250 322434 331660 730787
32205 730787 941204 476875 -278852 -590981 -433473 -415364 -745609 -940560 -670830 -299949
32195 -299949 -293640 -516884 -475883 -31465 450974 582652 350138 33236 -127752 -117090
32185 -117090 -37865 73474 220546 288165 124000 -162026 -207236 159863 684496 1033700
32175 1033700 1147201 1065705 688156 -19017 -790565 -1329123 -1599064 -1597480 -1148255 -317151
32165 -317151 285691 160865 -335955 -494270 -325965 -451724 -966652 -1202911 -789020 -228364
32155 -228364 -108328 -322223 -440419 -360749 -203416 30803 308560 397938 204687 3982
32145 3982 58980 280494 473694 583451 505576 88193 -446633 -595873 -392792 -525088
32135 -525088 -1182397 -1450428 -572488 725268 1078123 337359 -376116 -339910 29730 173481
32125 173481 174578 256551 270957 76303 -134339 -193404 -161267 14045 461781 838992 531073
32114 531073 -298468 -644134 -117037 340278 -104848 -772045 -474872 608817 1228737
32105 1228737 985711 745035 1046333 1271474 796916 7446 -411847 -454862 -455914 -375073
32095 -375073 -77927 133495 -62124 -397971 -461998 -439212 -735398 -1111368 -957924 -331928
32085 -331928 58202 -66292 -237027 -129749 -21278 -88649 31655 551063 981059 798506
32075 798506 228384 -147111 -205009 -201548 -202247 -149771 -251570 -709195 -1211547 -1264448 -916133
32064 -916133 -594519 -338059 150552 701111 674225 -40482 -694784 -678795 -294075 -161250
32054 -161250 -358055 -593596 -809040 -1064591 -1121806 -710746 -84880 187554 -59602 -474852
32044 -474852 -712283 -682547 -381232 76011 283469 -94576 -739570 -950241 -631249 -498204
32034 -498204 -1032437 -1712612 -1711427 -1004107 -266486 115018 334008 489056 248346 -548640
32024 -548640 -1408864 -1718508 -1539662 -1468585 -1763882 -2001539 -1690550 -936806 -288553 -64967
32014 -64967 -59875 92629 427765 626564 436007 -8087 -360822 -513161 -683394 -996148
32004 -996148 -1164506 -828132 -138304 288420 82196 -446416 -728915 -619720 -466684 -599910
31994 -599910 -950944 -1196371 -1177117 -1125072 -1422860 -2065105 -2455138 -1986676 -843626 84367
31984 84367 199566 -210000 -555982 -739878 -981775 -1175124 -962056 -362735 178535 391100
31974 391100 380690 222472 -155147 -572861 -583874 -90431 414527 466421 150221 -211788
31964 -211788 -504924 -668273 -494544 6771 352157 145768 -323469 -507262 -427057 -551455
31954 -551455 -956561 -1195723 -1044825 -824069 -833126 -953825 -1007050 -1056430 -1137643 -1134880 -1183758
31943 -1183758 -1690351 -2557562 -2920716 -2269969 -1423592 -1575218 -2574670 -3078790 -2458650
31934 -2458650 -1593106 -1445822 -1767226 -1785324 -1400315 -922945 -264093 670104 1220671 686408
31924 686408 -412892 -872921 -551186 -431069 -843895 -911910 -185156 450371 274617 17798
31914 17798 590286 1410840 1251972 185688 -608840 -666659 -586142 -675791 -532951 -102055
31904 -102055 23839 -322644 -506750 -167968 206017 191416 113308 355016 668790 643450
31894 643450 291330 -208940 -782963 -1144014 -847553 -56416 372180 -15215 -689198 -1055225
31884 -1055225 -1254253 -1536367 -1561071 -1026679 -416756 -350610 -615824 -574963 -179667 112551
31874 112551 116863 -38187 -339579 -727108 -821717 -441733 -36996 30539 193035 881903
31864 881903 1484358 1097773 50465 -416927 91426 748534 906839 794198 639836
31855 639836 204915 -420902 -541456 61995 560350 209922 -569876 -872551 -549659 -150969
31845 -150969 -9071 -22485 -127589 -410154 -810452 -1118212 -1221825 -1119981 -822411 -467368
31835 -467368 -350741 -567743 -779412 -608010 -155485 120054 -26410 -390914 -609263 -506946
31825 -506946 -164249 247286 632026 944190 1020493 635541 -104498 -609432 -376947 334096
31815 334096 735999 435760 -177345 -494949 -326028 93085 418180 412429 85951 -265949
31805 -265949 -330762 -121896 101385 203504 236160 198293 15166 -262790 -487097 -594473
31795 -594473 -565156 -363368 -173483 -412219 -1090474 -1468620 -938397 -6663 323619 -1356
31785 -1356 -114365 310632 586569 235018 -252826 -332450 -296652 -656364 -1205458 -1316006
31775 -1316006 -823311 -161856 126646 -219248 -937854 -1268609 -718831 116086 188330 -433013
31765 -433013 -553113 274786 946397 518641 -307181 -332137 365462 856884 866939 712722
31755 712722 315656 -483033 -1033316 -609519 204445 180583 -604726 -846299 -106445 549058
31745 549058 319232 -247070 -463289 -616537 -1140960 -1640251 -1560597 -1142523 -926988 -853602
31735 -853602 -570325 -213148 -200042 -536109 -863126 -950647 -737762 -213178 367288 513529
31725 513529 137065 -225151 -177754 4521 16442 135605 625975 1041816 848954 367364
31715 367364 317140 666681 730592 313721 -9693 205982 746308 1161060 1169110 643182
31705 643182 -233317 -800702 -538576 115397 212246 -376963 -806523 -592735 -276328 -363517
31695 -363517 -420223 105336 761305 633929 -284948 -1076741 -1152486 -803160 -455669 -77209
31685 -77209 437528 836240 847337 635086 568515 712646 845087 873219 944245 1124374
31675 1124374 1188911 852942 147743 -526137 -750339 -473525 -21000 255621 274308 178999
31665 178999 120560 145368 205285 191560 32638 -171957 -214617 -54704 101816 102342 52925
31654 52925 58334 -37435 -377551 -732162 -781543 -664110 -808688 -1221737 -1420068 -1193490
31644 -1193490 -950827 -1051088 -1225267 -1046297 -649378 -522378 -754100 -954497 -885303 -761904
31634 -761904 -853205 -1073108 -1092204 -719358 -123531 271579 188416 -144684 -203697 143429
31624 143429 405940 154938 -321645 -404805 2138 427988 540623 451103 329886 177701
31614 177701 68101 217955 655377 1101008 1300411 1243906 1015482 699044 467687 455777
31604 455777 497534 327754 92588 259367 879897 1343229 1102180 341918 -316344 -524979
31594 -524979 -383774 -110435 212118 635622 1198146 1705652 1745608 1178414 525638 443913
31584 443913 809424 843234 261756 -279315 -161298 343020 618375 637342 790969 1084572
31574 1084572 1070054 493854 -389163 -1092584 -1234832 -748892 -1008 464091 483583 360441
31564 360441 275074 20896 -458980 -772998 -672257 -438732 -268016 156641 901695 1213882
31554 1213882 540415 -368234 -373346 337348 548915 -76366 -574478 -318311 70314 -116527
31544 -116527 -575998 -668915 -447887 -366672 -504873 -669713 -842364 -1015002 -979949 -738831
31534 -738831 -704180 -1022944 -1142533 -604910 135759 338244 100578 133464 576488 804223
31524 804223 446429 -85923 -276292 -149739 5256 114701 206047 139304 -191167 -537701
31514 -537701 -498635 -27264 464512 554575 240178 -147977 -388306 -592127 -930976 -1261298
31504 -1261298 -1214451 -678856 -9985 337447 263802 17024 -155820 -236190 -384172 -745308
31494 -745308 -1253300 -1604647 -1547722 -1222052 -1033831 -1123880 -1167786 -842861 -288913 105572
31484 105572 214944 215893 220559 174714 120192 259963 647905 1030190 1157462 1108302 1104833
31473 1104833 1090318 755534 53425 -553573 -576391 -108967 302335 349125 213009 108081
31463 108081 -37030 -267717 -371104 -277174 -344137 -803064 -1208362 -1008802 -474015 -370411
31453 -370411 -762858 -903491 -446930 24497 28506 -48424 211842 329513 -340055 -1356683
31443 -1356683 -1616507 -923305 -254827 -326481 -674325 -507498 143368 613488 559080 220089
31433 220089 -104874 -390577 -667281 -790245 -581513 -113542 247749 139908 -406082 -910132
31423 -910132 -887814 -350820 241901 499625 398755 95982 -279989 -550464 -482250 -97876
31413 -97876 193583 60272 -257753 -221164 272224 746817 790136 496544 136597 -261072
31403 -261072 -715575 -976116 -818105 -503860 -476803 -630178 -399716 297120 743621 357346
31393 357346 -472318 -893083 -650454 -195399 68951 159272 201711 212867 224822 257032
31383 257032 128282 -361557 -1027943 -1412984 -1338856 -1028638 -672010 -268758 37351 -73582
31373 -73582 -596958 -1043810 -1020113 -676194 -376514 -223003 -142910 -168515 -335835 -484508
31363 -484508 -407004 -80984 379735 819842 982549 635304 -55091 -531853 -450599 -53720
31353 -53720 227676 265679 130166 -163764 -486375 -475269 8882 504301 423778 -212859
31343 -212859 -868283 -1182978 -1219153 -1109590 -861222 -521812 -224267 -7044 205274 434217
31333 434217 615158 691523 620881 396010 178549 230586 548458 766592 609101 209700
31323 209700 -193733 -558833 -778362 -516444 282560 1058703 1282982 1129087 989779 699516
31313 699516 -46705 -789535 -733279 -33550 278764 -183964 -629716 -386228 139248 312523
31303 312523 301255 533193 713876 255538 -595760 -912148 -349403 434925 738295 606675
31293 606675 460693 411582 308409 196860 315041 634645 726878 285666 -348737 -480178
31283 -480178 66092 659142 695009 430356 532982 958229 920662 113420 -695204 -679867
31273 -679867 -76260 251899 32201 -242690 -216222 -114832 -221290 -411513 -415807 -210680
31263 -210680 29579 141994 24958 -290273 -522841 -346533 161732 517059 425360 152718
31253 152718 99199 239148 279126 203361 278907 550329 727697 677134 643541 752750 627120
31242 627120 -96399 -1028235 -1289534 -575265 440052 909933 696388 247397 -70766
31233 -70766 -187119 -93190 201116 516886 608420 420403 63960 -361225 -705176 -697286
31223 -697286 -266455 202005 321491 306238 635008 1164480 1186852 498933 -208460 -324985
31213 -324985 -115772 -118298 -257761 -152534 59828 -96277 -555325 -678850 -157119 598904
31203 598904 1076031 1194703 1075554 714694 148144 -365621 -580751 -501400 -254394 44554
31193 44554 181500 -95305 -687011 -1073284 -898895 -437565 -199591 -265162 -345057 -363079
31183 -363079 -537830 -862230 -945635 -586192 -175193 -211376 -586122 -714770 -363870 5654
31173 5654 -131192 -661083 -1038036 -1056592 -1056474 -1300281 -1511893 -1305941 -842718 -651009 -841023
31162 -841023 -922263 -537697 7432 222424 127405 88014 157763 63011 -206767 -299568 -97424
31151 -97424 51994 -86573 -243255 -129303 55302 38 -119036 101336 598489 890748
31141 890748 745099 359251 -53018 -390185 -436500 -58430 349177 207950 -349222 -568418
31131 -568418 -247998 -88048 -484105 -732682 -103707 906840 1252689 876660 632880
31122 632880 840639 901483 456432 21525 147637 645466 1027995 1182700 1236146 1205906
31112 1205906 1139837 1205883 1323700 1098429 442580 -142076 -267820 -234134 -450612 -673525
31102 -673525 -399021 226336 521929 229352 -232677 -499753 -679953 -864913 -725767 26693
31092 26693 1018403 1424420 821897 -337370 -1144043 -1071722 -411607 87926 -13775 -468180
31082 -468180 -696266 -439529 -10397 47375 -490142 -1273182 -1676140 -1410778 -808450 -402766
31072 -402766 -325273 -304890 -170701 -32557 48929 202939 426387 451963 141251 -247444
31062 -247444 -378070 -198691 160318 567814 803167 614428 101011 -271159 -273052 -179954
31052 -179954 -180194 21021 588671 1012504 773179 206150 19731 205753 189390 -85777
31042 -85777 -69382 373613 693884 584366 377185 240638 -221022 -1120228 -1757567 -1546735
31032 -1546735 -918382 -636475 -635549 -277134 482177 949415 711731 145478 -212460 -291901
31022 -291901 -303023 -313534 -251742 -114311 13606 44724 -68184 -274165 -407376 -364470
31012 -364470 -290739 -426412 -739555 -857815 -438381 452110 1356190 1804513 1695527 1310260
31002 1310260 930978 526798 -41150 -601481 -776828 -547800 -346341 -411705 -418500 -53117
30992 -53117 355850 232308 -372346 -766996 -503267 99584 410209 217216 -103764 -37752
30982 -37752 494914 996176 932701 421763 85889 136281 66343 -429009 -752684 -232503
30972 -232503 732997 1146189 846639 613325 841108 1030475 789280 446262 303367 126468
30962 126468 -115194 175161 1201374 2028388 1733142 812473 507821 1041369 1497459
30953 1497459 1318354 920552 739690 579417 186399 -252549 -501197 -588190 -487584 -46075
30943 -46075 539689 758937 575168 581079 1022761 1280516 798366 -6649 -334727 -77863
30933 -77863 292653 548833 746134 699067 160245 -539370 -723373 -324237 -12421 -223045
30923 -223045 -578263 -511097 -46067 321777 248911 -189443 -653777 -791466 -510599 -133186
30913 -133186 -109157 -490018 -878549 -971133 -892141 -848942 -728239 -306915 284525 610532
30903 610532 447379 45944 -180493 -114784 -19526 -211414 -693226 -1104229 -1043865 -482181
30893 -482181 136719 257161 -230002 -799459 -811802 -282751 89326 -143014 -496235 -252816
30883 -252816 351321 349692 -435159 -915196 -272089 737498 810847 -16635 -484655 25576
30873 25576 715082 624853 -154573 -851370 -947679 -417360 415468 926822 612806 -209720
30863 -209720 -607709 -248817 130385 -144181 -682801 -725029 -314986 -66293 -90121 69805
30853 69805 556899 956837 954773 691440 430234 310866 417233 684158 811246 678753
30843 678753 686185 1158417 1601372 1252429 317201 -156704 216941 617224 316914 -264365
30833 -264365 -375408 -142950 -197245 -501512 -425865 114645 421951 89382 -341142 -155555
30823 -155555 519008 902704 575726 -90673 -509576 -570210 -604092 -820786 -1004935 -819402
30813 -819402 -268570 266488 415916 142253 -296907 -587562 -562721 -297665 -44744 14664
30803 14664 -25330 73015 355097 599443 610600 446171 279132 160241 33893 -88400
30793 -88400 -115532 -52615 -89752 -425123 -987193 -1411969 -1393793 -1026517 -661755 -460361
30783 -460361 -325652 -313451 -723160 -1516171 -1993775 -1528750 -449821 312847 394999 259969
30773 259969 283392 237159 -71242 -265804 25487 495614 589738 342228 240901 398906
30763 398906 409388 41306 -392100 -498101 -309463 -157289 -229896 -386846 -328734 76450
30753 76450 585507 779429 564173 322849 398136 597416 482206 18071 -401655 -530744
30743 -530744 -513590 -517104 -452322 -198484 118548 221818 -27076 -462727 -680535 -373170
30733 -373170 255402 579733 293155 -141761 -134715 151252 89269 -350970 -514316 -133978
30723 -133978 215629 50187 -296016 -356371 -379422 -819345 -1343765 -1125142 -55181 994363
30713 994363 1223244 730121 178796 36549 277455 545393 497882 178445 35055 353918
30703 353918 780203 734286 231204 -118218 72394 549470 878632 924632 776485 563744
30693 563744 474623 638290 884786 908709 693285 426770 49826 -591813 -1126139 -866675
30683 -866675 132588 911196 851870 439074 304378 217382 -258311 -698691 -368660 455061
30673 455061 699280 13060 -795995 -945928 -524448 27176 540099 919982 922894 508701
30663 508701 23529 -243078 -356360 -446914 -506451 -580767 -726963 -684590 -111599 728675
30653 728675 1127289 973691 947638 1354483 1550443 1069830 557343 764509 1218351 911001
30643 911001 -12154 -364944 289039 1008039 893021 246262 -126547 -69884 17198 -48335
30633 -48335 -130132 -176963 -244684 -251627 -85985 142872 247889 229200 125963 -211782 -831927
30622 -831927 -1288101 -1008589 -101580 640838 690360 343281 125607 64661 -52796 -64356
30612 -64356 312053 765999 661269 88557 -102014 386770 719310 218026 -456526 -255466
30602 -255466 613031 1015099 641831 311845 496032 691839 566767 618173 1133781 1440793
30592 1440793 899247 -107093 -864319 -1302221 -1566135 -1383965 -747535 -511448 -1243511
30583 -1243511 -2057059 -1777171 -812106 -534437 -1092096 -1316206 -781451 -408014 -715191
30574 -715191 -961857 -610971 -326203 -721769 -1245971 -1218589 -1030002 -1297150 -1588320 -1091747
30564 -1091747 -59324 478858 175954 -358671 -565522 -435161 -161062 19824 -185198
30555 -185198 -669824 -719977 52375 850624 590808 -518767 -1182551 -770696 21319 369706
30545 369706 311789 266193 316337 366564 454129 531665 371855 -14110 -267712 -244451 -262845
30534 -262845 -529674 -749994 -631538 -382813 -345935 -476991 -579848 -748906 -1127937 -1444108
30524 -1444108 -1275430 -715552 -328454 -395896 -569521 -396392 64839 333239 103575 -403853
30514 -403853 -718860 -672206 -548564 -634458 -775570 -610515 -153663 202961 302612 427738
30504 427738 705984 737511 202156 -472509 -575613 -125518 129610 -227739 -735131 -749885
30494 -749885 -265216 260661 552107 637635 561576 376208 312036 567097 926092 909355
30484 909355 347719 -430170 -986863 -1111093 -810371 -305837 -44062 -318348 -780394 -741474
30474 -741474 -130230 294698 -27812 -666395 -856816 -574118 -380570 -453441 -418351 -87433
30464 -87433 271038 474137 666471 866080 778006 295272 -213991 -346751 -71689 448348
30454 448348 1064953 1515726 1515230 1224852 1234441 1759888 2194439 1807962 646377 -563773
30444 -563773 -1171066 -1003458 -320665 297538 274501 -362582 -858615 -527925 465563 1380250
30434 1380250 1731466 1552147 1064027 505060 167478 214031 457992 564710 411141 79198
30424 79198 -333758 -687036 -785678 -639439 -530820 -613003 -708227 -723998 -891413 -1268684
30414 -1268684 -1433670 -1114392 -707268 -628910 -579508 -135057 318881 122010 -415993 -295650
30404 -295650 628610 1346486 1138360 450862 7729 -150610 -290329 -328056 -108256 123911
30394 123911 34542 -313163 -634007 -779246 -663725 -205235 395183 684023 517478 216206
30384 216206 -26819 -392886 -854606 -957440 -579822 -307311 -525352 -712078 -289649 328089
30374 328089 339607 -149391 -313190 90394 489391 546572 566753 715684 639963 159468
30364 159468 -328984 -478898 -452351 -409530 -114745 493267 842034 417867 -414719 -876324
30354 -876324 -830027 -767203 -876003 -816689 -490767 -350408 -646140 -916427 -666211 -162469
30344 -162469 -31021 -296896 -403399 -121449 146545 78425 -88782 -41002 105132 131726
30334 131726 196085 533405 921846 935660 621935 430785 475830 364119 -99863 -483381
30324 -483381 -278039 394224 929360 962634 687838 502596 551872 682345 724038 676989
30314 676989 596665 444124 224292 169920 465455 780851 522118 -271688 -766534 -432458
30304 -432458 165767 217989 -113375 -68957 390843 550931 181727 -132520 -80626 -111534
30294 -111534 -455654 -517473 169153 1058713 1344103 1085140 898087 909078 751053 378317
30284 378317 166287 246329 337845 281242 263861 442095 696752 834516 786579 594887
30274 594887 385633 305832 332625 252444 -35123 -356026 -530628 -583963 -565886 -456450
30264 -456450 -390597 -589512 -855806 -591674 355884 1326969 1728077 1805541 2031469 2192983
30254 2192983 1782254 970899 449411 455481 644469 806331 1025595 1185983 1008807 637750
30244 637750 571887 905385 1133457 810196 7102 -879193 -1415782 -1355740 -973504 -956245
30234 -956245 -1492024 -1809050 -1255785 -419747 -275438 -591119 -375005 262547 140199 -894664
30224 -894664 -1417198 -623289 286676 -94744 -1279774 -1744024 -1112345 -267145 213614
30215 213614 502656 670793 543848 372342 653785 1229891 1406521 1035440 686504 668307
30205 668307 667979 505511 459501 590780 470906 -64304 -522666 -517698 -365796 -469563 -602686
30194 -602686 -362403 36727 53177 -278164 -356848 63759 514082 510237 179192 -58251
30184 -58251 -96760 -111849 -112800 81865 428379 557748 230047 -330627 -717422 -792766 -684483
30173 -684483 -489489 -235540 -57699 -123290 -353735 -454962 -280894 18982 245234 341272
30163 341272 299470 84419 -272620 -662939 -1019437 -1282743 -1271110 -835218 -166219 313574
30153 313574 406748 231993 -115526 -611994 -978695 -798213 -155677 288185 144541 -198227
30143 -198227 -239320 -104122 -174237 -352406 -262020 43366 162464 58741 134840 556088
30133 556088 968354 991134 621318 53643 -558219 -1029320 -1118317 -765885 -234230 92093
30123 92093 -399 -417869 -817282 -880778 -652055 -488684 -560915 -596257 -331185 10441
30113 10441 31683 -180731 -108878 483505 1210552 1498796 1154181 471121 -72943 -250503
30103 -250503 -301569 -603692 -1063708 -1127454 -586624 -12912 -18400 -391271 -446207 -13791
30093 -13791 450137 599826 486186 172911 -366663 -934208 -1185749 -1084722 -859161 -542407
30083 -542407 -44674 365930 254918 -247734 -514039 -339668 -189310 -333120 -369340 66550
30073 66550 657273 865788 638533 283906 -21932 -283533 -500735 -673413 -771520 -631839
30063 -631839 -232421 -56434 -605967 -1455629 -1507717 -481737 581257 745078 383496
30054 383496 338726 543190 331445 -300169 -677109 -554492 -430221 -713801 -1203713 -1465259
30044 -1465259 -1274822 -690385 -63334 114060 -236862 -533652 -266504 218467 182522 -424338
30034 -424338 -912345 -781545 -138509 723483 1534724 1854033 1332987 330995 -272704
30025 -272704 -69701 487560 788529 724201 525813 361943 268745 194102 26216 -208304
30015 -208304 -271231 -131161 -227019 -836651 -1418625 -1242698 -526519 -158769 -327053 -317198
30005 -317198 189647 576965 398364 115325 201373 317286 51282 -196118 144881 777724
29995 777724 966949 686373 542233 709829 698131 191274 -470591 -754697 -496246 42328
29985 42328 409846 320104 -43609 -249195 -276198 -571326 -1193100 -1440149 -837923 -416
29975 -416 177433 -203509 -371432 -178527 -128026 -239855 49941 708342 857540 129143
29965 129143 -603259 -436716 283414 572264 222174 -97524 93488 566407 855747 759505
29955 759505 393582 115301 319730 951143 1297997 681252 -649782 -1688256 -1791211
29946 -1791211 -1270878 -764128 -411264 37546 557603 735815 360998 -200810 -415536
29937 -415536 -199464 91285 207795 270374 433837 566934 471279 253372 211638 399680
29927 399680 549496 448421 168428 -143748 -489759 -889189 -1171459 -1096424 -670475 -203577
29917 -203577 -3098 -80300 -217547 -277088 -326954 -429797 -452250 -242707 74848 200943
29907 200943 65500 -81175 -39300 85659 87783 -70372 -284363 -416239 -312420 47034
29897 47034 343140 164543 -423682 -903542 -1038592 -1137696 -1340174 -1190312 -410841 384977
29887 384977 430643 -61897 -249368 52970 223431 -66514 -416614 -488110 -485181 -604527
29877 -604527 -647811 -483137 -357345 -456779 -620048 -722904 -870262 -979521 -690808 26778
29867 26778 671905 900745 926351 943303 710484 96660 -485936 -656252 -614558 -654913
29857 -654913 -585545 -159834 326748 444727 310219 310258 454585 544419 681264 1025766 1321741
29846 1321741 1265661 1111471 1276267 1542431 1318975 582456 -81153 -299250 -177281 163154
29836 163154 655543 921265 498248 -461006 -1250575 -1434348 -1144108 -601934 89355 670827
29826 670827 817818 574538 220371 -246354 -928555 -1437403 -1223217 -538242 -287969 -759914
29816 -759914 -1260635 -1247323 -1036299 -1024930 -956866 -478969 157871 511476 638218 866128
29806 866128 1187501 1294216 1004764 415317 -138427 -219407 201558 413732 -198697 -989618
29796 -989618 -655556 771655 1652578 1011970 -54762 -129322 438154 427883 -81264 7238
29786 7238 738107 937377 194484 -448936 -186860 388016 382771 -92611 -385722 -368777
29776 -368777 -382007 -558549 -754959 -869700 -857543 -674929 -436383 -338065 -305697 -107111
29766 -107111 96752 -159591 -820009 -1141383 -679273 53404 276850 -129538 -738959 -1195016
29756 -1195016 -1337208 -1096232 -675423 -522555 -755657 -926789 -677624 -249485 18556
29747 18556 256872 659305 939743 782771 491929 541562 752308 606484 181104 6910
29737 6910 102897 -24354 -379186 -336147 258972 654615 295799 -300676 -331786 124702
29727 124702 362289 161703 -2360 210516 547069 627960 466812 345741 402674 506989
29717 506989 462832 250573 62077 65905 145487 -4512 -470042 -953040 -1106914 -893146
29707 -893146 -501784 -89601 244758 381455 281124 72377 -136979 -433897 -898823 -1336428
29697 -1336428 -1442245 -1202120 -922430 -870394 -1035524 -1212564 -1182500 -874756 -485649 -331718
29687 -331718 -436235 -431436 -92715 245588 155040 -199759 -316922 -186197 -262115 -579982
29677 -579982 -584464 -76252 347748 228448 2440 224714 568971 418225 101095 526599
29667 526599 1597984 2025562 1072471 -364787 -970678 -646198 -256496 -230456 -230456 -28906
29657 -28906 89011 -108395 -429782 -614700 -599075 -316560 288130 895804 976766 582825
29647 582825 466670 1005024 1470571 970332 -207407 -913263 -704287 -305220 -363585 -539327
29637 -539327 -290974 62736 -215597 -1066206 -1597965 -1288190 -618694 -338941 -541238 -729092
29627 -729092 -521574 -18519 411003 515149 366479 245740 298418 374498 303210 180824
29617 180824 177735 213151 116716 -44159 -188314 -596802 -1492273 -2314855 -2151384 -1037525
29607 -1037525 -92955 -58257 -432985 -492932 -380290 -523375 -681020 -437828 -124533 -281416
29597 -281416 -587408 -349359 210858 262565 -184219 -322933 -56039 -182794 -850066 -1116963
29587 -1116963 -548262 3631 -101510 -193813 385155 932853 533249 -282541 -376525 44626
29577 44626 -221114 -1272646 -1803816 -1066050 112161 652704 565491 469806 580254 731776
29567 731776 865946 979810 939813 721528 578309 732661 1117487 1510356 1661780 1334331
29557 1334331 616722 124396 341514 807250 650427 -19412 -117729 735974 1462485 1049075
29547 1049075 55117 -256443 224543 444782 -159721 -948353 -1121383 -710104 -240707
29538 -240707 28441 171342 245089 228491 153640 62361 -77366 -262420 -355747 -240318
29528 -240318 -25149 22481 -241505 -683306 -1027271 -1108596 -969346 -740990 -515019 -360625
29518 -360625 -374204 -599806 -929894 -1176402 -1219645 -1035013 -664893 -265039 -59581 -93048
29508 -93048 -140219 -37518 49771 -68369 -225543 -193761 -215432 -736417 -1602194 -2048915
29498 -2048915 -1643054 -767242 8959 562343 946971 960594 420911 -386360 -927119 -947012
29488 -947012 -546177 42923 501337 515708 142230 -137048 -24397 149236 -82209 -593291
29478 -593291 -810648 -455567 189345 654806 654166 219644 -259739 -299991 106510 378172
29468 378172 90832 -410567 -506984 -155308 202326 356866 437821 451857 286522 119576
29458 119576 255021 527274 413630 -179788 -752992 -931959 -855578 -727915 -516455 -299674
29448 -299674 -396620 -832310 -1083260 -705735 70344 657014 749170 411675 -159645 -657847
29438 -657847 -716802 -304249 91110 -26388 -556292 -949237 -859258 -452032 -158496 -273839
29428 -273839 -687557 -905423 -515096 264236 737876 587196 269441 335579 668605 770876
29418 770876 565695 434862 542932 609914 434927 246068 345020 666093 885859 816914
29408 816914 528532 174579 -146314 -387499 -525858 -573980 -588696 -624730 -650253 -531718
29398 -531718 -171736 322793 673833 664271 312683 -147219 -393675 -204581 314334 726077
29388 726077 694887 414627 358389 589531 658852 307849 -95476 -93458 182701 226912 -133389
29377 -133389 -604157 -879276 -865234 -534365 46179 531770 536731 149700 -113665 9769
29367 9769 208684 112931 -175019 -321753 -317124 -464381 -883448 -1297452 -1347469 -957252 -370444
29356 -370444 44940 38653 -316487 -629157 -543709 -144044 136086 73755 -58953 62618
29346 62618 278716 183449 -158540 -178735 342852 810241 571140 -150225 -586038 -544269
29336 -544269 -589493 -1048416 -1465509 -1349617 -949972 -838402 -1064571 -1222938 -1145250 -1013881
29326 -1013881 -883426 -599149 -221694 -81979 -289370 -538214 -553236 -446197 -471642 -644122
29316 -644122 -746795 -573438 -84416 513014 787802 405311 -450162 -1125475 -1095347 -433029
$$ [...]
##END NTUPLES=NMR SPECTRUM
##END=
