##TITLE=31Pdec_LR-742-RM3
 , 24 sc
 8.11.2021
##JCAMPDX= 6.0         $$ Bruker NMR JCAMP-DX V2.0
##DATA TYPE= NMR SPECTRUM
##DATA CLASS= NTUPLES
##ORIGIN= UXNMR, Bruker Analytische Messtechnik GmbH
##OWNER= root
$$ XWIN-NMR		Version 3.5
$$ Mon Nov  8 13:07:09 2021 Russian Standard Time (UT+4h)  she@DPX200
##.OBSERVE FREQUENCY= 81.013821
##.OBSERVE NUCLEUS= ^31P
##.ACQUISITION MODE= SIMULTANEOUS
##.ACQUISITION SCHEME= undefined
##.AVERAGES= 24
##.DIGITISER RES= 16
##SPECTROMETER/DATA SYSTEM= spect
##.PULSE SEQUENCE= zgpg30
##.SOLVENT NAME= CDCl3
##.SHIFT REFERENCE= (INTERNAL, CDCl3, 0, 248.564)
##AUDIT TRAIL= $$ (NUMBER, WHEN, WHO, WHERE, WHAT)
$$ ##TITLE= Audit trail, XWIN-NMR		Version 3.5
$$ ##JCAMPDX= 5.01
$$ ##ORIGIN= Bruker BioSpin GmbH
$$ ##OWNER= she
$$ F:/spectra/data/she/nmr/P31/1/pdata/1/auditp.txt
$$ ##AUDIT TRAIL=  $$ (NUMBER, WHEN, WHO, WHERE, WHAT)
(   1,<2021-11-08 13:05:17.18 +0400>,<she>,<DPX200>,
      <created by zg, POWCHK disabled, PULCHK disabled
       configuration hash MD5:
       00 E9 B6 7A A2 85 ED C7 34 08 36 98 17 FE 4E 26
       data hash MD5: 32K
       EA F8 E9 A3 B7 50 D6 31 E0 FE 04 E6 DF 2B AA 39>)
(   2,<2021-11-08 13:05:29.46 +0400>,<she>,<DPX200>,
      <Start of raw data processing
       efp BC_mod = 2 LB = 1 FT_mod = 6 PKNL = 1 PHC0 = -8845.208 PHC1 = 110.2694 SI = 64K 
       data hash MD5: 64K
       12 FD 8A 9D 25 9B 30 B8 B5 41 6E 4E 85 69 06 FD>)
(   3,<2021-11-08 13:05:54.07 +0400>,<she>,<DPX200>,
      <pk PHC0 = -22.83113 PHC1 = 55 
       data hash MD5: 64K
       10 DA F1 60 D1 EC 9C FA 58 97 FD CB 6C 23 28 A7>)
$$ ##END=
$$ 
$$ hash MD5
$$ A8 77 DA 9E 86 F7 B1 9F 0D 01 95 3B 5E A5 07 DB
##$RELAX= 
##$RELAX= 
##$RELAX= 
##$RELAX= 
##$RELAX= 
##$RELAX= 
##$RELAX= 
##$RELAX= 
$$ Bruker specific parameters
$$ --------------------------
##$DU= <F:/spectra>
##$EXPNO= 1
##$NAME= <P31>
##$PROCNO= 1
##$TYPE= <nmr>
##$USER= <she>
##$AMP= (0..31)
100 100 100 100 100 100 100 100 100 100 100 100 100 100 100 100 100 100 
100 100 100 100 100 100 100 100 100 100 100 100 100 100 
##$AQSEQ= 0
##$AQ_mod= 1
##$AUNM= <au_zg>
##$AUTOPOS= <>
##$BF1= 81.014009
##$BF2= 200.13
##$BF3= 200.13
##$BF4= 200.13
##$BF5= 200.13
##$BF6= 200.13
##$BF7= 200.13
##$BF8= 200.13
##$BYTORDA= 1
##$CFDGTYP= 0
##$CFRGTYP= 5
##$CHEMSTR= <none>
##$CNST= (0..31)
1 1 145 1 1 1 1 1 1 1 1 1 1 1 1 1 1 1 1 1 1 1 1 1 1 1 1 1 1 1 1 1 
##$CPDPRG= <waltz16>
##$CPDPRG1= <>
##$CPDPRG2= <waltz16>
##$CPDPRG3= <>
##$CPDPRG4= <mlev>
##$CPDPRG5= <mlev>
##$CPDPRG6= <mlev>
##$CPDPRG7= <mlev>
##$CPDPRG8= <mlev>
##$CPDPRGB= <>
##$CPDPRGT= <>
##$D= (0..31)
0 1 0 0 0 0 0 0 0 0 0 0.03 2e-05 3e-06 0 0 0 0 0 0 0 0 0 0 0 0 0 0 0 0 
0 0 
##$DATE= 1636362316
##$DBL= (0..7)
120 120 120 11 120 120 24 19 
##$DBP= (0..7)
150 150 150 150 150 150 150 150 
##$DBP07= 0
##$DBPNAM0= <>
##$DBPNAM1= <>
##$DBPNAM2= <>
##$DBPNAM3= <>
##$DBPNAM4= <>
##$DBPNAM5= <>
##$DBPNAM6= <>
##$DBPNAM7= <>
##$DBPOAL= (0..7)
0.5 0.5 0.5 0.5 0.5 0.5 0.5 0.5 
##$DBPOFFS= (0..7)
0 0 0 0 0 0 0 0 
$$ [...]
##$SUBNAM2= <"">
##$SUBNAM3= <"">
##$SUBNAM4= <"">
##$SUBNAM5= <"">
##$SUBNAM6= <"">
##$SUBNAM7= <"">
##$SUBNAM8= <"">
##$SUBNAM9= <"">
##$SW= 501.771253377433
##$SWIBOX= (0..15)
0 1 3 0 0 0 0 0 0 0 0 0 0 0 0 0 
##$SW_h= 40650.406504065
##$TD= 32768
##$TD0= 1
##$TE= 0
##$TE2= 300
##$TE3= 300
##$TEG= 300
##$TL= (0..7)
0 120 53 12 22 120 120 120 
##$TP= (0..7)
150 150 150 150 150 150 150 150 
##$TP07= 0
##$TPNAME0= <>
##$TPNAME1= <>
##$TPNAME2= <>
##$TPNAME3= <>
##$TPNAME4= <>
##$TPNAME5= <>
##$TPNAME6= <>
##$TPNAME7= <>
##$TPOAL= (0..7)
0.5 0.5 0.5 0.5 0.5 0.5 0.5 0.5 
##$TPOFFS= (0..7)
0 0 0 0 0 0 0 0 
##$TUNHIN= 0
##$TUNHOUT= 0
##$TUNXOUT= 0
##$USERA1= <user>
##$USERA2= <user>
##$USERA3= <user>
##$USERA4= <user>
##$USERA5= <user>
##$V9= 5
##$VALIST= <valist>
##$VCLIST= <CCCCCCCCCCCCCCC>
##$VD= 0
##$VDLIST= <DDDDDDDDDDDDDDD>
##$VPLIST= <PPPPPPPPPPPPPPP>
##$VTLIST= <TTTTTTTTTTTTTTT>
##$WBST= 1024
##$WBSW= 4
##$XGAIN= (0..3)
0 0 0 0 
##$XL= 0
##$YL= 0
##$YMAX_a= 14982
##$YMIN_a= -17208
##$ZGOPTNS= <>
##$ZL1= 120
##$ZL2= 120
##$ZL3= 120
##$ZL4= 120
##$ABSF1= 0
##$ABSF2= 0
##$ABSG= 0
##$ABSL= 0
##$ALPHA= 0
##$AQORDER= 0
##$ASSFAC= 0
##$ASSFACI= 0
##$ASSFACX= 0
##$ASSWID= 0
##$AUNMP= <proc_1d>
##$AZFE= 0.1
##$AZFW= 0.5
##$BCFW= 0
##$BC_mod= 2
##$BYTORDP= 0
##$COROFFS= 0
##$CY= -3
##$DATMOD= 1
##$DC= 0
##$DFILT= <>
##$DTYPP= 0
##$F1P= 0
##$F2P= 0
##$FCOR= 1
##$FTSIZE= 65536
##$FT_mod= 6
##$GAMMA= 0
##$GB= 0
##$INTBC= 1
##$INTSCL= 5.30512e-09
##$ISEN= 30
##$LB= 1
##$LEV0= 0
##$LPBIN= 0
##$MAXI= 10000
##$MC2= 0
##$MEAN= 0
##$ME_mod= 0
##$MI= 50
##$NCOEF= 0
##$NC_proc= -4
##$NLEV= 6
##$NOISF1= 182.463
##$NOISF2= 159.3651
##$NSP= 0
##$NTH_PI= 0
##$NZP= 0
##$OFFSET= 248.5645
##$PC= 4
##$PHC0= -8868.039
##$PHC1= 165.2694
##$PH_mod= 1
##$PKNL= yes
##$PPARMOD= 0
##$PSCAL= 0
##$PSIGN= 0
##$REVERSE= no
##$SF= 81.014009
##$SI= 65536
##$SIGF1= 159.3651
##$SIGF2= -187.1042
##$SINO= 113.3802
##$SIOLD= 16384
##$SREGLST= <1H.CDCl3>
##$SSB= 0
##$STSI= 65536
##$STSR= 0
##$SW_p= 40650.406504065
##$SYMM= 0
##$S_DEV= 0
##$TDeff= 32768
##$TDoff= 0
##$TI= <>
##$TILT= no
##$TM1= 0
##$TM2= 0
##$TOPLEV= 0
##$USERP1= <user>
##$USERP2= <user>
##$USERP3= <user>
##$USERP4= <user>
##$USERP5= <user>
##$WDW= 1
##$XDIM= 65536
##$YMAX_p= 514697759
##$YMIN_p= -9626953
$$ End of Bruker specific parameters
$$ ---------------------------------
##NTUPLES= NMR SPECTRUM
##VAR_NAME=  FREQUENCY,     SPECTRUM/REAL,   SPECTRUM/IMAG
##SYMBOL=    X,             R,               I
##VAR_TYPE=  INDEPENDENT,   DEPENDENT,       DEPENDENT
##VAR_FORM=  AFFN,          ASDF,            ASDF
##VAR_DIM=   65536,         65536,           65536
##UNITS=     HZ,            ARBITRARY UNITS, ARBITRARY UNITS
##FACTOR=    0.620285442955139, 1,           1
##FIRST=     20137.2065510759, 0,            0
##LAST=      -20513.1999529892, 0,           0
##MIN=       -20513.1999529892, -9626953,    0
##MAX=       20137.2065510759, 514697759,    0
$$ Real data points
##PAGE= N=1
##DATA TABLE= (X++(R..R)), XYDATA
$$ [...]
##PAGE= N=2
##DATA TABLE= (X++(I..I)), XYDATA
39452 1295105 1494429 1606024 1603090 1398429 1041162 784900 817518 1021657 1152992 1172199
39442 1172199 1226383 1359298 1441360 1388633 1273790 1190352 1150680 1143661 1162890 1160266 1096234
39431 1096234 1036428 1061784 1099237 1016873 879444 888753 1038710 1084415 950270 902755 1131212
39420 1131212 1379848 1259447 803609 450998 511261 866661 1202268 1348541 1365080 1411659
39410 1411659 1566256 1712409 1649200 1376209 1158017 1172751 1222378 1015075 660148 590272
39400 590272 953825 1361771 1371732 1017312 687843 629898 760930 898072 972784 1006000
39390 1006000 1006600 952595 836078 713562 702637 862910 1060088 1062000 856361 758732 1045169
39379 1045169 1543251 1789797 1593753 1225083 985425 832044 596992 377495 428572 745654
39369 745654 1046861 1181510 1273051 1385743 1350096 1097839 910929 1065234 1394255 1510299
39359 1510299 1362681 1253509 1329401 1398815 1315087 1227441 1315472 1515915 1658019 1675098
39349 1675098 1563427 1338623 1155795 1239706 1534320 1662326 1436224 1161840 1169304 1286265
39339 1286265 1136665 782025 631127 785638 930789 906612 939334 1168694 1349129 1252040
39329 1252040 1051828 1038114 1165798 1171170 994910 831174 830205 959074 1110321 1194281 1181137
39318 1181137 1174301 1350091 1693532 1913881 1796682 1528202 1450885 1570877 1565464 1278778
39308 1278778 956354 906806 1125225 1368611 1472058 1462135 1425615 1382866 1295685 1155595
39298 1155595 1048737 1104273 1339014 1586771 1655457 1538988 1396835 1342710 1352177 1372074
39288 1372074 1396617 1401681 1325214 1188083 1144630 1314327 1601334 1762806 1651545 1351768
39278 1351768 1093354 1059533 1243728 1453954 1482187 1307967 1121394 1125850 1345011 1636608
39268 1636608 1841402 1881476 1774387 1624602 1564731 1622237 1662624 1553484 1376779 1361452
39258 1361452 1563320 1727475 1577472 1183234 907029 972176 1206859 1288567 1158880 1064804
39248 1064804 1182012 1332197 1196907 774630 463827 602784 1031817 1272031 1114106
39239 1114106 840077 799741 961405 1048858 982618 936029 992899 1021626 950986 921866 1028002
39228 1028002 1115486 1034765 929734 1028707 1240069 1237698 954618 729068 868212 1263499
39218 1263499 1565273 1604955 1511225 1487439 1596698 1741003 1775699 1653397 1482291 1414271
39208 1414271 1474595 1560050 1598188 1614203 1628350 1601523 1527479 1474735 1478992 1486760 1461247 1445784
39196 1445784 1458316 1424026 1290162 1116925 983333 902621 898834 1035465 1266863 1402654
39186 1402654 1358472 1305580 1403434 1524966 1468480 1315475 1290325 1344092 1230564 1004817
39176 1004817 1051594 1473265 1808894 1626654 1135910 892180 1057766 1296323 1327937 1240754
39166 1240754 1220846 1279601 1359092 1473140 1599169 1594730 1367283 1020694 726504 558816
39156 558816 551953 774996 1185556 1517217 1516289 1254352 1025615 960257 941540 913036 1024446
39145 1024446 1358373 1703069 1771910 1544246 1228284 967637 764673 651788 729040 979758
39135 979758 1201273 1209156 1031534 841421 766676 822975 966535 1133128 1252563 1296194
39125 1296194 1320990 1430545 1667192 1937927 2066271 1959252 1726893 1570748 1528321 1428139
39115 1428139 1174921 958297 1014166 1256163 1366329 1247652 1150589 1287972 1547680 1700499
39105 1700499 1696550 1615695 1503724 1421368 1486048 1671388 1720801 1483942 1197013 1168745 1317030
39094 1317030 1336045 1230667 1288619 1517851 1549952 1245734 993838 1146714 1474864 1509571
39084 1509571 1214358 966079 992429 1173632 1353843 1518694 1636692 1607620 1443989 1290280
39074 1290280 1197608 1067588 872741 739425 742104 799220 855387 988781 1236965 1479177
39064 1479177 1602280 1636903 1626822 1526169 1347773 1239964 1262643 1262341 1156652 1153590 1422728
39053 1422728 1703630 1589858 1144174 861358 987579 1238616 1299165 1246193 1278154 1338315
39043 1338315 1298702 1294673 1530264 1856760 1888980 1544973 1181026 1121932 1286937 1392110
39033 1392110 1352597 1327978 1433246 1548245 1469942 1220774 1111464 1396363 1902270 2177214
39023 2177214 2054463 1855488 1898513 2036877 1944148 1682223 1622749 1851754 2031691 1919321
39013 1919321 1674452 1518403 1402757 1233285 1168543 1410733 1835996 2103816 2084322 1960028
39003 1960028 1925888 1984648 2056730 2123128 2186321 2187399 2056931 1843462 1727927 1838492 2044209
38992 2044209 2042276 1736730 1414822 1386347 1553995 1581877 1415171 1306216 1331409 1284649
38982 1284649 1157799 1286906 1764708 2110050 1903592 1439850 1296054 1486663 1561280 1398990
38972 1398990 1324886 1441925 1440643 1219606 1148395 1438891 1715978 1583703 1263210 1229882
38962 1229882 1451691 1476050 1195541 1046071 1346762 1823585 2003581 1849847 1752279 1974527
38952 1974527 2335535 2467816 2239322 1832858 1488934 1288546 1185804 1138903 1139505 1171023
38942 1171023 1210005 1242731 1240158 1170057 1083602 1110115 1281303 1443902 1462878 1427606 1497991
38931 1497991 1616447 1586679 1422782 1375685 1548819 1716563 1660119 1505659 1543227 1805358
38921 1805358 2014833 1942659 1681481 1524980 1638325 1885572 1983242 1819608 1581885 1518394
38911 1518394 1619926 1642799 1442047 1154796 1008174 1052426 1158995 1210953 1210206 1221540 1275576
38900 1275576 1340089 1370533 1369666 1369802 1368572 1354312 1400296 1603188 1857658 1845359 1407330 824132
38888 824132 538390 660833 934373 1124621 1226472 1307957 1378067 1436696 1478928 1449393
38878 1449393 1359508 1398373 1697519 2027616 2013115 1653463 1334705 1291554 1371845 1393431
38868 1393431 1390791 1390556 1283869 1091999 1047590 1224215 1381511 1369467 1372192 1529824 1656346
38857 1656346 1614076 1625485 1849004 1960113 1612726 1088755 976917 1326086 1634153 1644373
38847 1644373 1629430 1803019 1937427 1778228 1477681 1353906 1440253 1508895 1422395 1282543
38837 1282543 1275569 1462298 1699876 1762650 1584295 1341407 1231671 1246479 1257502 1221697
38827 1221697 1169692 1111194 1110859 1317846 1717378 1999440 1928450 1714074 1726036 1958534 2109045
38816 2109045 2088222 2061572 2033792 1828100 1516426 1440110 1694705 1982381 2096973 2163545
38806 2163545 2249345 2160943 1861639 1688881 1843304 2006242 1827811 1501474 1435822 1579376
38796 1579376 1543910 1284056 1165952 1349114 1550383 1536984 1469325 1557793 1680004 1599708
38786 1599708 1382935 1329244 1566705 1939826 2265480 2482077 2527745 2299265 1855038 1499529
38776 1499529 1490932 1741627 1969109 2072386 2155197 2222143 2129683 1893362 1763114 1857348
38766 1857348 1973642 1936190 1876708 1938522 1956639 1752403 1539457 1648150 1977768 2139432
38756 2139432 2071666 2068029 2193189 2140633 1782402 1446601 1473035 1816126 2236429 2575783
38746 2575783 2702486 2508580 2142192 1957337 2062091 2187917 2150985 2127109 2283844 2459073
38736 2459073 2436672 2262625 2065848 1846505 1666440 1745417 2100921 2380260 2337103 2197485
38726 2197485 2257021 2409791 2421799 2385977 2500344 2628091 2507452 2220626 2039230 1967632
38716 1967632 1857176 1809643 2011920 2298141 2348597 2230582 2263999 2427253 2405020 2185727
38706 2185727 2075496 2109206 2005573 1775718 1798644 2141669 2377338 2308344 2322282 2698854
38696 2698854 3065602 2964177 2559967 2329522 2349721 2375344 2391757 2578713 2837866 2851405
38686 2851405 2610466 2456650 2540462 2622824 2531690 2469778 2661516 2943139 2966430 2695969
38676 2695969 2462101 2533215 2823553 3063948 3110290 2998210 2813623 2651312 2639468 2832153
38666 2832153 3078122 3172139 3165237 3318808 3673092 3908132 3815459 3686103 3957769 4619432
38656 4619432 5254745 5568218 5553554 5227437 4587938 3865805 3446799 3428818 3537293 3560845
38646 3560845 3570528 3613735 3538463 3311879 3205691 3406309 3668501 3629668 3309436 3038016
38636 3038016 3004563 3125944 3285969 3454898 3577261 3543051 3325023 3049533 2902921 2989743
38626 2989743 3240250 3437734 3418190 3268958 3225380 3344074 3420976 3294788 3081069 3002102
38616 3002102 3103941 3252887 3323615 3293099 3217248 3191046 3276151 3423241 3522989 3546218 3565383
38605 3565383 3657711 3874356 4243027 4663224 4879359 4756056 4512628 4451359 4525117 4463756
38595 4463756 4265712 4196155 4301655 4338296 4243203 4245563 4387247 4377082 4108651 3888108
38585 3888108 3915005 3972849 3915570 4007500 4408569 4749670 4682759 4494937 4657917 5054404
38575 5054404 5214271 5112869 5134145 5336382 5361265 5117883 5023162 5402941 6035616 6456795
38565 6456795 6468611 6249558 6146304 6388243 6857631 7181517 7183712 7113629 7256360 7513938
38555 7513938 7619136 7562474 7520354 7563593 7746512 8251573 9071815 9769397 9970101 9912361
38545 9912361 10081528 10495267 10817409 11005180 11350780 12009917 12928830 14060630 15231819
38536 15231819 16076220 16579161 17308591 18547631 19723137 20446864 21465921 23494455 25781756
38527 25781756 27307995 28653502 30338318 29416278 20877137 4105168 -14239346 -26017155
38519 -26017155 -29163259 -27712753 -25748922 -23985997 -21800945 -19579184 -18006618 -16883561
38511 -16883561 -15795057 -14904493 -14314227 -13559235 -12408037 -11370768 -10821694 -10360417 -9609515
38502 -9609515 -8927809 -8714295 -8634684 -8191950 -7551555 -7156344 -6937344 -6533634 -5980953 -5600616
38492 -5600616 -5433170 -5280812 -5109360 -4969845 -4727957 -4288584 -3890463 -3779293 -3787876 -3637473
38482 -3637473 -3446862 -3498918 -3664656 -3540417 -3095588 -2735075 -2697552 -2770618 -2671385 -2411627
38472 -2411627 -2195404 -2156142 -2258641 -2341693 -2264657 -2093397 -2042916 -2132986 -2077659 -1706713
38462 -1706713 -1318415 -1337448 -1724030 -2006306 -1864013 -1437214 -1071355 -966976 -1078892 -1193282
38452 -1193282 -1115946 -900998 -818272 -976331 -1122929 -999633 -727267 -585114 -560454 -449886
38442 -449886 -313307 -429129 -776032 -948890 -724271 -391607 -326118 -469159 -467155 -191499
38432 -191499 113172 177617 41628 -10515 206607 553612 723980 618408 458459 468779
38422 468779 579144 582448 471447 412284 454930 509142 576632 735559 871461 721372 295797
38411 295797 -14474 71882 352883 470297 421172 473647 691745 859665 877741 940425
38401 940425 1218288 1579133 1775182 1770746 1727961 1750197 1796219 1810281 1784093 1688108 1482977
38390 1482977 1227358 1036773 881160 566180 14393 -566284 -936096 -1136894 -1372879
38381 -1372879 -1659368 -1816894 -1792510 -1739651 -1733696 -1642355 -1372372 -1040609 -788297 -612926
38371 -612926 -498821 -510454 -609796 -594370 -408610 -304200 -443256 -545720 -265359 220165
38361 220165 387806 103539 -216868 -231362 -68683 37702 154307 436950 770145 915917
38351 915917 894911 946283 1151060 1323485 1294218 1133559 1042867 1124479 1309555 1467415
38341 1467415 1551047 1635494 1813086 2071245 2307829 2443230 2462941 2386967 2289630 2314823
38331 2314823 2532776 2781501 2812010 2632197 2538239 2721140 3008035 3132486 3128546 3267419
38321 3267419 3657870 4095863 4331905 4355543 4363769 4524131 4825745 5143386 5410347 5696518
38311 5696518 6098179 6592879 7072943 7493847 7880102 8191808 8335876 8337695 8289768 7978824
38301 7978824 6746031 4020089 38033 -4134983 -7378848 -9246932 -9971433 -9974442 -9542264
38292 -9542264 -8893925 -8319748 -8065958 -8081999 -8018992 -7594987 -6932276 -6421877 -6250900 -6192379
38282 -6192379 -5915851 -5383959 -4842982 -4513374 -4410204 -4402788 -4314440 -4004368 -3508147 -3099673
38272 -3099673 -3055250 -3305187 -3456825 -3251425 -2887957 -2765527 -2965867 -3152960 -3013496 -2655656
38262 -2655656 -2456489 -2573434 -2754858 -2673974 -2333963 -2036912 -2007224 -2174046 -2326964 -2358288
38252 -2358288 -2295913 -2196366 -2096515 -2022037 -1959418 -1839272 -1614822 -1348658 -1163630 -1102048
38242 -1102048 -1078413 -994587 -883418 -899624 -1128329 -1411908 -1456695 -1176681 -846162 -784312
38232 -784312 -944967 -995038 -786435 -534964 -478439 -580143 -686150 -764344 -815767 -734769
38222 -734769 -477462 -230256 -178395 -225456 -193574 -182385 -408582 -752981 -839225 -591584
38212 -591584 -344011 -298066 -248120 -31146 109241 -90082 -422762 -471260 -212966 -18452
38202 -18452 -98369 -271779 -299941 -177194 -24263 103273 221652 361383 532714 651772
38192 651772 548195 196395 -124863 -119261 106359 149896 -146184 -523097 -724742 -809671
38182 -809671 -931625 -1078762 -1205770 -1390440 -1645014 -1772427 -1655657 -1522479 -1641165 -1875235
38172 -1875235 -1856209 -1543979 -1286700 -1299101 -1392038 -1320993 -1142228 -1062408 -1109848 -1125208 -992874
38161 -992874 -763926 -598243 -638675 -877679 -1120186 -1156196 -981022 -761833 -616117 -552687
38151 -552687 -585299 -705768 -761174 -603668 -387338 -436116 -745134 -927016 -788204 -618094
38141 -618094 -684598 -789425 -658508 -472314 -569899 -830822 -841888 -571476 -368878 -325132
38131 -325132 -177241 80141 44503 -424766 -878634 -915751 -732303 -695396 -738510 -597412
38121 -597412 -363658 -334753 -477046 -492643 -344767 -293834 -423094 -511587 -414781 -241856
38111 -241856 -107131 -86 54227 -9183 -95028 -28827 114864 72170 -149375 -204937 51037
38100 51037 285268 158860 -183152 -349013 -234007 -62574 -32304 -150421 -329520 -443286
38090 -443286 -366365 -130446 40978 -6135 -175187 -327917 -488369 -640180 -539119 -55391
38080 -55391 433376 384940 -182658 -672990 -671411 -385693 -225503 -267141 -320613 -279579 -187310
38069 -187310 -109011 -109516 -228201 -344787 -222138 175147 557791 658903 546714 422057
38059 422057 281666 25970 -227552 -233388 8743 224016 217303 48620 -148917 -312358
38049 -312358 -389795 -352889 -311482 -406080 -530154 -391508 36812 351113 193432 -255700
38039 -255700 -476502 -233469 195722 399143 268196 21671 -83937 7430 164905 265038
38029 265038 330716 444894 568447 557057 386968 244591 309853 536172 733969 796977
38019 796977 748279 634314 496074 403065 393255 400422 352109 316673 425360 645784 764153
38008 764153 637574 371247 195960 232286 411649 577442 627975 584515 528899 470496
37998 470496 329106 99812 -44802 60486 324603 483332 433745 336035 352939 443980
37988 443980 485336 449453 371858 268023 192496 256019 445493 538516 369176 94108 -5100
37977 -5100 74747 91813 -15428 -19752 192982 394002 371317 288045 410333 631407 601883
37966 601883 291922 77400 206466 500799 712888 864475 1012729 968412 579785 113742
37956 113742 -28302 103766 94387 -171368 -332327 -136501 184898 315994 293927 300427
37946 300427 300679 194771 115544 241137 447504 471703 327534 244787 270319 261336 234362
37935 234362 364654 614553 708922 563370 427429 490206 621173 628416 519833 377610
37925 377610 222646 149701 349313 811054 1213207 1292079 1140398 982548 867477 774848
37915 774848 809135 1046757 1351516 1560608 1695998 1796909 1757022 1573214 1517143 1742041
37905 1742041 1956500 1887690 1832219 2190200 2568084 2034505 420954 -1235683 -1856997
37896 -1856997 -1470273 -861902 -518977 -381439 -351459 -486520 -724182 -849503 -799299 -712992
37886 -712992 -651858 -518402 -280908 -48818 108664 218567 265494 209535 160273 292802
37876 292802 530336 559533 284675 40592 164699 517147 647175 358291 -97804 -365298
37866 -365298 -337026 -146814 26088 74584 -8143 -131307 -179059 -133372 -94064 -137325 -189215
37855 -189215 -99954 158861 431917 552671 541585 560561 660575 666261 401306 -14917
37845 -14917 -230175 -59117 286967 454301 359955 242922 329624 566817 724440 692408
37835 692408 613082 716073 1031705 1293984 1196283 774408 441660 537003 904305 1081222
37825 1081222 891684 647533 685528 901878 928541 655673 343760 221452 197216 69798
37815 69798 -135590 -211696 -96443 20844 -24441 -110055 35393 462416 900719 1075205
37805 1075205 1012267 933493 929923 901127 797971 737979 808268 901441 864703 720130 615994
37794 615994 612362 623399 547588 380229 226050 245173 515400 885381 1058296 917771
37784 917771 681991 623946 740444 847852 903648 1012002 1141660 1081481 747358 363850
37774 363850 243079 470274 860658 1157312 1242224 1203813 1199406 1234159 1160158 949372 812090
37763 812090 894549 1018330 950395 793229 805571 940497 936087 819020 873321 1058087 946320
37752 946320 426019 -13808 -3740 120004 -134245 -602608 -707253 -332683 46554 71413
37742 71413 -119439 -247784 -240586 -118600 137820 474252 732443 836752 851517 823795
37732 823795 747591 687375 727638 789190 716120 554544 499703 547970 489603 313572 305647
37721 305647 597137 904508 928527 774525 725451 781588 711653 457381 208655 114056
37711 114056 161198 334452 653491 1015725 1209860 1170851 1072241 1087466 1185885 1238968 1202077
37700 1202077 1096596 927137 736115 648123 724698 848065 894565 943912 1116856 1265685
37690 1265685 1113904 739611 588087 835941 1057609 819565 359316 273683 667791 1067018
37680 1067018 1151533 1098563 1098862 1014898 760019 612756 818784 1166616 1299935 1228936 1188778
37669 1188778 1179184 1022776 767332 654940 728202 790199 741351 670821 628719 578038 558368
37658 558368 634580 698846 589903 399210 386621 587119 771279 810315 806727 831643 806443
37647 806443 705160 630689 632617 667962 764764 979879 1173495 1100259 778301 504729 446445
37636 446445 474640 453868 411535 352022 194586 -11294 -83749 -2158 74559 129724 290414
37625 290414 454473 342855 54525 85357 541359 817873 454397 -101339 -75984 567907
37615 567907 1169484 1288441 1077134 834050 685595 706234 908356 1059859 884965 499730
37605 499730 312133 450901 635767 663600 654609 707628 674314 466443 293169 366413 584893
37594 584893 723783 763403 818181 875437 818467 631033 404537 202460 61378 56041 208783
37583 208783 383604 421201 347971 309019 326351 291596 197521 184543 294253 360885 277838
37572 277838 218873 395938 688906 769272 589809 473219 613639 763908 635537 389638
37562 389638 407557 683804 821121 644213 449081 520812 740441 881484 1003650 1244380
37552 1244380 1422637 1231175 763059 476574 578472 760359 686376 477849 490803 780563
37542 780563 1054360 1101945 1017439 961005 931846 886101 888623 978857 1024509 910526 771677
37531 771677 802876 917454 884593 763320 829229 1031159 963046 547760 287316 518671
37521 518671 857305 828570 662850 864902 1269804 1250485 767573 452941 573670 657790
37511 657790 383289 149598 381872 828466 1005956 919211 887123 986458 1102244 1259267
37501 1259267 1491992 1604553 1432572 1149905 990774 883820 684504 536438 647801
37492 647801 912567 1094625 1185668 1251181 1154618 803553 448836 351569 365259 246556
37482 246556 146652 330631 614294 605450 376173 359041 634010 835439 761531 598647
37472 598647 526009 539741 675243 965520 1172099 1005156 635133 539960 811007 1065638
37462 1065638 1095998 1120780 1284929 1380627 1242973 1031808 946932 990189 1126519 1348902
37452 1348902 1494735 1350806 1027725 872513 941165 948171 806891 775593 943782 1021481
37442 1021481 812387 487672 226523 -787 -130166 69603 563062 968078 1110928
37433 1110928 1219099 1366045 1247599 801619 510790 682984 913309 736851 394347
37424 394347 413273 762477 986177 936676 820102 684559 407561 106977 67855 279782
37414 279782 458193 507869 603109 826927 1053678 1171578 1157963 999433 781933 739726
37404 739726 948692 1120084 992065 754631 749576 927091 996771 967760 1086496 1319500
37394 1319500 1364927 1172697 1020617 1042815 1081419 1049587 1054743 1093371 990483 737483 566094
37383 566094 596581 707282 816910 988458 1181687 1214855 1065723 921844 850247 714617
37373 714617 507996 451203 630650 830973 875460 864964 928326 995318 983782 970279 997318
37362 997318 937014 739708 612439 731483 938167 950756 780424 720378 945465 1275554
37352 1275554 1361910 1061205 618578 437854 613970 793590 644756 340152 311258 598451
37342 598451 796489 670928 458939 441157 560294 644409 702947 779564 762259 567759
37332 567759 312659 111501 -84783 -281018 -326530 -209285 -170567 -277296 -200820 233704
37322 233704 585740 349762 -248349 -533980 -359955 -247062 -535047 -935220 -1057047 -885945
37312 -885945 -520319 128201 1057099 1913708 2357494 2494819 2668526 2960999 3163202 3118543
37302 3118543 2853116 2451567 2030851 1777925 1805465 1995535 2139380 2182154 2189841 2157745
37292 2157745 2030610 1856711 1743236 1691907 1633404 1577969 1574813 1578664 1524080 1466789 1468981
37281 1468981 1431225 1269132 1167852 1355451 1666208 1694802 1417018 1253772 1392506 1468230
37271 1468230 1171186 787699 768153 1045712 1215840 1199487 1254386 1416373 1423144 1229162
37261 1229162 1142257 1322620 1537965 1588979 1625963 1815206 1988521 1903461 1643086 1481372
37251 1481372 1497033 1571709 1648725 1741521 1776907 1682110 1569586 1591984 1653884 1526092 1248096
37240 1248096 1146545 1375744 1672532 1704529 1495340 1342695 1415298 1598084 1704816 1692053
37230 1692053 1624132 1527620 1370502 1173732 1065647 1164254 1416245 1615138 1609774 1461681
37220 1461681 1368888 1460776 1689442 1892273 1936248 1825255 1683218 1613449 1586273 1509690
37210 1509690 1383659 1291922 1246229 1162821 1027122 952680 1014790 1154057 1323388 1583021
37200 1583021 1922834 2130717 2020429 1702732 1446862 1345155 1310335 1329904 1463734 1600942
37190 1600942 1507671 1196010 989982 1094104 1317179 1389856 1357926 1440124 1634383 1715243
37180 1715243 1566716 1304189 1097120 1055949 1243387 1579787 1776407 1625712 1360740 1423341
37170 1423341 1812702 2011363 1727337 1352309 1374199 1638309 1638403 1364045 1319190 1691747
37160 1691747 2038135 1963197 1655676 1482172 1438811 1356675 1344606 1597306 1932398 1948037
37150 1948037 1595519 1244574 1198296 1445545 1854016 2274290 2453029 2190806 1656215 1253804
37140 1253804 1122260 1049341 926170 936797 1174079 1408374 1439124 1399035 1487367 1633259
37130 1633259 1654888 1561705 1474621 1411717 1360625 1392861 1489441 1431739 1121928 855085 978051
37119 978051 1385607 1663622 1668235 1640501 1753774 1878138 1874532 1837609 1898383 1987380 1958629
37108 1958629 1822029 1701276 1636707 1565757 1469786 1425168 1488046 1596893 1634581 1567874 1479401
37097 1479401 1451093 1473487 1521678 1653766 1911508 2147829 2121266 1812796 1496373 1404986
37087 1404986 1462047 1460223 1378387 1353899 1417684 1448920 1393241 1365356 1482158 1695285 1852790
37076 1852790 1872813 1796478 1691722 1576563 1472647 1471172 1634504 1839013 1872698 1751051
37066 1751051 1753490 2012226 2265812 2243501 2090140 2070496 2018645 1562307 862420 573743
37056 573743 923338 1359101 1393898 1308936 1595524 2084718 2178949 1765401 1368888 1411711
37046 1411711 1739836 1938366 1812367 1493657 1279051 1381882 1697661 1871696 1735331
37037 1735331 1542091 1592476 1806645 1923506 1937827 2002786 2038594 1835866 1494677 1359679
37027 1359679 1496384 1601448 1501102 1400797 1530408 1827230 2092629 2225416 2190862 1976705
37017 1976705 1693605 1535729 1543508 1563634 1506406 1462277 1492015 1495198 1405539 1365572 1563247
37006 1563247 1965110 2317100 2392873 2201000 1953681 1829451 1786018 1682596 1564624 1644747
36996 1644747 1944074 2177114 2131370 1935224 1762376 1522407 1124160 818958 911710 1264034
36986 1264034 1455414 1356131 1188738 1099914 1044792 1044176 1170674 1299081 1248613 1158378 1329429
36975 1329429 1699374 1894685 1825023 1773892 1837435 1758530 1458887 1258778 1350642 1485585
36965 1485585 1441267 1405336 1590180 1810772 1786086 1593983 1496104 1526589 1568849 1653441 1859352
36954 1859352 2052882 2029512 1840388 1722389 1752039 1780699 1686188 1527628 1463035 1597654
36944 1597654 1866370 2035654 1933263 1695271 1617853 1736567 1777747 1600271 1431886 1525146
36934 1525146 1799376 1992996 1993870 1861869 1684486 1559373 1583367 1737897 1903666 2037519
36924 2037519 2159082 2148452 1837912 1379559 1195959 1412698 1659529 1635151 1545194 1707135
36914 1707135 2016079 2154624 2127456 2210687 2469633 2662865 2601955 2356658 2118266 2041084
36904 2041084 2173891 2392167 2461177 2299341 2093257 2036592 2077405 2050433 1922080 1769078
36894 1769078 1657091 1671231 1903638 2268273 2499159 2478079 2380823 2360562 2320641 2182467
36884 2182467 2109915 2201666 2203596 1868032 1434841 1387448 1794073 2214712 2258091 1978324
36874 1978324 1713618 1729283 2022388 2338767 2404951 2223800 2054073 2052206 2126612 2226578
36864 2226578 2487421 2896567 3108349 2880731 2464516 2250392 2241373 2205191 2133720 2150890
36854 2150890 2129344 1850888 1476934 1416738 1721501 2004457 2006057 1888346 1907176 2099123
36844 2099123 2357232 2554546 2555166 2344525 2145751 2152484 2187118 1937204 1502211 1331095
36834 1331095 1577609 1900960 2006291 2007892 2095757 2193815 2180551 2167931 2301299 2485491
36824 2485491 2552848 2539231 2561970 2570771 2470901 2385201 2514106 2766164 2802666 2506529 2175783
36813 2175783 2125233 2269445 2289441 2118988 2024774 2178444 2385428 2379824 2209508 2116944
36803 2116944 2155381 2182716 2179635 2276075 2441640 2452458 2255126 2088339 2121512 2226827 2244555
36792 2244555 2226783 2272181 2361552 2493798 2715078 2877833 2707764 2302207 2178341 2543530
36782 2543530 2906859 2784502 2410236 2281064 2350601 2255023 2072392 2181212 2492402 2520821
36772 2520821 2219842 2065683 2220494 2281652 2061212 1969857 2295674 2655354 2590317 2282566
36762 2282566 2209075 2390781 2472944 2371197 2356613 2539351 2685282 2619910 2500790 2544533
36752 2544533 2683333 2676631 2490903 2385595 2565083 2872631 2978521 2817792 2633891 2577550
36742 2577550 2534960 2458830 2547500 2850287 2996036 2685760 2233013 2168434 2447151 2549009
36732 2549009 2317495 2156174 2312141 2492995 2404663 2223361 2244663 2401571 2446952 2385603
36722 2385603 2424866 2625089 2836402 2915195 2851086 2732351 2664495 2664874 2634754 2531104 2502044
36711 2502044 2675755 2895077 2916919 2816379 2877350 3099323 3168960 2962838 2722412 2654677
36701 2654677 2709658 2838977 3099677 3377594 3391112 3137288 2965826 3027939 3037220 2801895
36691 2801895 2591732 2666691 2804806 2681350 2435890 2445313 2709596 2857719 2681840 2355666
36681 2355666 2177895 2321508 2744264 3161532 3242909 3010255 2861883 3023687 3220494 3139090
36671 3139090 2951214 3022315 3294822 3366759 3100667 2787094 2723834 2932287 3268515 3547730
36661 3547730 3588330 3380813 3171722 3148864 3128768 2834412 2398334 2243676 2473898 2732987
36651 2732987 2741084 2650899 2740363 3004910 3222145 3255456 3144928 3003253 2937914 3013540 3214067
36640 3214067 3464926 3692655 3818722 3747104 3465999 3134421 2953057 2962146 3062662 3191720
36630 3191720 3343700 3451048 3410626 3252465 3145590 3188117 3287609 3295140 3190939 3094974
36620 3094974 3121300 3241869 3307983 3241492 3176555 3303389 3567806 3691103 3558669 3408506
36610 3408506 3495102 3728268 3839377 3782551 3736515 3771404 3758593 3615997 3429989 3291678
36600 3291678 3185229 3096092 3091396 3222790 3434948 3614110 3673324 3593771 3449284 3367406
36590 3367406 3387499 3393185 3277131 3122296 3098567 3225418 3386394 3548215 3779364 4029855
36580 4029855 4086762 3846597 3501408 3340834 3440024 3629501 3717812 3663788 3562509 3529334
36570 3529334 3590787 3662635 3657091 3615830 3674235 3862866 4022313 3994130 3844624 3786900 3885322
36559 3885322 3963389 3862918 3685636 3656782 3801269 3904610 3811230 3624371 3548034 3642741
36549 3642741 3824829 4015070 4174698 4250343 4201428 4071113 3955770 3923611 4005371 4197086
36539 4197086 4405587 4476537 4371041 4234517 4194711 4195633 4152869 4141158 4240440 4309741 4161136
36528 4161136 3902466 3840858 4043606 4249945 4258403 4161334 4125727 4164151 4222405 4305427 4405584
36517 4405584 4461063 4492552 4648192 4998313 5371857 5491678 5243772 4799132 4507173 4615726
36507 4615726 5011021 5308595 5305025 5212040 5281958 5379420 5212101 4854099 4665686 4734301
36497 4734301 4789441 4699475 4651833 4746561 4800830 4718689 4713745 4963706 5309554 5475954 5376034
36486 5376034 5094564 4813301 4808821 5202394 5641644 5618430 5213687 5074661 5465979 5848768
36476 5848768 5720384 5378727 5388778 5686460 5772361 5545489 5370255 5433009 5566022 5684004
36466 5684004 5911068 6221860 6367354 6262384 6128849 6142767 6189372 6083900 5855916 5705326
36456 5705326 5770028 5998927 6222295 6341545 6423412 6528723 6520758 6260249 5956594 5995365
36446 5995365 6357879 6594199 6513726 6475636 6749350 7036935 7011714 6924475 7169537 7546065
36436 7546065 7519107 7052618 6634712 6549974 6632933 6711008 6802050 6849782 6718599 6523651
36426 6523651 6573451 6901121 7190963 7238576 7173110 7168250 7230186 7328509 7469530 7597109 7652217
36415 7652217 7719410 7875196 7958067 7789264 7554292 7608106 7929337 8146680 8116963 8088381
36405 8088381 8240087 8447798 8600133 8777339 8982027 9025923 8843248 8639505 8590856 8650186
36395 8650186 8759137 8971513 9232376 9313360 9143068 8972149 9036446 9251355 9400370 9443643
36385 9443643 9470814 9500663 9503854 9529629 9666187 9924795 10240558 10530980 10716107 10763719
36375 10763719 10757405 10850757 11116903 11475405 11762631 11861010 11817233 11843230 12088062 12399955
36365 12399955 12502236 12440188 12579605 13050852 13516652 13689636 13740385 13917875 14122700 14226028
36355 14226028 14461307 15024231 15583369 15740447 15738568 16100481 16738937 17104796 17138981 17360735
36345 17360735 17972608 18582540 18952961 19359301 19983071 20556826 20900626 21293592 22004640
36336 22004640 22879621 23666583 24375205 25092265 25808257 26611938 27682454 28933672 30060515
36327 30060515 31068166 32324926 33969171 35734853 37486652 39414324 41573109 43798682
36319 43798682 46199793 49079719 52224122 55044599 57646877 60835610 64689409 68147215
36311 68147215 70442496 71446245 69356992 59543920 38311451 8237797 -21934049 -43687880
36303 -43687880 -54543271 -57691749 -57445527 -55999879 -53638924 -50393336 -46828146 -43590476
36295 -43590476 -40757589 -38034993 -35661060 -34632894 -35506266 -37227668 -37890662 -36703679
36287 -36703679 -34571076 -32645872 -31061691 -29401196 -27674345 -26213934 -25025648 -23852403
36279 -23852403 -22672145 -21643826 -20725858 -19789472 -18967776 -18451779 -18039082 -17333339 -16356781
36270 -16356781 -15524402 -14990652 -14472221 -13819929 -13304685 -13095131 -12850079 -12203092 -11390225
36261 -11390225 -10959097 -10970696 -10941574 -10591222 -10194362 -10033643 -9913519 -9522783 -8977263 -8603457
36251 -8603457 -8361668 -7945016 -7418159 -7269285 -7668436 -8071136 -7846140 -7056624 -6321054
36242 -6321054 -6040283 -6060787 -6055913 -5948068 -5862332 -5840973 -5761852 -5524788 -5216200 -5006101
36232 -5006101 -4895031 -4688342 -4297871 -3935106 -3838819 -3914487 -3874827 -3675310 -3523426 -3461695
36222 -3461695 -3278458 -2924593 -2688705 -2775488 -2979478 -2996290 -2843089 -2742870 -2768413 -2835738
36212 -2835738 -2917671 -3040390 -3159322 -3220223 -3260633 -3317488 -3354858 -3407440 -3630780 -4054409
36202 -4054409 -4462471 -4697894 -4893891 -5188446 -5410363 -5335577 -5105508 -5068544 -5281969 -5475325
36192 -5475325 -5469947 -5344954 -5193813 -4995531 -4764808 -4588991 -4456677 -4251353 -3981242 -3840641
36182 -3840641 -3955891 -4191763 -4294028 -4160433 -3919045 -3768086 -3762772 -3769969 -3647621 -3411406
36172 -3411406 -3131582 -2744082 -2167801 -1575824 -1259204 -1163308 -878888 -230792 451909 860171
36162 860171 1169791 1686618 2314091 2744990 2992532 3364500 4016114 4772697 5169543 4398274
36152 4398274 1626371 -3017745 -7951143 -11278962 -12470677 -12439596 -12096163 -11530761 -10657722
36143 -10657722 -9803143 -9238053 -8765146 -8274228 -8201185 -8848723 -9630596 -9669175 -8971969 -8360940
36133 -8360940 -8265849 -8233119 -7773857 -7113524 -6762983 -6750556 -6705804 -6498018 -6366336 -6453453
36123 -6453453 -6568259 -6484270 -6209493 -5855296 -5462392 -5105254 -4973083 -5126050 -5284986 -5107209
36113 -5107209 -4635651 -4250398 -4183778 -4316310 -4471277 -4640318 -4816793 -4867337 -4757774 -4714536
36103 -4714536 -4935648 -5253978 -5303851 -4970896 -4500542 -4186337 -4091378 -4069289 -3964287 -3791209
36093 -3791209 -3734639 -3904822 -4117042 -4082441 -3832040 -3705078 -3825413 -3875202 -3581965 -3164374
36083 -3164374 -3014469 -3137545 -3223682 -3138096 -3015232 -2948568 -2902719 -2895540 -2979310 -3057706 -2981470
36072 -2981470 -2811575 -2745934 -2807322 -2842524 -2803665 -2786077 -2808646 -2798000 -2769693 -2790802 -2801004
36061 -2801004 -2717384 -2659095 -2780095 -2925976 -2786146 -2380678 -2059597 -2002070 -2063741 -2148947
36051 -2148947 -2336324 -2535665 -2433857 -1985115 -1607370 -1645487 -1918341 -2043111 -1957069 -1853049
36041 -1853049 -1812958 -1795763 -1837686 -1983281 -2115810 -2107709 -2070525 -2226231 -2571568 -2867898
36031 -2867898 -2936021 -2794888 -2546154 -2288679 -2125054 -2095381 -2105101 -2039240 -1926256 -1864036
36021 -1864036 -1818608 -1664173 -1438183 -1379269 -1614344 -1925861 -1971463 -1700558 -1413943 -1378097
36011 -1378097 -1510189 -1554095 -1473148 -1470598 -1613565 -1665598 -1427939 -1077879 -965230 -1158514
36001 -1158514 -1396790 -1450907 -1335258 -1177545 -1078085 -1108066 -1250076 -1312515 -1109104 -780340
35991 -780340 -719530 -1069208 -1491647 -1599119 -1437735 -1324282 -1322814 -1175128 -764236 -364132
35981 -364132 -277014 -410408 -436244 -278839 -179733 -261211 -310800 -147322 43865 -9193 -232774
35970 -232774 -390501 -602074 -1269107 -2432845 -3587547 -4271041 -4508969 -4515310 -4309878 -3890771
35960 -3890771 -3482928 -3294304 -3228697 -3116583 -3020296 -3025326 -2953816 -2625309 -2220975 -2043495
35950 -2043495 -2078215 -2134851 -2232980 -2440928 -2511261 -2168127 -1661244 -1516390 -1754098 -1876207
35940 -1876207 -1668977 -1481682 -1568070 -1662487 -1459705 -1109539 -947792 -1026916 -1163174 -1221210
35930 -1221210 -1157771 -996951 -914540 -1118733 -1507771 -1692891 -1511579 -1264215 -1269742 -1438094
35920 -1438094 -1490278 -1380069 -1260663 -1196355 -1138194 -1080889 -1052788 -1024707 -974289 -970282 -1073549
35909 -1073549 -1214048 -1257375 -1152533 -975399 -875154 -965336 -1185842 -1312900 -1217814 -1052686
35899 -1052686 -1033524 -1119648 -1099763 -924841 -738263 -633591 -601884 -649738 -738857 -700702 -468760
35888 -468760 -282364 -366537 -547609 -536885 -438481 -533919 -696400 -557111 -199539 -100665
35878 -100665 -344952 -488707 -307201 -87368 -28376 51957 207082 155583 -143021 -274824
35868 -274824 -46498 171539 113402 71346 278424 392290 108035 -188735 26897 553460
35858 553460 734983 383450 -85758 -285991 -182924 90189 363982 478206 470121 578433
35848 578433 863749 1059728 996883 873795 889407 942745 931156 982557 1154430 1295735
35838 1295735 1424921 1775729 2242765 2353166 2075205 2006546 2406382 2774362 2833737 3097039
35828 3097039 3856081 4498666 4591040 4716118 5323421 5782099 5774195 6453159 8377915 9169492
35818 9169492 5701407 -1337453 -7408714 -9266152 -8136238 -6980578 -6645649 -6170366
35810 -6170366 -5290768 -4689651 -4482329 -4151550 -3736096 -3765331 -4131907 -4131172 -3595832 -3084839
35800 -3084839 -2944322 -2945070 -2852674 -2697635 -2485730 -2201547 -2046186 -2163842 -2248744 -1937926
35790 -1937926 -1446474 -1268653 -1399820 -1441561 -1351196 -1444111 -1700738 -1733795 -1502651 -1439479
35780 -1439479 -1727521 -2010193 -2002445 -1888974 -1879406 -1806297 -1462374 -1018798 -810898 -905502
35770 -905502 -1108513 -1253591 -1301399 -1258888 -1141142 -964836 -735701 -504115 -399420 -479236
35760 -479236 -580807 -492218 -257809 -133093 -230171 -391518 -453868 -473504 -613885 -907014
35750 -907014 -1197301 -1306722 -1249378 -1246862 -1435924 -1597932 -1391542 -888779 -588804 -750920
35740 -750920 -1019899 -968309 -724166 -698308 -905537 -997417 -866102 -760963 -802541 -802197 -646043
35729 -646043 -496113 -485784 -512368 -467148 -423560 -456684 -472920 -353231 -129145 72986 157912
35718 157912 102074 -19913 -59831 31780 111657 67358 28659 142770 262593 158539 -53987
35707 -53987 -71569 51203 -52512 -409408 -551739 -195738 319904 520497 394660 234380
35697 234380 158533 115652 158418 371740 615378 627300 373285 105350 76018 294332
35687 294332 522899 477994 141961 -114032 84102 579501 817906 595118 315562 327096
35677 327096 404186 229062 18053 177860 573972 703921 512594 467037 775402 1070629
35667 1070629 1034358 863224 864215 973397 984298 961362 1091444 1321264 1465842 1546181 1708777
35656 1708777 1890185 1875994 1691028 1644270 1909056 2272692 2413701 2284866 2106056 2061359
35646 2061359 2111342 2081602 1870934 1566750 1364483 1353067 1383990 1202759 736283 214127
35636 214127 -36886 84641 360886 489649 401022 322038 511953 941317 1273757 1207282
35626 1207282 825699 548456 679797 1040549 1137865 718864 47755 -448805 -701273 -983113
35616 -983113 -1419830 -1766911 -1780365 -1591564 -1509123 -1576937 -1567909 -1365291 -1105924 -929834
35606 -929834 -818106 -746140 -784752 -926708 -984619 -824479 -591306 -536015 -680477 -814193
35596 -814193 -796974 -711274 -699439 -782059 -885487 -946695 -920732 -759662 -484273 -252157 -243156
35585 -243156 -436037 -581975 -477911 -208309 -6496 79570 206240 392850 385203 22784
35575 22784 -417304 -486498 -128079 252487 295020 67358 -103218 -15264 250334 430323
35565 430323 292415 -134907 -527062 -584193 -386037 -270858 -372642 -494095 -470860 -412676
35555 -412676 -474072 -596157 -608670 -422350 -24788 516256 942590 942879 568490 282707
35545 282707 387730 617499 548523 221106 45859 211380 494880 618232 531940 359630
35535 359630 262945 339029 504675 558811 487462 544320 847572 1107172 1018110 719501 536024
35524 536024 464607 323181 232430 444030 778440 796275 545029 548746 932270 1151504
35514 1151504 851629 444813 451878 712603 711211 379437 100327 89495 201339 262956
35504 262956 247320 166652 77882 137266 407420 685585 745873 650771 596811 582868 503407
35493 503407 449282 589295 811828 820903 594950 435901 508428 614549 522902 286008
35483 286008 109048 81084 152878 247219 288812 224597 95315 13049 20472 45817 24962
35472 24962 -13058 -7383 63520 188042 328496 423290 459194 522915 677813 808302 730074
35461 730074 477508 326978 455922 705141 793894 681309 572607 609636 719410 794986
35451 794986 863211 966379 1003837 873078 716364 798383 1093869 1233196 1002736 694998
35441 694998 730333 1065333 1254279 1041490 611577 258450 91584 111693 292298 487719
35431 487719 507497 393089 393799 567420 659742 516438 348024 395597 576997 687566 729865
35420 729865 793147 808868 712009 673664 856854 1071204 1008189 734090 592425 650393 622376
35409 622376 394966 255487 437422 733252 789255 600485 468548 552195 695577 724575
35399 724575 722245 878536 1148456 1250062 1063697 860315 951317 1226663 1316548 1176344
35389 1176344 1149278 1352692 1404193 1030918 613002 704779 1208433 1487777 1251281 871126
35379 871126 766360 889825 1002430 1114660 1374793 1694592 1762308 1414958 849866 445356
35369 445356 414201 622574 748016 638024 462517 450674 572136 630092 606873 700230
35359 700230 992894 1293710 1397454 1339464 1268991 1193421 1015043 781450 726251 984237
35349 984237 1348814 1433183 1097385 630260 439646 622761 932508 1103803 1071645 908823
35339 908823 740221 731593 961398 1250897 1313988 1136543 1003078 1083681 1239588 1332755
35329 1332755 1435381 1564793 1519103 1236042 1040974 1208591 1493971 1472593 1195905 1108899
35319 1108899 1385944 1736475 1867132 1786165 1614332 1411262 1263481 1287605 1464701 1653618
35309 1653618 1789736 1897980 1941175 1864420 1751879 1711054 1641699 1368198 967904 706579
35299 706579 675751 762726 934179 1222756 1442620 1293797 831238 488975 511316 662529
35289 662529 650029 554851 645609 973711 1351385 1599741 1668967 1606811 1504558 1403780
35279 1403780 1241326 991891 821507 910327 1145260 1219225 1051548 879307 903050 1073073
35269 1073073 1256586 1375684 1349128 1158285 1012174 1165238 1509102 1643453 1440126 1221220
35259 1221220 1247252 1348471 1251194 982832 735701 581094 548035 751662 1181819 1548340
35249 1548340 1597262 1439840 1339823 1332089 1304622 1302418 1434452 1564942 1438317 1123419
35239 1123419 1021744 1338862 1794411 1997603 1920990 1817203 1790114 1689231 1431757 1202061
35229 1202061 1206486 1374255 1475648 1454967 1438844 1447874 1354434 1177162 1160475 1434462 1806062
35218 1806062 2020652 2028424 1873584 1576772 1288241 1265101 1482695 1586103 1480047 1569367
35208 1569367 2032632 2295344 1813535 1040802 886357 1403914 1815814 1775303 1737246 1959835
35198 1959835 2018259 1639590 1254741 1274567 1451885 1437347 1398124 1559669 1643305 1358098
35188 1358098 1052378 1244256 1776186 2042429 1876671 1648940 1600436 1619439 1629034 1710347
35178 1710347 1824726 1810018 1677117 1595858 1604790 1620026 1670273 1823506 1951262 1880478 1716595
35167 1716595 1693502 1759061 1656019 1394111 1283459 1455549 1674179 1707592 1616732 1569807
35157 1569807 1590266 1600862 1562279 1483774 1410795 1443516 1655391 1961373 2161989 2143398 1977580
35146 1977580 1841742 1886576 2129530 2420005 2576276 2599304 2647299 2757893 2755328 2522649
35136 2522649 2202176 2008021 1991140 2100487 2299638 2491518 2520260 2407453 2393293 2568219
35126 2568219 2672570 2474581 2142301 1992132 2057731 2183250 2364154 2671755 2967933 3034707
35116 3034707 2920753 2853076 2862222 2795835 2655730 2608218 2670268 2679064 2579123 2464828 2335140
35105 2335140 2092316 1810756 1719555 1855466 1995566 2005934 1998102 2047632 2025474 1864112
35095 1864112 1761491 1907961 2159890 2214059 2043152 1940553 2107428 2366591 2392843 2151250
35085 2151250 1969688 2141670 2554794 2812134 2684013 2326254 2053811 2022323 2169301 2353811
35075 2353811 2476686 2520178 2520963 2486813 2369801 2184015 2081483 2182138 2383278 2497092
35065 2497092 2522107 2584071 2665320 2638941 2536876 2503595 2502779 2394336 2305895 2542322 3055504
35054 3055504 3405768 3369678 3175827 2999194 2702515 2313630 2241667 2636929 2994593 2871149
35044 2871149 2605737 2772729 3218675 3277072 2789281 2289979 2207211 2439016 2752210 3065817
35034 3065817 3230868 3015238 2505398 2157507 2246074 2532888 2649499 2574008 2561013 2767127
35024 2767127 3091324 3297821 3235940 3007453 2894344 3026237 3199897 3172087 3019204 2994651
35014 2994651 3125627 3212163 3174963 3131280 3134708 3099471 2999709 2908791 2824412 2683775 2567957
35003 2567957 2646813 2872697 2966667 2802821 2615560 2712099 3105722 3523528 3690917 3552130
34993 3552130 3277681 3092345 3067681 3101618 3115808 3170331 3308259 3413426 3366508 3250188
34983 3250188 3231670 3299386 3295068 3199561 3226371 3575748 4166846 4663273 4780624 4583862
34973 4583862 4432072 4569589 4860862 5046991 5121303 5214610 5245305 5045274 4768519 4738653
34963 4738653 4883007 4813991 4553645 4608327 5112055 5482663 5284680 4899045 4881769 5124313
34953 5124313 5177026 5025880 4993139 5168775 5475900 6005953 6721121 7101815 6727576 6014864
34943 6014864 5730432 5907301 5905746 5475633 5068350 5050199 5239175 5341018 5303312 5117650
34933 5117650 4766229 4482765 4598987 5007355 5207472 4998398 4710536 4650579 4735613 4792456
34923 4792456 4813371 4786368 4648849 4523574 4630221 4865217 4862368 4585164 4449148 4696685
34913 4696685 5045182 5157986 5102960 5102286 5134009 5057493 4923680 4901766 5006694 5079062 4982831
34902 4982831 4743841 4537971 4533655 4686245 4776434 4736018 4750981 4890360 4908609 4701875
34892 4701875 4661102 5129990 5742131 5839658 5425277 5118483 5205290 5336228 5229041 5076840
34882 5076840 5090951 5156822 5158609 5215082 5391659 5551329 5645286 5781004 5887942 5734952
34872 5734952 5412472 5341250 5614861 5793176 5593798 5343267 5428509 5697820 5782075 5703569
34862 5703569 5767741 6046815 6329445 6467059 6485011 6437321 6378478 6401454 6518138 6571566
34852 6571566 6414218 6112083 5869508 5821586 5968312 6223655 6464635 6603390 6645737 6630654
34842 6630654 6551342 6419082 6325680 6321158 6328812 6322800 6445447 6747599 6972757 6874140 6622810
34831 6622810 6594012 6833400 7047565 7065740 7005190 7016547 7140768 7366999 7582230 7566652
34821 7566652 7306923 7163530 7405796 7748776 7736542 7429524 7268746 7376615 7478452 7458628
34811 7458628 7498168 7658484 7795947 7916865 8175601 8484959 8556216 8374301 8231395 8248936
34801 8248936 8260718 8208063 8255398 8450729 8624686 8681028 8685631 8670999 8649440 8763172 9100125
34790 9100125 9440135 9512081 9394664 9338405 9364432 9398596 9560988 9880437 9990053 9637186
34780 9637186 9235926 9310710 9641429 9648366 9408687 9504304 9980304 10286546 10250450 10297333
34770 10297333 10623302 10904266 10947899 10944480 10961031 10846181 10719452 10889436 11213775 11216231
34760 11216231 10904151 10774367 10947445 11030874 10925645 11000148 11329520 11532131 11534530 11733997
34750 11733997 12188574 12399138 12164718 11957807 12160946 12557315 12846717 13086597 13375862
34741 13375862 13619509 13788708 13949307 13979151 13758096 13587438 13832787 14252283 14347441 14237127
34731 14237127 14416592 14810073 14938997 14888076 15133630 15527774 15520711 15322381 15672250 16436301
34721 16436301 16678413 16256571 16069494 16480768 16792447 16638126 16624796 17114778 17552523
34712 17552523 17533163 17467477 17681096 17868514 17896244 18141734 18619210 18786832 18603205 18728137
34702 18728137 19322647 19750445 19812134 20103755 20781500 21198178 21180876 21415042 22112341 22575804
34692 22575804 22562014 22767876 23457470 23932102 23901035 24046323 24685538 25224311 25461723 26032252
34682 26032252 27023694 27630386 27721359 28203986 29269175 29928248 29915103 30294917 31451775
34673 31451775 32279585 32224285 32325749 33300369 34373237 34974073 35796059 37181691 38264163
34664 38264163 38711178 39510201 41071266 42423255 43173261 44249117 45863762 46964296
34656 46964296 47548782 49081587 51703168 53701896 54721660 56539808 59590735 62005317
34648 62005317 63373631 65859173 70059559 73668186 76024410 79738385 85705515 91148536
34640 91148536 95082717 100656408 109149871 117232189 123632494 132304992 144810244 156641261
34632 156641261 166296070 179800411 199487711 217892081 231648227 248394940 262982660
34625 262982660 238282063 137763318 -19772757 -162543296 -233756275 -240479538 -226184915
34618 -226184915 -215425761 -203588552 -185663226 -168956407 -158350030 -148773798 -136650993
34611 -136650993 -126047241 -119712720 -113997161 -106209365 -99048464 -94595873 -90582005 -85366323
34603 -85366323 -80861699 -78110391 -75070819 -70895110 -67719967 -66327472 -64413538 -60928977
34595 -60928977 -57989841 -56755550 -55350155 -52625335 -50286245 -49482432 -48694654 -46791389
34587 -46791389 -45051955 -44430350 -43719624 -42092764 -40744498 -40415414 -39850932 -38257639 -36863493
34578 -36863493 -36553038 -36260586 -35148753 -34167650 -34031865 -33762915 -32651936 -31678870 -31603342
34569 -31603342 -31522051 -30648645 -29738090 -29471232 -29154628 -28264194 -27599580 -27673422 -27567628 -26613022
34559 -26613022 -25670364 -25544091 -25586851 -25047437 -24403161 -24216246 -24008703 -23369704 -22885759
34550 -22885759 -22925393 -22782173 -22042051 -21512419 -21758437 -21985660 -21438363 -20684128 -20434341
34541 -20434341 -20275667 -19685875 -19190037 -19352699 -19617021 -19276252 -18710692 -18588118 -18654391
34532 -18654391 -18345561 -17863930 -17687197 -17667340 -17464797 -17248756 -17231449 -17146797 -16826728 -16611333
34522 -16611333 -16628714 -16429297 -15870326 -15537381 -15745263 -15980668 -15871040 -15786988 -15920339 -15739692
34512 -15739692 -15011556 -14418310 -14471950 -14702625 -14588076 -14391304 -14409731 -14305875 -13884518 -13645452
34502 -13645452 -13859181 -13969547 -13610325 -13320288 -13529955 -13741672 -13472012 -13117246 -13100837
34493 -13100837 -13047035 -12622539 -12331323 -12605765 -12931073 -12760441 -12508072 -12713855 -12971147
34484 -12971147 -12643942 -11988572 -11627406 -11519126 -11355815 -11376807 -11850851 -12281897 -12056501
34475 -12056501 -11442412 -11111101 -11103717 -11045664 -10926729 -10903991 -10788503 -10470801 -10391746 -10861212
34465 -10861212 -11381461 -11370394 -11074656 -11035368 -11134167 -10926325 -10474854 -10115734 -9817249 -9470481
34455 -9470481 -9375972 -9747950 -10166936 -10184486 -10016674 -10011936 -9965509 -9638420 -9393484 -9575806
34445 -9575806 -9801837 -9618481 -9323979 -9360431 -9461337 -9230134 -8981894 -9105184 -9164474 -8646890
34435 -8646890 -8078710 -8279551 -8909960 -8948618 -8364171 -8107452 -8519328 -8909606 -8813326 -8616934
34425 -8616934 -8705289 -8856662 -8776577 -8571086 -8441341 -8398367 -8411731 -8443761 -8340726 -8063536
34415 -8063536 -7899547 -8043475 -8184396 -7968598 -7607151 -7504536 -7576056 -7515485 -7439653 -7615031
34405 -7615031 -7818615 -7675064 -7399024 -7471802 -7774220 -7800317 -7586459 -7640677 -8016068 -8226379
34395 -8226379 -8083771 -7894982 -7792631 -7570101 -7258541 -7215493 -7514712 -7802533 -7858718 -7806528
34385 -7806528 -7723612 -7536933 -7335664 -7316341 -7400704 -7344201 -7183543 -7131408 -7120346 -6949207
34375 -6949207 -6777269 -6912292 -7176946 -7082979 -6626909 -6323582 -6414592 -6613354 -6698349 -6795111
34365 -6795111 -6952765 -6963682 -6768034 -6600269 -6583648 -6557572 -6425808 -6328333 -6363737 -6440491
34355 -6440491 -6466558 -6426564 -6279256 -6046967 -5947719 -6144953 -6450471 -6578297 -6565492 -6604221
34345 -6604221 -6623514 -6449348 -6232975 -6261271 -6446102 -6469181 -6349500 -6385172 -6591952 -6694650
34335 -6694650 -6649447 -6678286 -6780514 -6709003 -6478521 -6411923 -6584626 -6672580 -6489307 -6277077
34325 -6277077 -6295195 -6440756 -6458084 -6297544 -6115439 -6050122 -6078832 -6045269 -5867870 -5739087
34315 -5739087 -5932026 -6347472 -6555592 -6432643 -6374829 -6634873 -6882482 -6798372 -6669090 -6889175
34305 -6889175 -7249343 -7308023 -7173840 -7282083 -7599907 -7695118 -7466879 -7204692 -7021215 -6800962
34295 -6800962 -6614146 -6613361 -6615903 -6355802 -6043838 -6086329 -6351712 -6345605 -6041737 -5886945 -6015846
34284 -6015846 -6124073 -6122911 -6246615 -6464054 -6454794 -6257789 -6282256 -6543775 -6537554 -6057270 -5545006
34273 -5545006 -5417058 -5569655 -5730765 -5785099 -5591209 -5010625 -4305083 -3997745 -4160093 -4328205
34263 -4328205 -4272582 -4303584 -4617469 -4899351 -4849792 -4615524 -4423536 -4242894 -4074877 -4130196
34253 -4130196 -4427768 -4619796 -4493704 -4278502 -4210457 -4181326 -4071368 -4045018 -4230343 -4444376
34243 -4444376 -4509066 -4531826 -4634484 -4719047 -4730402 -4821687 -5013348 -5015043 -4663285 -4246631 -4109806
34232 -4109806 -4179619 -4162334 -4008258 -3910680 -3981211 -4142764 -4257682 -4238364 -4120327 -4062508
34222 -4062508 -4146088 -4202785 -4039221 -3774008 -3691540 -3818383 -3944257 -3998158 -4064540 -4104475
34212 -4104475 -4051122 -4092248 -4393666 -4621412 -4297966 -3624061 -3333538 -3657233 -4058520 -4132183
34202 -4132183 -4107478 -4227469 -4278724 -4079471 -3874499 -3878176 -3914375 -3845335 -3863995 -4021880 -3986362
34191 -3986362 -3652473 -3472413 -3733262 -4021178 -3916913 -3730539 -3930897 -4262376 -4138969
34182 -4138969 -3647098 -3424252 -3651610 -3853373 -3713266 -3482616 -3457145 -3543947 -3536007 -3461044
34172 -3461044 -3460246 -3540701 -3600426 -3580134 -3512985 -3485393 -3550133 -3645028 -3663898 -3628467 -3658498 -3747005
34160 -3747005 -3755539 -3677263 -3669146 -3751113 -3740913 -3584859 -3457798 -3414688 -3274755 -3011662 -2895776
34149 -2895776 -3026627 -3088211 -2850038 -2571255 -2591180 -2836438 -3068743 -3299521 -3576090 -3667500
34139 -3667500 -3415766 -3152298 -3285494 -3661122 -3817381 -3725484 -3759162 -4003603 -4124962 -3961323
34129 -3961323 -3773589 -3804065 -3962454 -4063590 -4068610 -3989797 -3819896 -3644802 -3605822 -3684716
34119 -3684716 -3711425 -3611948 -3477469 -3398219 -3399858 -3498555 -3636558 -3644798 -3481586 -3397684 -3601960
34108 -3601960 -3885128 -3906039 -3748165 -3784360 -4031959 -4115148 -3931951 -3863588 -4124706 -4358614
34098 -4358614 -4191539 -3829965 -3721549 -3871531 -3917577 -3749201 -3620896 -3654759 -3621562 -3331835
34088 -3331835 -2962560 -2834011 -3028790 -3356963 -3575512 -3552540 -3339460 -3169215 -3259610 -3532829
34078 -3532829 -3671437 -3549034 -3416459 -3493742 -3592297 -3439827 -3225242 -3399841 -3937668 -4240841
34068 -4240841 -3938852 -3397126 -3181041 -3334273 -3507707 -3556016 -3621957 -3751675 -3794167 -3667981
34058 -3667981 -3460685 -3279179 -3202587 -3313622 -3568166 -3724719 -3618878 -3398613 -3273613 -3199619
34048 -3199619 -3083140 -3092901 -3385700 -3685483 -3593469 -3231194 -3087322 -3249036 -3306002 -3082071
34038 -3082071 -2936214 -3156214 -3503023 -3597017 -3414146 -3179251 -3043417 -3042926 -3140259 -3189585
34028 -3189585 -3084998 -2970041 -3025128 -3092074 -2904978 -2657054 -2819055 -3341919 -3617943 -3386835
34018 -3386835 -3090187 -3096349 -3175920 -3066851 -2968530 -3061357 -3081460 -2849227 -2718041 -2963820
34008 -2963820 -3183765 -2895867 -2354361 -2149040 -2314777 -2470902 -2556068 -2746449 -2874073 -2651116
33998 -2651116 -2332738 -2420680 -2768931 -2735501 -2257170 -2017047 -2384242 -2892449 -3032567 -2929873
33988 -2929873 -2893145 -2844593 -2619053 -2402509 -2427394 -2533461 -2446372 -2265252 -2277439 -2452841
33978 -2452841 -2512673 -2421800 -2452589 -2748564 -3113523 -3300985 -3306301 -3283117 -3308158 -3333086 -3309049
33967 -3309049 -3262600 -3229754 -3165787 -2989170 -2729051 -2555465 -2601710 -2809649 -3019255 -3149876
33957 -3149876 -3202552 -3153878 -2988096 -2805060 -2750080 -2835235 -2963524 -3129351 -3429961 -3827686
33947 -3827686 -4066036 -3948884 -3610653 -3368732 -3343505 -3369540 -3303359 -3264905 -3452180 -3805044
33937 -3805044 -4035457 -3998421 -3851448 -3779039 -3741758 -3627412 -3479244 -3383992 -3273777 -3070652
33927 -3070652 -2918852 -3007742 -3236929 -3340095 -3289734 -3274091 -3311625 -3237951 -3073528 -3017413
33917 -3017413 -3029961 -2843299 -2499383 -2434355 -2821475 -3244403 -3298957 -3150494 -3170230 -3339241
33907 -3339241 -3379932 -3231408 -3029789 -2813875 -2599109 -2568635 -2834267 -3136491 -3118155 -2800250
33897 -2800250 -2491261 -2336135 -2256153 -2228936 -2306460 -2416777 -2442725 -2451337 -2576200 -2726971
33887 -2726971 -2696726 -2530569 -2506328 -2719005 -2916602 -2822086 -2480952 -2227754 -2345978 -2751853
33877 -2751853 -3038872 -2936427 -2664617 -2617365 -2754599 -2677029 -2336086 -2196943 -2510328 -2898678
33867 -2898678 -2967388 -2878835 -2934774 -3013050 -2893804 -2774436 -2915214 -3076684 -2904091 -2631944
33857 -2631944 -2755446 -3143477 -3162341 -2671083 -2244328 -2306478 -2613632 -2758958 -2714686 -2675555
33847 -2675555 -2731280 -2865171 -3004605 -2989314 -2743256 -2481892 -2461680 -2560892 -2448592 -2134903
33837 -2134903 -1971603 -2104068 -2304571 -2378429 -2375588 -2368507 -2360170 -2430866 -2653780 -2876883 -2903323
33826 -2903323 -2821514 -2813246 -2762233 -2481830 -2190179 -2228949 -2411043 -2259430 -1861285 -1809807
33816 -1809807 -2230615 -2561077 -2462123 -2266881 -2279316 -2297074 -2171053 -2217893 -2643448 -3067061
33806 -3067061 -3068916 -2796620 -2619347 -2565494 -2498927 -2485750 -2587223 -2621301 -2506141 -2512557 -2808427
33795 -2808427 -3088027 -3032690 -2805202 -2694235 -2608398 -2352981 -2082693 -2010192 -1959302 -1707538
33785 -1707538 -1511722 -1751354 -2241342 -2450418 -2279498 -2087137 -2020012 -1861736 -1553019 -1354262
33775 -1354262 -1400617 -1507289 -1521460 -1529091 -1614529 -1696115 -1687018 -1605809 -1498594 -1442069 -1587683
33764 -1587683 -1976845 -2355597 -2417151 -2199857 -2017626 -2041333 -2179458 -2314722 -2410560 -2426532
33754 -2426532 -2363017 -2343114 -2441514 -2525621 -2489259 -2495284 -2692588 -2851378 -2662887 -2290413 -2176038
33743 -2176038 -2337318 -2345287 -2065369 -1921083 -2223619 -2664987 -2767136 -2526316 -2295142 -2225869
33733 -2225869 -2147569 -1918506 -1650529 -1571978 -1791582 -2195398 -2525746 -2598025 -2456819 -2266459
33723 -2266459 -2086656 -1879435 -1704121 -1716123 -1930350 -2144236 -2161956 -1990003 -1786374 -1723217
33713 -1723217 -1891361 -2201744 -2385749 -2244694 -1900750 -1657180 -1638620 -1742144 -1888628 -2072255
33703 -2072255 -2176401 -2043937 -1793735 -1768738 -2050932 -2309063 -2284667 -2152419 -2179456 -2272587
33693 -2272587 -2153783 -1830719 -1594031 -1615298 -1800963 -2001946 -2133812 -2114843 -1923268 -1736137
33683 -1736137 -1793611 -2064030 -2224581 -2060610 -1739301 -1580520 -1663160 -1790957 -1803072 -1773719
33673 -1773719 -1849046 -1971930 -1901267 -1550677 -1203814 -1246555 -1691010 -2120083 -2164670 -1897714
33663 -1897714 -1657770 -1617951 -1688898 -1753349 -1787452 -1761907 -1621335 -1415369 -1304772 -1372369
33653 -1372369 -1535161 -1686972 -1807354 -1873573 -1801785 -1581746 -1367352 -1308202 -1355874 -1354833
33643 -1354833 -1268657 -1180926 -1103127 -937180 -657627 -405749 -336945 -442658 -573921 -599935
33633 -599935 -516454 -434291 -475705 -656439 -886141 -1119952 -1451105 -1959711 -2520933 -2908590
33623 -2908590 -3074817 -3155867 -3185814 -3020871 -2643196 -2330042 -2344808 -2604627 -2840793 -2965731
33613 -2965731 -3069339 -3156377 -3149364 -3111623 -3197199 -3367506 -3427317 -3399000 -3583644 -4118732 -4714949
33602 -4714949 -5013889 -5016447 -4951239 -4881225 -4698439 -4418546 -4203415 -4093403 -3962646 -3783892
33592 -3783892 -3706530 -3768901 -3738843 -3423564 -3017239 -2918935 -3215661 -3542189 -3523816 -3211412
33582 -3211412 -2953069 -2926314 -2972855 -2897656 -2751164 -2708627 -2781845 -2806199 -2688891 -2528695
33572 -2528695 -2460535 -2492657 -2557965 -2649325 -2818602 -3054813 -3220446 -3143614 -2800078 -2408974
33562 -2408974 -2282380 -2505456 -2808036 -2860579 -2674391 -2559954 -2666075 -2747777 -2518108 -2089736
33552 -2089736 -1867117 -2036268 -2346536 -2427736 -2181272 -1810521 -1590420 -1674501 -2015230 -2377300
33542 -2377300 -2512752 -2424040 -2377493 -2542937 -2712599 -2560865 -2132164 -1824603 -1847941 -1958924
33532 -1958924 -1874853 -1710465 -1760634 -2006848 -2136074 -1992242 -1726135 -1508092 -1376657 -1401439
33522 -1401439 -1690842 -2127778 -2367903 -2256402 -2021710 -1899076 -1799841 -1565440 -1328086 -1331904
33512 -1331904 -1532567 -1674279 -1701723 -1810009 -2081644 -2317010 -2281849 -1968362 -1580092 -1364425
33502 -1364425 -1439053 -1675318 -1799416 -1716676 -1651349 -1834731 -2175071 -2426566 -2568441 -2759261
33492 -2759261 -2978112 -3001221 -2756976 -2455114 -2305418 -2303817 -2344084 -2364656 -2339321 -2271661 -2223712
33481 -2223712 -2221334 -2154468 -1928425 -1673381 -1609908 -1732605 -1828227 -1782298 -1660539 -1527892
33471 -1527892 -1426967 -1494899 -1816167 -2165196 -2197544 -1927445 -1724177 -1804301 -2034825 -2267945
33461 -2267945 -2509809 -2678057 -2579333 -2280319 -2142335 -2310370 -2517991 -2582397 -2688840 -2911310
33451 -2911310 -2871787 -2302665 -1641012 -1561235 -2067257 -2521466 -2518112 -2285523 -2191314 -2247549
33441 -2247549 -2243824 -2099039 -1917957 -1832255 -1881186 -1980843 -1990193 -1858819 -1677212 -1541109 -1460332
33430 -1460332 -1455808 -1593122 -1816404 -1924708 -1860577 -1837531 -1996074 -2132021 -2015395 -1798331
33420 -1798331 -1791868 -1959451 -1977598 -1747787 -1509476 -1445779 -1495142 -1581860 -1722733 -1842245
33410 -1842245 -1781364 -1596538 -1582251 -1856004 -2141228 -2114372 -1795998 -1464464 -1336149 -1451079
33400 -1451079 -1714769 -1912538 -1824713 -1484445 -1210316 -1234109 -1405482 -1434780 -1324696 -1330599
33390 -1330599 -1522849 -1645304 -1489921 -1203495 -1066260 -1107651 -1151661 -1178412 -1377404 -1774868
33380 -1774868 -2052219 -1929506 -1581941 -1429906 -1577251 -1728973 -1684240 -1618175 -1738031 -1906265
33370 -1906265 -1841230 -1557532 -1349629 -1368400 -1442060 -1363145 -1176650 -1079882 -1134077 -1202068 -1168417
33359 -1168417 -1118921 -1221494 -1461016 -1613550 -1535266 -1360230 -1297251 -1332763 -1312235 -1253320
33349 -1253320 -1349217 -1647791 -1946316 -2061694 -2014312 -1888527 -1713231 -1555133 -1519412 -1554211
33339 -1554211 -1458735 -1207378 -1063911 -1227506 -1553312 -1784396 -1881460 -1941593 -1948324 -1803695
33329 -1803695 -1511138 -1180476 -944901 -944080 -1209671 -1486976 -1424266 -1072264 -897597 -1108900
33319 -1108900 -1316584 -1157239 -895536 -967503 -1216487 -1138176 -730326 -502684 -658756 -847107
33309 -847107 -816734 -770684 -873428 -894133 -623492 -262564 -92404 -67542 -48801 -164865
33299 -164865 -577478 -1071292 -1260612 -1128856 -1014984 -1071048 -1061775 -787724 -431303 -296383
33289 -296383 -353732 -260338 182173 757809 1100767 1126118 1053545 1008143 765563 24388
33279 24388 -1134865 -2219795 -2792230 -2875958 -2848114 -2979088 -3162828 -3129426 -2857933 -2645562
33269 -2645562 -2711363 -2874279 -2806480 -2532194 -2417461 -2635326 -2908567 -2902501 -2643511 -2388337
33259 -2388337 -2280247 -2321432 -2504316 -2751389 -2864514 -2750089 -2580634 -2543580 -2570060 -2518803
33249 -2518803 -2464370 -2543648 -2662591 -2649741 -2575360 -2589845 -2553026 -2218884 -1757976 -1665243 -2058465
33238 -2058465 -2455818 -2426805 -2147756 -2073213 -2280766 -2426939 -2273534 -2007156 -1973643 -2216233
33228 -2216233 -2398045 -2215341 -1799831 -1568165 -1690326 -1919225 -2013503 -2077853 -2308759 -2618450
33218 -2618450 -2746180 -2593929 -2247181 -1826554 -1515742 -1521868 -1767863 -1863632 -1656275 -1513790
33208 -1513790 -1707337 -1863695 -1556033 -1134124 -1280317 -1900309 -2218234 -1968582 -1712679
33199 -1712679 -1836954 -2009295 -1907796 -1772488 -1837084 -1842769 -1595075 -1466528 -1801845 -2247930
33189 -2247930 -2247488 -1887873 -1695594 -1810249 -1920057 -1893149 -1937956 -2136022 -2251283 -2084636
33179 -2084636 -1736765 -1459438 -1408320 -1525239 -1565952 -1355574 -1094652 -1191053 -1663166 -2008862
33169 -2008862 -1883017 -1585669 -1568796 -1758305 -1763230 -1528795 -1338703 -1311340 -1332208 -1404909
33159 -1404909 -1640503 -1917715 -1950140 -1725319 -1546187 -1597867 -1757979 -1860827 -1885321 -1859945
33149 -1859945 -1816377 -1836556 -1931525 -1923410 -1692343 -1468746 -1578682 -1939172 -2137664 -2019183
33139 -2019183 -1856382 -1879386 -1964759 -1910519 -1747518 -1630258 -1616226 -1674944 -1760495 -1795538 -1729910
33128 -1729910 -1658315 -1717361 -1839655 -1802536 -1565031 -1356970 -1365195 -1513813 -1628302 -1644229
33118 -1644229 -1576268 -1445673 -1324222 -1303870 -1344369 -1290705 -1114944 -997727 -1084847 -1294693
33108 -1294693 -1458717 -1535386 -1588384 -1651487 -1713523 -1765904 -1783071 -1714046 -1561394 -1419689 -1379743
33097 -1379743 -1433108 -1509016 -1563691 -1594634 -1596412 -1544399 -1436412 -1349378 -1412973 -1653155 -1877890
33086 -1877890 -1847997 -1597951 -1432112 -1513632 -1625796 -1496144 -1206527 -1066883 -1181031 -1374539
33076 -1374539 -1501427 -1576726 -1605004 -1511030 -1297571 -1103983 -1056502 -1173403 -1410791 -1673586
33066 -1673586 -1816035 -1788652 -1746395 -1837732 -1940822 -1827305 -1546231 -1381562 -1429012 -1503491
33056 -1503491 -1511489 -1603264 -1833315 -1963409 -1803144 -1525333 -1420368 -1495361 -1541321 -1491957
33046 -1491957 -1489422 -1621397 -1767010 -1731147 -1463157 -1151468 -1104021 -1440369 -1886570 -2024851
33036 -2024851 -1799008 -1587101 -1669223 -1836603 -1730360 -1396697 -1220402 -1369875 -1600153 -1641930
33026 -1641930 -1531313 -1447457 -1422394 -1372767 -1301345 -1291752 -1340302 -1342184 -1254058 -1149560 -1081631
33015 -1081631 -1006884 -919543 -952176 -1204555 -1523983 -1630263 -1479898 -1333835 -1390086 -1521497
33005 -1521497 -1517037 -1429375 -1462835 -1594986 -1571642 -1303628 -1032087 -999832 -1141150 -1236128 -1241267
32994 -1241267 -1296286 -1459210 -1600990 -1584954 -1440654 -1309272 -1278674 -1333123 -1441318 -1615243
32984 -1615243 -1837986 -1980362 -1877088 -1501236 -999445 -540593 -203895 -26755 -39414 -178925
32974 -178925 -276533 -236462 -150764 -140124 -170400 -147520 -104471 -136520 -207197 -183360 -36217
32963 -36217 143286 305945 468777 593239 597301 503137 442152 492662 599010 629438 437463
32952 437463 -48486 -668846 -1067696 -1059794 -874446 -841892 -947553 -945815 -805437 -712676 -686915
32941 -686915 -567998 -398198 -424434 -646849 -762531 -684295 -707596 -971647 -1174354 -1114612
32931 -1114612 -1132683 -1609237 -2302484 -2629534 -2451564 -2155571 -2036272 -2002353 -1898101 -1760512
32921 -1760512 -1681558 -1664672 -1686775 -1738479 -1792368 -1861606 -2028521 -2267101 -2354463 -2164815 -1923462
32910 -1923462 -1907058 -2009099 -1922723 -1672456 -1587863 -1756462 -1898374 -1859555 -1845982 -2011386
32900 -2011386 -2152890 -2045211 -1821441 -1766029 -1892381 -1958319 -1804820 -1498791 -1214024 -1113763
32890 -1113763 -1281089 -1634913 -1954815 -2072929 -2003792 -1857815 -1714530 -1611822 -1554074 -1494090
32880 -1494090 -1405163 -1373745 -1491012 -1669213 -1744318 -1746179 -1834043 -1959633 -1892219 -1641356 -1513495
32869 -1513495 -1606704 -1610555 -1343798 -1136354 -1330619 -1696404 -1772268 -1585632 -1550263 -1748000
32859 -1748000 -1826590 -1641201 -1507640 -1664752 -1890763 -1879517 -1694330 -1598132 -1639893 -1648048
32849 -1648048 -1514300 -1300891 -1142051 -1150826 -1335186 -1529738 -1520112 -1299824 -1083401 -1020441
32839 -1020441 -1052486 -1103009 -1212195 -1387757 -1520195 -1578552 -1706652 -1968119 -2165827 -2100306
32829 -2100306 -1867608 -1702948 -1644681 -1566103 -1454056 -1420496 -1457945 -1399195 -1167011 -922854
32819 -922854 -905098 -1174964 -1539382 -1712461 -1594661 -1397127 -1403661 -1612879 -1765635 -1742689
32809 -1742689 -1713545 -1805643 -1879312 -1799842 -1693442 -1706890 -1733726 -1652257 -1625969 -1827515 -2037421
32798 -2037421 -1928359 -1650049 -1672110 -2038393 -2236759 -1920534 -1350255 -951521 -803613 -787292
32788 -787292 -910226 -1187433 -1416337 -1372427 -1122758 -921904 -880792 -914710 -934497 -930232 -931715
32777 -931715 -1002534 -1191971 -1402892 -1427087 -1223305 -1041142 -1143989 -1507905 -1901126 -2150879
32767 -2150879 -2220838 -2139427 -1979540 -1826925 -1675358 -1446527 -1179965 -1063183 -1177538 -1355896
32757 -1355896 -1402557 -1320773 -1219919 -1146286 -1118952 -1179381 -1285440 -1309819 -1250310 -1258533 -1353089
32746 -1353089 -1342531 -1186256 -1154909 -1399971 -1637425 -1568047 -1370124 -1399682 -1593942 -1608378
32736 -1608378 -1433660 -1407802 -1627677 -1797306 -1722510 -1549895 -1419355 -1268826 -1120551 -1182698
32726 -1182698 -1463621 -1616730 -1421999 -1154861 -1196040 -1478828 -1628159 -1525310 -1426926 -1545954
32716 -1545954 -1770755 -1851128 -1692903 -1401550 -1144527 -1047334 -1168028 -1476731 -1824052 -1989355
32706 -1989355 -1867642 -1624116 -1542104 -1661137 -1717486 -1557015 -1417286 -1568446 -1822216 -1729077
32696 -1729077 -1224321 -731358 -581926 -676354 -821240 -1050269 -1402036 -1676536 -1695730 -1608329
32686 -1608329 -1650058 -1744497 -1643197 -1381721 -1278495 -1461310 -1673355 -1649126 -1473755 -1413222
32676 -1413222 -1507818 -1526246 -1331284 -1130105 -1229682 -1593462 -1823419 -1659598 -1333809 -1251061
32666 -1251061 -1433012 -1533805 -1381966 -1209859 -1261978 -1449941 -1565171 -1618163 -1749450 -1945329
32656 -1945329 -2061492 -2043247 -1928201 -1703901 -1361490 -1040036 -909573 -921489 -872253 -733210
32646 -733210 -723074 -986120 -1360156 -1567617 -1526892 -1366041 -1209865 -1085699 -1013439 -1050066
32636 -1050066 -1194569 -1337105 -1380763 -1366548 -1393046 -1446670 -1428309 -1345894 -1330791 -1407688 -1405845
32625 -1405845 -1218280 -1014701 -1031077 -1242051 -1423003 -1466102 -1442670 -1410220 -1368145 -1364118 -1423561
32614 -1423561 -1410712 -1204363 -974972 -994685 -1187430 -1220500 -1080258 -1139418 -1504853 -1729447
32604 -1729447 -1455295 -982449 -832702 -1019526 -1159041 -1120972 -1132317 -1305651 -1469795 -1489529
32594 -1489529 -1430382 -1364792 -1280795 -1226016 -1316676 -1558109 -1822654 -2005205 -2058537 -1944740
32584 -1944740 -1733785 -1652226 -1803554 -1939221 -1776394 -1441080 -1269312 -1254872 -1101086 -807380
32574 -807380 -743946 -1037920 -1322952 -1294098 -1128369 -1110558 -1184864 -1174516 -1158092 -1283947 -1416482
32563 -1416482 -1319205 -1063444 -930085 -983995 -1044168 -1026432 -1029746 -1091751 -1118161 -1082461 -1082613
32552 -1082613 -1161134 -1238813 -1257016 -1245918 -1237304 -1228949 -1227009 -1214391 -1117595 -930656 -815387
32541 -815387 -927095 -1190182 -1400135 -1480874 -1463456 -1303010 -975396 -711547 -827105 -1271855
32531 -1271855 -1630088 -1653380 -1525823 -1491180 -1500334 -1413869 -1306941 -1322219 -1387243 -1339829 -1234886
32520 -1234886 -1277688 -1497896 -1707623 -1768928 -1719544 -1637524 -1544499 -1454902 -1392608 -1351587 -1331925
32509 -1331925 -1379586 -1488188 -1523354 -1381691 -1172694 -1089962 -1143161 -1180248 -1142546 -1122350 -1182682
32498 -1182682 -1293136 -1432657 -1580226 -1625404 -1492507 -1339960 -1395612 -1578752 -1560121 -1265217
32488 -1265217 -1027649 -1105115 -1314986 -1348100 -1212849 -1125333 -1132637 -1108787 -1017381 -930260 -849119
32477 -849119 -731837 -659592 -778622 -1083274 -1401217 -1569989 -1525528 -1299224 -1052615 -1006988
32467 -1006988 -1185210 -1336181 -1277559 -1166552 -1220157 -1332417 -1265455 -1098132 -1128596 -1376342
32457 -1376342 -1546210 -1498263 -1390284 -1301439 -1092156 -762138 -590561 -726392 -931335 -939428
32447 -939428 -824321 -799958 -882555 -971255 -1068576 -1202295 -1300662 -1344086 -1457550 -1653349 -1697574
32436 -1697574 -1479404 -1291791 -1423263 -1645802 -1486915 -919419 -398088 -237013 -322104 -460635
32426 -460635 -635900 -814641 -846015 -725525 -704031 -962408 -1374307 -1723454 -1946244 -2021380
32416 -2021380 -1856790 -1492752 -1219004 -1240179 -1359525 -1244638 -906043 -651614 -635542 -737190
32406 -737190 -869636 -1100567 -1397390 -1536081 -1413242 -1237432 -1242835 -1380620 -1466457 -1474749
32396 -1474749 -1473603 -1398113 -1151953 -870174 -798433 -909009 -919725 -753252 -692351 -944767
32386 -944767 -1310244 -1479042 -1457741 -1458732 -1514003 -1466925 -1273746 -1059472 -903354 -798852 -812111
32375 -812111 -1043458 -1400279 -1616065 -1552457 -1325154 -1105593 -964407 -929707 -1011848 -1122614
32365 -1122614 -1138613 -1086435 -1098967 -1165535 -1128220 -972305 -897219 -1010797 -1163038 -1194414 -1157805
32354 -1157805 -1177240 -1267080 -1404120 -1591024 -1730727 -1643856 -1356819 -1170325 -1276346 -1499641
32344 -1499641 -1582314 -1505249 -1336989 -1021880 -596223 -381629 -607387 -1000117 -1127291 -1034552
32334 -1034552 -1124702 -1451983 -1597614 -1326606 -949467 -854614 -1013057 -1158414 -1192523 -1173262
32324 -1173262 -1092698 -918126 -750628 -735060 -864348 -1017130 -1125149 -1172682 -1110001 -935513
32314 -935513 -826024 -994963 -1372903 -1580791 -1341349 -849249 -588353 -768967 -1093082 -1169917
32304 -1169917 -1026742 -1010723 -1250298 -1482657 -1461582 -1268094 -1091566 -956286 -850839 -889314
32294 -889314 -1093718 -1219994 -1091894 -928407 -1002141 -1135304 -956885 -569978 -474142 -792261
32284 -792261 -1063622 -947077 -680239 -618022 -716161 -765719 -806482 -960357 -1099063 -1042465
32274 -1042465 -930960 -1049191 -1358377 -1513482 -1319573 -924030 -575178 -402719 -421719 -564640
32264 -564640 -705951 -784192 -867875 -1002977 -1090723 -1043024 -941200 -891845 -864340 -847091 -991437
32253 -991437 -1349237 -1625343 -1514430 -1185035 -1075403 -1264355 -1437413 -1474420 -1615287 -1917343
32243 -1917343 -1999429 -1599860 -1045150 -827192 -954033 -1074215 -1078778 -1191355 -1510564 -1824675
32233 -1824675 -1931646 -1864251 -1725827 -1544978 -1391546 -1419091 -1642952 -1826697 -1748211 -1487182
32223 -1487182 -1308415 -1331774 -1464684 -1611367 -1766456 -1877410 -1795462 -1487897 -1199041 -1233352
32213 -1233352 -1574341 -1850162 -1731533 -1279716 -847067 -712063 -876817 -1137288 -1250699
32204 -1250699 -1104235 -849137 -820645 -1178131 -1658122 -1854446 -1719830 -1572588 -1592752 -1587391
32194 -1587391 -1365800 -1072831 -944948 -959697 -981901 -1069395 -1318511 -1532344 -1407249 -1024237
32184 -1024237 -808411 -958220 -1220760 -1294014 -1158620 -936475 -725896 -690466 -1004845 -1544694
32174 -1544694 -1897938 -1861079 -1674619 -1600883 -1561523 -1414938 -1284469 -1300845 -1279948 -1018725
32164 -1018725 -710562 -688350 -915749 -1119194 -1271386 -1507880 -1683213 -1514230 -1138239 -1009143
32154 -1009143 -1179436 -1200332 -872304 -586729 -685564 -938599 -972646 -840914 -803985 -845629
32144 -845629 -799953 -750797 -908061 -1198646 -1334285 -1239682 -1118583 -1110550 -1129501 -1055619 -904734
32133 -904734 -790493 -822193 -1001483 -1149137 -1045052 -738221 -570124 -750977 -1062607 -1153974
32123 -1153974 -997093 -859621 -935852 -1193327 -1489465 -1661514 -1592668 -1358443 -1215225 -1291361
32113 -1291361 -1405931 -1346430 -1173487 -1062574 -1012891 -953928 -987666 -1234233 -1535467 -1608763
32103 -1608763 -1445081 -1284176 -1240447 -1224540 -1201259 -1237443 -1283694 -1177210 -910981 -686736
32093 -686736 -659110 -800243 -1022917 -1262410 -1439238 -1504491 -1505871 -1476248 -1344872 -1128149
32083 -1128149 -1062972 -1285071 -1501449 -1329667 -905292 -765062 -1095168 -1476327 -1489264 -1233870
32073 -1233870 -1064473 -1073119 -1063996 -903378 -706822 -707985 -1004108 -1408364 -1596808 -1474080
32063 -1474080 -1293585 -1293188 -1362563 -1269030 -1043319 -865273 -729350 -569458 -566606 -898958 -1278199
32052 -1278199 -1234568 -857403 -728550 -1050257 -1375980 -1352829 -1191202 -1166882 -1177236 -1105804
32042 -1105804 -1151507 -1407766 -1520811 -1205518 -784711 -766764 -1121760 -1401581 -1389691 -1226630
32032 -1226630 -1049787 -907796 -912007 -1090549 -1181160 -932612 -549930 -496048 -881833 -1356624
32022 -1356624 -1574382 -1485645 -1198527 -838256 -563742 -498332 -613619 -803376 -1006137 -1147096
32012 -1147096 -1124899 -1019916 -1101305 -1404985 -1558296 -1328471 -1070711 -1206885 -1495771 -1371764
32002 -1371764 -887671 -696059 -1052286 -1447204 -1411149 -1137893 -1034857 -1121901 -1224479 -1384473
31992 -1384473 -1675295 -1870084 -1700704 -1297348 -1023054 -986869 -1044578 -1177487 -1504207 -1925063
31982 -1925063 -2100502 -1879600 -1510419 -1322651 -1380063 -1533682 -1652120 -1684324 -1616271 -1491497
31972 -1491497 -1411384 -1421814 -1444305 -1384776 -1256431 -1132983 -1048608 -1026288 -1131466 -1373107
31962 -1373107 -1597029 -1632806 -1547462 -1588286 -1826686 -2022165 -1938456 -1660648 -1473492 -1527881
31952 -1527881 -1754384 -2008943 -2162393 -2136639 -2009492 -2002356 -2204227 -2408886 -2418073 -2383160
31942 -2383160 -2571283 -2873178 -2875509 -2413903 -1714482 -960021 -100896 787489 1348768 1377277
31932 1377277 1115328 891542 722396 505546 342490 367882 451512 376619 186178 85051
31922 85051 113831 165157 204328 229182 129138 -163478 -483585 -632062 -652903 -677219 -633621
31911 -633621 -402411 -140021 -126636 -356631 -588019 -738713 -908201 -1045555 -957306 -681201
31901 -681201 -517907 -603818 -734443 -713110 -627862 -661709 -819326 -954273 -935005 -723641
31891 -723641 -410504 -192923 -202134 -361675 -525914 -678200 -830136 -843356 -604604 -300995
31881 -300995 -232126 -382787 -474541 -415962 -377474 -415348 -381398 -274406 -321460 -573835 -742734
31870 -742734 -613004 -352967 -231942 -261167 -295708 -294830 -311978 -390881 -592605 -935795 -1204262
31859 -1204262 -1056261 -487890 36740 107419 -171955 -420204 -465299 -384626 -264259 -180436
31849 -180436 -272901 -565921 -812354 -762993 -510993 -334719 -289922 -232313 -185319 -357709
31839 -357709 -748899 -1039176 -1013776 -871717 -924549 -1133700 -1170957 -900001 -584905 -549338
31829 -549338 -770803 -944357 -889233 -739784 -717687 -864095 -1079433 -1302878 -1514962 -1638845
31819 -1638845 -1598129 -1446415 -1298520 -1154007 -938152 -707837 -645079 -808374 -1033529 -1130687
31809 -1130687 -1065198 -913129 -761174 -688756 -731018 -815160 -831153 -786986 -791205 -880716 -992083
31798 -992083 -1098135 -1214287 -1262098 -1120613 -865364 -757577 -896815 -1063771 -1042228 -940069
31788 -940069 -1005647 -1216910 -1267499 -981852 -579626 -424172 -583021 -783349 -824298 -851703
31778 -851703 -1055559 -1250743 -1099204 -724677 -653324 -983064 -1103302 -601855 7128 12905
31768 12905 -393879 -469316 -157227 -135548 -604144 -912932 -661101 -350660 -500805 -813723
31758 -813723 -791132 -604829 -696721 -949994 -957734 -807203 -881808 -1076342 -930839 -477849
31748 -477849 -265242 -492695 -759723 -796106 -857124 -1173094 -1499913 -1509364 -1275842 -1102734
31738 -1102734 -1115233 -1237701 -1361879 -1363578 -1144328 -802826 -592042 -596090 -628713 -540430 -424632
31727 -424632 -422082 -529281 -709272 -978401 -1248376 -1287341 -1008755 -642154 -455302 -441050
31717 -441050 -431315 -387365 -398151 -481896 -567704 -631185 -700617 -750308 -716036 -622468 -597326 -723630
31705 -723630 -919242 -998752 -873196 -684626 -683872 -929812 -1182872 -1189908 -1003911 -879929 -904634
31694 -904634 -917122 -796561 -621841 -488399 -362329 -222562 -180433 -312961 -497563 -570283
31684 -570283 -567834 -646191 -798087 -831414 -663211 -483659 -523361 -740961 -884933 -861431 -873474
31673 -873474 -1086074 -1291843 -1140158 -670548 -330044 -354855 -419686 -137880 316545 431816
31663 431816 92287 -296975 -424223 -423627 -503565 -580981 -507177 -388881 -411314 -513587 -512524
31652 -512524 -438756 -476080 -618924 -661976 -547719 -480842 -620422 -849558 -955713 -893760
31642 -893760 -752815 -583425 -408549 -331245 -451869 -679608 -794651 -749936 -752953 -934442
31632 -934442 -1072106 -839383 -279473 187326 265190 95414 -15471 4688 12054 -69482
31622 -69482 -161883 -173191 -90081 24235 40740 -122815 -302844 -175600 272666 542924
31612 542924 184890 -558583 -1029579 -1028502 -985596 -1202642 -1394919 -1224075 -882045 -772667
31602 -772667 -883594 -899065 -785210 -812529 -1020800 -1103881 -937600 -844537 -1113905 -1528541
31592 -1528541 -1649710 -1422541 -1203544 -1222586 -1301941 -1198769 -1006581 -1014303 -1245966 -1370120
31582 -1370120 -1138484 -751431 -628149 -883767 -1223666 -1364075 -1350862 -1357782 -1352341 -1169766
31572 -1169766 -840203 -615190 -648073 -824429 -955065 -981985 -933586 -834779 -759790 -826843
31562 -826843 -1002672 -1041304 -803173 -544038 -647754 -1083749 -1384504 -1240683 -892327 -779544
31552 -779544 -982914 -1215614 -1261364 -1183334 -1121053 -1103886 -1117425 -1178636 -1253558 -1219902 -1013436
31541 -1013436 -748913 -617381 -693145 -880037 -1013658 -996621 -872978 -779828 -793404 -850202
31531 -850202 -878034 -943358 -1139005 -1358919 -1363720 -1103918 -810930 -701556 -743308 -787485 -776237
31520 -776237 -714558 -591198 -462220 -478967 -679165 -863904 -848694 -738297 -765718 -932274
31510 -932274 -1017811 -924211 -799768 -790632 -845971 -845929 -802452 -835634 -990488 -1143923 -1117571 -888290
31498 -888290 -650806 -605532 -713555 -781424 -772266 -844261 -1041530 -1177116 -1136192 -1063571 -1083224
31487 -1083224 -1066933 -907829 -792347 -901760 -1044698 -949537 -764876 -843484 -1121963 -1198474
31477 -1198474 -1026799 -1011729 -1288676 -1420564 -1078394 -598843 -506022 -778754 -972514 -872875
31467 -872875 -660329 -541918 -559048 -709245 -957671 -1131830 -1057667 -823201 -704941 -810850
31457 -810850 -973303 -1019084 -974787 -951538 -964757 -947690 -864424 -741472 -624922 -554885 -573199
31446 -573199 -717029 -967146 -1204828 -1291743 -1241860 -1228040 -1319901 -1319240 -1035597 -647658 -534792
31435 -534792 -755586 -978008 -982007 -925126 -981962 -1030662 -916467 -768059 -782177 -887489 -897988
31424 -897988 -839048 -836371 -822779 -664964 -471143 -440199 -479411 -332277 -66432 -53775 -402458
31413 -402458 -764020 -830704 -712078 -657420 -690688 -729787 -820087 -982921 -1005847 -688179 -229187
31402 -229187 -83770 -395192 -789008 -821434 -492755 -205550 -281496 -628691 -890060 -838746
31392 -838746 -565042 -304419 -185762 -200994 -326391 -537867 -727961 -761688 -668373 -660602
31382 -660602 -877166 -1185447 -1331022 -1230737 -1021732 -854980 -755249 -696885 -706379 -816330
31372 -816330 -971666 -1064589 -1056116 -1000329 -947225 -893192 -851172 -887408 -1017827 -1122461 -1054416
31361 -1054416 -814258 -537786 -333408 -219957 -202032 -290284 -434605 -535006 -531610 -410567
31351 -410567 -165862 115522 191760 -96585 -535769 -733084 -630911 -538178 -579616 -483731
31341 -483731 -122181 116328 -152257 -696461 -1011986 -1070802 -1227014 -1484805 -1438774 -1009260
31331 -1009260 -683018 -802434 -1070336 -1059508 -851631 -817152 -1016985 -1190268 -1183867 -1061440
31321 -1061440 -881811 -671680 -560346 -659056 -826117 -804930 -596228 -455814 -500525 -554858
31311 -554858 -466460 -364154 -457228 -700894 -824940 -674321 -399221 -260544 -313367 -382425
31301 -382425 -362076 -405124 -680885 -1036401 -1124211 -876492 -610404 -582338 -684555 -728358
31291 -728358 -774264 -940874 -1088809 -1001977 -765107 -648902 -690387 -705124 -675208 -773396 -977003
31280 -977003 -1019306 -825729 -660487 -684522 -686953 -477117 -263666 -351797 -657127 -836759
31270 -836759 -797328 -766593 -890356 -1031123 -1005299 -823125 -638009 -576037 -634030 -674492 -570239
31259 -570239 -426375 -531321 -945452 -1295490 -1214028 -855454 -663836 -706417 -629863 -309224
31249 -309224 -110957 -327315 -712126 -853339 -735920 -628277 -616858 -590673 -551890 -592578
31239 -592578 -629860 -504970 -328016 -384483 -662406 -808896 -658127 -484213 -556002 -717427
31229 -717427 -658271 -411721 -297710 -451325 -665796 -704514 -568140 -416647 -381790 -513638
31219 -513638 -793887 -1117111 -1318896 -1309636 -1180857 -1119169 -1180537 -1195408 -985088 -665889
31209 -665889 -588632 -881717 -1204382 -1151236 -805848 -624291 -789758 -999491 -970506 -827815
31199 -827815 -798773 -807105 -653552 -404386 -286879 -314312 -323331 -316270 -453021 -711040 -850482
31188 -850482 -765404 -623042 -594518 -658543 -724060 -747533 -679186 -487088 -281985 -228057 -293876
31177 -293876 -296444 -220460 -248192 -414064 -504652 -416882 -346587 -458563 -616131 -635551 -587928
31166 -587928 -622523 -679713 -626897 -529551 -537097 -619032 -656990 -689546 -815232 -947750 -932197
31155 -932197 -833377 -836047 -905884 -832554 -597984 -423176 -430150 -522162 -631271 -810884 -1013448
31144 -1013448 -1045778 -867095 -708523 -760538 -925556 -1009299 -984658 -925551 -834917 -700111
31134 -700111 -607450 -645656 -761923 -830514 -806701 -729421 -643296 -591542 -605929 -638286 -594342
31123 -594342 -496592 -497820 -654028 -812462 -835621 -814052 -909795 -1076235 -1100032 -892721 -603358
31112 -603358 -437508 -453750 -540907 -543361 -424105 -326856 -423755 -684274 -891248 -928387 -932093
31101 -932093 -1074545 -1305625 -1419740 -1299796 -999228 -663227 -461360 -506100 -728576 -909653
31091 -909653 -922788 -853736 -806762 -744153 -637980 -602567 -691139 -731122 -599315 -500463 -666881
31080 -666881 -911558 -872094 -651886 -754736 -1280391 -1641857 -1339095 -654475 -242405 -288497
31070 -288497 -460290 -521093 -551417 -588889 -481981 -225892 -105486 -301330 -585083 -625825
31060 -625825 -437159 -290808 -296509 -320984 -287901 -306427 -460890 -681199 -890337 -1094332
31050 -1094332 -1245222 -1212345 -1014183 -886175 -953021 -1023456 -919103 -802031 -877887 -961489
31040 -961489 -749144 -409287 -391778 -648488 -631223 -223605 -49173 -491023 -983730 -837608
31030 -837608 -318922 -213807 -596054 -809961 -597885 -443297 -665134 -909313 -836259 -692423
31020 -692423 -794206 -931120 -747091 -377352 -249396 -463253 -755036 -906309 -855887 -578904
31010 -578904 -193814 -40361 -308701 -701854 -787519 -579048 -437736 -494191 -538060 -456462
31000 -456462 -408678 -499713 -587659 -526825 -384130 -317484 -394018 -575475 -742023 -724495 -476586
30989 -476586 -217733 -227571 -483398 -677661 -619057 -441729 -378928 -497581 -715599 -934198
30979 -934198 -1072952 -1074200 -947401 -770153 -631977 -601202 -689352 -787470 -731005 -530166 -423239
30968 -423239 -551433 -699254 -568232 -220132 4584 -33852 -151149 -196970 -240794 -320575
30958 -320575 -282352 -36859 211150 178569 -137931 -460120 -546294 -422201 -307441 -353133
30948 -353133 -468188 -451262 -304361 -287470 -563691 -930463 -1077872 -1001673 -946820 -1033424
30938 -1033424 -1184296 -1346896 -1499296 -1479851 -1136666 -657381 -420008 -468672 -473494 -283311
30928 -283311 -148332 -252374 -396043 -368212 -303514 -394725 -526100 -500824 -411034 -458652 -585122
30917 -585122 -616669 -647556 -920982 -1379171 -1665540 -1594600 -1357086 -1231306 -1310945 -1534874
30907 -1534874 -1774053 -1856840 -1695692 -1428653 -1284597 -1294358 -1284155 -1150687 -970098 -823702
30897 -823702 -702559 -630794 -706011 -931905 -1145952 -1206334 -1155115 -1120375 -1142989 -1176441 -1180619
30886 -1180619 -1125055 -953041 -653347 -368398 -327592 -603320 -977190 -1142850 -1050922 -947446
30876 -947446 -1014221 -1100880 -962409 -662578 -505426 -582951 -666373 -619155 -629450 -854750 -1088440
30865 -1088440 -1050257 -840741 -793814 -954477 -1024926 -843716 -621135 -599365 -708265 -706082
30855 -706082 -522589 -318470 -264321 -361116 -469608 -487557 -501451 -710873 -1134727 -1471436
30845 -1471436 -1406982 -1029875 -738411 -705410 -669117 -389611 -98332 -224894 -749256 -1129185
30835 -1129185 -965047 -506700 -308186 -513053 -737670 -651228 -398610 -318722 -454752 -574897
30825 -574897 -578465 -615101 -780632 -921698 -843787 -574617 -322651 -257298 -390283 -596869
30815 -596869 -711588 -675045 -604202 -640038 -743318 -759940 -663838 -572481 -533878 -497862 -503482
30804 -503482 -648477 -822391 -748451 -409995 -165534 -267801 -511809 -559895 -387303 -177724
30794 -177724 3267 156926 155473 -99695 -437812 -600929 -559983 -422404 -192946 90560
30784 90560 167301 -129575 -491069 -473040 -146709 16814 -122312 -231489 -144673 -137944 -384405
30773 -384405 -591558 -480742 -279134 -378732 -730555 -936851 -833667 -656473 -641838 -727214
30763 -727214 -713841 -570291 -471026 -564761 -774037 -885939 -832111 -751193 -712792 -574135 -297840
30752 -297840 -209320 -598914 -1175993 -1336117 -976555 -614409 -611335 -738676 -698961 -619645
30742 -619645 -706920 -789245 -614730 -339267 -296042 -457526 -538370 -505316 -566766 -724034 -748246
30731 -748246 -599506 -485206 -476860 -441987 -402359 -560356 -855132 -899433 -571206 -301391
30721 -301391 -470378 -819079 -847985 -599882 -584005 -970309 -1332457 -1311750 -1123965 -1146225
30711 -1146225 -1305787 -1247741 -962379 -838070 -1061391 -1316855 -1234270 -882270 -618740 -621980
30701 -621980 -783835 -955659 -1073993 -1085860 -954421 -749638 -591408 -507136 -459981 -474071
30691 -474071 -592263 -757692 -892663 -1042681 -1267434 -1450152 -1428836 -1267183 -1149710 -1050425
30681 -1050425 -804552 -499129 -432351 -617143 -706339 -555286 -467902 -649937 -799285 -590275
30671 -590275 -261856 -295359 -694694 -1024813 -1063726 -983072 -911777 -752584 -497115 -345015
30661 -345015 -383675 -450489 -443001 -498370 -716601 -934320 -940515 -751173 -533685 -404307 -409847
30650 -409847 -555348 -735110 -783549 -705366 -701640 -849298 -925847 -717570 -359357 -178436
30640 -178436 -301930 -599960 -916113 -1141330 -1134528 -827879 -420903 -239860 -348128 -488228
30630 -488228 -470310 -410489 -470463 -562838 -513289 -385986 -407637 -606703 -763992 -756147 -731555
30619 -731555 -843150 -984881 -955326 -772124 -638544 -641963 -666670 -612826 -533064 -500237 -485700
30608 -485700 -456436 -477449 -602196 -735786 -734891 -615299 -543838 -621194 -771939 -874940 -924679
30597 -924679 -1026275 -1285646 -1733512 -2295593 -2786388 -2986918 -2817315 -2433336 -2086320 -1878510
30587 -1878510 -1718546 -1519889 -1330888 -1200260 -1029867 -718163 -398937 -335401 -541322 -706664
30577 -706664 -608678 -423137 -454538 -683957 -810765 -697431 -537440 -542471 -660292 -701049
30567 -701049 -615137 -535120 -600437 -815747 -1053711 -1160130 -1082064 -910572 -784429 -769440
30557 -769440 -849677 -978551 -1085673 -1099778 -1038855 -1009377 -1040971 -1021897 -903609 -840935 -966031
30546 -966031 -1145110 -1168627 -1074308 -1031286 -1000594 -817875 -555467 -451008 -483714 -403839 -224820
30535 -224820 -262711 -562673 -724848 -524585 -297622 -404903 -675396 -750174 -678408 -743544
30525 -743544 -913205 -916473 -748933 -666131 -723672 -719811 -586569 -479667 -471265 -486338 -554982
30514 -554982 -789830 -1077168 -1132139 -939770 -816541 -918048 -993876 -803046 -514454 -474004
30504 -474004 -734652 -1022395 -1088305 -945923 -802081 -843218 -1060078 -1246034 -1207197 -973351
30494 -973351 -748055 -679292 -746481 -819571 -751861 -504264 -275440 -368250 -772498 -1053011
30484 -1053011 -889711 -559567 -556589 -865358 -1022604 -847561 -645137 -628485 -611867 -438088
30474 -438088 -280483 -290984 -327039 -289918 -377920 -690802 -907294 -733043 -413608 -390519
30464 -390519 -633652 -751796 -657760 -669790 -951019 -1258187 -1332342 -1215421 -1076666 -988782
30454 -988782 -973889 -1041054 -1085939 -962559 -737274 -659138 -786228 -865240 -712036 -493831
30444 -493831 -451724 -531276 -526041 -459265 -538817 -762829 -853665 -656013 -370003 -259660 -316070
30433 -316070 -390243 -512958 -818829 -1190788 -1273497 -938819 -506695 -342235 -412724 -442254
30423 -442254 -351703 -279153 -248357 -127655 65659 112740 -72240 -307051 -446411 -578390
30413 -578390 -777323 -902527 -839938 -737129 -764035 -814457 -716791 -602528 -739239 -1053144
30403 -1053144 -1159225 -906448 -587686 -505662 -598158 -654409 -684034 -841791 -1096183 -1206288
30393 -1206288 -1031487 -702371 -440249 -317352 -268683 -273487 -399111 -623641 -722870 -485600
30383 -485600 -36180 233863 134951 -92190 -162574 -179178 -409411 -737754 -722381 -265045
30373 -265045 141380 46345 -360206 -578085 -525514 -562363 -853553 -1115303 -1093255 -954152
30363 -954152 -993924 -1188102 -1281000 -1180971 -1013054 -859878 -716606 -681457 -903062 -1265082
30353 -1265082 -1386248 -1094297 -703566 -619859 -809480 -896415 -708403 -460578 -384971 -429620
30343 -429620 -421950 -335856 -253754 -190338 -107952 -41588 -69922 -180590 -266783 -259001 -198495 -188975
30331 -188975 -313336 -563133 -808932 -892524 -805847 -721897 -776100 -878805 -844914 -657639
30321 -657639 -471423 -375346 -310927 -250413 -288711 -462569 -612481 -571977 -422274 -400134 -576737
30310 -576737 -785312 -874050 -859739 -780942 -591708 -336648 -265197 -550197 -975297 -1146433
30300 -1146433 -991749 -792946 -702837 -547716 -237120 -46749 -223201 -544257 -622597 -508728
30290 -508728 -594340 -944504 -1144842 -923133 -559114 -466079 -634831 -747748 -666823 -540454
30280 -540454 -510301 -552707 -603233 -662417 -747065 -827740 -828345 -669043 -371623 -137078 -184930
30269 -184930 -447042 -574376 -370426 -74282 -46108 -288753 -487696 -460043 -342880 -334231
30259 -334231 -440807 -540476 -570205 -582975 -658189 -769897 -753178 -487569 -135763 -40417 -285980
30248 -285980 -546245 -540409 -453408 -635784 -1029718 -1246929 -1171849 -1103958 -1242595 -1401939
30238 -1401939 -1387514 -1323398 -1374450 -1403248 -1184670 -797855 -529020 -478740 -511342 -527700 -545834
30227 -545834 -539596 -438566 -317666 -380035 -679397 -1012124 -1165821 -1159375 -1148465 -1177477 -1136096
30216 -1136096 -951310 -737378 -694259 -855140 -999921 -901978 -638862 -527106 -708642 -950794
30206 -950794 -966274 -794928 -689761 -715331 -693079 -539962 -424025 -503502 -698837 -838673
30196 -838673 -883907 -870154 -748659 -463015 -135374 -1574 -136981 -363422 -463205 -402718
30186 -402718 -311455 -312669 -429777 -625884 -874248 -1154967 -1377873 -1361380 -992850 -446308
30176 -446308 -123235 -248653 -581449 -676966 -420588 -125258 -71768 -163700 -164133 -86300 -121585
30165 -121585 -272083 -322399 -196847 -103276 -221952 -439839 -537526 -503925 -494839 -560555 -598218
30154 -598218 -558940 -542864 -658424 -892843 -1141562 -1280840 -1217216 -973237 -728111 -653423
30144 -653423 -693791 -646728 -488725 -447772 -661204 -937049 -1018578 -947889 -946796 -1018383 -938244
30133 -938244 -658458 -448160 -511013 -675968 -651108 -444530 -319430 -392366 -490216 -426811
30123 -426811 -254691 -176406 -301881 -541991 -680754 -544869 -183339 117183 96524 -186578
30113 -186578 -439599 -525165 -596563 -775346 -901755 -803273 -663301 -824002 -1235889 -1423376
30103 -1423376 -1131544 -741953 -787984 -1204038 -1384270 -1003899 -476683 -432694 -940008 -1473180
30093 -1473180 -1566771 -1259899 -886105 -652924 -540174 -463072 -384153 -316565 -315017 -419153
30083 -419153 -543647 -514716 -313668 -181200 -327978 -620670 -745898 -638969 -524892 -540088
30073 -540088 -576534 -564962 -632933 -824291 -908389 -703234 -411969 -370650 -574507 -732442
30063 -732442 -723788 -702732 -756928 -769316 -687025 -646506 -704653 -690598 -503743 -363000 -529237
30052 -529237 -887867 -1041589 -798679 -382741 -137143 -169648 -340067 -484363 -554849 -572597
30042 -572597 -533282 -416797 -276103 -240200 -369184 -553159 -647274 -682772 -818122 -1062577
30032 -1062577 -1191853 -1022654 -665066 -392035 -325909 -371493 -420359 -487272 -618359 -761635
30022 -761635 -798295 -681381 -497626 -374908 -344292 -329771 -282001 -257375 -302975 -325502 -199682
30011 -199682 3024 43498 -171900 -436386 -502241 -409131 -431217 -725800 -1138380 -1370986
30001 -1370986 -1288932 -1043203 -900743 -952329 -1014331 -869980 -576011 -418410 -549811 -802256
29991 -802256 -924641 -886506 -847275 -920548 -1087852 -1275974 -1393928 -1342393 -1115651 -865343
29981 -865343 -740210 -690117 -568139 -410444 -433108 -694906 -934039 -874176 -591484 -414549
29971 -414549 -487858 -598297 -482560 -179684 24527 -57422 -329997 -550926 -554002 -345673
29961 -345673 -91529 -25988 -259466 -624710 -816036 -733147 -574395 -534031 -563695 -541230
29951 -541230 -496993 -486527 -394933 -121678 141328 102269 -206414 -480505 -586018 -630918
29941 -630918 -610354 -371832 -14300 88547 -150644 -322074 -119835 186150 190322 -40243
29931 -40243 -178929 -221772 -413526 -726854 -871967 -798797 -772138 -907405 -1005556 -933254 -832203
29920 -832203 -828441 -822362 -715916 -608309 -604194 -620860 -553736 -487018 -570984 -777216 -920581
29909 -920581 -893224 -786695 -783175 -945729 -1111627 -1045194 -746748 -515447 -590304 -828980
29899 -828980 -915481 -796226 -676370 -636693 -545198 -379070 -338993 -528348 -761522 -838038
29889 -838038 -806562 -793758 -744888 -534966 -234760 -72857 -164607 -410369 -638279 -746288
29879 -746288 -724666 -630469 -554093 -574348 -730461 -1001655 -1262642 -1302903 -1006581 -527646
29869 -527646 -184221 -141727 -267698 -316165 -192158 -26354 -36083 -296712 -621783 -740997
29859 -740997 -636944 -568075 -670970 -743369 -612589 -501256 -707972 -1074965 -1166828 -912117
29849 -912117 -643060 -503883 -290961 30499 142329 -86677 -321551 -307171 -302121 -619645
29839 -619645 -1064626 -1228086 -1098495 -967927 -908955 -767582 -568241 -504404 -549789 -456235
29829 -456235 -172661 48314 17103 -176875 -364565 -484942 -522537 -459178 -352697 -315161
29819 -315161 -369720 -439412 -480150 -521037 -593319 -708690 -856494 -951172 -896064 -788453 -882346
29808 -882346 -1196317 -1369462 -1136251 -735951 -549160 -520402 -332531 -27916 7860 -317429
29798 -317429 -625132 -619812 -450051 -396527 -523086 -757937 -1018721 -1134516 -941709 -595567
29788 -595567 -501131 -786950 -1124697 -1220968 -1188710 -1232441 -1256586 -1058120 -706047 -469073
29778 -469073 -496398 -750157 -1094668 -1296545 -1145505 -765661 -590513 -814413 -1093719 -1035865
29768 -1035865 -741581 -552500 -492635 -356712 -192827 -245109 -466479 -529602 -359542 -256840
29758 -256840 -403132 -604787 -652296 -607154 -574732 -489350 -322970 -261008 -444820 -712940
29748 -712940 -802441 -672792 -460792 -261614 -141028 -223199 -535869 -848125 -888109 -695522
$$ [...]
##END NTUPLES=NMR SPECTRUM
##END=
