##TITLE=31Pdec_LR-742-RM2
 , 24 sc
 8.11.2021
##JCAMPDX= 6.0         $$ Bruker NMR JCAMP-DX V2.0
##DATA TYPE= NMR SPECTRUM
##DATA CLASS= NTUPLES
##ORIGIN= UXNMR, Bruker Analytische Messtechnik GmbH
##OWNER= root
$$ XWIN-NMR		Version 3.5
$$ Mon Nov  8 11:30:51 2021 Russian Standard Time (UT+4h)  she@DPX200
##.OBSERVE FREQUENCY= 81.013821
##.OBSERVE NUCLEUS= ^31P
##.ACQUISITION MODE= SIMULTANEOUS
##.ACQUISITION SCHEME= undefined
##.AVERAGES= 24
##.DIGITISER RES= 16
##SPECTROMETER/DATA SYSTEM= spect
##.PULSE SEQUENCE= zgpg30
##.SOLVENT NAME= CDCl3
##.SHIFT REFERENCE= (INTERNAL, CDCl3, 0, 248.564)
##AUDIT TRAIL= $$ (NUMBER, WHEN, WHO, WHERE, WHAT)
$$ ##TITLE= Audit trail, XWIN-NMR		Version 3.5
$$ ##JCAMPDX= 5.01
$$ ##ORIGIN= Bruker BioSpin GmbH
$$ ##OWNER= she
$$ F:/spectra/data/she/nmr/P31/1/pdata/1/auditp.txt
$$ ##AUDIT TRAIL=  $$ (NUMBER, WHEN, WHO, WHERE, WHAT)
(   1,<2021-11-08 11:28:45.90 +0400>,<she>,<DPX200>,
      <created by zg, POWCHK disabled, PULCHK disabled
       configuration hash MD5:
       00 E9 B6 7A A2 85 ED C7 34 08 36 98 17 FE 4E 26
       data hash MD5: 32K
       98 A1 52 0B A6 6E 6B 95 B2 BA C4 2F 14 95 67 A0>)
(   2,<2021-11-08 11:28:56.06 +0400>,<she>,<DPX200>,
      <Start of raw data processing
       efp BC_mod = 2 LB = 1 FT_mod = 6 PKNL = 1 PHC0 = -8861.352 PHC1 = 147.8694 SI = 64K 
       data hash MD5: 64K
       55 E0 A4 20 F0 5E A6 7B 3C 22 FB 22 B2 6B 6D 4F>)
(   3,<2021-11-08 11:29:15.07 +0400>,<she>,<DPX200>,
      <pk PHC0 = 8.802839 PHC1 = -18.4 
       data hash MD5: 64K
       FF 1F BB EE 42 00 F3 3B 99 70 D9 D0 0A 4D B6 60>)
$$ ##END=
$$ 
$$ hash MD5
$$ 80 8D 18 1D A8 DD 4B 12 40 D7 03 31 B6 A1 5B 75
##$RELAX= 
##$RELAX= 
##$RELAX= 
##$RELAX= 
##$RELAX= 
##$RELAX= 
##$RELAX= 
##$RELAX= 
$$ Bruker specific parameters
$$ --------------------------
##$DU= <F:/spectra>
##$EXPNO= 1
##$NAME= <P31>
##$PROCNO= 1
##$TYPE= <nmr>
##$USER= <she>
##$AMP= (0..31)
100 100 100 100 100 100 100 100 100 100 100 100 100 100 100 100 100 100 
100 100 100 100 100 100 100 100 100 100 100 100 100 100 
##$AQSEQ= 0
##$AQ_mod= 1
##$AUNM= <au_zg>
##$AUTOPOS= <>
##$BF1= 81.014009
##$BF2= 200.13
##$BF3= 200.13
##$BF4= 200.13
##$BF5= 200.13
##$BF6= 200.13
##$BF7= 200.13
##$BF8= 200.13
##$BYTORDA= 1
##$CFDGTYP= 0
##$CFRGTYP= 5
##$CHEMSTR= <none>
##$CNST= (0..31)
1 1 145 1 1 1 1 1 1 1 1 1 1 1 1 1 1 1 1 1 1 1 1 1 1 1 1 1 1 1 1 1 
##$CPDPRG= <waltz16>
##$CPDPRG1= <>
##$CPDPRG2= <waltz16>
##$CPDPRG3= <>
##$CPDPRG4= <mlev>
##$CPDPRG5= <mlev>
##$CPDPRG6= <mlev>
##$CPDPRG7= <mlev>
##$CPDPRG8= <mlev>
##$CPDPRGB= <>
##$CPDPRGT= <>
##$D= (0..31)
0 1 0 0 0 0 0 0 0 0 0 0.03 2e-05 3e-06 0 0 0 0 0 0 0 0 0 0 0 0 0 0 0 0 
0 0 
##$DATE= 1636356525
##$DBL= (0..7)
120 120 120 11 120 120 24 19 
##$DBP= (0..7)
150 150 150 150 150 150 150 150 
##$DBP07= 0
##$DBPNAM0= <>
##$DBPNAM1= <>
##$DBPNAM2= <>
##$DBPNAM3= <>
##$DBPNAM4= <>
##$DBPNAM5= <>
##$DBPNAM6= <>
##$DBPNAM7= <>
##$DBPOAL= (0..7)
0.5 0.5 0.5 0.5 0.5 0.5 0.5 0.5 
##$DBPOFFS= (0..7)
0 0 0 0 0 0 0 0 
$$ [...]
##$SUBNAM2= <"">
##$SUBNAM3= <"">
##$SUBNAM4= <"">
##$SUBNAM5= <"">
##$SUBNAM6= <"">
##$SUBNAM7= <"">
##$SUBNAM8= <"">
##$SUBNAM9= <"">
##$SW= 501.771253377433
##$SWIBOX= (0..15)
0 1 3 0 0 0 0 0 0 0 0 0 0 0 0 0 
##$SW_h= 40650.406504065
##$TD= 32768
##$TD0= 1
##$TE= 0
##$TE2= 300
##$TE3= 300
##$TEG= 300
##$TL= (0..7)
0 120 53 12 22 120 120 120 
##$TP= (0..7)
150 150 150 150 150 150 150 150 
##$TP07= 0
##$TPNAME0= <>
##$TPNAME1= <>
##$TPNAME2= <>
##$TPNAME3= <>
##$TPNAME4= <>
##$TPNAME5= <>
##$TPNAME6= <>
##$TPNAME7= <>
##$TPOAL= (0..7)
0.5 0.5 0.5 0.5 0.5 0.5 0.5 0.5 
##$TPOFFS= (0..7)
0 0 0 0 0 0 0 0 
##$TUNHIN= 0
##$TUNHOUT= 0
##$TUNXOUT= 0
##$USERA1= <user>
##$USERA2= <user>
##$USERA3= <user>
##$USERA4= <user>
##$USERA5= <user>
##$V9= 5
##$VALIST= <valist>
##$VCLIST= <CCCCCCCCCCCCCCC>
##$VD= 0
##$VDLIST= <DDDDDDDDDDDDDDD>
##$VPLIST= <PPPPPPPPPPPPPPP>
##$VTLIST= <TTTTTTTTTTTTTTT>
##$WBST= 1024
##$WBSW= 4
##$XGAIN= (0..3)
0 0 0 0 
##$XL= 0
##$YL= 0
##$YMAX_a= 14120
##$YMIN_a= -16687
##$ZGOPTNS= <>
##$ZL1= 120
##$ZL2= 120
##$ZL3= 120
##$ZL4= 120
##$ABSF1= 0
##$ABSF2= 0
##$ABSG= 0
##$ABSL= 0
##$ALPHA= 0
##$AQORDER= 0
##$ASSFAC= 0
##$ASSFACI= 0
##$ASSFACX= 0
##$ASSWID= 0
##$AUNMP= <proc_1d>
##$AZFE= 0.1
##$AZFW= 0.5
##$BCFW= 0
##$BC_mod= 2
##$BYTORDP= 0
##$COROFFS= 0
##$CY= -3
##$DATMOD= 1
##$DC= 0
##$DFILT= <>
##$DTYPP= 0
##$F1P= 0
##$F2P= 0
##$FCOR= 1
##$FTSIZE= 65536
##$FT_mod= 6
##$GAMMA= 0
##$GB= 0
##$INTBC= 1
##$INTSCL= 5.30512e-09
##$ISEN= 30
##$LB= 1
##$LEV0= 0
##$LPBIN= 0
##$MAXI= 10000
##$MC2= 0
##$MEAN= 0
##$ME_mod= 0
##$MI= 50
##$NCOEF= 0
##$NC_proc= -4
##$NLEV= 6
##$NOISF1= 182.463
##$NOISF2= 159.3651
##$NSP= 0
##$NTH_PI= 0
##$NZP= 0
##$OFFSET= 248.5645
##$PC= 4
##$PHC0= -8852.549
##$PHC1= 129.4694
##$PH_mod= 1
##$PKNL= yes
##$PPARMOD= 0
##$PSCAL= 0
##$PSIGN= 0
##$REVERSE= no
##$SF= 81.014009
##$SI= 65536
##$SIGF1= 159.3651
##$SIGF2= -187.1042
##$SINO= 113.3802
##$SIOLD= 16384
##$SREGLST= <1H.CDCl3>
##$SSB= 0
##$STSI= 65536
##$STSR= 0
##$SW_p= 40650.406504065
##$SYMM= 0
##$S_DEV= 0
##$TDeff= 32768
##$TDoff= 0
##$TI= <>
##$TILT= no
##$TM1= 0
##$TM2= 0
##$TOPLEV= 0
##$USERP1= <user>
##$USERP2= <user>
##$USERP3= <user>
##$USERP4= <user>
##$USERP5= <user>
##$WDW= 1
##$XDIM= 65536
##$YMAX_p= 330098283
##$YMIN_p= -32736312
$$ End of Bruker specific parameters
$$ ---------------------------------
##NTUPLES= NMR SPECTRUM
##VAR_NAME=  FREQUENCY,     SPECTRUM/REAL,   SPECTRUM/IMAG
##SYMBOL=    X,             R,               I
##VAR_TYPE=  INDEPENDENT,   DEPENDENT,       DEPENDENT
##VAR_FORM=  AFFN,          ASDF,            ASDF
##VAR_DIM=   65536,         65536,           65536
##UNITS=     HZ,            ARBITRARY UNITS, ARBITRARY UNITS
##FACTOR=    0.620285442955139, 1,           1
##FIRST=     20137.2065510759, 0,            0
##LAST=      -20513.1999529892, 0,           0
##MIN=       -20513.1999529892, -32736312,   0
##MAX=       20137.2065510759, 330098283,    0
$$ Real data points
##PAGE= N=1
##DATA TABLE= (X++(R..R)), XYDATA
$$ [...]
40009 -333701 -393352 -478554 -465718 -365806 -356338 -481882 -522615 -314212 -20692 108808 104182
39998 104182 160100 270131 240229 18632 -238043 -418301 -555969 -679844 -768571 -863526
39988 -863526 -1046808 -1311002 -1613913 -2017865 -2573787 -3105997 -3334968 -3197135 -2844697 -2395720
39978 -2395720 -1931501 -1645649 -1647322 -1658718 -1315175 -786072 -638087 -973404 -1200363 -893022
39968 -893022 -397280 -228327 -294722 -195566 35382 43951 -160879 -210634 -27380 66933 -45839
39957 -45839 -62187 200013 467429 447203 255262 148764 100953 -68327 -325737 -478066
39947 -478066 -480836 -432059 -332242 -106559 161324 266857 187042 129098 209166 276794 175217
39936 175217 13878 5107 119701 116070 -83707 -252278 -189705 -39802 -97663 -371968 -547720
39925 -547720 -412414 -129240 16458 -4197 6088 145300 292725 303015 170259 -21080
39915 -21080 -182015 -221753 -84031 154786 307292 259400 81697 -74285 -120546 -46716
39905 -46716 106512 218993 130368 -186463 -539914 -698901 -624683 -462807 -373201 -449814
39895 -449814 -708787 -1007630 -1052199 -687208 -163729 94245 7556 -104246 -36300 19688
39885 19688 -136348 -324299 -268003 -73818 -70384 -259906 -311652 -114258 51198 2663 -41733
39874 -41733 129557 315904 211447 -79269 -175936 12598 190209 143401 7270 -15953
39864 -15953 50948 89566 120116 226382 349403 342447 215239 166844 320260 519395 483825
39853 483825 145950 -254445 -444265 -410014 -338835 -323549 -263702 -76390 131875 182084
39843 182084 24705 -245311 -495780 -611298 -531068 -327670 -178162 -163779 -163366 -33505
39833 -33505 186694 359248 452283 521919 550093 459653 275564 137779 156233 345855 655298
39822 655298 938352 964608 639484 196593 -8439 92296 238506 218958 102881 49658
39812 49658 74573 101818 111575 124705 128454 98714 32103 -79256 -216823 -264263 -102806
39801 -102806 176082 307856 195101 66279 167405 415950 521463 369560 108046 -111911
39791 -111911 -288020 -432269 -460887 -320329 -116002 2706 29507 54746 63178 -70793
39781 -70793 -348860 -559565 -534285 -384858 -336997 -402882 -407762 -306142 -245367 -290024 -319005
39770 -319005 -272941 -267869 -343350 -335561 -167823 -34531 -83148 -139780 -15538 131628 72477
39759 72477 -44496 73524 303308 248120 -78492 -201615 87737 414116 408079 202798
39749 202798 89875 37359 -121882 -275597 -164680 187932 472774 467782 213863 -123665
39739 -123665 -394274 -507722 -479555 -412126 -378174 -390478 -483653 -664637 -765703 -573668
39729 -573668 -173976 80340 42338 -56868 -40133 -70082 -283223 -453100 -339965 -131700
39719 -131700 -164360 -371419 -402470 -195576 -40790 -94841 -194489 -189172 -144109 -140553 -132810
39708 -132810 -83059 -32379 15704 92835 116742 -50851 -347989 -506980 -373319 -73107
39698 -73107 188163 334829 368435 261037 8977 -278294 -422555 -316108 -42860 132583
39688 132583 917 -309003 -427053 -223505 -3804 -44094 -153436 -4619 272487 251624
39678 251624 -79055 -228362 66406 428647 379405 -29055 -377906 -450577 -351181 -195989
39668 -195989 16702 249317 368858 308647 171113 117252 197299 316287 361201 343168
39658 343168 358792 392924 276258 -53472 -363042 -382943 -186519 -87966 -191144 -290379
39648 -290379 -237789 -140236 -111710 -86179 -8883 5975 -128116 -286377 -308375 -224855 -168473
39637 -168473 -179650 -224098 -273602 -248148 -24047 350961 584456 451943 84942 -207076
39627 -207076 -304967 -313413 -325300 -338499 -353160 -379288 -369883 -281904 -178202 -155138 -204932 -251327
39615 -251327 -271175 -282306 -275900 -262898 -309523 -416699 -455610 -349144 -217145 -196430 -229021
39604 -229021 -210021 -231580 -441488 -732244 -842894 -754869 -712024 -817192 -882539 -761147
39594 -761147 -571431 -468567 -418687 -351313 -334242 -412446 -437955 -269795 -28118 61479 -4904
39583 -4904 -51137 -33559 -75319 -183533 -169436 56984 283902 222510 -144864 -544205 -699197
39572 -699197 -574902 -360801 -261513 -298322 -309722 -164491 57329 161756 96351 6962
39562 6962 30562 141887 237781 257314 165306 -57335 -321559 -450331 -402539 -360350 -459602
39551 -459602 -561757 -483386 -333997 -359088 -504673 -459663 -170186 17586 -138977 -426254
39541 -426254 -517860 -411453 -281059 -129190 98453 224965 44556 -260654 -284944 16939
39531 16939 276697 296438 300230 455305 517595 230389 -201483 -380237 -298007 -291746 -468737
39520 -468737 -532938 -257453 154043 334110 203261 -14195 -125863 -146947 -157837 -141894
39510 -141894 -36281 127080 219465 156051 -13048 -167059 -230276 -205239 -135334 -72103 -46637
39499 -46637 -34220 22952 127153 207311 225750 228051 227037 139500 -50168 -167338 -59468
39488 -59468 140292 170810 29261 -39863 51434 114348 42266 11330 162100 315462 222682
39477 222682 -61581 -269516 -266491 -117736 72522 188748 85313 -231884 -486647 -427445
39467 -427445 -181947 -84882 -205990 -307995 -248525 -136789 -60245 54919 217321 264090
39457 264090 120496 -42247 -56778 10044 26322 24871 83668 117630 4508 -161255 -159892
39446 -159892 21609 142296 37158 -147739 -136922 118145 348645 259177 -118790 -435090
39436 -435090 -426816 -229361 -156743 -249382 -272409 -168233 -201508 -494401 -696732 -411333 213634
39425 213634 637867 594137 279977 -69272 -417398 -672494 -590118 -151668 245966 249341
39415 249341 1177 -139455 -162152 -345815 -697733 -829644 -495316 26106 251643 32782
39405 32782 -377656 -670060 -725383 -588919 -370266 -195714 -164755 -296261 -512713 -674225
39395 -674225 -658193 -468815 -262367 -186714 -201084 -161797 -83217 -140576 -349643 -447519 -259289
39384 -259289 -15615 -56292 -313038 -391754 -174869 -20111 -234131 -623184 -785036 -656911
39374 -656911 -508368 -491895 -484852 -371483 -218639 -98698 46989 245048 350244 223258
39364 223258 -42350 -215883 -202279 -91097 28743 157080 275158 285626 125067 -136717
39354 -136717 -363381 -470553 -448990 -335402 -211262 -175442 -249375 -338030 -347709 -321106 -382311
39343 -382311 -543074 -634889 -480078 -107558 245056 360686 255187 123434 75429 15181
39333 15181 -138408 -211593 28816 432738 501632 41266 -456051 -384453 152139 459568
39323 459568 176695 -324408 -560753 -546295 -529480 -482906 -248842 17147 -7608 -279552
39313 -279552 -406330 -228825 -25230 -48546 -193600 -270463 -315807 -427085 -512269 -438367
39303 -438367 -281897 -215982 -254702 -305217 -377414 -529673 -665507 -607633 -379954 -225874
39293 -225874 -297174 -459822 -463543 -210778 183782 519113 641472 508853 194887 -149806
39283 -149806 -361135 -352120 -209036 -158958 -319455 -482276 -314401 167845 523081 429624
39273 429624 127504 84010 333644 450340 174623 -230211 -358989 -175553 23175 13534
39263 13534 -159747 -327661 -376287 -284495 -101548 65680 93489 -69145 -318613 -422396
39253 -422396 -210697 200969 456737 333260 15231 -132304 -23261 95750 46746 -43833
39243 -43833 10092 172489 287300 313297 299265 237036 105173 -22086 -72758 -119391 -259944
39232 -259944 -414480 -423623 -316686 -284104 -378404 -438596 -353044 -216998 -160433 -175360 -193038
39221 -193038 -195971 -176381 -117577 -92281 -225623 -455358 -492807 -184028 217586 326269 83487
39210 83487 -242481 -431975 -466459 -361530 -122737 98402 71991 -172662 -296759 -96168
39200 -96168 181332 159179 -149377 -369310 -262131 20137 192203 153019 -18148 -222044
39190 -222044 -381069 -418991 -327867 -216321 -179319 -137720 66343 387974 534544 316551
39180 316551 -49389 -165466 34156 199860 64062 -193519 -252424 -145998 -171728 -382186
39170 -382186 -488016 -312526 -40723 110061 197853 343321 436407 310253 63262 -57505
39160 -57505 -16187 11326 -57295 -143985 -217730 -327054 -427705 -417246 -362723 -449771 -647251
39149 -647251 -661409 -327241 155500 487212 583412 508154 286634 -43379 -330839 -440391
39139 -440391 -400389 -293754 -108017 161888 370754 364471 203817 84380 81766 124607 156320
39128 156320 150112 25472 -230247 -380301 -141745 366791 637000 384432 -49679 -120825
39118 -120825 228765 555377 533338 303683 146482 76389 -51832 -214034 -242121 -113490
39108 -113490 27437 139233 333813 588323 644624 360763 -2308 -48321 279433 659788
39098 659788 767516 530151 80709 -362245 -595512 -577555 -463788 -380940 -245176 38641
39088 38641 312394 339490 160566 -5477 -144199 -381072 -567906 -375265 112695 355414
39078 355414 118348 -150569 -11749 290218 255013 -70897 -214082 -29208 170486 193781
39068 193781 210634 348989 446933 335003 85341 -125955 -190129 -51419 258119 534224
39058 534224 567250 415045 299403 253376 138532 -4127 42328 259347 326557 91030
39048 91030 -200451 -281095 -188030 -49395 156946 423160 554457 438434 263856 238736
39038 238736 284367 237824 152080 130916 63260 -165573 -358478 -255622 2117 34324 -184308
39027 -184308 -270228 -25353 267205 277723 76524 -42290 8221 55168 -44006 -216769
39017 -216769 -274145 -135734 43624 7453 -285177 -555855 -549736 -395098 -408797 -594070
39007 -594070 -623615 -371697 -150288 -243845 -466028 -441752 -181994 -86035 -390943 -853923
38997 -853923 -1042173 -800725 -367125 -86660 -60668 -83458 56370 266835 283925 111698
38987 111698 97096 426769 771349 693855 277784 26170 171769 429247 494007 452195
38977 452195 525650 680217 727171 637033 506226 330818 65122 -162920 -153790 47003
38967 47003 164021 65941 -71168 -43227 105723 181510 89929 -111640 -325407 -478266
38957 -478266 -526770 -479415 -399579 -349688 -348787 -384447 -418356 -380533 -224476 -5712 144980
38946 144980 135431 -32747 -284391 -481204 -471121 -241204 19198 134116 167238 267656
38936 267656 352215 194200 -165378 -388560 -315691 -186156 -227886 -297497 -159495 96818
38926 96818 194673 71031 -128312 -325148 -497880 -501831 -216969 169467 330019 235102
38916 235102 140368 146630 86859 -104643 -226171 -127787 54029 106185 -12992 -224148 -426949
38905 -426949 -476300 -275065 26775 145625 54646 15376 136941 204768 92313 14074
38895 14074 132342 216281 6277 -331233 -472950 -464811 -575719 -762592 -728997 -470113
38885 -470113 -299717 -294851 -170429 166011 378048 245892 52716 107442 208218 -10542
38875 -10542 -416104 -533091 -283111 -94515 -219224 -383265 -290905 -89854 -54819 -106567
38865 -106567 -2570 188801 207888 106422 197943 479800 539799 192008 -185660 -200008
38855 -200008 -245 34508 -102424 -146318 -73681 -68621 -80578 95305 298255 85161 -528259
38844 -528259 -902977 -617633 -61129 151517 7671 -71547 33064 63543 -62952 -114260
38834 -114260 7863 91495 6792 -57092 79945 267881 235749 -15445 -205637 -109968
38824 -109968 205056 454275 399191 73936 -242201 -311051 -165824 -8090 49286 31684
38814 31684 -25593 -96033 -97781 9726 83494 -56402 -332045 -465335 -366974 -250279 -277482
38803 -277482 -316048 -194270 -9711 24030 -79140 -114656 -26634 9633 -118364 -262744
38793 -262744 -209751 36711 282508 398345 412311 344937 115818 -262964 -510925 -320472
38783 -320472 201358 550199 404780 16959 -148981 -18126 92686 -13775 -194272 -274760
38773 -274760 -303821 -386907 -474175 -453799 -320284 -131487 87548 290717 366296 256550
38763 256550 43515 -165495 -346094 -477679 -481000 -351434 -247163 -300763 -414773 -386846
38753 -386846 -185230 44562 211651 362875 530001 636400 603561 459476 298384 194733
38743 194733 180203 238240 283819 203925 -23119 -261199 -316445 -127818 153447 303608
38733 303608 255215 153557 158109 232791 201564 -9298 -270197 -396700 -323349 -117803 98611
38722 98611 218679 206890 119108 21640 -93731 -239068 -314414 -207433 -12492 24351 -160877
38711 -160877 -338258 -300783 -135274 -48943 -69957 -89019 -92111 -158101 -273632 -326859 -272933
38700 -272933 -169282 -68517 -3237 -40037 -200243 -348714 -321911 -174878 -147785 -347932
38690 -347932 -586427 -580056 -242034 234119 505801 332912 -174025 -571024 -490342 -47346
38680 -47346 292235 252462 -3676 -178697 -192047 -142021 -102079 -103402 -199084 -387593 -539379
38669 -539379 -537521 -449876 -441294 -544557 -633993 -617395 -545916 -508801 -493598 -399221 -176776
38658 -176776 67264 148208 21264 -123100 -79450 80872 87779 -135762 -349224 -358914 -310354
38647 -310354 -427922 -616397 -589049 -330203 -137291 -166591 -205581 -4525 386923 755968
38637 755968 1009761 1145952 1099698 848817 587350 557675 722454 807418 681248 496017
38627 496017 411832 382566 306589 218475 201091 233089 260599 323425 469754 621404 666331
38616 666331 624454 580447 518270 393454 313969 429319 641258 665852 447836 278182
38606 278182 373529 554318 533498 358257 316834 488151 638645 565647 325893 85437
38596 85437 -70876 -117121 -33607 133459 269322 322081 347875 376317 343202 227647 143305
38585 143305 189890 295597 314640 222143 108892 33918 -4740 14573 129344 298719 420511
38574 420511 461361 487389 543946 581627 539203 447662 414245 524726 763729 998097 1055004
38563 1055004 883068 639857 546691 639571 741484 707441 598761 549526 558727 535170 491461
38552 491461 538609 679021 755737 678270 580732 636969 782590 769607 516954 277763 356546
38541 356546 706946 938488 773917 402916 250171 421041 574435 440193 259242 458877
38531 458877 991851 1346180 1269121 1126825 1339110 1755492 1917773 1752407 1618795 1741171
38521 1741171 1974099 2151237 2313901 2515602 2717953 2992513 3539988 4382482 5292907
38512 5292907 6138151 7032182 8078513 9298198 10907717 13264652 16436091 20377085
38504 20377085 25690627 33242471 42165201 48929430 49790089 44374204 36008197 28377996
38496 28377996 22715832 18358853 14770799 12066712 10228634 8888322 7823713 7023974
38488 7023974 6338086 5574809 4852545 4375775 3975824 3352290 2661197 2332715 2340918 2202913
38478 2202913 1761071 1433875 1527005 1757428 1698687 1343782 980497 778512 724696 757454
38468 757454 776747 690932 581441 636519 829996 897640 736660 560527 516779 450952 264303
38457 264303 208152 504820 892014 916765 578666 319282 390666 566223 534875 301548
38447 301548 78779 -19768 -39206 -49985 -66088 -47901 58430 234582 337556 217079
38437 217079 -93875 -383769 -479755 -391323 -232557 -98428 -47367 -99703 -180408 -139620 80381
38426 80381 340309 445564 358633 188921 15699 -147648 -218417 -49067 343083 691135
38416 691135 766889 658399 596399 588095 448809 173617 12379 105021 278990 328388 289401
38405 289401 297714 360055 425010 507527 585497 560090 486585 614364 973137 1179373 973800
38394 973800 706433 866902 1321340 1524056 1386354 1356470 1612880 1786239 1653391 1534988
38384 1534988 1708543 1922755 1879519 1798715 2057775 2542348 2795931 2651625 2338425 2088076
38374 2088076 1975625 2041983 2254562 2415872 2368546 2201530 2040087 1798373 1403551 1072353
38364 1072353 1022230 1060004 846597 476581 379810 663745 953913 937385 709305 499571
38354 499571 376531 330407 372091 423459 335014 123551 -3138 50239 125974 67808 -54283
38343 -54283 -70143 72337 286924 435565 399256 182396 -27472 -21810 188063 391438
38333 391438 424478 291200 84120 -85871 -128611 -74359 -68868 -144823 -118904 117318 364523
38322 364523 412483 406658 604614 904035 999021 924023 997066 1214160 1166626 681291 132880
38311 132880 -56839 106517 380092 622257 755320 688207 485727 382565 470006 601939
38301 601939 722551 982564 1379007 1615568 1536369 1378914 1347164 1260510 954308 742942
38291 742942 1068981 1845330 2541995 2871317 3058163 3443592 4096493 4846246 5511778 6080841
38281 6080841 6769852 7851550 9314250 10764119 11752393 12102513 11871177 11184985 10229442
38272 10229442 9201418 8136804 6967448 5828827 5020051 4518837 3905069 3029074 2379853
38263 2379853 2390162 2683593 2515927 1786630 1091678 849822 892628 937023 969123 1033183
38253 1033183 1038139 939063 822503 699642 483802 253401 239679 437589 514647 261881
38243 261881 -105803 -263014 -180732 -49469 31104 98481 170612 207748 185891 113930 22317
38232 22317 -16743 73453 271801 456044 529361 494970 406566 317523 273688 281867 294016
38221 294016 279875 272315 275276 203971 16185 -177424 -252373 -237738 -216036 -150617 27543
38210 27543 240578 341297 311353 238023 175893 167961 273769 409723 335502 29512 -119978
38199 -119978 175366 573978 508452 36588 -194220 125524 552461 565320 246840 47392
38189 47392 167932 439986 623893 604081 418741 252894 289154 470412 549499 442532
38179 442532 355375 472835 705581 855819 877422 861988 889891 979425 1088681 1133941 1091465
38168 1091465 1039738 983464 757923 322262 -523 99786 425189 555533 532889 741732
38158 741732 1121632 1129692 645378 275632 444153 759108 714086 496778 557370 782151
38148 782151 717113 356349 95274 45420 -27047 -154717 -112379 92748 171450 38697
38138 38697 -89172 -133749 -265957 -494681 -547729 -300076 13165 148350 136569 106680
38128 106680 94059 126492 243528 338574 235980 6720 -64679 79522 156232 -1588
38118 -1588 -169070 -93044 134883 289536 369067 491688 614271 616755 540581 488055 385248
38107 385248 114663 -179388 -214205 -8675 91893 -77263 -236257 -88845 190032 175577
38097 175577 -172647 -410780 -220414 153310 268150 96137 -17871 71183 117260 -64901
38087 -64901 -265399 -194751 69408 189983 20189 -272804 -478321 -533371 -457504 -276773
38077 -276773 -44548 174165 353689 474194 478531 355037 211986 156514 138822 30161
38067 30161 -173677 -328846 -299513 -69855 240411 412789 291532 -1977 -150187 -50721
38057 -50721 18574 -189523 -503933 -602694 -503439 -472903 -554431 -540745 -380774 -252728 -211987
38046 -211987 -116610 40360 71981 -40165 -75884 402 -92752 -458255 -727779 -548724
38036 -548724 -107883 140959 85200 -25021 -29891 -7107 -13108 31909 172753 329353 400589
38025 400589 336215 146271 -41378 -21071 236465 468123 449344 344143 479337 830006
38015 830006 1021787 860995 565411 375048 211448 -94934 -443767 -566702 -396330 -124015
38005 -124015 77898 208052 298501 292537 145137 -41594 -83329 88200 340134 469942
37995 469942 410260 284797 251942 315107 331239 207693 24174 -86448 -120515 -179984 -291673
37984 -291673 -362319 -336322 -285662 -281252 -280627 -239474 -231313 -307889 -319585 -82025 291619 452179
37972 452179 263612 -19015 -106194 3923 176243 370932 529007 454987 100601 -199033
37962 -199033 -109308 181964 193132 -138675 -377166 -269007 -85818 -116858 -199700 -34093
37952 -34093 306398 486481 373807 126738 -62879 -87191 95498 366811 448617 229480
37942 229480 -16429 19349 219226 217842 -38241 -239779 -211649 -119087 -117011 -117577 -34006
37931 -34006 27308 -10010 -12356 122792 238099 150114 -31957 -58300 79881 160003 82959
37920 82959 -17606 -46097 -107230 -294515 -463772 -367489 19784 419877 521571 288228
37910 288228 -35681 -206954 -219500 -226725 -284205 -276797 -119976 79039 148707 78299 9257
37899 9257 18978 19675 -92956 -264053 -323481 -195144 2568 113217 165384 337013 662731
37888 662731 910340 889366 783412 949004 1422949 1944859 2539280 3662817 5433929
37879 5433929 6999168 7187123 5799489 3833345 2345593 1502149 902388 389335 136002
37870 136002 167644 249553 230902 177800 146547 91840 39543 110261 296953 415431 361890
37859 361890 258646 256952 332763 369557 332556 272717 241007 263843 328681 356644 284112
37848 284112 199916 272459 485368 590338 421035 125544 -36912 -17932 49568 103786
37838 103786 178683 212930 58189 -257389 -450895 -303942 29432 180407 16776 -194336
37828 -194336 -126072 197612 429652 310818 -49761 -328447 -339096 -182165 -97284 -216271
37818 -216271 -429390 -480767 -254126 41148 86441 -126207 -268994 -152740 -3440 -80875
37808 -80875 -235541 -144677 145595 276771 140721 12137 67319 127913 10748 -178006
37798 -178006 -264069 -258749 -218901 -89247 130249 263161 184999 2259 -137997 -224389 -241730
37787 -241730 -101047 122058 137787 -151582 -432863 -400671 -161644 20101 122758 220329
37777 220329 194216 -50648 -290999 -287355 -203691 -329449 -547034 -517610 -279946 -193739 -340817
37766 -340817 -447255 -386449 -298370 -193433 88608 454938 551592 295183 3785 -108692
37756 -108692 -154874 -182197 -13341 341681 548589 457424 356002 462326 539410 315026
37746 315026 -42097 -191768 -106506 24240 146643 294784 381192 328124 262459 329760
37736 329760 446243 445284 333379 223734 166648 187952 311531 435407 443485 553204 1186408
37725 1186408 2270982 3051454 2929698 2183507 1503101 1132511 887511 723773 746213
37716 746213 799603 574076 97038 -289236 -409732 -361362 -214320 13399 160061 95584
37706 95584 32321 257258 611907 673588 420386 243952 285649 260703 35219 -121963
37696 -121963 -46771 12556 -152910 -331267 -253411 -49770 -39476 -252804 -430665 -385035
37686 -385035 -159610 89200 237027 277676 318157 412553 434609 266774 47031 -11059
37676 -11059 13865 -126374 -382818 -435117 -219654 -31395 -5366 77395 302120 377369 139161
37665 139161 -100308 -34213 151310 137017 20088 88229 271880 271239 98076 52829 212025
37654 212025 338140 306391 267123 334671 414963 417600 401867 437705 501137 552699 571113
37643 571113 500438 309455 93232 -26676 -72180 -132420 -173239 -100081 36719 98839 100278
37632 100278 191582 400306 569862 579437 477025 378961 354053 395232 411539 308838 171206
37621 171206 228028 492435 616434 353018 -12720 -34188 223197 299190 82569 -43480
37611 -43480 122534 262983 88657 -192901 -246960 -122488 -76097 -144043 -215777 -320447
37601 -320447 -496226 -542155 -267813 112527 204354 8650 -88282 84741 250496 150671
37591 150671 -59341 -55990 217019 537227 704996 705006 629650 552964 468857 324691 139739
37580 139739 51316 150197 307627 307239 136809 -21030 -102533 -257603 -544384 -733112 -588753
37569 -588753 -222929 32787 47289 -11401 -213 -29541 -263657 -604285 -733269 -490224
37559 -490224 -92608 112910 60734 -8708 68716 163199 117345 39557 112272 230744 129926
37548 129926 -153370 -270986 -90875 81158 -31714 -268375 -316960 -183853 -99212 -121500
37538 -121500 -140436 -166875 -303179 -471979 -482246 -362821 -339046 -455483 -510207 -414309 -327922
37527 -327922 -354345 -383965 -362234 -429885 -624988 -703625 -476862 -120470 78756 105220 103879
37516 103879 59594 -122400 -327878 -337268 -184818 -137264 -311762 -555360 -704082 -719531
37506 -719531 -564214 -217237 125373 139264 -213024 -574563 -637774 -498220 -417127 -429993
37496 -429993 -397159 -293002 -204536 -124468 19334 161875 148809 -15272 -171273 -267294
37486 -267294 -391788 -502607 -386979 -35103 189245 686 -343767 -341618 56150 382739
37476 382739 329776 124298 65849 27062 -258445 -628456 -632367 -199554 221274 261871 44771
37465 44771 -123941 -167663 -166437 -133454 -93835 -188382 -458498 -681276 -651207 -481742 -386514
37454 -386514 -323055 -162775 -81581 -382822 -947480 -1263390 -1092590 -758619 -629045 -634318
37444 -634318 -506110 -229991 -8119 56549 7304 -107353 -216801 -185611 8875 153700
37434 153700 57412 -152175 -193903 -30249 119795 123804 61454 8265 -72689 -166891 -138652
37423 -138652 73711 332702 466862 458127 388257 298524 191712 99340 53640 26476 -39902
37412 -39902 -159794 -288998 -350113 -265537 -29216 230343 326714 193998 -61908 -302896
37402 -302896 -463835 -494930 -333668 -38982 151627 58943 -182973 -272580 -146083 -64317
37392 -64317 -230498 -482403 -504641 -251039 15287 76591 -16424 -110402 -176583 -264539 -336826
37381 -336826 -306305 -216887 -238614 -431290 -612913 -548901 -231759 104354 238642 167041
37371 167041 37803 -54892 -156302 -337084 -543165 -600287 -379920 47274 437141 565069
37361 565069 407266 140878 -29133 -42662 195 -34559 -188300 -378803 -455312 -309392
37351 -309392 -5899 194003 49385 -354560 -616934 -460320 -93391 30697 -203926 -442557
37341 -442557 -363683 -96637 26227 -31515 -11404 183649 298526 88164 -299804 -464004
37331 -464004 -229929 129354 189000 -159863 -596824 -743262 -585298 -431653 -471217 -543790
37321 -543790 -443784 -285186 -348023 -622980 -763092 -550003 -203188 -94158 -284990 -508037
37311 -508037 -548201 -495760 -597411 -941926 -1341146 -1510919 -1357703 -1077157 -960212 -1124694
37301 -1124694 -1464133 -1810949 -2066989 -2199210 -2228411 -2254813 -2390485 -2605690 -2719109 -2604924
37291 -2604924 -2348418 -2131100 -2013057 -1900300 -1695980 -1417852 -1176203 -1075116 -1119918 -1196618
37281 -1196618 -1169850 -1021225 -850686 -722527 -578390 -356885 -135193 -54875 -120198 -165483
37271 -165483 -58612 124008 187383 66044 -90012 -117744 -72301 -153139 -397484 -582710
37261 -582710 -519651 -328518 -274070 -395044 -483685 -417819 -307183 -266016 -244043 -184743 -173078
37250 -173078 -282462 -414846 -452090 -447207 -484681 -455951 -206130 138494 246135 30445
37240 30445 -194790 -120249 162987 309428 157437 -121056 -262724 -181582 60 100464
37230 100464 37390 -121437 -253271 -321731 -389175 -490215 -571737 -596095 -611977 -640760 -579414
37219 -579414 -351203 -101892 -70093 -250229 -367799 -259648 -99134 -110824 -221082 -195782
37209 -195782 -22569 96744 108536 186373 382727 460502 224973 -166463 -405746 -405910 -292566
37198 -292566 -154453 -21813 -4379 -195470 -447977 -478589 -234894 32677 109272 39887
37188 39887 -48272 -157305 -328415 -476514 -468808 -319956 -196577 -228991 -367550 -430158 -301150
37177 -301150 -98426 -81556 -326526 -578225 -558682 -343042 -236691 -327865 -408644 -348750
37167 -348750 -273312 -290192 -306957 -250909 -225063 -278122 -253664 -77126 25559 -140325 -361244
37156 -361244 -275616 91639 364818 344346 200288 135134 133549 100681 10879 -152356 -400001
37145 -400001 -608642 -579824 -319545 -97314 -129222 -326822 -436194 -309000 22368 404890
37135 404890 624413 533569 220012 -35861 -41436 141379 337759 454057 484745 451217
37125 451217 403080 372897 276584 -9898 -407222 -618034 -465420 -116194 150180 264322
37115 264322 323526 362361 348544 310182 275533 158918 -98373 -340840 -373900 -280244 -309606
37104 -309606 -464413 -484622 -300599 -193049 -351134 -547180 -485028 -267708 -239177 -483642
37094 -483642 -769093 -929200 -1014423 -1062708 -998420 -828712 -707854 -702971 -679456 -525012 -330678
37083 -330678 -246024 -297414 -444587 -660623 -842251 -809657 -553932 -337339 -361247 -461358
37073 -461358 -347303 -39403 188401 239171 273051 343685 263671 -41806 -298544 -207931
37063 -207931 130767 331878 205406 -51161 -151062 -63510 8898 -77980 -243566 -324404
37053 -324404 -299402 -282885 -323550 -343458 -306671 -295728 -330060 -266194 -38073 137196 14181
37042 14181 -297688 -448411 -317084 -121417 -54090 -71032 -97591 -187604 -359808 -486127
37032 -486127 -482297 -449883 -503020 -591742 -609565 -549047 -448953 -307528 -137948 2409 96872
37021 96872 152477 70438 -269723 -733861 -968812 -829469 -557043 -405320 -321052 -163405
37011 -163405 -7370 -502 -96254 -157293 -173454 -166742 -45139 211237 369152 207808 -144463
37000 -144463 -374092 -368444 -214913 35377 331062 483760 375299 205280 230133 352157
36990 352157 295001 99992 72832 269295 421417 398239 364366 419180 445881 425778 556776
36979 556776 901806 1202477 1202252 928021 540049 149750 -100496 -43586 266507 530880
36969 530880 562448 460656 333937 117640 -175955 -296688 -74001 293040 471748 374865
36959 374865 144669 -70456 -161891 -64368 110894 121480 -56385 -118595 127733 421549
36949 421549 395743 93753 -144955 -182017 -158170 -159548 -122795 -56361 -67741 -141184 -135290
36938 -135290 -49661 -72224 -282739 -485150 -432412 -114071 241573 383865 246467 8649
36928 8649 -66241 72251 177337 21052 -277736 -405204 -294176 -211776 -370049 -629655
36918 -629655 -688157 -452451 -125423 22384 -102600 -366179 -543903 -511051 -316447 -86834
36908 -86834 99147 220870 258404 193034 49473 -107238 -206572 -193324 -64965 85232
36898 85232 126435 31885 -99325 -191093 -270071 -353235 -376058 -322235 -312971 -443739 -617626
36887 -617626 -672829 -604831 -522193 -445056 -312137 -159394 -121121 -233493 -372688 -420663 -383213
36876 -383213 -308801 -185264 27359 305480 538450 593403 423744 126050 -150808 -356232
36866 -356232 -519024 -579113 -396012 -5531 294642 268167 33562 -127592 -152291 -199165
36856 -199165 -352123 -529937 -648045 -671066 -539444 -250945 7505 28928 -112806 -152246
36846 -152246 -38107 -16520 -255605 -604611 -806197 -766086 -550047 -296795 -184496 -281772
36836 -281772 -381343 -209818 142283 279361 86756 -68981 89013 310708 239787 -23313
36826 -23313 -152404 -157996 -269058 -393330 -209359 204956 348107 27351 -341834 -380004
36816 -380004 -274201 -360913 -523717 -408589 -31993 245306 263576 194231 138877 -29875
36806 -29875 -352117 -619092 -657297 -535959 -368775 -134709 151689 296742 155286 -134791
36796 -134791 -335550 -415428 -483108 -521210 -420823 -236643 -164738 -243517 -287939 -177320 -22552
36785 -22552 35485 30171 59660 100046 59819 -53898 -144580 -164545 -147716 -121169 -57980 76587
36773 76587 262691 412040 433097 340765 251787 190310 -25896 -524807 -1032548 -1047163 -456775
36762 -456775 246723 524867 358657 81720 -114655 -223789 -162853 137514 441774 401101
36752 401101 67637 -149869 -113774 -150418 -462277 -739745 -632860 -291888 -96477 -83570
36742 -83570 -24770 89306 54076 -128320 -232636 -213767 -249819 -344234 -266997 4217 153426
36731 153426 7591 -182695 -161317 -66744 -144766 -310844 -311924 -146581 -10739 37894 50642
36720 50642 -46590 -306066 -466500 -210331 291379 496497 227109 -101372 -120820 -262
36710 -262 -74955 -317898 -477248 -493819 -457429 -323440 -18215 267791 235574 -79171 -306112
36699 -306112 -216738 36802 196646 187159 62882 -125754 -308703 -386631 -353690 -333416 -411285
36688 -411285 -512044 -510422 -392538 -242073 -118448 -12277 94382 161577 107845 -72699
36678 -72699 -214250 -96876 274887 603253 612406 359942 118356 25918 4766 -41975 -132415
36667 -132415 -263737 -378986 -311338 22676 394953 487277 358690 392570 687514 828446
36657 828446 478401 -76666 -288248 -88545 74417 -99004 -395484 -454642 -225431 85573
36647 85573 328861 484932 515262 338636 -19754 -378873 -562720 -553259 -438406 -271618
36637 -271618 -73979 54613 -30683 -308725 -526271 -463676 -209135 -39840 -67717 -156884
36627 -156884 -188052 -218052 -301982 -318877 -121611 212765 422645 344417 66140 -197813
36617 -197813 -309796 -276948 -187749 -130313 -148054 -216870 -246660 -158456 -16352 -31824 -320042
36606 -320042 -663760 -686812 -325610 44014 76974 -102929 -119488 130986 412190 536907
36596 536907 559484 578271 592084 600296 635272 636996 484258 210143 10557 -16776 30445
36585 30445 66104 126773 216231 242000 195593 208343 331743 441438 455884 464422 525645
36574 525645 522410 352554 105967 -75952 -167674 -173610 -45646 178629 319567 285760 212030
36563 212030 224916 227756 82284 -139468 -260560 -243855 -178680 -132431 -144583 -237555 -309793
36552 -309793 -181315 111317 257451 98819 -79057 75561 471630 720500 676104 537783
36542 537783 475588 445941 384515 329431 301003 236585 90281 -111860 -306261 -394182 -287240
36531 -287240 -74043 -38708 -338541 -739190 -856687 -612031 -272461 -94210 -103466 -190746
36521 -190746 -241802 -189056 -81097 -81607 -278551 -538988 -666584 -633212 -535210 -412543 -254681
36510 -254681 -100535 12062 114518 197683 142878 -98287 -373667 -522687 -567786 -577258
36500 -577258 -510013 -367799 -310258 -407204 -463357 -318990 -128302 -85002 -86098 31995 143265
36489 143265 73896 -11254 124214 305884 195134 -100546 -160511 59604 182450 67268
36479 67268 7237 183363 391547 450551 465604 532144 545696 453702 359810 255040 -12892
36468 -12892 -380399 -528434 -346000 -105675 -35664 -35672 42577 147552 201689 228638 203273
36457 203273 90125 97665 493340 1052686 1149095 596340 -40535 -231924 -144284 -190882
36447 -190882 -342048 -315208 -144246 -88045 -139245 -42883 267625 571236 651616 480372
36437 480372 202092 94451 381540 914013 1214248 1015104 569619 277849 239886 334706
36427 334706 455982 469369 241673 -54401 471 425935 623337 187158 -412248 -452388
36417 -452388 -4484 219820 -54628 -340126 -187559 203083 362951 197093 22755 125867
36407 125867 424754 546524 246986 -238394 -412022 -139603 187138 247496 232613 426612
36397 426612 663058 590189 254874 -3324 -85958 -137407 -136309 64123 350491 446153 378075
36386 378075 431964 639502 717855 550347 342623 261714 288548 454550 823974 1178254
36376 1178254 1128588 666983 244226 173638 300597 386116 452527 570187 634889 575499
36366 575499 517390 546357 556722 507536 565217 787196 917114 744015 468757 454936 750151
36355 750151 1086101 1250177 1243125 1143432 1018321 945840 975358 1068498 1162652 1262001 1402829
36344 1402829 1574429 1728587 1827888 1859584 1849142 1857952 1908917 1953906 2007382 2236852 2748665
36333 2748665 3328790 3622453 3598438 3621868 4003011 4670461 5377435 6041372 6744934 7544235
36323 7544235 8446799 9535310 10988522 12962173 15495945 18562368 22211862 26645546
36315 26645546 32128619 38931992 47430270 57895090 69512564 79500557 84096570 81373257
36307 81373257 73047756 62983100 53991057 46532438 40118743 34824502 31030914 28494877
36299 28494877 26381927 24006708 21214140 18288355 15734349 13873331 12451223 10939739
36291 10939739 9341762 8252323 7923108 7797600 7314955 6650350 6198049 5818805 5206455
36282 5206455 4613671 4511344 4751811 4762858 4445934 4198956 4104298 3803128 3241929 2859736
36272 2859736 2845256 2809099 2447999 2010605 1812740 1755450 1649566 1605552 1732904 1793835
36262 1793835 1550098 1198391 1082892 1180325 1233340 1210768 1248395 1269301 1078995 789061
36252 789061 747548 1019455 1286784 1334297 1318413 1443660 1650163 1771664 1782555 1730291
36242 1730291 1603030 1421598 1307125 1298507 1246268 1059301 917983 1028936 1271962 1341105
36232 1341105 1195419 1114031 1288555 1605902 1893758 2145101 2391582 2564825 2631585 2701464
36222 2701464 2850028 2980492 3006267 3011602 3061502 3028340 2836918 2721221 2937838 3320145
36212 3320145 3445024 3211002 2925939 2818851 2807055 2794922 2838138 2884123 2694229 2219158
36202 2219158 1762586 1560475 1464930 1279508 1145491 1295540 1619766 1793946 1712455 1511893
36192 1511893 1287583 1076780 1015175 1196424 1436370 1472252 1351535 1336137 1465440 1521318
36182 1521318 1406353 1238787 1067649 827740 622081 707213 1092886 1460181 1596444 1623369
36172 1623369 1669903 1632147 1443557 1290389 1315176 1345827 1188696 999648 1074704 1401639
36162 1401639 1701639 1841988 1961041 2237272 2750979 3520801 4471948 5424162 6314951
36153 6314951 7386573 8979161 11246695 14273598 18219226 22823314 26758569 28108784
36145 28108784 25981777 21509287 16944892 13820154 12127913 11078783 10211785 9642699
36137 9642699 9518436 9550579 9172880 8089551 6588570 5274799 4509507 4147005 3787450
36128 3787450 3196054 2465076 1870629 1630123 1727415 1906193 1871984 1549348 1124844 838274
36118 838274 774054 827623 790208 506378 88990 -54389 377297 1124499 1564577 1452816
36108 1452816 1189817 1192158 1315773 1207486 953223 926687 1122088 1136306 839898 595224
36098 595224 670735 854070 861010 774768 807673 908526 909237 850614 854016 826036 603143 288830
36086 288830 146449 211296 282335 262194 237427 234899 171209 77161 117929 309326 423830
36075 423830 285999 7508 -176269 -191124 -149665 -166362 -229440 -230458 -79335 213563 578296
36064 578296 980618 1385531 1633595 1536045 1177299 919442 943208 986337 770078 483924
36054 483924 507480 783964 883580 664553 446763 467046 581526 651369 820194 1170921
36044 1170921 1446379 1410377 1238909 1252830 1454188 1618011 1674076 1688812 1604642 1336242
36034 1336242 1056773 1049869 1273625 1370101 1145220 771145 460158 212233 234 -42121
36024 -42121 188088 524961 678595 564668 356604 247009 271352 350192 400643 385443
36014 385443 314962 227452 144702 51564 -51685 -94963 5084 227731 453220 611850
36004 611850 746402 861918 819166 537803 248242 299354 663500 888155 690188 355466
35994 355466 299007 433502 336913 -46579 -290147 -116013 235131 398839 325721 152725
35984 152725 -65423 -265131 -257700 27230 344702 421149 298944 177259 74566 -81892
35974 -81892 -171321 -11882 275821 359807 173467 24296 166129 497509 768985 894418
35964 894418 955506 1046916 1220989 1488834 1797502 2067167 2284569 2499979 2730740 2938839
35954 2938839 3081152 3091451 2858558 2365179 1830714 1546231 1532981 1512106 1261758 863060
35944 863060 523912 300135 109956 -67836 -155314 -118669 -35352 15266 61419 185196
35934 185196 384386 554768 628985 659612 693119 630766 358979 2880 -138918 20372
35924 20372 215662 201977 104312 201311 463022 545092 249605 -201782 -418242 -250781
35914 -250781 95789 288389 168185 -133253 -363744 -425702 -426116 -456940 -452952 -329858 -137632
35903 -137632 18266 95771 63889 -133846 -445901 -680474 -737690 -727033 -719849 -582905 -253125
35892 -253125 35662 67664 -7445 42243 90822 -102794 -357270 -257745 159274 413194
35882 413194 313538 179341 211061 166783 -109970 -326945 -233094 -69247 -154926 -345157
35872 -345157 -296737 -36298 129529 95818 -14669 -166080 -396935 -592741 -594482 -465345
35862 -465345 -381113 -346807 -271391 -198321 -198782 -179488 -75225 -62144 -261677 -421289 -271495
35851 -271495 -20581 -45744 -242680 -197222 97337 267850 262247 388439 613034 512716
35841 512716 87158 -87943 195159 375356 61381 -308031 -256823 -67882 -129555 -91392
35831 -91392 496974 1182771 1221067 893894 1171557 2180138 3105872 3667523 4528338 6035471
35821 6035471 7824072 10159276 14223442 19896547 24303934 24220908 19703116 14013626
35813 14013626 9993075 7753874 6051592 4449688 3321842 2694721 2157105 1581675
35805 1581675 1166595 923652 697882 553379 632285 740271 553905 184220 78243 352038
35795 352038 631832 611236 399525 228419 144833 125997 219482 404350 520288 487853
35785 487853 436876 486376 550932 501915 385249 330607 349997 375607 413537 500995 563409
35774 563409 481675 296282 189439 228353 261689 148442 -14501 -13047 180662 359641
35764 359641 359039 264708 268463 391051 454482 307622 -8940 -313650 -424852 -276955 5168
35753 5168 166488 74532 -101039 -105887 14886 -33699 -306598 -440766 -153269 292515 395656
35742 395656 86808 -206771 -147985 140233 345182 351123 237267 86494 -43036 -72630
35732 -72630 18598 127821 151273 123574 138709 181494 151311 42190 -11660 84186 216773
35721 216773 149039 -207196 -631629 -769634 -497880 -73278 134446 23012 -194968 -282492
35711 -282492 -207239 -89044 -50457 -161604 -412147 -658924 -703008 -524619 -360255 -412696
35701 -412696 -541426 -418062 4342 369033 347070 25543 -277586 -444875 -586039 -710595
35691 -710595 -665404 -451611 -326959 -440268 -590525 -552581 -438609 -461005 -499116 -264759
35681 -264759 164635 377128 228382 17142 -52104 -168172 -450783 -583486 -272323 209199
35671 209199 354160 131064 -64835 -60567 -51716 -123817 -105697 3313 -90143 -463969 -726322
35660 -726322 -549887 -164890 -806 -69580 -78748 -6968 -123856 -429396 -506334 -108508
35650 -108508 427875 625621 503613 459317 649474 894238 1226092 2063321 3513700 4803543
35640 4803543 4895856 3676906 2126580 1213788 991707 961672 929553 1088297 1448734 1676818
35630 1676818 1566656 1347128 1376510 1716231 2113137 2280245 2125901 1802082 1568311 1538964
35620 1538964 1579687 1537561 1500041 1656565 1949896 2093325 1965452 1770817 1727584 1788232
35610 1788232 1791954 1743195 1786199 1981301 2237850 2443098 2571844 2667255 2741703 2700567 2408508
35599 2408508 1886510 1380923 1124884 1074675 1018675 904151 868106 945684 967773 822142
35589 822142 632359 574856 662487 802802 929495 975485 859939 630851 497098 573834
35579 573834 695443 635900 434980 331115 413407 530463 559347 576826 667496 699001 458950
35568 458950 -3026 -332146 -251789 102788 353979 337124 235042 261867 399907 518788
35558 518788 568458 526800 332492 47782 -77315 61974 170736 -65996 -441946 -437096
35548 -437096 27095 430641 373971 96777 61343 302878 480009 393893 163009 -38491
35538 -38491 -157775 -190017 -126546 -2279 122848 229836 308614 306716 210081 127337 177387
35527 177387 319030 400209 359663 275643 222308 187253 152787 160334 235661 308003 274549
35516 274549 130439 -27109 -128924 -197797 -247203 -203461 -28547 149379 189489 192071 382296
35505 382296 708501 819367 575003 326543 460351 861848 1103247 1015328 775893 539781
35495 539781 308899 124969 73624 93703 59054 45715 243031 600452 838343 815250
35485 815250 625042 360810 80638 -32950 162983 451666 475179 285135 269354 501557
35475 501557 632513 525222 496659 735891 962327 924210 800743 813682 842650 741724
35465 741724 655660 692463 663205 500162 531343 913242 1178416 865034 279723 61721
35455 61721 227964 269033 48254 -52049 121177 220058 10273 -247084 -228514 11209
35445 11209 218891 273181 178565 -25731 -207623 -189762 18471 179441 104881 -133824
35435 -133824 -319519 -321327 -186366 -53262 26829 159710 393771 496805 217368 -216941
35425 -216941 -254575 175504 449883 125219 -410052 -567362 -428595 -441853 -581715 -473881
35415 -473881 -165928 -72565 -202230 -119328 264364 499462 342910 117533 129264 231216
35405 231216 201295 115236 90713 22093 -184392 -391832 -438204 -327609 -113587 158197
35395 158197 344568 329794 268341 377984 521028 398087 123871 99197 288208 218420
35385 218420 -171993 -316718 96180 613377 720505 523213 353969 209613 15700 -7620
35375 -7620 269592 517378 445874 330896 541897 861061 812417 423244 115003 28575
35365 28575 -938 50695 352596 742906 828368 571919 330934 297874 322909 307834 357572
35354 357572 480380 510951 408302 309484 232388 35035 -275115 -487767 -501221 -409277
35344 -409277 -236015 118914 593236 899536 867408 641510 452603 371542 345009 296470
35334 296470 150112 -74947 -177873 29721 424579 655569 548955 253381 -21396 -209997
35324 -209997 -316341 -335276 -300805 -261360 -186747 -35362 109002 126031 47494 -13294 -59751
35313 -59751 -139024 -148401 29691 253057 268464 110102 38613 81022 -21151 -340652 -591995
35302 -591995 -562701 -404655 -326341 -272785 -115373 67294 119218 58553 9252 2287 -7953
35291 -7953 -41673 -117402 -253159 -361470 -294134 -68734 118151 169950 182338 198786 138523
35280 138523 69663 238773 639205 861356 641392 286613 236358 437188 523879 429365
35270 429365 391054 467040 495991 502698 686694 958192 928783 503669 95876 59695 243838
35259 243838 328170 303085 340737 428428 439640 415033 468905 508269 338936 24229 -123994
35248 -123994 57594 389929 588587 548133 374551 261265 333862 507249 528762 288596
35238 288596 27995 64217 355387 553624 470780 239528 -4273 -290729 -556603 -536799
35228 -536799 -156890 200389 126032 -251250 -437186 -232087 97160 285968 374130 461107
35218 461107 472630 346479 224401 253362 346960 340712 264884 257742 299326 263871 197386
35207 197386 289692 529395 626235 406175 107147 92610 354522 505402 280960 -117176
35197 -117176 -270120 -34604 332617 511782 450070 309950 200604 92404 -24419 -50759
35187 -50759 71576 221351 233245 126765 63652 90105 89488 36054 101584 365717 583457
35176 583457 477702 181112 98177 316137 468194 301761 70666 115931 303162 227778
35166 227778 -143239 -416667 -354359 -150616 -50748 -15235 87928 217343 266687 248465
35156 248465 206458 107799 -37828 -122366 -142398 -269385 -550058 -726729 -561818 -180986
35146 -180986 117193 239402 265632 204267 48041 -53489 33662 171040 142624 22860
35136 22860 51072 205186 230252 72134 -51128 -33690 -11361 -46586 147 173806 273519
35125 273519 139910 -109408 -249073 -187910 28792 290526 442286 401169 286872 277860
35115 277860 352330 364351 326467 355235 376531 205980 -78553 -196016 -126074 -140294 -308483
35104 -308483 -381349 -275039 -239701 -373583 -410162 -223424 -102921 -218521 -239504 120070
35094 120070 553447 618468 436252 424863 562219 468936 121468 -63407 119008 384777
35084 384777 428787 307801 244790 316949 432428 437286 220986 -134233 -354417 -283751 -98430
35073 -98430 -33689 -48315 4689 53840 -26498 -84495 95161 352981 349138 141401 120493
35062 120493 355805 466491 239988 -58404 -156933 -162817 -254944 -324200 -188124 69677
35052 69677 226947 232110 186848 146157 91870 -1237 -171980 -419132 -584797 -477063 -185182
35041 -185182 -53013 -218715 -403238 -320671 -90356 -23685 -156365 -240399 -127962 62935
35031 62935 156249 113510 -8594 -177926 -408818 -694650 -938981 -986040 -780946 -484540
35021 -484540 -332205 -369536 -433432 -409130 -372026 -420940 -500904 -490923 -389547 -317372 -368400
35010 -368400 -519513 -668531 -732952 -725199 -726184 -766055 -775076 -701656 -613667 -590977 -576219 -459294
34998 -459294 -283688 -235339 -412873 -702516 -891202 -849614 -635174 -465036 -522312 -738999
34988 -738999 -876481 -868848 -898316 -1023030 -990135 -656422 -350533 -459957 -817127 -906847
34978 -906847 -609422 -310881 -284443 -403212 -528959 -743713 -1043451 -1193127 -1091104 -960752
34968 -960752 -987927 -1068081 -1109135 -1277332 -1685908 -2087915 -2156160 -1905116 -1611136 -1459230
34958 -1459230 -1454107 -1530635 -1581922 -1517381 -1415677 -1441282 -1509847 -1295109 -727930 -209510 -104728
34947 -104728 -279989 -394312 -388187 -374721 -287086 -24989 197252 60440 -347585 -595856
34937 -595856 -494599 -294823 -260607 -324936 -260877 11085 376805 655857 727220 628439
34927 628439 541263 601495 755373 874419 927005 937566 890632 817440 868629 1129716 1443498
34916 1443498 1571188 1448617 1150600 739293 332122 173713 390083 760201 971839
34907 971839 1020750 1105593 1219815 1160898 914334 701218 609781 490374 298967 247061
34897 247061 454803 688484 642211 345796 115679 169364 424007 645275 694620 622747
34887 622747 565022 570758 564248 482021 380310 345710 353661 294805 115917 -115586 -254767
34876 -254767 -174426 101311 350791 371285 258576 291234 498694 586576 389727 123653
34866 123653 19687 -1452 -63544 -39942 168970 337833 262350 157244 296838 496058
34856 496058 435371 289339 447337 754400 709208 383858 395346 838894 1020298 551297
34846 551297 -4421 -27079 238565 223319 -3812 25512 297630 352067 59880 -228687
34836 -228687 -274068 -179661 -40896 181441 399600 406826 216480 81296 130483 255491
34826 255491 361496 466464 558129 607336 686963 814756 756283 313625 -246261 -428046
34816 -428046 -166965 130629 217880 256018 367123 401241 324241 406407 764369 1077611
34806 1077611 1056783 882394 856568 899966 771071 567945 584027 771315 767080 450616
34796 450616 107094 -18781 -20556 -87065 -221593 -331007 -398464 -429249 -362201 -168614 42288
34785 42288 125393 66825 -19763 -34254 23475 98034 177177 316012 526118 663299 537763
34774 537763 186741 -81212 -20773 265190 497495 573309 569581 479470 203437 -172254
34764 -172254 -336178 -116846 266893 450731 322234 63406 -118322 -170545 -137009 -37389
34754 -37389 151854 426878 694260 809250 708401 486527 300883 225339 252021 383869
34744 383869 611114 811163 813634 615821 431140 455171 645147 786156 734091 552015
34734 552015 428178 475760 608969 647272 552365 469796 474889 415732 169259 -63654 27516
34723 27516 383712 594297 457666 263647 381257 766385 1045377 957370 575066 191238
34713 191238 95647 357269 728369 868002 734420 623124 741081 916930 861908 565212
34703 565212 275967 201662 352019 578877 672005 537628 360292 424749 704865 861404
34693 861404 765212 728700 995736 1291156 1210147 844465 637188 735531 877311 876033 845942
34682 845942 916473 1040978 1156842 1288870 1430186 1507784 1495945 1417311 1266797 1093075
34672 1093075 1073521 1305830 1604343 1715154 1648565 1594628 1639436 1794987 2125601 2538861
34662 2538861 2654106 2281269 1862892 1969775 2482143 2801384 2791102 2888048 3255729 3501968
34652 3501968 3417435 3362268 3623086 3934363 3992030 3970632 4146234 4411773 4571451 4776645
34642 4776645 5256766 5881038 6371027 6739147 7188551 7779712 8485010 9357445 10371798
34633 10371798 11332301 12212335 13341490 14977368 16950281 19026758 21354969 24222390
34625 24222390 27637792 31531951 36166193 41959985 49054421 57391616 67160125 78959050
34617 78959050 93651512 112183469 135343840 163612158 197305012 236122093 276977609
34610 276977609 311895895 330098283 324759538 298375767 260789070 221958470 187034705
34603 187034705 157135987 132203411 111948495 95474231 81680205 70082419 60653880
34596 60653880 53123634 46965604 41843493 37588832 33910061 30521462 27432561 24797432
34588 24797432 22591093 20665596 18981039 17566057 16368293 15293889 14272716 13217664
34580 13217664 12106098 11131175 10508525 10099703 9553234 8862864 8378983 8165712 7822480
34571 7822480 7154771 6539287 6300465 6166275 5760590 5267969 5114082 5234887 5181223 4829819
34561 4829819 4512295 4457142 4504329 4412898 4146035 3807635 3528097 3432267 3532672 3662767
34551 3662767 3670449 3620024 3634258 3620562 3369140 2883674 2414466 2175894 2190634 2379732
34541 2379732 2634046 2803399 2769957 2559534 2296202 2060296 1859514 1697749 1596421 1579884
34531 1579884 1678494 1882331 2067259 2070118 1880378 1653671 1507309 1428974 1403244 1454254
34521 1454254 1520464 1479533 1361481 1338178 1433031 1466530 1377038 1337813 1423349 1431928 1233060
34510 1233060 1038272 1081828 1240102 1237707 1073108 965541 993079 1048152 1078251 1125257 1162223
34499 1162223 1101920 963186 879011 941889 1118525 1267981 1207284 879009 501899 398339
34489 398339 614902 892124 1046886 1135780 1180895 1060591 815800 727440 881264 975316
34479 975316 793155 542133 461872 452216 408127 546844 989617 1365531 1317732 1104850
34469 1104850 1166398 1364853 1272929 996512 1006872 1255012 1204412 785041 571388 838061
34459 838061 1128830 1040208 811323 778507 790649 600083 395018 467098 662861 630142
34449 630142 401971 314616 474541 662818 682712 518705 240325 -11237 -50128 114129
34439 114129 192122 6725 -168341 59240 626152 1065708 1096080 880381 697365 616784
34429 616784 569445 529795 511653 491789 429260 318911 196085 124126 172184 352976 579712
34418 579712 724575 727515 635913 544691 495145 424764 258135 80302 131549 518610 1001122
34407 1001122 1225267 1131065 945292 803358 627629 417238 377662 615036 916253 1014834
34397 1014834 921521 818594 767605 721120 723589 882368 1165974 1406406 1506969 1521201
34387 1521201 1522389 1500405 1407938 1251251 1124728 1155469 1356599 1530375 1428521 1063281
34377 1063281 747523 743538 970826 1149949 1128936 950261 690784 393300 127505 -8010
34367 -8010 48715 305128 702473 1058342 1128409 869192 579134 608348 928350 1144544
34357 1144544 973106 568240 299652 316760 462915 574968 696874 918385 1126827 1102205
34347 1102205 858526 698015 823539 1052680 1084114 935576 896053 1088698 1320999 1388397
34337 1388397 1299617 1140162 924462 681088 507323 439115 423435 491228 752410 1106987
34327 1106987 1196788 850498 400518 315321 627007 958818 1041761 956752 891153 896144 925538
34316 925538 934372 883477 771496 694605 763626 936385 1031574 936727 729223 580505 601138
34305 601138 770005 950700 990975 865994 707413 651698 704199 789954 859323 885467 855275
34294 855275 840548 959379 1156220 1155162 801238 341525 162884 315298 502228 493523
34284 493523 319323 78320 -184669 -362566 -290921 17636 310506 370705 234490 71385
34274 71385 -17253 -15956 46147 71035 -55762 -316238 -570216 -756027 -939823 -1116704 -1144711
34263 -1144711 -980058 -805574 -781666 -815214 -740829 -606932 -586130 -680227 -718892 -628205 -522536
34252 -522536 -522590 -625899 -769875 -895535 -924220 -778277 -468916 -114169 138097 183517 15160
34241 15160 -235424 -378993 -374018 -384846 -547569 -767575 -868251 -843272 -806581 -785262 -749353
34230 -749353 -756407 -833446 -792652 -457643 -39131 61165 -147065 -224567 -5117 105602
34220 105602 -209192 -602680 -546067 -122114 117786 -44057 -285639 -307783 -174159 -40057
34210 -40057 79365 168191 154963 108128 202904 390843 386476 100337 -200649 -303361 -324047
34199 -324047 -393402 -361485 -73404 289793 426941 317894 162529 61556 -3872 -9327
34189 -9327 53513 70238 -18998 -63955 47122 139287 19240 -167845 -172211 -90482 -201330
34178 -201330 -439323 -459569 -211773 -5955 47180 200919 534616 704146 489211 211336
34168 211336 268258 527935 557638 282825 42405 55763 174720 188841 107718 57567 76171
34157 76171 111461 138837 202099 342990 504821 539221 368843 121208 -1973 21786 49542
34146 49542 37621 105697 295280 475272 577461 707707 887655 908384 644055 331152
34136 331152 297069 539200 811933 1017466 1234806 1423920 1402418 1147047 870008 726530
34126 726530 641856 503171 353637 297551 333349 382028 415669 480013 611480 766825 837894
34115 837894 756430 587153 456540 380920 276979 173522 231518 438714 488113 184606
34105 184606 -181678 -162631 227502 543968 549595 467712 523161 589851 488758 343632 364975
34094 364975 469152 410671 201756 117571 295909 566661 704635 655669 473246 221603
34084 221603 25876 58659 345616 667983 768271 602758 314358 33496 -180163 -260204
34074 -260204 -155679 65564 273688 458386 712853 1000677 1114577 969364 765606 699790
34064 699790 666521 478973 264594 325031 623112 756738 533949 249222 215307 314856
34054 314856 273414 142229 179028 380006 478425 380083 284243 333469 419112 423908 431570
34043 431570 565417 769807 881490 840680 747845 751990 903259 1067150 1014159 685318
34033 685318 326011 225814 363880 479886 473567 515745 718489 912891 871262 596704
34023 596704 274904 58490 3760 104289 264241 319769 199734 16445 -71754 -24005
34013 -24005 101414 227277 261356 146839 -1572 55138 370657 673561 695855 532019
34003 532019 467033 522731 438568 122835 -147436 -110232 101030 163138 34579 -17194 151630
33992 151630 340446 317449 170921 163530 329995 443887 386697 321494 404623 522607 489672
33981 489672 373981 413273 667509 969496 1201258 1400274 1569455 1607363 1507210 1427728
33971 1427728 1456522 1477696 1402489 1359489 1479071 1624718 1554659 1280300 1051135 1006353
33961 1006353 1040354 1025212 976917 946393 904481 821508 751753 754477 804372 842732 848716 805922
33949 805922 676643 485483 368656 451249 699488 959010 1111306 1132064 1041100 896856
33939 896856 827390 942761 1170491 1278712 1144590 930773 891815 1043427 1149456 1047023
33929 1047023 854104 783567 848636 866740 720239 502878 393496 459495 610513 698303
33919 698303 644369 507231 434608 511190 645079 647096 439791 152180 -13376 18165 141611
33908 141611 192133 102101 -41289 -82260 39979 207939 238901 99706 -31265 31280
33898 31280 226754 278107 21998 -346631 -461536 -219545 89944 152733 11418 -49109
33888 -49109 89281 273975 363077 389744 394102 308660 128578 8372 32126 46934 -89814
33877 -89814 -237648 -171473 48365 155914 81218 19591 104948 254616 361289 408475 355668
33866 355668 141376 -132628 -245665 -176664 -161434 -322469 -460135 -361473 -116443 58995
33856 58995 147174 262994 386991 390047 259813 104659 -21873 -120640 -122414 32804 209966
33845 209966 186743 -17604 -117752 51663 291293 305398 102870 -27677 94703 338805
33835 338805 479123 481452 459154 426799 277853 30197 -93617 43498 258048 274838
33825 274838 101537 -28556 -31091 -45761 -141223 -210278 -218968 -296946 -463449 -507929 -305169
33814 -305169 -38004 72021 59653 50876 8257 -120626 -189564 -75479 41630 -54369 -194246
33803 -194246 -53243 258576 278158 -82643 -340642 -162224 116370 -797 -427191 -646491
33793 -646491 -461278 -190678 -124628 -141927 -851 246810 332436 135555 -212429 -539234
33783 -539234 -781702 -919324 -903124 -718440 -436611 -139716 146468 388961 491769 394339
33773 394339 175844 -30904 -177887 -253995 -181618 67063 300013 271668 28977 -131577
33763 -131577 -84504 -2656 534 59323 237434 321608 173283 28976 148351 369866 366622
33752 366622 197285 214276 487640 704779 650561 438325 228206 52235 -11166 184221
33742 184221 572157 836269 788150 582545 463692 491135 585391 650452 600597 453595
33732 453595 394580 521517 587567 334019 31592 218937 839493 1181079 881710 445598
33722 445598 412926 543724 333328 -88024 -202394 11367 105255 -36831 -76550 86352
33712 86352 116911 -122616 -282983 -95987 199757 256300 100995 -25581 -42023 -1033
33702 -1033 82541 164194 120068 -51119 -153467 -77013 34660 48007 51810 126687 130902 -49636
33690 -49636 -234201 -200155 -52545 -54709 -196663 -231476 -88092 48530 69390 79502 162633
33679 162633 249725 289295 337331 395567 354263 201394 120284 249206 469695 563024 480669
33668 480669 338839 233147 193948 258308 429349 579720 540588 317043 112090 98895
33658 98895 244139 386487 416894 341283 227440 145566 134858 198041 341598 596877 926629
33647 926629 1128744 981822 556437 241216 323673 642683 815035 724090 581946 555061
33637 555061 578179 566160 558276 563148 491081 364648 378145 593552 792513 821135 862439
33626 862439 1113347 1393272 1404302 1241710 1268747 1546597 1783873 1859595 1991558 2297627
33616 2297627 2573401 2658627 2681421 2750590 2723129 2504396 2295233 2284427 2341568 2280146 2191382
33605 2191382 2223764 2247749 2070647 1804225 1665413 1567891 1305056 1025970 1092833 1497228
33595 1497228 1848220 1960108 2023665 2132534 2091698 1844230 1654474 1636666 1486097 968552
33585 968552 351004 17745 -69198 -169954 -260044 -136325 112987 173756 -1934 -163071
33575 -163071 -222198 -362531 -619079 -734170 -583183 -417259 -470955 -594117 -526906 -334859
33565 -334859 -273203 -340389 -285712 -39530 165423 166629 103164 137600 159892 -17504 -293934
33554 -293934 -369811 -193495 -73650 -255928 -582606 -726874 -628927 -503019 -484060 -490380
33544 -490380 -441721 -397148 -403752 -388142 -309080 -274571 -372746 -495599 -483967 -379069 -368224
33533 -368224 -499340 -596603 -490313 -230873 -25678 -7712 -105688 -151212 -108456 -138124 -358706
33522 -358706 -606710 -604395 -368671 -234276 -383548 -576718 -512830 -259613 -101027 -111290
33512 -111290 -137348 -98191 -36223 52101 168637 164654 -72828 -341659 -347631 -166375 -124379
33501 -124379 -236218 -191025 38219 56174 -294409 -602542 -525409 -339981 -454300 -700171
33491 -700171 -601030 -144560 211841 225579 101295 50668 35560 -4825 -27310 -50962 -151308
33480 -151308 -248104 -187725 -57931 -109193 -335380 -471642 -458677 -535705 -771515 -893726
33470 -893726 -748099 -541901 -414953 -167147 278717 523487 235013 -232598 -271103 78955
33460 78955 194633 -170260 -521753 -369775 103626 377646 287240 86361 -3105 -9084
33450 -9084 -29196 -64378 -61127 6307 121684 234651 291859 299974 321409 365550 339939 177430
33438 177430 -30052 -108650 -8041 135008 151118 18886 -119174 -103528 76697 254531
33428 254531 242060 36033 -162859 -171970 -34862 55834 19864 -33899 -18821 -24850 -146204
33417 -146204 -258647 -167943 38751 26346 -321992 -694035 -760688 -600261 -484060 -411404
33407 -411404 -184771 132541 217345 -11141 -249709 -282062 -240114 -227228 -54625 354917
33397 354917 629064 421203 8787 -45802 269833 406502 89913 -304912 -345816 -97018
33387 -97018 122709 189217 135304 -41136 -244114 -192924 207810 584388 526431 191284
33377 191284 103686 388738 607385 438706 137814 91591 218552 147850 -146214 -259638
33367 -259638 53304 505337 644846 416681 155235 98026 121259 -6283 -276972 -470000
33357 -470000 -447008 -295504 -180559 -156831 -175586 -213544 -306042 -443684 -516171 -435287 -284071
33346 -284071 -234109 -289314 -241482 23611 297302 290498 19525 -265906 -480216 -726732
33336 -726732 -906614 -689386 -68999 398853 249766 -239672 -443930 -263947 -159758 -376107
33326 -376107 -636328 -685882 -662225 -718520 -686607 -408927 -98255 -35797 -125660 -78616 114168
33315 114168 219261 175710 151586 227885 324011 433767 648089 899242 947571 719970
33305 719970 449705 362785 397866 372175 283153 264890 307245 215365 -93898 -385718 -335448
33294 -335448 51791 391676 365929 97245 -64916 -33112 -18376 -103319 -90320 113128
33284 113128 251449 81890 -243418 -413636 -401290 -378740 -333073 -104406 254876 506062
33274 506062 611984 772730 1039201 1220458 1259570 1379334 1716356 2106220 2406205 2745578
33264 2745578 3214334 3540521 3382698 2816661 2251788 1932699 1768251 1600608 1391610
33255 1391610 1146678 885926 725482 785337 957780 948509 641546 284404 198790 399345
33245 399345 610701 604293 400255 148275 -70195 -253883 -360116 -294264 -71306 99070
33235 99070 17684 -218697 -280465 -17967 322786 426095 344005 407471 720953 975736
33225 975736 861576 481300 186173 111591 93976 23721 35990 246251 477499 439387
33215 439387 113599 -215415 -314227 -238237 -183247 -224485 -271249 -209099 -35916 101786 13503
33204 13503 -306413 -564641 -429441 52664 453948 460680 224039 106661 223935 386937
33194 386937 383825 154532 -214918 -507378 -491044 -208513 -36003 -225696 -498932 -387939
33184 -387939 86703 430796 373785 171451 116247 129393 48412 -10375 124680 321139
33174 321139 325106 165153 72531 88326 51615 -55272 -48488 129602 277970 224370 55579
33163 55579 -46219 -54865 -73873 -159462 -289432 -449588 -625965 -717871 -581121 -222893 123979
33152 123979 234423 179449 239126 487635 640648 458530 146434 107900 372079 556803
33142 556803 416605 126961 -70054 -210810 -423414 -631226 -667721 -537647 -367379 -215810
33132 -215810 -97700 -60456 -77372 -14079 134492 154031 -47689 -220652 -157576 -88052 -333180
33121 -333180 -722685 -786482 -474300 -235136 -329729 -490531 -400433 -129226 103585 277429
33111 277429 438989 473924 278827 3072 -113071 -34645 105064 209928 216928 23135
33101 23135 -370841 -724674 -765434 -499484 -175131 15284 60157 14964 -79871 -178603 -233098
33090 -233098 -202187 -15383 373134 815930 1004042 823134 556053 537484 710853 763034
33080 763034 618585 498810 490202 390032 97889 -141623 -101799 44243 -27555 -299005
33070 -299005 -457677 -385513 -302920 -388337 -522767 -524501 -421399 -333530 -248873 -97460 66397
33059 66397 147097 191614 289809 351095 216599 -15275 -39350 208565 403508 275955 -647
33048 -647 -63813 142353 348826 355021 212196 40498 -116945 -223725 -215549 -108235 -20892
33037 -20892 -31042 -94671 -147206 -193182 -255060 -315742 -356148 -381770 -376662 -302125 -185093 -143108
33025 -143108 -261859 -484517 -674854 -767875 -806273 -829653 -784939 -599538 -333052 -178106
33015 -178106 -252573 -441992 -532609 -462902 -333875 -203541 -29430 176542 312520 351083
33005 351083 364884 340429 181077 -20783 25428 377523 666808 564185 222996 -4357
32995 -4357 -75258 -157098 -211596 -85479 92065 33419 -220734 -361435 -356471 -487505 -787786
32984 -787786 -918551 -757886 -657258 -868945 -1113680 -1019225 -668093 -386934 -254029 -153709
32974 -153709 -116068 -254421 -488075 -630548 -667290 -697369 -703905 -630841 -582975 -682885 -801949
32963 -801949 -700448 -403967 -199399 -258428 -465233 -621472 -652389 -600543 -546684 -544009 -559135
32952 -559135 -519762 -454981 -463418 -492685 -353811 -64949 72938 -56845 -104571 263226 816570
32941 816570 1070176 990432 974182 1188926 1384304 1394593 1382669 1440298 1342450 944152 533461
32930 533461 503064 835366 1170840 1296027 1332228 1460117 1648180 1714349 1569371 1332414
32920 1332414 1204819 1254920 1364743 1391303 1317195 1216969 1160362 1197213 1336824 1477042
32910 1477042 1475031 1367368 1361767 1497181 1512898 1240238 912927 821710 852444 713936 478520
32899 478520 470319 670199 695214 426764 216387 327088 565968 653692 594613 468078
32889 468078 209946 -122680 -191732 173826 612659 675718 456030 397275 597015 709718
32879 709718 523981 245036 122199 124133 130262 180738 325817 392938 153484 -306525 -593813
32868 -593813 -468508 -172173 -152845 -497294 -812123 -733621 -379140 -127380 -95066 -92838
32858 -92838 -30910 -38333 -135537 -123102 63445 189268 107368 31669 165089 303247 144608
32847 144608 -176307 -245903 11849 247973 222075 81844 51711 149081 306282 500943
32837 500943 637822 540796 218504 -52732 -66006 59135 107623 95647 176992 341271
32827 341271 422872 369042 304014 309018 288913 120100 -142310 -266982 -68737 359105 664692
32816 664692 576315 226986 19494 127810 293120 223791 20887 -13174 123607 124362 -118976
32805 -118976 -307007 -179652 67631 57473 -202686 -304445 430 454888 616628 378694
32795 378694 36557 -94592 10384 161154 214157 181784 127564 56440 -46662 -125080
32785 -125080 -80065 97950 285365 336557 199459 -85402 -426147 -679278 -691406 -437345
32775 -437345 -90186 122922 121322 -19540 -199889 -342220 -353410 -178515 91921 275771
32765 275771 288076 200397 117140 90285 145586 263253 323653 221482 67889 112993 393648
32754 393648 625500 567743 352905 291466 443424 566591 461162 202337 4069 -38707
32744 -38707 -22236 -93315 -274303 -441907 -481221 -405634 -267832 -36123 301415 577219
32734 577219 600920 459081 411791 477437 424958 246538 260225 549262 685260 343566
32724 343566 -124981 -171705 118542 166986 -223719 -633241 -682487 -471095 -255716 -92575
32714 -92575 33898 39949 -115073 -321978 -467312 -501679 -338371 55752 429702 420644 58252
32703 58252 -200612 -69641 222423 332328 254042 172886 131525 81901 74316 159642 239432
32692 239432 198613 59941 -131788 -409488 -714707 -814946 -582907 -213329 16276 69598
32682 69598 83108 122963 172196 219881 214688 79061 -99980 -89397 123499 212043 -24231
32671 -24231 -297202 -213243 158447 413762 386218 264714 205925 157137 73667 31028 64594
32660 64594 104699 122748 188126 349720 573606 788461 896270 794679 507494 228673
32650 228673 115875 116489 112074 114027 154209 104975 -170936 -550563 -741275 -632315 -401204
32639 -401204 -281400 -342627 -482369 -553972 -530796 -550394 -698050 -799674 -667023 -512427
32629 -512427 -725065 -1159449 -1155058 -522984 16353 -175102 -695338 -728399 -250096 108528
32619 108528 152248 260168 505068 477590 109547 -105757 45289 140050 -84503 -242403
32609 -242403 -13588 241758 79891 -295501 -433404 -382462 -476477 -656753 -582450 -254828
32599 -254828 -4879 56352 108856 198492 176234 53635 27914 129690 184869 152171 185623
32588 185623 328500 435178 437839 422944 403273 278426 77832 -12714 51271 80394 -42798
32577 -42798 -170064 -121952 47800 157140 154829 150023 239053 391100 485847 426261 225060
32566 225060 -23864 -262189 -490532 -650301 -614845 -408398 -297954 -476195 -744259 -745885
32556 -745885 -476475 -290007 -374011 -502613 -423407 -225823 -124757 -79318 99456 352762
32546 352762 381844 91360 -216626 -223340 -16065 44068 -179197 -410203 -317176 67625
32536 67625 375286 294715 -138013 -606947 -784530 -549355 -44027 438184 678839 690032
32526 690032 635010 609912 559053 402470 170999 -23023 -112577 -145123 -227225 -382587 -469264
32515 -469264 -323501 -28534 94456 -104527 -333883 -218991 150741 321298 114956 -154066
32505 -154066 -190876 -115545 -163366 -285055 -314620 -314394 -440428 -603470 -579106 -380568 -226956
32494 -226956 -182910 -115949 5093 60952 55539 156324 390126 546197 476411 280338 101647
32483 101647 -53885 -196919 -253881 -213886 -201051 -273700 -316058 -253864 -200971 -246261 -282833
32472 -282833 -237307 -281766 -559723 -840976 -761399 -350328 -3151 75218 76040 165503 189556
32461 189556 -13780 -265344 -265605 -20933 190851 196054 52758 -127355 -261982 -241113 -19198
32450 -19198 228188 259199 111619 78656 275078 444188 313836 -37430 -313239 -356672
32440 -356672 -231468 -65502 42023 50918 41362 148926 337447 377185 177363 -31449
32430 -31449 -29201 55695 -18982 -198661 -259999 -225459 -288634 -390178 -276404 -480 61650
32419 61650 -191743 -387821 -271057 -111626 -237482 -477646 -435268 -112017 114691 40571
32409 40571 -174500 -331185 -413167 -462157 -459083 -383753 -255865 -104982 3269 -40856 -252913
32398 -252913 -460739 -473084 -295492 -82082 45849 33518 -133759 -351574 -410865 -250291
32388 -250291 -78428 -81381 -148836 -92833 7324 -61322 -272302 -399490 -364241 -271629 -157541
32377 -157541 18747 173964 183377 127515 157137 164613 -49324 -306732 -186067 306296 646091
32366 646091 526892 247025 130169 -4275 -432202 -931068 -1039934 -721655 -352856 -167124
32356 -167124 -90830 -69986 -187172 -431599 -645317 -733002 -705013 -533381 -210257 66799
32346 66799 37023 -262366 -504614 -470077 -225785 83083 362914 472277 285762 -50609
32336 -50609 -191172 -42062 93051 -47248 -324271 -442235 -339250 -149901 36798 177202
32326 177202 186437 59090 -57550 -99039 -225742 -505182 -648669 -391570 4451 30135
32316 30135 -333086 -576178 -413238 -142745 -109514 -209137 -185679 -93247 -127257 -218353 -148279
32305 -148279 49352 125848 -4349 -195477 -334357 -420666 -426155 -324974 -235789 -286957 -365725
32294 -365725 -258200 -15828 106927 85281 169470 427559 568267 364956 -18512 -294722
32284 -294722 -408045 -449162 -439178 -396262 -420024 -501558 -425196 -74807 320772 468555 388732
32273 388732 284234 189602 25796 -113572 -43763 186897 340802 347230 347687 379899 285942
32262 285942 -6284 -329082 -467599 -340964 18840 469927 731135 588806 204026 5261
32252 5261 188671 510054 653422 607501 559218 592136 643193 639074 543107 361249 207121
32241 207121 258989 539915 830943 914888 826874 748548 723304 610890 309553 -79231
32231 -79231 -328449 -294889 -59473 134591 118554 -32309 -120409 -91858 -75805 -158143 -247712
32220 -247712 -212809 -37768 207448 442566 564713 482943 258156 116839 223062 486309
32210 486309 661032 584368 280441 -78067 -257011 -118391 217363 448131 414586 268241
32200 268241 233431 305200 313778 213009 138154 182246 255358 210120 31243 -136672 -123977
32189 -123977 91602 319403 304512 -1139 -353757 -472200 -341166 -173138 -99236 -31460
32179 -31460 131778 294343 274230 67659 -140597 -237827 -304524 -399351 -374697 -89613 272759
32168 272759 350908 96133 -135356 -90882 25681 -96365 -389781 -554204 -537695 -539475
32158 -539475 -591520 -490822 -187299 79138 127646 61212 38151 60234 103022 221350 378520
32147 378520 373545 96138 -305009 -627264 -812495 -836188 -620121 -216551 120565 229415
32137 229415 231336 264365 231818 24105 -210236 -272395 -232853 -273494 -343586 -262434 -70828
32126 -70828 16854 -35646 -58985 20501 108671 163602 244039 328547 304960 158246 -9665
32115 -9665 -132138 -179684 -74850 175355 327483 148758 -213587 -388240 -293816 -198755
32105 -198755 -253950 -296149 -195038 -72211 -36010 16958 168400 295177 299778 300829 398355
32094 398355 447716 283941 13227 -138155 -144448 -143983 -186939 -225721 -275303 -375491 -442560
32083 -442560 -351477 -139094 44805 157740 256466 292429 134241 -154936 -269428 -28120
32073 -28120 337710 433796 193899 -52555 -30566 136406 155514 4544 -80475 -27502 -60532
32062 -60532 -299376 -480962 -313900 47531 166916 -95465 -432861 -515856 -329361 -74338
32052 -74338 43774 -90921 -402713 -591275 -415917 -28177 203838 189910 149946 156694
32042 156694 25557 -248012 -347673 -131278 99332 72837 -48990 -33001 3041 -98877
32032 -98877 -110591 233244 668046 688260 307897 41139 141666 329850 322863 192014
32022 192014 82192 -28803 -139826 -132509 -24886 -21570 -164496 -227949 -118931 -76239 -260469
32011 -260469 -427292 -277377 81926 309798 316359 288090 317163 283581 102154 -127017
32001 -127017 -251548 -223658 -111636 -36004 -73717 -162937 -154011 -18011 70764 -55630 -332549
31990 -332549 -530095 -494131 -259438 10007 138530 75174 -37512 -19563 90888 70671
31980 70671 -152936 -372321 -400513 -325355 -326497 -402714 -444129 -424024 -340705 -125928 175242
31969 175242 290895 59475 -242547 -224525 46369 153171 -12162 -100618 100126 327992
31959 327992 303649 175960 215480 324507 211685 -91460 -258556 -168507 -31063 14549
31949 14549 91986 263444 309034 42545 -347422 -514807 -409533 -277371 -256552 -224377
31939 -224377 -81901 31830 -74617 -387669 -734821 -986727 -1105807 -1095092 -1038799 -1124650
31929 -1124650 -1465309 -1915575 -2206452 -2257506 -2228208 -2266261 -2353298 -2417272 -2435910 -2368650 -2134596
31918 -2134596 -1754070 -1397569 -1188568 -1048176 -846318 -632700 -583764 -740581 -917670 -905527
31908 -905527 -705031 -516480 -498259 -576974 -564133 -454589 -458406 -636802 -689893 -358296 79937
31897 79937 80846 -378006 -685075 -427642 46321 181556 9268 -7982 269244 498556
31887 498556 410085 134252 -73744 -141068 -138162 -153299 -256985 -423721 -495535 -390005 -278153
31876 -278153 -334145 -398158 -198061 139621 178785 -174882 -491232 -422920 -150578 -18282
31866 -18282 -23056 65368 285779 468460 520370 485652 386164 198884 -39344 -246910 -386875
31855 -386875 -444351 -373079 -165323 70714 188501 135336 -22433 -156546 -157048 -36135 53991
31844 53991 1124 -99480 -81572 38344 110565 99256 70741 -2723 -159274 -220216 11490
31833 11490 331047 309969 -44194 -245461 -84608 43091 -191749 -514666 -532214 -355846
31823 -355846 -316347 -379913 -318806 -214061 -287607 -398960 -215699 188277 372929 159842
31813 159842 -181487 -374312 -398229 -308515 -127946 60611 180516 286217 385721 277326
31803 277326 -121082 -451940 -342402 -11566 25392 -232095 -290751 27324 360106 440638
31793 440638 387244 255557 -102913 -540384 -565219 -95149 280929 159932 -54551 162266
31783 162266 576941 549228 -5902 -550625 -694451 -563088 -435156 -390949 -344883 -177769
31773 -177769 153322 485271 545456 337834 241399 499892 817395 750244 330578 -24750
31763 -24750 -103225 -58160 -53828 -77236 -88854 -82233 7882 227889 456072 540516 537401 590607
31751 590607 636719 487052 169774 -76905 -155036 -196000 -276885 -299730 -218074 -159353 -215590
31740 -215590 -277156 -193614 -5565 82238 -67938 -360644 -534939 -425051 -152237 13173
31730 13173 -29122 -156557 -276280 -406176 -455981 -226425 209687 424403 192417 -129334
31720 -129334 -102985 136218 119301 -224543 -514090 -520747 -391973 -284477 -200814 -222153 -473796
31709 -473796 -766907 -688581 -202822 208740 193874 -13441 4418 282302 544740 603940
31699 603940 450475 146061 -154509 -248823 -150367 -131379 -321598 -472704 -341308 -88504
31689 -88504 -13050 -68941 5665 185302 161536 -145997 -425922 -408207 -192010 -32664 -24101
31678 -24101 -116574 -257684 -362983 -291258 -18420 249497 288544 127738 -24952 -76098
31668 -76098 -113398 -197384 -255455 -226153 -166641 -138433 -96338 15320 143284 204710 213337
31657 213337 216696 176199 40616 -116444 -181796 -187381 -252788 -379067 -476209 -554101 -660492
31646 -660492 -657031 -355561 83644 234621 19800 -110515 157670 493762 417989 37953
31636 37953 -141435 2856 89223 -120384 -378244 -363762 -111650 117430 164266 40477
31626 40477 -160142 -314366 -346141 -300403 -254608 -185951 -51928 61013 46343 -22330 -833
31615 -833 70508 45690 -43914 -40097 39115 23692 -77401 -46685 200328 481653 584220
31604 584220 429691 53127 -327668 -311100 257237 895002 946110 448153 80334 185463
31594 185463 366385 225890 -34558 -64878 60755 119025 202598 467799 702096 591725
31584 591725 233432 -14044 -31797 51843 176337 312584 285902 15948 -213783 -107814
31574 -107814 162416 232424 151934 247274 465062 392491 -21233 -285948 -87379 248967
31564 248967 255196 -46763 -284404 -278756 -170482 -117403 -104161 -41717 80141 165150 107816
31553 107816 -75374 -240829 -282324 -236579 -163743 -34656 143647 216248 79339 -100376
31543 -100376 -71386 161885 388277 512370 599508 650214 578920 403981 231331 67815
31533 67815 -125414 -239211 -144682 17919 -9529 -156290 -71326 311270 604324 509423
31523 509423 214111 56555 69678 99879 157707 352442 578519 542788 124292 -447374
31513 -447374 -801734 -751648 -422424 -100574 52793 118946 221044 301320 231331 65271
31503 65271 -14981 26965 77247 119041 243450 411308 467196 416714 409788 412522 225767
31492 225767 -86187 -161951 85538 234451 -40107 -450109 -522612 -282742 -118154 -141239
31482 -141239 -111104 81800 260809 311857 339078 402789 390701 246159 94004 40691 38978
31471 38978 43314 125295 319618 486294 452770 228272 -13178 -124512 -98392 -16177 55508
31460 55508 98349 97243 23643 -86288 -95578 75848 284318 309969 173611 109916 187955
31449 187955 207415 80911 36821 222925 363351 132063 -299505 -457954 -241623 -24476
31439 -24476 -63723 -154105 7054 373362 628332 562916 262965 8914 26912 257681
31429 257681 398808 280014 104954 145496 314000 314699 141670 74616 179165 198652 34560
31418 34560 -46513 144399 413955 541138 618608 774093 837040 609399 255653 80665
31408 80665 70766 -7851 -171773 -229163 -157173 -129690 -192071 -226587 -234103 -329170 -437262 -330698
31396 -330698 -31295 152155 101241 82517 293411 508860 425239 130700 -53508 -58985
31386 -58985 -102116 -287258 -452875 -437596 -289505 -158956 -140109 -263555 -493549 -658327
31376 -658327 -523671 -72227 356773 362182 -59910 -469407 -469779 -156326 50392 -26691 -122546
31365 -122546 29872 276690 276555 36598 -74087 145915 463840 570088 462557 323741
31355 323741 217578 113939 74514 184920 369577 476271 500072 534418 542668 392413
31345 392413 115360 -82695 -115353 -126544 -236587 -347404 -301799 -112401 63029 83490
31335 83490 -95122 -387828 -570102 -439760 -85558 134014 -4069 -318947 -484429 -426048
31325 -426048 -294187 -165471 -10206 95973 -1463 -257722 -414584 -354052 -258667 -297590
31315 -297590 -351082 -231355 -22827 38657 -48482 -44870 140356 291945 202053 -48765 -240505
31304 -240505 -295445 -275513 -215369 -117641 -41612 -32785 -958 171280 408099 485045 312491
31293 312491 35709 -169574 -256354 -229462 -81998 102663 137709 -44664 -255999 -262388
31283 -262388 -57547 182454 327002 343793 213329 -36832 -250332 -260504 -90548 89872
31273 89872 185701 223075 213813 143713 85072 135450 223274 159367 -72936 -261230 -262626 -180553
31261 -180553 -160829 -192264 -219122 -270721 -335132 -277129 -69516 41371 -167438 -530195 -678112
31250 -678112 -548203 -436908 -517854 -575939 -352296 40808 236187 60232 -291860 -506839
31240 -506839 -458298 -249995 -50617 58085 101709 140097 195981 238214 213722 105329 -25897
31229 -25897 -87207 -85452 -165087 -417640 -678851 -665214 -346945 -24861 47785 -41891 -81946
31218 -81946 -76242 -157256 -277568 -263920 -147661 -153959 -315684 -375403 -189732 17049 -15374
31207 -15374 -197989 -268571 -211847 -231309 -360486 -391705 -231829 -67218 -54799 -62193 99926
31196 99926 334340 380707 222708 119471 198783 263617 127307 -68582 -81847 23964
31186 23964 -26555 -260222 -378526 -198983 92817 255363 311365 370765 352829 151386
31176 151386 -65426 -27485 220064 368571 306384 222216 200570 34294 -405286 -862681
31166 -862681 -965563 -640301 -100546 416495 728592 691737 343376 -28218 -176399 -192238
31156 -192238 -305948 -479529 -466015 -247854 -109871 -198026 -279559 -102102 209900 316766
31146 316766 105540 -216072 -405774 -403619 -295843 -211202 -251741 -403962 -508238 -418675
31136 -418675 -202541 -80099 -150834 -286740 -331050 -284254 -214451 -91483 145834 396359
31126 396359 437610 213357 -43983 -80465 65762 146693 64161 -23713 -2779 -28948 -285188
31115 -285188 -607686 -592753 -124065 398637 483956 92064 -371106 -519201 -307631 42179
31105 42179 262180 183026 -166357 -540865 -671626 -530427 -321973 -205663 -155513 -121166
31095 -121166 -149179 -245176 -277190 -165085 -41295 -54754 -120083 -57985 93620 136005 42764
31084 42764 -4875 67653 112828 14297 -162242 -340541 -530518 -657130 -537626 -188551
31074 -188551 75732 64715 20835 232357 517511 458098 62742 -214891 -157192 -70813
31064 -70813 -237023 -451928 -400784 -204911 -212017 -390731 -359494 -22372 230464 101612
31054 101612 -164398 -151410 141036 374142 390125 319683 216270 -37827 -359559 -360349 118286
31043 118286 602617 487613 -126045 -466346 -52533 679909 924949 488110 -46179 -79001
31033 -79001 340574 710659 735498 573453 468552 379954 125762 -238086 -417587 -275030
31023 -275030 -23312 58704 -53385 -195545 -244770 -149453 110158 410822 479067 217979
31013 217979 -75807 -67342 159225 290081 312084 458375 659474 520197 -39502 -556251
31003 -556251 -643999 -469305 -364058 -320625 -185006 -50129 -90732 -218582 -248374 -228512
30993 -228512 -273951 -250525 5655 298034 286223 -1619 -243333 -322418 -369365 -381087 -226478
30982 -226478 -12091 -6205 -163704 -151619 87142 231176 152174 140579 369130 555542
30972 555542 432961 194705 143294 184113 32732 -267878 -403451 -264873 -52315 55788
30962 55788 75706 73805 66048 68607 85527 52260 -69813 -164673 -73641 163937 317027 243520
30950 243520 67076 16856 135823 219508 79190 -179898 -259323 -76507 89190 -9812
30940 -9812 -213883 -210255 -41106 -25643 -197126 -196817 162274 569104 649766 460116 311416
30929 311416 311454 333453 305774 283575 292040 291248 268650 237684 183470 100498 29983 -101 1162
30916 1162 48413 148344 199554 97585 -37542 39001 310777 465247 347703 185441 210439
30905 210439 321837 317997 220719 144665 63644 -54560 -83432 42614 133350 22945 -142439
30894 -142439 -165702 -150983 -283643 -436651 -354925 -109499 -2116 -97376 -208619 -287429
30884 -287429 -447878 -618563 -557505 -267798 -54751 -86440 -205055 -267851 -371725 -591011
30874 -591011 -745127 -623040 -295985 -46398 -49367 -208398 -270265 -86991 207505 335996
30864 335996 229528 101290 82397 4040 -255376 -439660 -260764 90571 179882 -6796
30854 -6796 -63944 164155 346038 188475 -177211 -462796 -550558 -429220 -123493 164544
30844 164544 143969 -166606 -391375 -298349 -80510 16571 52158 157999 210790 11872
30834 11872 -366283 -650572 -680100 -486851 -189949 48418 95473 1528 -55459 -59869 -191286
30823 -191286 -468187 -616239 -463915 -221580 -148282 -169337 -82493 58700 66719 -26867 -56789
30812 -56789 -64051 -227028 -489408 -571906 -395431 -229416 -321314 -558122 -613908 -353608 -2724
30801 -2724 92774 -134257 -368916 -298115 -31138 63835 -81976 -152880 -4888 60169 -193451
30790 -193451 -492585 -478386 -300780 -345215 -541391 -458939 -55093 192851 1077 -333724
30780 -333724 -443633 -389050 -396765 -422754 -296886 -102185 -86276 -276351 -436884 -381001 -142903
30769 -142903 122843 261888 189608 -6227 -75955 119329 374743 354008 41832 -190059
30759 -190059 -29033 404556 715445 662580 333419 -27564 -237002 -252491 -167131 -145295
30749 -145295 -263341 -383921 -283493 53599 369850 427466 260036 41557 -166464 -371394
30739 -371394 -456255 -277091 53069 227311 154562 74944 161456 239156 80705 -206161
30729 -206161 -320310 -186037 2038 93056 117546 136352 163537 245761 421241 571755
30719 571755 505259 242027 41332 55793 117345 -7208 -268137 -402464 -301039 -139301
30709 -139301 -110001 -155192 -67911 187467 386742 326108 94498 -42709 17298 136680
30699 136680 196501 258178 389111 486904 421255 254165 166516 214772 291517 293133 213439
30688 213439 106334 57697 146888 331278 427174 317605 108057 -47000 -168612 -325224
30678 -325224 -382938 -144036 288350 553266 478934 242533 29244 -200698 -482505 -634975
30668 -634975 -481778 -133745 134551 191646 97094 -40635 -111228 -21001 180837 288181
30658 288181 190539 33205 -18550 -35007 -141775 -221520 -74396 193519 256309 52102
30648 52102 -132539 -133983 -147229 -324707 -426781 -146806 386310 729928 688703 483925
30638 483925 365917 314984 204564 54638 -19874 -4201 8174 -35757 -87825 -80953 -11890
30627 -11890 68066 116352 133221 123842 47387 -130837 -313324 -293132 -105 343141 445420
30616 445420 294405 135597 128799 207491 286193 379981 438433 297105 -39263 -257290 -98252
30605 -98252 266773 452268 357121 212206 194807 254879 311912 369194 401436 357335 313089
30594 313089 401698 552584 548161 398439 379516 586577 748163 677930 621051 858765 1193583
30583 1193583 1200228 875138 637934 683861 720946 473283 117535 -12405 54582 -14452
30573 -14452 -340322 -632502 -574891 -248244 -35190 -154573 -419389 -487434 -250376 107315
30563 107315 357734 402969 235763 -89495 -395269 -454384 -234337 36678 137184 75645
30553 75645 -40784 -209162 -442275 -598033 -512401 -265873 -128358 -236354 -469938 -639257
30543 -639257 -650277 -501504 -275724 -143950 -226915 -427766 -532614 -491424 -457979 -524946
30533 -524946 -573404 -461094 -250920 -161572 -329168 -654468 -867927 -771329 -457097 -228236
30523 -228236 -236191 -303745 -228826 -125615 -233479 -474395 -507427 -238634 30433 49228 -79433
30512 -79433 -186495 -342203 -640902 -892536 -821519 -480787 -205623 -176483 -241775 -192448
30502 -192448 -41162 30716 -85099 -282118 -328357 -119422 171691 291932 246648 264653
30492 264653 379159 291949 -168207 -673462 -766620 -477975 -261955 -367009 -586463 -652234
30482 -652234 -552035 -358179 -45420 333241 520268 340608 -18440 -234093 -261881 -295604
30472 -295604 -361984 -214625 296284 937957 1310252 1256480 948896 628009 391260 239439
30462 239439 190513 249214 325828 305674 204246 147159 161247 101110 -122312 -330478 -246422
30451 -246422 137257 499375 533494 246385 -119701 -352588 -396030 -309587 -202062 -160210
30441 -160210 -168293 -132518 -38649 -22942 -196723 -443220 -502794 -267310 96011 326694 303170
30430 303170 87865 -164608 -303559 -271172 -169910 -194460 -420618 -682225 -726541 -486594
30420 -486594 -138731 106292 194919 197199 171572 136556 124647 162255 195040 127727 -26564
30409 -26564 -120729 -64168 29978 -7588 -143137 -169256 -24485 61727 -140113 -513719 -708317
30398 -708317 -587907 -398250 -413111 -556921 -528652 -236416 68674 119247 -51825 -198408
30388 -198408 -161074 22905 240453 406035 460835 387956 251341 134623 28407 -130313
30378 -130313 -295132 -311594 -138416 52255 85192 -14066 -131539 -259098 -410372 -443759
30368 -443759 -205168 179402 407236 425017 483713 680132 743966 486435 191471 234904
30358 234904 482198 459153 79852 -209986 -106527 121770 94786 -94879 -79195 174287
30348 174287 304953 95079 -239590 -376909 -287084 -175849 -167257 -192771 -146502 -22691
30338 -22691 118526 242168 344002 394727 341760 188382 25177 -61622 -78495 -68173 -14597
30327 -14597 96980 159373 31479 -227709 -359949 -210024 93431 324545 393574 312496
30317 312496 90939 -184558 -301806 -146126 107650 213356 196704 272442 459691 523497
30307 523497 336241 76837 -27820 833 -26441 -188330 -366064 -397578 -251259 -51566
30297 -51566 55183 58523 63166 97775 51977 -122281 -277409 -275884 -206735 -214048 -228561 -113065
30285 -113065 16975 -76042 -326496 -399290 -191741 15341 -7668 -157405 -256452 -287139
30275 -287139 -234990 -19671 243947 245558 -35497 -178560 60656 320013 198272 -55540
30265 -55540 83843 559712 820971 704744 640835 884221 1090267 884127 420533 90648
30255 90648 3002 54454 245797 587589 860690 802404 467968 155901 23398 -7435
30245 -7435 -9081 57515 196109 298052 254743 59755 -183909 -287013 -88808 324710 605076
30234 605076 516789 261990 224401 433890 544300 366711 136813 125357 236720 206833
30224 206833 22677 -107323 -103962 -82468 -99365 -79144 -19412 -53260 -241174 -472708 -641942
30213 -641942 -763626 -846147 -807828 -612076 -354795 -138539 11770 57241 -50582 -197661
30203 -197661 -157541 60183 140884 -85533 -368487 -432907 -393624 -468707 -525020 -317289 -5030
30192 -5030 39741 -152170 -224323 -158468 -316334 -743358 -980917 -760218 -390025 -218993
30182 -218993 -170672 -76885 -22148 -49678 29650 185373 -8229 -648484 -1057431 -642603
30172 -642603 140557 346208 -164004 -667337 -706703 -550227 -494998 -413812 -194812 -56065
30162 -56065 -144595 -251793 -184297 -69355 -73672 -136952 -183762 -298631 -496505 -601746 -541528
30151 -541528 -488998 -541386 -541362 -411642 -374170 -593158 -855109 -874853 -717208 -642243 -691556
30140 -691556 -697950 -595374 -471201 -375408 -276783 -160695 -28087 131300 251250 184921
30130 184921 -85645 -353311 -431121 -376169 -341714 -343862 -325349 -312029 -326669 -265634 -54429
30119 -54429 170154 232231 192928 241281 352907 281216 -87307 -544642 -778598 -665149
30109 -665149 -320617 28317 194795 146378 22934 823 120637 276232 356198 336125
30099 336125 233763 56432 -148824 -242508 -103327 165932 247880 -44397 -480170 -644376
30089 -644376 -461182 -269781 -317408 -437620 -392977 -273521 -284573 -348160 -256669 -84677
30079 -84677 -72775 -178123 -136183 49623 89381 -80718 -173737 -44835 67603 -60058
30069 -60058 -327665 -541586 -635257 -532069 -148733 286519 292638 -229180 -736502 -704585
30059 -704585 -272600 51108 67555 -49565 -151256 -218357 -189725 1150 266701 453779
30049 453779 524540 507737 398555 238741 130248 46815 -158099 -439074 -534307 -405395
30039 -405395 -359981 -512958 -508023 -105459 320662 298842 -34886 -227387 -241366 -354164
30029 -354164 -513329 -398560 -68081 43867 -181136 -380584 -322126 -189835 -135672 -15721
30019 -15721 231757 355365 182130 -81176 -181397 -188387 -281210 -377488 -259915 18567
30009 18567 106144 -228248 -760342 -983732 -652770 -96497 152991 34314 -2810 277125
29999 277125 489958 238380 -202180 -249959 133370 459712 481128 420385 446701 438473 347874
29988 347874 333168 407090 372197 221505 189196 286435 228471 -20759 -92263 176540 414805
29977 414805 286172 -14598 -152901 -177150 -283396 -368615 -229909 10140 77087 -7857
29967 -7857 -19076 54128 33703 -75112 -71733 95770 249009 246596 119318 -55538 -234618
29956 -234618 -373169 -449071 -493269 -496450 -366096 -84523 195093 326467 326529 248288 63564
29945 63564 -183301 -296098 -208803 -178289 -444107 -821721 -906314 -604273 -193647 98905
29935 98905 304532 483765 550425 416059 153031 -72591 -158280 -132120 -116039 -205715 -348806
29924 -348806 -399651 -322238 -225512 -156450 -31609 138501 173678 32063 -30624 155762 339441
29913 339441 202343 -103912 -148516 124892 329529 234837 43582 -33002 -114454 -365995
29903 -365995 -648570 -701345 -512044 -283935 -133941 -18790 93488 151644 121285 45996
29893 45996 -4320 8120 71227 126495 110786 20300 -88259 -164630 -197619 -187307 -136349
29882 -136349 -67192 -1772 57573 78220 -17174 -220704 -351360 -243862 -4242 93516 -21856
29871 -21856 -143394 -137653 -161404 -388896 -696059 -816123 -710507 -574228 -515598 -445183 -301558
29860 -301558 -188074 -200749 -261435 -230829 -108202 -26540 -93108 -294450 -515257 -611319 -527462
29849 -527462 -386326 -376119 -488744 -474490 -163561 266621 495680 455641 335698 243553
29839 243553 104016 -83545 -147415 -13264 146859 181695 188685 310110 482609 587558
29829 587558 675986 797528 765258 409307 -33827 -154091 22378 41981 -279548 -551118
29819 -551118 -382398 59464 334640 331820 272059 251272 111394 -231483 -579958 -650470
29809 -650470 -361588 94139 401051 383386 191396 156236 380737 590965 526358 338413
29799 338413 368581 603230 648348 297185 -157320 -333323 -269288 -288132 -466876 -524362
29789 -524362 -266285 105751 273530 230896 229125 359042 425065 286739 111998 137483
29779 137483 309224 352547 144418 -169129 -416155 -575012 -669583 -657062 -512831 -318918
29769 -318918 -174953 -88691 -27406 -17569 -112901 -286579 -415010 -380620 -190458 945 21473
29758 21473 -125763 -241477 -163713 25761 110866 4056 -206047 -413703 -562611 -595259
29748 -595259 -505961 -434124 -525824 -689792 -676165 -430469 -174463 -76682 -49621 21372 49618
29737 49618 -82779 -268031 -283720 -102470 76733 97115 14073 -31433 -25280 -94787 -298671
29726 -298671 -457718 -309258 130863 500764 513132 324943 309604 557143 821021 891197
29716 891197 764909 486285 99380 -235834 -359043 -353764 -398036 -391726 -91322 370083
29706 370083 538002 323703 177302 372204 572922 411440 70417 -81579 -63104 -57809
29696 -57809 53520 437193 816508 767054 371787 86608 44616 -12980 -169047 -213724
29686 -213724 -125305 -171120 -415075 -552198 -382098 -87828 100144 194535 267855 277340 211285
29675 211285 146355 55893 -161964 -381108 -302941 53126 261990 93228 -130307 -33427
29665 -33427 242567 293693 63958 -147551 -171731 -127075 -132901 -160700 -191706 -283514 -423454
29654 -423454 -490121 -424208 -321448 -312510 -432621 -622263 -772852 -764881 -552077 -239692 -19038
29643 -19038 5058 -111145 -249418 -353861 -440528 -530382 -614989 -673490 -681027 -596652 -392917
29632 -392917 -128928 60106 114698 145385 266844 372278 243418 -87922 -290368 -158901
29622 -158901 84866 89051 -164041 -393158 -430701 -372946 -339642 -299609 -184111 -28302 62340
29611 62340 25276 -83015 -97784 87635 314216 256220 -161870 -608362 -762793 -709914
29601 -709914 -693688 -673916 -459173 -151584 -61495 -206778 -285907 -177877 -89099 -135282 -159464
29590 -159464 -84351 -77714 -208348 -282515 -197861 -113615 -75411 143359 554375 706727 320475
29579 320475 -161529 -134950 288072 494092 319760 199870 366673 501492 351093 161041
29569 161041 201520 282841 113227 -168296 -228897 -115618 -161514 -401814 -506263 -316942
29559 -316942 -67396 38153 115210 289806 402065 276693 67018 30212 109378 64547
29549 64547 -69722 -21216 228224 364695 250256 149112 262500 361706 159784 -195074
29539 -195074 -320698 -140721 96220 228652 281034 211669 -76205 -437529 -530106 -264547
29529 -264547 44618 89860 -84580 -256836 -332883 -335884 -265528 -128343 9739 133531
29519 133531 337656 656067 931049 978538 811302 584297 384388 196246 36579 -11820
29509 -11820 68019 133850 -14986 -423629 -881616 -1085492 -930733 -598280 -323853 -161650
29499 -161650 -35645 82633 167597 229543 275384 245421 122488 24657 41846 80796 50937
29488 50937 74685 260101 383968 143396 -323593 -550519 -403236 -233341 -278628 -326527
29478 -326527 -170975 -14234 -109602 -299353 -258547 -8287 153324 115927 43766 63680
29468 63680 137119 210791 264003 221804 15073 -277697 -491181 -544605 -443482 -203045 83140
29457 83140 202146 41439 -213850 -286636 -161480 -61503 -125292 -286733 -436315 -518868
29447 -518868 -488125 -328842 -120084 44217 152082 177932 6660 -356538 -616230 -495577
29437 -495577 -157313 -17325 -151458 -227581 -85608 -4981 -204497 -418857 -293629 25088
29427 25088 80876 -204228 -422702 -301974 -76969 -88772 -285923 -358747 -205089 -8938
29417 -8938 73876 72230 51262 18190 9274 87284 194306 164766 -53267 -338234 -601183
29406 -601183 -854558 -990747 -741505 -67553 595838 751280 407504 -2596 -188535 -221346
29396 -221346 -234897 -211132 -116957 -21961 -3760 -90280 -302935 -582992 -702962 -483165 -95392
29385 -95392 99845 31123 -47036 -24515 -108353 -407840 -670067 -628160 -361286 -102238 92438
29374 92438 263240 336767 240123 95265 80543 191310 304569 368583 369304 237637 -28529
29363 -28529 -254825 -278630 -168019 -109544 -158624 -221084 -196028 -48465 150880 207551 -1711
29352 -1711 -268007 -235129 66219 188052 -64450 -295795 -133924 177568 205554 49026
29342 49026 122075 390890 391232 -19331 -455609 -617156 -624436 -616832 -472400 -148798 71666
29331 71666 -47144 -341427 -510700 -516208 -482019 -401490 -214044 -36469 -33924 -118150 -34910
29320 -34910 240003 419282 290352 12047 -99632 9094 76368 -104719 -399601 -511765
29310 -511765 -369484 -185077 -138407 -170510 -149334 -75812 -10666 63218 153953 151492 -12557
29299 -12557 -177557 -129737 75491 177391 91644 9588 66367 119901 -14229 -253018 -339977
29288 -339977 -201347 -53488 -116319 -326813 -443569 -401511 -404925 -589891 -747679 -583113
29278 -583113 -176077 71285 -32397 -247597 -295986 -209911 -148690 -116169 -65640 -79428 -208909
29267 -208909 -299735 -217186 -102461 -154537 -288801 -288171 -184982 -184114 -264968 -185264 102253
29256 102253 329272 277858 38915 -172186 -276285 -331210 -411804 -557284 -749423 -909321
29246 -909321 -969726 -940412 -876358 -855497 -1005359 -1391957 -1824318 -1992578 -1919868 -2009771 -2448346
29235 -2448346 -2851891 -2801338 -2444850 -2185070 -2014800 -1644906 -1129919 -824393 -767010 -648106
29225 -648106 -418805 -396237 -648067 -777205 -514150 -98121 138537 185555 151156 11530
29215 11530 -207167 -326145 -319375 -409644 -642449 -696464 -380324 -3572 50070 -150710 -290941
29204 -290941 -285470 -217150 -37249 287086 495790 313391 -79182 -227612 -25008 202893
29194 202893 232702 207508 290125 373419 298052 131384 35013 -12000 -159763 -400258 -513387
29183 -513387 -354798 -79365 45793 13894 98481 439533 778516 770598 439650 95719
29173 95719 -126535 -358299 -621515 -691988 -469313 -212987 -205378 -359057 -368662 -141526 111488
29162 111488 155787 -36340 -294480 -398706 -265222 -34039 90238 88430 100964 164322
29152 164322 166488 97611 110007 229495 241182 17329 -251719 -345754 -348335 -461112 -625486
29141 -625486 -596114 -335331 -89851 -64936 -207789 -343534 -384001 -361142 -351283 -405632 -499857
29130 -499857 -529486 -390182 -90395 204293 257289 -25675 -417310 -512384 -184424 191505
$$ [...]
##END NTUPLES=NMR SPECTRUM
##END=
