##TITLE=31Pdec_LR-741-RM7
 , 24 sc
 19.11.2021
##JCAMPDX= 6.0         $$ Bruker NMR JCAMP-DX V2.0
##DATA TYPE= NMR SPECTRUM
##DATA CLASS= NTUPLES
##ORIGIN= UXNMR, Bruker Analytische Messtechnik GmbH
##OWNER= root
$$ XWIN-NMR		Version 3.5
$$ Fri Nov 19 11:17:11 2021 Russian Standard Time (UT+4h)  she@DPX200
##.OBSERVE FREQUENCY= 81.013821
##.OBSERVE NUCLEUS= ^31P
##.ACQUISITION MODE= SIMULTANEOUS
##.ACQUISITION SCHEME= undefined
##.AVERAGES= 24
##.DIGITISER RES= 16
##SPECTROMETER/DATA SYSTEM= spect
##.PULSE SEQUENCE= zgpg30
##.SOLVENT NAME= CDCl3
##.SHIFT REFERENCE= (INTERNAL, CDCl3, 0, 248.564)
##AUDIT TRAIL= $$ (NUMBER, WHEN, WHO, WHERE, WHAT)
$$ ##TITLE= Audit trail, XWIN-NMR		Version 3.5
$$ ##JCAMPDX= 5.01
$$ ##ORIGIN= Bruker BioSpin GmbH
$$ ##OWNER= she
$$ F:/spectra/data/she/nmr/P31/1/pdata/1/auditp.txt
$$ ##AUDIT TRAIL=  $$ (NUMBER, WHEN, WHO, WHERE, WHAT)
(   1,<2021-11-19 11:15:15.07 +0400>,<she>,<DPX200>,
      <created by zg, POWCHK disabled, PULCHK disabled
       configuration hash MD5:
       00 E9 B6 7A A2 85 ED C7 34 08 36 98 17 FE 4E 26
       data hash MD5: 32K
       14 69 7B 38 1E 38 9F D0 F0 28 7B 41 C4 E2 66 B2>)
(   2,<2021-11-19 11:15:59.70 +0400>,<she>,<DPX200>,
      <Start of raw data processing
       efp BC_mod = 2 LB = 1 FT_mod = 6 PKNL = 1 PHC0 = -9134.084 PHC1 = -11.33051 SI = 64K 
       data hash MD5: 64K
       3C B8 2F 2D F1 59 27 99 1E 9E BF A2 E3 A5 91 76>)
(   3,<2021-11-19 11:16:33.12 +0400>,<she>,<DPX200>,
      <pk PHC0 = -23.51174 PHC1 = 24.00001 
       data hash MD5: 64K
       5F 34 47 0B 30 DC 4D B9 C5 8A 8D 14 9C E4 39 72>)
(   4,<2021-11-19 11:16:40.92 +0400>,<she>,<DPX200>,
      <abs ABSG = 5 
       data hash MD5: 64K
       F0 BA 78 E3 B3 45 09 EC 06 0F 5F 26 1C 32 8F B4>)
$$ ##END=
$$ 
$$ hash MD5
$$ F5 D0 8B EF 43 CA 3B EF C9 41 0D 9E 0D CA 4C 0E
##$RELAX= 
##$RELAX= 
##$RELAX= 
##$RELAX= 
##$RELAX= 
##$RELAX= 
##$RELAX= 
##$RELAX= 
$$ Bruker specific parameters
$$ --------------------------
##$DU= <F:/spectra>
##$EXPNO= 1
##$NAME= <P31>
##$PROCNO= 1
##$TYPE= <nmr>
##$USER= <she>
##$AMP= (0..31)
100 100 100 100 100 100 100 100 100 100 100 100 100 100 100 100 100 100 
100 100 100 100 100 100 100 100 100 100 100 100 100 100 
##$AQSEQ= 0
##$AQ_mod= 1
##$AUNM= <au_zg>
##$AUTOPOS= <>
##$BF1= 81.014009
##$BF2= 200.13
##$BF3= 200.13
##$BF4= 200.13
##$BF5= 200.13
##$BF6= 200.13
##$BF7= 200.13
##$BF8= 200.13
##$BYTORDA= 1
##$CFDGTYP= 0
##$CFRGTYP= 5
##$CHEMSTR= <none>
##$CNST= (0..31)
1 1 145 1 1 1 1 1 1 1 1 1 1 1 1 1 1 1 1 1 1 1 1 1 1 1 1 1 1 1 1 1 
##$CPDPRG= <waltz16>
##$CPDPRG1= <>
##$CPDPRG2= <waltz16>
##$CPDPRG3= <>
##$CPDPRG4= <mlev>
##$CPDPRG5= <mlev>
##$CPDPRG6= <mlev>
##$CPDPRG7= <mlev>
##$CPDPRG8= <mlev>
##$CPDPRGB= <>
##$CPDPRGT= <>
##$D= (0..31)
0 1 0 0 0 0 0 0 0 0 0 0.03 2e-05 3e-06 0 0 0 0 0 0 0 0 0 0 0 0 0 0 0 0 
0 0 
##$DATE= 1637306114
##$DBL= (0..7)
120 120 120 11 120 120 24 19 
##$DBP= (0..7)
150 150 150 150 150 150 150 150 
##$DBP07= 0
##$DBPNAM0= <>
##$DBPNAM1= <>
##$DBPNAM2= <>
$$ [...]
##$SUBNAM3= <"">
##$SUBNAM4= <"">
##$SUBNAM5= <"">
##$SUBNAM6= <"">
##$SUBNAM7= <"">
##$SUBNAM8= <"">
##$SUBNAM9= <"">
##$SW= 501.771253377433
##$SWIBOX= (0..15)
0 1 3 0 0 0 0 0 0 0 0 0 0 0 0 0 
##$SW_h= 40650.406504065
##$TD= 32768
##$TD0= 1
##$TE= 0
##$TE2= 300
##$TE3= 300
##$TEG= 300
##$TL= (0..7)
0 120 53 12 22 120 120 120 
##$TP= (0..7)
150 150 150 150 150 150 150 150 
##$TP07= 0
##$TPNAME0= <>
##$TPNAME1= <>
##$TPNAME2= <>
##$TPNAME3= <>
##$TPNAME4= <>
##$TPNAME5= <>
##$TPNAME6= <>
##$TPNAME7= <>
##$TPOAL= (0..7)
0.5 0.5 0.5 0.5 0.5 0.5 0.5 0.5 
##$TPOFFS= (0..7)
0 0 0 0 0 0 0 0 
##$TUNHIN= 0
##$TUNHOUT= 0
##$TUNXOUT= 0
##$USERA1= <user>
##$USERA2= <user>
##$USERA3= <user>
##$USERA4= <user>
##$USERA5= <user>
##$V9= 5
##$VALIST= <valist>
##$VCLIST= <CCCCCCCCCCCCCCC>
##$VD= 0
##$VDLIST= <DDDDDDDDDDDDDDD>
##$VPLIST= <PPPPPPPPPPPPPPP>
##$VTLIST= <TTTTTTTTTTTTTTT>
##$WBST= 1024
##$WBSW= 4
##$XGAIN= (0..3)
0 0 0 0 
##$XL= 0
##$YL= 0
##$YMAX_a= 15692
##$YMIN_a= -18646
##$ZGOPTNS= <>
##$ZL1= 120
##$ZL2= 120
##$ZL3= 120
##$ZL4= 120
##$ABSF1= 248.5645
##$ABSF2= -253.2056
##$ABSG= 5
##$ABSL= 3
##$ALPHA= 0
##$AQORDER= 0
##$ASSFAC= 0
##$ASSFACI= 0
##$ASSFACX= 0
##$ASSWID= 0
##$AUNMP= <proc_1d>
##$AZFE= 0.1
##$AZFW= 0.5
##$BCFW= 0
##$BC_mod= 2
##$BYTORDP= 0
##$COROFFS= 0
##$CY= -3
##$DATMOD= 1
##$DC= 0
##$DFILT= <>
##$DTYPP= 0
##$F1P= 0
##$F2P= 0
##$FCOR= 1
##$FTSIZE= 65536
##$FT_mod= 6
##$GAMMA= 0
##$GB= 0
##$INTBC= 1
##$INTSCL= 5.30512e-09
##$ISEN= 30
##$LB= 1
##$LEV0= 0
##$LPBIN= 0
##$MAXI= 10000
##$MC2= 0
##$MEAN= 0
##$ME_mod= 0
##$MI= 50
##$NCOEF= 0
##$NC_proc= -5
##$NLEV= 6
##$NOISF1= 182.463
##$NOISF2= 159.3651
##$NSP= 0
##$NTH_PI= 0
##$NZP= 0
##$OFFSET= 248.5645
##$PC= 4
##$PHC0= -9157.596
##$PHC1= 12.6695
##$PH_mod= 1
##$PKNL= yes
##$PPARMOD= 0
##$PSCAL= 0
##$PSIGN= 0
##$REVERSE= no
##$SF= 81.014009
##$SI= 65536
##$SIGF1= 159.3651
##$SIGF2= -187.1042
##$SINO= 113.3802
##$SIOLD= 16384
##$SREGLST= <1H.CDCl3>
##$SSB= 0
##$STSI= 65536
##$STSR= 0
##$SW_p= 40650.406504065
##$SYMM= 0
##$S_DEV= 0
##$TDeff= 32768
##$TDoff= 0
##$TI= <>
##$TILT= no
##$TM1= 0
##$TM2= 0
##$TOPLEV= 0
##$USERP1= <user>
##$USERP2= <user>
##$USERP3= <user>
##$USERP4= <user>
##$USERP5= <user>
##$WDW= 1
##$XDIM= 65536
##$YMAX_p= 490000248
##$YMIN_p= -21203097
$$ End of Bruker specific parameters
$$ ---------------------------------
##NTUPLES= NMR SPECTRUM
##VAR_NAME=  FREQUENCY,     SPECTRUM/REAL,   SPECTRUM/IMAG
##SYMBOL=    X,             R,               I
##VAR_TYPE=  INDEPENDENT,   DEPENDENT,       DEPENDENT
##VAR_FORM=  AFFN,          ASDF,            ASDF
##VAR_DIM=   65536,         65536,           65536
##UNITS=     HZ,            ARBITRARY UNITS, ARBITRARY UNITS
##FACTOR=    0.620285442955139, 1,           1
##FIRST=     20137.2065510759, 0,            0
##LAST=      -20513.1999529892, 0,           0
##MIN=       -20513.1999529892, -21203097,   0
##MAX=       20137.2065510759, 490000248,    0
$$ Real data points
##PAGE= N=1
##DATA TABLE= (X++(R..R)), XYDATA
$$ [...]
$$ plain form
41546 -578074 -197247 -171766 -447936 -544406 -464397 -550721 -736226 -717163 -647218 -848263 -997749
41535 -997749 -501980 357076 595862 -16385 -603679 -560075 -375532 -621236 -913385 -551613
41525 -551613 351709 1050496 1146982 832969 391497 -29773 -277457 -242312 -25242 163548
41515 163548 197557 51164 -178322 -238758 -24436 80038 -396424 -1202958 -1528509 -1145654
41505 -1145654 -760039 -910917 -1189559 -1033443 -677944 -670152 -917562 -943433 -747125 -677564
41495 -677564 -702824 -563932 -491575 -952267 -1672538 -1719041 -768155 351420 692097 277345
41485 277345 -161463 -156197 153447 428988 545343 615966 775583 971045 975098 650414
41475 650414 140790 -288735 -527714 -642358 -733053 -882441 -1111664 -1274010 -1170627 -895029
$$ packed form
41546e78074L80827K5481k76170r6470Q0009q6324j85505J9063O9945k01045j49486
41535i97749M95769Q59056K38786o12247n87294M3604J84543k45704k92149L61772
41525e51613R03322O98787R6486l14013m41472m21270k47684L5145K17070J88790
41515A63548L4009j46393k29486o0436K14322J04474m76462q06534l25551L82855
41505a145654L85615j50878k78642J56116L55499P792k47410k5871J96308O9561
41495f77564k5260J38892P2357m60692p20271m6503R50886J119575L40677m14752
41485B77345m38808N266L09644K75541J16355P0623J59617J95462M053l24684
41475F50414n09624m29525k38979j14644r0695j49388k29223j62346J03383K75598
$$ plain form
41465 -895029 -806151 -971507 -956349 -476078 51496 33005 -451416 -807606 -783646 -657110
41455 -657110 -643852 -645614 -608873 -654050 -762662 -731936 -504552 -194963 194736 671999 910218
41444 910218 544088 -135802 -367389 27868 346347 33639 -540504 -741641 -621568 -671716
41434 -671716 -937077 -957908 -495269 165327 636049 791919 695059 442314 131546 -201244
41424 -201244 -594038 -974569 -1080357 -760822 -241571 138153 324637 424148 332903 -117761
41414 -117761 -695029 -883516 -561233 -162098 -10510 108326 447317 732211 523360 -52999
41404 -52999 -396013 -215739 173132 358374 244922 -84897 -499015 -677005 -314506 279060
41394 279060 274747 -557411 -1271571 -906217 116550 562853 209049 87443 706808 1081339
$$ packed form
41465h95029Q8878j65356J5158M80271N27574j8491m84421l56190K3960J26536
41455f57110J3258j762L6741m5177j08612L0726K27384L09589L89699M77263K38219
41444I10218l66130o79890k31587L95257L18479l12708n74143k01137J20073n0148
41434f71716k65361k0831M62639O60596M70722J55870r6860k52745l10768l32790
41424b01244l92794l80531j05788L19535N19251L79724J86484R9511r1245m50664
41414a17761n77268j88487L22283L99135J51588J18836L38991K84894k08851n76359
41404e2999l43014J80274L88871J85242j13452l29819m14118j77990L62499N93566
41394B79060m313q32158p14160L65354J022767M46303l53804j21606O19365L74531
$$ plain form
41384 1081339 211660 -1248491 -1764146 -977893 -17908 181229 -60067 3059 416448
41375 416448 680679 564651 296534 136100 88479 -18187 -322801 -732604 -922133 -701249
41365 -701249 -361240 -372623 -715127 -864523 -559257 -190787 -192840 -396504 -351310 -37504
41355 -37504 170724 134893 97714 176622 134459 -169435 -422947 -241503 263031 594607
41345 594607 500611 190233 -102340 -434978 -848889 -1049686 -771010 -300875 -188081 -434197
41335 -434197 -479039 -119583 101818 -241141 -697094 -552938 123356 650349 741089 706364
41325 706364 734088 638739 394598 271922 261276 -35040 -661311 -1006234 -612649 151510
41315 151510 620601 653426 529878 371661 124584 -120516 -223745 -243374 -232842 -13745
$$ packed form
41384A081339q69679j460151n15655P86253R59985J99137k41296O3126M13389
41375D16448K64231j16028k68117j60434m7621j06666l04614m09803j89529K20884
41365g01249L40009j1383l42504j49396L05266L68470k053k03664M5194L13806
41355c7504K08228l5831l7179P8908m2163l03894k53512J81444N04534L31576
41345E94607r3996l10378k92573l32638m13911k00797K78676M70135J12794k46116
41335d34197m4842L59456K21401l42959m55953J44156O76294N26993R0740l4725
41325G06364K7724r5349k44141j22676j0646k96316o26271l44923L93585P64159
41315A51510M69091L2825j23548j58217k47077k45100j03229j9629J0532K19097
$$ plain form
41305 -13745 458824 744569 411826 -274874 -650406 -520386 -235554 17180 420602 981898
41295 981898 1339513 1276319 977518 629044 195893 -240371 -386565 -212364 -82694 -146898
41285 -146898 -52424 363299 550666 -31365 -970928 -1316174 -831800 -231816 -120741 -284024
41275 -284024 -217390 140090 513698 769844 922988 896022 636543 350639 285022 324120
41265 324120 119560 -355763 -675932 -498664 -19528 271522 163242 -110866 -225261 -126307
41255 -126307 -18826 -85559 -283238 -402036 -295747 -40128 140367 99416 -87309 -209828
41245 -209828 -154054 -37850 -97200 -418915 -809508 -974000 -817276 -519396 -327329 -346734
41235 -346734 -523292 -704883 -698213 -414565 -32352 137927 53957 33771 289905 558165
$$ packed form
41305a3745M72569K85745l32743o86700l75532J30020K84832K52734M03422N61296
41295I81898L57615o3194k98801l48474m33151m36264j46194J74201J29670o4204
41285a46898R4474M15723J87367n82031r39563l45246M84374N99984J11075j63283
41275b84024O6634L57480L73608K56146J53144k6966k59479k85904o5617L9098
41265C24120k04560m75323l20169J77268M79136K91050j08280k74108j14395R8954
41255a26307J07481o6733j97679j18798J06289K55619J80495m0951j86725j22519
41245b09828N5774J16204n9350l21715l90593j64492J56724K97880J92067j9405
41235c46734j76558j81591O670K83648L82213J70279q3970k0186K56134K68260
$$ plain form
41225 558165 442604 -4425 -349100 -342463 -96753 242247 602896 755001 426290 -193345
41215 -193345 -476701 -130369 392932 498236 143004 -331620 -713190 -918858 -812931 -452256
41205 -452256 -261552 -513031 -841291 -743212 -352139 -177746 -255371 -191408 37493 54206
41195 54206 -111445 40916 530788 654049 87238 -461737 -264321 335108 510853 224970
41185 224970 136253 452029 665154 465440 212899 290664 517559 509084 285500 219091
41175 219091 534862 1060177 1398643 1286154 853046 511446 469560 458913 149273 -290969
41165 -290969 -377549 1194 467461 746759 936398 1050890 771624 -36596 -916099 -1301932
41155 -1301932 -1161039 -775148 -170398 698480 1354697 1082196 -51230 -1043660 -1140993
$$ packed form
41225E58165j15561m47029l44675O637K45710L39000L60649J52105l28711o19635
41215a93345k83356L46332N23301J05304l55232m74624l81570k05668J05927L60675
41205d52256J90704k51479l28260R8079L91073J74393p7625O3963K28901J6713
41195E4206j65651J52361M89872J23261n66811n48975J97416N99429J75745k85883
41185B24970q8717L15776K13125j99714k52541P7765K26895q475k23584o6409
41175B19091L15771N25315L38466j12489m33108l41600m1886j0647l09640m40242
41165b90969q6580L78743M66267K79298J89639J14492k79266q08220q79503l85833
41155a301932J40893L85891O04750Q68878O56217k72501j133426r92430r7333
$$ plain form
41146 -1140993 -698572 -479328 -537342 -382327 19616 141076 -193012 -468147 -286285 46893
41136 46893 70647 -158382 -339809 -467619 -603570 -448593 247689 1029534 1141549 572009
41126 572009 69156 51588 134011 -80231 -364323 -367116 -213854 -167162 -103327 181382 441235
41115 441235 267591 -267469 -702258 -799711 -685388 -512783 -387420 -486654 -820626 -972145
41105 -972145 -533677 241099 683750 603337 454943 565108 687071 490794 54250 -369684
41095 -369684 -720201 -1002886 -1079284 -853801 -485864 -199554 -26079 110684 212142 255612
41085 255612 286230 336108 370072 376635 375065 312298 131642 -66058 -158035 -256537 -519504
41074 -519504 -743226 -562426 -82418 181901 104479 131683 463252 656481 394134 39873
$$ packed form
41146a140993M42421K19244n8014J55015M01943J21460l34088k75135J81862L33178
41136D6893K3754k29029j81427j27810j35951J54977O96282P81845J12015n69540
41126E72009n02853j7568Q2423k14242k84092k793J53262M6692O3835K84709K59853
41115D41235j73644n35060m34789r7453J14323J72605J25363r9234l33972j51519
41105i72145M38468P74776M42651q0413j48394J10165J21963j96277m36544m23934
41095c69684l50517k82685p6398K25483L67937K86310J73475J36763J01458M3470
41085B55612L0618M9878L3964O563j570o2767j80656j97700r1977r8502k62967
41074e19504k23722J80800M80008K64319p7422K7204L31569J93229k62347l54261
$$ plain form
41064 39873 -49723 -163559 -545386 -631399 151020 1196148 1333691 508097 -154065 -16668
41054 -16668 312441 147766 -294850 -538260 -661394 -883971 -949399 -562925 -7275 275583
41044 275583 360879 533980 640137 358455 -108192 -247247 -29360 79806 -154843 -515858
41034 -515858 -802676 -1020153 -1085500 -829298 -369225 -77379 -84991 -153318 -82521 72940
41024 72940 206197 240333 32531 -420420 -711030 -422406 168526 313414 -147906 -483569
41014 -483569 -76731 742901 1205367 1036052 524085 13551 -263037 -136568 258946 398310
41004 398310 -36194 -612671 -660018 -222689 -1240 -319191 -669990 -498508 -13039 138527
40994 138527 -216053 -573390 -462542 -33391 212532 82519 -164173 -278786 -318329 -349649
$$ packed form
41064C9873q9596j13836l81827q6013P82419J045128J37543q25594o62162J37397
41054a6668L29109j64675m42616k43410j23134k22577o5428L86474N55650K82858
41044B75583Q5296J73101J06157k81682m66647j39055K17887J09166k34649l61015
41034e15858k86818k17477o5347K56202M60073K91846p612o8327P0797J55461
41024G2940J33257L4136k07802m52951k90610K88624N90932J44888m61320l35663
41014d83569M06838Q19632M62466j69315n11967n10534k76588J26469L95514J39364
41004C98310m34504n76477m7347M37329K21449l17951l50799J71482M85469J51566
40994A38527l54580l57337J10848M29151K45923j30013k46692j14613l9543l1320
$$ plain form
40984 -349649 -152841 448439 1101116 1185130 613477 17113 -1739 476813 912798 913373
40974 913373 471541 -131731 -476380 -285112 250380 604762 500547 130924 -265503 -692333
40964 -692333 -1104265 -1250603 -1084196 -936425 -973934 -895676 -540862 -326852 -565087 -792973
40954 -792973 -453488 133330 261698 16187 41144 279517 -8926 -864620 -1331868 -913290
40944 -913290 -353008 -414992 -735613 -620986 -286590 -409075 -884736 -967835 -467868 34739
40934 34739 146188 78696 19039 -242786 -811664 -1320862 -1359398 -952154 -414100 11703
40924 11703 226819 249172 252183 398249 528338 290715 -288196 -680172 -544806 -256112
40914 -256112 -374481 -774374 -775799 -166778 397178 272014 -278269 -507153 -309482 -341043
$$ packed form
40984c49649J96808O01280O52677Q4014n71653n96364j8852M78552M35985N75
40974I13373m41832o03272l44649J91268N35492L54382j04215l69623l96427m26830
40964f92333m11932j46338J66407J47771l7509P8258L54814K14010k38235k27886
40954g92973L39485N86818J28368k45511K4957K38373k88443q55694m67248M18578
40944i13290N60282o1984l20621J14627L34396j22485m75661q3099M99967N02607
40934C4739J11449o7492n9657k61825n68878n09198l8536M07244N38054M25803
40924A1703K15116K2353L011J46066J30089k37623n78911l91976J35366K88694
40914b56112j18369l99893j425O09021N63956j25164n50283k28884J97671l1561
$$ plain form
40904 -341043 -936722 -1488725 -1278051 -527939 -106118 -362539 -806540 -902375 -641338 -231764
40894 -231764 244974 630104 600380 141603 -217527 -31277 419858 487626 20995 -482488
40884 -482488 -524725 -101905 410741 600619 274887 -358492 -757777 -535834 64299 357640
40874 357640 -63302 -911671 -1521340 -1466515 -865869 -198782 115547 -831 -354257 -735578
40864 -735578 -1030461 -1170465 -1175617 -1228626 -1466180 -1664885 -1415559 -705268 -31179 213555
40854 213555 164907 114897 66715 -34367 41017 476802 940749 908299 371891 -181977
40844 -181977 -425177 -389669 -81168 588410 1390001 1784542 1573167 1195458 1142115 1347498
40834 1347498 1414386 1216114 988940 949179 1085327 1294285 1499414 1587994 1383603 807528
$$ packed form
40904c41043n95679n52003K10674P50112M21821k56421m44001r5835K61037M09574
40894b31764M76738L85130k9724m58777l59130J86250M51135O7768m66631n03483
40884d82488m2237M22820N12646J89878l25732o33379l99285K21943O00133K93341
40874C57640m20942q48369o09669N4825O00646O67087L14329j16378l53426l81321
40864g35578k94883j40004n152n3009k37554j98705K49326P10291O74089K44734
40854B13555m8648n0010m8182j01082P5384M35785M63947l2450n36408n53868
40844a81977k43200L5508L08501O69578Q01591L94541k11375l77709n3343K05383
40834A347498O6888j98272k27174l9761J36148K08958K05129Q8580k04391n76075
$$ plain form
40824 807528 78744 -328166 -64726 674741 1218459 1046511 335519 -231953 -167213 419295
40814 419295 1037136 1265039 1008315 506093 134025 76030 163666 133048 -2659 -9337
40804 -9337 152125 199838 -77793 -489801 -666598 -505350 -203755 94154 437494 776568
40794 776568 787518 269115 -394007 -556812 -190428 -21481 -519023 -1125242 -980719 -165881
40784 -165881 406733 273001 -82914 -108147 110548 264966 330322 309192 39174 -349266
40774 -349266 -334998 186482 561459 367802 147259 472643 871632 572388 -123963 -262379
40764 -262379 209314 403628 -10936 -366177 -214150 25096 -46928 -172679 -95183 -58224
40754 -58224 -220549 -286634 -158010 -254920 -700770 -858668 -263950 546565 740191 254392
$$ packed form
40824H07528p28784m06910K63440P39467N43718j71948p10992n67472O4740N86508
40814D19295O17841K27903k56724n02222l72068n7995Q7636l0618j35707o678
40804i337J61462M7713k77631m12008j76797J61248L01595K97909L43340L39074
40794G76568J0950n18403o63122j62805L66384J68947m97542o06219J44523Q14838
40784a65881N72614j33732l55915k5233K18695J54418O5356k1130k70018l88440
40774c49266J4268N21480L74977j93657k20543L25384L98989k99244o96351j38416
40764b62379M71693J94314m14564l55241J52027K39246p2024j25751P7496L6959
40754e8224j62325o6085J28624r6910m45850j57898N94718Q10515J93626m85799
$$ plain form
40744 254392 -402030 -942186 -1293294 -1232562 -704947 -192507 -131704 -227049 49479 547771
40734 547771 688757 413729 184754 144608 -20392 -368019 -516145 -311762 -138069 -344733
40724 -344733 -766397 -1000897 -886602 -560358 -234935 1378 262696 674714 1013207 787393
40714 787393 -59321 -818354 -805623 -289330 -152276 -736348 -1515599 -1878155 -1726000 -1248819
40704 -1248819 -594499 56049 434680 403772 59785 -409734 -791321 -849715 -549312 -211727
40694 -211727 -160917 -293879 -321469 -301271 -493670 -759288 -615653 29309 642527 692372
40684 692372 183075 -474540 -784110 -391935 550511 1242920 972261 68911 -417584 -116531
40674 -116531 217557 -90294 -651090 -713392 -311867 -78084 -217684 -336724 -192639 -37834
$$ packed form
40744B54392o56422n40156l51108O0732N27615N12440O0803r5345K76528M98292
40734E47771J40986k75028k28975m0146j65000l47627j48126K04383J73693k06664
40724c44733m21664k34500J14295L26244L25423K36313K61318M12018L38493k25814
40714G87393q46714p59033J2731N16293J37054n84072p79251l62556J52155M77181
40704a248819O54320O50548L78631l0908l43987m69519l81587n8394L00403L37585
40694b11727N0810j32962k7590K0198j92399k65618J43635O44962O13218M9845
40684F92372n09297o57615l09570L92175R42446O92409k70659r03350m86495L01053
40674a16531L34088l07851n60796o2302M01525K33783j39600j19040J44085J54805
$$ plain form
40664 -37834 -142694 -391812 -479413 -248194 245255 807685 1193149 1253731 1059062 804744
40654 804744 622484 533255 524092 592094 734999 903146 920385 560977 -108474 -569050
40644 -569050 -360360 253227 510849 132684 -349447 -417027 -274629 -405441 -788344 -996583
40634 -996583 -853957 -564885 -321237 -163493 -141704 -259965 -324282 -164515 58705 69506
40624 69506 -94883 -202619 -271893 -488636 -712336 -526102 105788 626333 540245 10687
40614 10687 -397752 -372114 -57129 244269 375295 368529 315406 232324 67871 -155910 -298662
40603 -298662 -264301 -104521 118074 404346 629931 524684 95089 -174708 72580 448111
40593 448111 296425 -294661 -548166 -124220 419042 521289 410293 615257 1139647 1581881
$$ packed form
40664c7834j04860k49118q7601K31219M93449N62430L85464O0582j94669k54318
40654H04744j82260q9229r163O8002J42905J68147J7239l59408o69451m60576
40644e69050K08690O13587K57622l78165m82131o7580J42398j30812l82903k08239
40634i96583J42626K89072K43648J57744K1789j18261o4317J59767K23220J0801
40624F9506j64389j07736o9274k16743k23700J86234O31890N20545q6088n29558
40614A0687m08439K5638L14985L01398J31026o766n3123q3082j64453k23781j42752
40603b98662L4361J59780K22595K86272K25585j05247m29595k69797K47288L75531
40593D48111j51686n91086k53505M23946N43262J02247j10996K04964N24390M42234
$$ plain form
40583 1581881 1766105 1786578 1653196 1354702 1112798 1129217 1204505 1038144 772515 741199
40573 741199 767935 315205 -602470 -1255487 -1176198 -776723 -663429 -786746 -720873 -469723
40563 -469723 -459261 -837898 -1268554 -1446260 -1428789 -1348895 -1125814 -663290 -145812 84377
40553 84377 -82450 -382030 -454187 -221718 52856 105105 -17157 -103790 -181229 -485404
40543 -485404 -957985 -1108164 -652250 -20718 179354 31253 117710 508996 581287 56306
40533 56306 -395949 -73869 671629 903799 446442 70318 286875 609316 317372 -510836
40523 -510836 -1162496 -1244540 -1043896 -981958 -1059147 -947254 -467294 134532 381980 54146
40513 54146 -542227 -894690 -878527 -829651 -962400 -1004357 -646583 -116096 71089 -173277
$$ packed form
40583A581881J84224K0473j33382k98494k41904J6419P5288j66361k65629l1316
40573G41199K6736m52730r17675o53017P9289L99475J13294j23317O5873K51150
40563d69723J0462l78637m30656j77706J7471P9894K23081M62524N17478K30189
40553H4377j66827k99580p2157K32469K74574N2249j22262q6633p7439l04175
40543d85404m72581j50179M55914O31532K00072j48101Q6457L91286P2291n24981
40533E6306m52255L22080P45498K32170m57357l76124K16557L22441k91944q28208
40523e10836o51660q2044K00644O1938p7189J11893M79960O01826K47448l27834
40513E4146n96373l52463J6163M8876j32749m1957L57774N30487J87185k44366
$$ plain form
40503 -173277 -426420 -382230 -186000 -81020 -88422 -160131 -295977 -340680 -22803 573255
40493 573255 932099 806652 634736 857137 1174591 1050354 693487 811555 1434607 1771471
40483 1771471 1404804 866942 673717 511441 -38840 -566969 -406535 200809 354903
40474 354903 -187468 -739339 -785520 -603911 -566243 -502855 -151794 282442 468868 474186
40464 474186 519143 533446 413663 453216 963235 1580896 1519735 579676 -535356 -1036302
40454 -1036302 -830357 -348724 55775 294686 364919 279317 119283 -17983 -93380 -68529
40444 -68529 112409 362713 402845 67108 -401048 -577568 -381107 -142697 -95252 -45982
40434 -45982 259860 651628 709648 358082 -41814 -219185 -278394 -333860 -218619 160026
$$ packed form
40503a73277k53143M4190J96230J04980p402p1709j35846m4703L17877N96058
40493E73255L58844j25447j71916K22401L17454j24237l56867J18068O23052L36864
40483A771471l66667n37862j93225j62276n50281n28129J60434O07344J54094
40474C54903n42371n51871m6181J81609L7668O3388L51061M34236J86426N318
40464D74186M4957J4303j19783L9553N10019O17661o1161r40059j115032n00946
40454a036302K05945M81633M04499K38911P0233q5602j60034j37266p5397K4851
40444f8529J80938K50304M0132l35737m68156j76520J96461K38410M7445M9270
40434d5982L05842L91768N8020l51566l99896j77371n9209n5466J15241L78645
$$ plain form
40424 160026 456715 284897 -162198 -315815 -20792 311618 383141 383895 515081 557918
40414 557918 235360 -272847 -523477 -381796 -119926 -25697 -133857 -286334 -297620 -129808
40404 -129808 -7597 -224598 -725893 -1073714 -986048 -704373 -621692 -747370 -797684 -653467
40394 -653467 -448056 -314283 -302115 -451871 -721592 -947874 -1074777 -1258924 -1538172 -1625654
40384 -1625654 -1317167 -864620 -607936 -487152 -309074 -204498 -312868 -306310 110258 450602
40374 450602 15891 -868907 -1118107 -506283 -52670 -448543 -1065159 -1102348 -840596 -934854
40364 -934854 -1158641 -842059 -138820 166000 -68340 -219357 -33873 39013 -222167 -396731
40354 -396731 -217045 -54644 -242876 -513013 -525789 -478010 -720692 -1132665 -1326047 -1228292
$$ packed form
40424A60026K96689j71818m47095j53617K95023L32410P1523P54J31186M2837
40414E57918l22558n08207k50630J41681K61870R4229j08160j52477j1286J67812
40404a29808J22211k17001n01295l47821Q7666K81675Q2681j25678n0314J44217
40394f53467K05411J33773J2168j49756k69721k26282j26903j84147k79248q7482
40384a625654L08487M52547K56684J20784J78078J04576j08370O558M16568L40344
40374D50602m34711q84798k49200O11824M53613l95873o16616l7189K61752r4258
40364i34854k23787L16582P03239L04820k34340j51017J85484P2886k61180j74564
40354c96731J79686J62401j88232k70137j2776M7779k42682m11973j93382R7755
$$ plain form
40344 -1228292 -1061474 -934492 -810743 -711068 -611434 -298667 315802 858363 841950 302167
40334 302167 -255780 -509523 -551818 -459187 -66210 622687 1135109 994597 361641 -102696
40324 -102696 -16820 337505 492440 418605 453859 719741 908801 737588 368906 170376
40314 170376 187123 124287 -171997 -499399 -642301 -677213 -773582 -875489 -789070 -486721
40304 -486721 -135239 121907 257377 303945 364532 598766 1002963 1264841 1075897 572584
40294 572584 202279 115543 -8098 -394968 -733377 -573096 -10552 340919 64505 -604618
40284 -604618 -1086338 -1070631 -776696 -678909 -980293 -1316621 -1077110 -133615 874745 1204039
40274 1204039 879001 622908 919907 1482656 1763066 1652141 1421958 1227059 1001282
$$ packed form
40344a228292J66818J26982J23749R9675R9634L12767O14469N42561j6413n39783
40334C02167n57947k53743m2295R2631L92977O88897N12422j40512o32956m64337
40324a02696Q5876L54325J54935p3835L5254K65882J89060j71213l68682j98530
40314A70376J6747o2836k96284l27402j42902l4912r6369j01907Q6419L02349
40304d86721L51482K57146J35470M6568O0587K34234M04197K61878j88944n03313
40294E72584l70305q6736j23641l86870l38409J60281N62544L51471k76414o69123
40284f04618m81720J5707K93935R7787l01384l36328K39511R43495J008360L29294
40274A204039l25038k56093K96999N62749K80410j10925k30183j94899k25777
$$ plain form
40265 1001282 726857 469789 179222 -237191 -610397 -584740 -110976 376050 444749 178960
40255 178960 26093 221623 542412 625267 393096 105644 37180 167523 224633 17904
40245 17904 -342253 -602880 -673410 -660309 -615701 -391499 170457 944884 1500356 1425460
40235 1425460 709842 -213259 -848866 -1048844 -988500 -823265 -561019 -252324 -22414 173763
40225 173763 514362 854541 676089 -164057 -965422 -969331 -405015 -161328 -514157 -865220
40215 -865220 -809327 -714318 -942696 -1174374 -990034 -610640 -502058 -636717 -722586 -829903
40205 -829903 -1136277 -1283930 -734249 277438 851476 593844 52783 -176695 -169803 -211134
40195 -211134 -188162 100742 416405 354448 -42685 -368747 -426974 -341799 -173588 189102
$$ packed form
40265A001282k74425k57068k90567m16413l73206K5657M73764M87026O8699k65789
40255A78960j52867J95530L20789Q2855k32171k87452o8464J30343N7110k06729
40245A7904l60157k60627p0530J3101M4608K24202N61956P74427N55472p4896
40235A425460p15618r23101o35607j99978O0344J65235K62246L08695K29910J96177
40225A73763L40599L40179j78452q40146q01365l909N64316K43687l52829l51063
40215h65220N5893R5009k28378k31678J84340L79394J08582j34659q5869j07317
40205h29903l06374j47653N49681J011687N74038k57632n41061k29478O892m1331
40195b11134K2972K88904L15663o1957l97133l26062n8227Q5175J68211L62690
$$ plain form
40185 189102 706846 1069899 1029111 674878 295928 77948 4307 -36592 -98678 -84319
40175 -84319 189729 750949 1314497 1504622 1274805 971677 881029 835688 471428 -167749
40165 -167749 -555499 -348390 107740 214837 -65558 -224519 -45440 31713 -367191 -866451
40155 -866451 -829787 -309256 32170 -96461 -268483 -112706 106259 21490 -133661 143114
40145 143114 773812 1110031 830198 385715 368535 755684 1050512 972121 681754 398068
40135 398068 137364 -85929 -116774 69213 179907 -14412 -257571 -115213 348385 603410
40125 603410 409299 102444 -14478 -93675 -257771 -172804 394022 940574 785417 92211
40115 92211 -310899 -107644 153659 -25505 -441078 -649458 -545644 -234822 186692 466207
$$ packed form
40185A89102N17744L63053m0788l54233l78950k17980p3641m0899o2086J4359
40175h4319K74048N61220N63548J90125k29817l03128r0648m5341l64260o39177
40165a67749l87750K07109M56130J07097k80395j58961J79079P7153l98904m99260
40155h66451L6664N20531L41426j28631j72022J55777K18965q4769j55151K76775
40145A43114O30698L36219k79833m44483j7180L87149K94828p8391k90367k83686
40135C98068k60704k23293l0845J85987J10694j94319k43159J42358M63598K55025
40125F03410j94111l06855j16922p9197j64096Q4967N66826N46552j55157o93206
40115I2211m03110K03255K61303j79164m15573k08380J03814L10822M21514K79515
$$ plain form
40105 466207 296486 -123926 -131588 438163 840746 460590 -208259 -245350 366737 804111
40095 804111 638318 305663 314464 595258 788464 716513 400977 -52762 -454243 -650386
40085 -650386 -687049 -638932 -367695 238130 874471 1063125 756246 336494 67650 -49815
40075 -49815 58284 512656 1074879 1263646 981380 590029 304189 7005 -246181 -127304
40065 -127304 343082 625456 417226 102536 123791 337462 333012 13570 -433849 -759658
40055 -759658 -613376 205415 1164260 1268516 345852 -550339 -558355 -186954 -367148 -943053
40045 -943053 -1054170 -593482 -219797 -136543 41147 235875 -164115 -1145748 -1849237 -1812599
40035 -1812599 -1546756 -1528941 -1490970 -1142502 -789569 -710863 -639590 -414749 -458054 -984328
$$ packed form
40105D66207j69721m20412p662N69751M02583l80156o68849l7091O12087M37374
40095H04111j65793l32655Q801K80794J93206p1951l15536m53739m01481j96143
40085f50386l6663M8117K71237O05825O36341J88654l06879m19752k68844j17465
40075d9815J08099M54372N62223J88767k82266l91351k85840k97184k53186J18877
40065a27304M70386K82374k08230l14690K1255K13671m450l19442m47419l25809
40055g59658J46282Q18791R58845J04256r22664q96191q016L71401j80194n75905
40045i43053j11117M60688L73685Q3254J77690J94728l99990r81633p03489L6638
40035a812599K65843J7815L7971L48468L52933P8706P1273K24841m3305n26274
$$ plain form
40025 -984328 -1379781 -1078411 -520137 -479488 -875834 -1028581 -753316 -424127 -213171 -51660
40015 -51660 -145904 -726936 -1378346 -1382027 -729742 -115910 53594 -13856 -109801 -244835 -268558
40004 -268558 -14004 161416 -221552 -770198 -551779 383488 819531 142764 -700547 -685486
39994 -685486 -240057 -361997 -898779 -862914 -131516 356074 122571 -187262 42404 454087
39984 454087 388217 -124498 -567151 -722689 -741911 -687023 -517640 -422029 -668609 -1062167
39974 -1062167 -966054 -106659 887977 1075993 289209 -657169 -935934 -632281 -461617 -738408
39964 -738408 -1015370 -799826 -255738 57587 -71627 -333558 -395220 -283197 -206840 -201797
39954 -201797 -99198 197942 530173 640331 480936 248242 70262 -180241 -606257 -965037
$$ packed form
40025i84328l95453L01370N58274M0649l96346j52747K75265L29189K10956J61511
40015e1660r4244n81032o51410l681O52285O13832J69504o7450r5945j35034k3723
40004b68558K54554J75420l82968n48646K18419R35267M36043o76767q43311J5061
39994f85486M45429j21940n36782L5865P31398M87590k33503l09833K29666M11683
39984D54087o5870n12715m42653j55538j9222N4888J69383R5611k46580l93558
39974a062167R6113Q59395R94636J88016p86784r46378k78765L03653J70664k76791
39964g38408k76962K15544N44088L13325j29214k61931o1662J12023P6357N043
39954b01797J02599K97140L32231J10158j59395k32694j77980k50503m26016l58780
$$ plain form
39944 -965037 -905263 -488730 -171857 -225253 -466013 -644058 -770125 -893273 -846257 -462591
39934 -462591 127272 612297 775039 544513 -104 -548283 -748721 -653392 -686494 -980147
39924 -980147 -1096563 -711254 -213494 -194519 -603499 -896384 -846275 -705563 -666933 -665376
39914 -665376 -682136 -769637 -769523 -461588 -21135 118503 -96896 -293578 -310437 -390072 -611314
39903 -611314 -665495 -441257 -332826 -603280 -843272 -508461 261187 802389 770968 425658
39893 425658 137104 -10978 -102887 -188201 -303757 -481564 -608814 -438081 90070 606817
39883 606817 616745 109704 -327381 -209540 186684 201972 -220887 -415140 3188 545695
39873 545695 633090 454048 465417 459205 -67536 -818576 -907749 -248914 159863 -331706
$$ packed form
39944i65037N9774M16533L16873n3396k40760j78045j26067j23148M7016L83666
39934d62591N89863M85025J62742k30526n44617n48179k00438R5329l3102k93653
39924i80147j16416L85309M97760J8975m08980k92885N0109J40712L8630J557
39914f65376j6760q7501J14L07935M40453J39638k15399j96682j6859p9635k21242
39903f11314n4181K24238J08431k70454k39992L34811P69648N41202l1421l45310
39893D25658k88554j48082r1909q5314j15556j77807j27250J70733N28151N16747
39883F06817R928n07041m37085J17841L96224J5288m22859j94253M18328N42507
39873E45695Q7395j79042J1369o212n26741p51040q9173O58835M08777m91569
$$ plain form
39863 -331706 -1073651 -1074981 -330528 346993 412960 10427 -406064 -447869 -25122 480389
39853 480389 516702 54367 -362912 -444412 -520274 -783941 -788102 -237199 261733 -38356
39843 -38356 -857411 -1219275 -750908 23678 537710 673020 497740 152007 -43272 72467
39833 72467 122263 -290970 -819719 -759052 -93848 530984 808687 973911 1039846 715653
39823 715653 210950 204762 712373 856568 195742 -538255 -563081 -142525 85747 171741
39813 171741 437819 574478 107223 -558291 -539896 151163 543995 107736 -574318 -757892
39803 -757892 -492242 -273697 -247064 -166451 126355 524289 813396 801512 425313 -108987
39793 -108987 -413031 -285214 83032 339153 309233 60672 -241144 -451915 -516162 -499675
$$ packed form
39863c31706p41945j330P44453O77521O5967m02533m16491m1805M22747N05511
39853D80389L6313m62335m17279q1500p5862k63667m161N50903M98932l00089
39843c8356q19055l61864M68367P74586N14032J35310j75280l45733j95279J15739
39833G2467M9796m13233n28749O0667O65204O24832K77703J65224O5935l24193
39823G15653n04703o188N07611J44195o60826p33997k4826M20556K28272Q5994
39813A71741K66078J36659m67255o65514J8395O91059L92832m36259o82054j83574
39803g57892K65650K18545K6633Q0613K92806L97934K89107j1884l76199n34300
39793a08987l04044J27817L68246K56121k9920k48561l01816k10771o4247J6487
$$ plain form
39783 -499675 -510431 -554593 -527426 -371795 -183411 -108622 -150197 -116135 172632 580998 667288
39772 667288 174329 -507178 -623339 80341 994348 1313383 902869 316402 106125 337969
39762 337969 677550 720695 307222 -276516 -467173 -11856 663216 888383 509603 -23441
39752 -23441 -295525 -360976 -469720 -623289 -600092 -322400 -19435 21059 -187688 -301243
39742 -301243 -34533 482540 884157 1056209 1199032 1382852 1377049 1075165 745330 596053
39732 596053 418524 17359 -299441 -126085 355252 614389 567400 566862 655660 463368
39722 463368 -58261 -412291 -303934 -92778 -209352 -559005 -812383 -893689 -851472 -605155
39712 -605155 -185761 73917 -34478 -226146 -138876 110300 144032 -107906 -422584 -667879
$$ packed form
39783d99675j0756m4162K7167J55631J88384P4789m1575L4062K88767M08366Q6290
39772F67288m92959o81507j16161P03680R14007L19035m10514n86467k10277K31844
39762C37969L39581M3145m13473n83738j90657M55317O75072K25167l78780n33044
39752b3441k72084o5451j08744j53569K3197K77692L02965M0494k08747j13555
39742c01243K66710N17073M01617J72052J42823J83820n803l01884l29835j49277
39732E96053j77529m01165l16800J73356M81337K59137m6989n38Q8798j92292
39722D63368n21629l54030J08357K11156j16574l49653k53378q1306M2217K46317
39712f05155M19394K59678j08395j91668Q7270K49176L3732k51938l14678k45295
$$ plain form
39702 -667879 -800196 -681566 -323000 -135216 -451252 -907054 -827193 -208787 239243 140859
39692 140859 -23574 290658 837721 932766 399698 -262181 -578426 -582491 -528666 -429426
39682 -429426 -121551 310282 479347 209757 -105759 33677 486136 579694 75679 -430898
39672 -430898 -373182 -58994 -155701 -615937 -778458 -481713 -371757 -903555 -1639051 -1909296
39662 -1909296 -1728363 -1580569 -1570828 -1314218 -651562 -49665 -106235 -821236 -1523660 -1541212
39652 -1541212 -896176 -256342 -163997 -450785 -551839 -237419 233434 568186 678111 491404
39642 491404 -35048 -625134 -826824 -614121 -454816 -593006 -704340 -541570 -451061 -802978
39632 -802978 -1288516 -1331274 -944233 -602683 -439191 -197767 69217 -54258 -566125 -823458
$$ packed form
39702f67879j32317J18630L58566J87784l16036m55802P9861O18406M48030r8384
39692A40859j64433L14232N47063R5045n33068o61879l16245m065N3825R9240
39682d29426L07875M31833J69065k69590l15516J39436M52459R3558n04015n06577
39672d30898N7716L14188r6707m60236j62521K96745J09956n31798p35496k70245
39662a909296J80933J47794R741K56610O62656O01897n6570p15001p02424j7552
39652a541212O45036O39834R2345k86788j01054L14420M70853L34752J09925j86707
39642D91404n26452n90086k01690K12703J59305j38190j11334J62770R0509l51917
39632h02978m85538m2758L87041L41550J63492K41424K66984j23475n11867k57333
$$ plain form
39622 -823458 -396106 317348 657985 535106 342434 328221 425248 535340 620435 587163
39612 587163 387277 198068 231483 370349 257282 -201969 -650207 -697425 -359823 47252
39602 47252 326339 531442 732523 846706 776309 577667 366029 128173 -223191 -642149
39592 -642149 -958062 -1085549 -1043481 -756275 -99078 742550 1238076 1094390 683193 576632
39582 576632 780076 796600 427702 86280 153855 363577 125881 -656484 -1366567 -1302206
39572 -1302206 -414162 621141 1037830 676795 38262 -326732 -352956 -337052 -460717 -636204
39562 -636204 -721813 -655719 -426979 -145533 -81516 -346153 -566383 -247901 464691 782719
39552 782719 235423 -684913 -1121855 -861897 -423327 -295856 -453076 -607136 -628604 -583047
$$ packed form
39622h23458M27352P13454L40637j22879j92672j4213R7027J10092Q5095l3272
39612E87163j99886j89209L3415J38866j13067m59251m48238m7218L37602M07075
39602D7252K79087K05103K01081J14183p0397j98642k11638k37856l51364m18958
39592f42149l15913j27487M2068K87206O57197Q41628M95526j43686m11197j06561
39582E76632K03444J6524l68898l41422O7575K09722k37696p82365p10083O4361
39572a302206Q88044J035303M16689l61035o38533l64994k6224J5904j23665j75487
39562f36204q5609O6094K28740K81446O4017k64637k20230L18482P12592L18028
39552G82719n47296r20336m36942K59958M38570J27471j57220j54060k1468M5557
$$ plain form
39542 -583047 -501261 -256863 293653 1042747 1569237 1494285 917682 312532 -74538 -466927
39532 -466927 -1040407 -1446675 -1214445 -499296 -1469 -64738 -233684 79369 769472 1210741
39522 1210741 1119516 843535 717327 525038 -73631 -814136 -1005216 -471801 132485 167294
39512 167294 -223467 -505623 -572946 -688212 -830947 -714539 -438982 -516078 -1079380 -1591519
39502 -1591519 -1588853 -1265533 -1010993 -774648 -290619 347562 749834 721730 386397 -47440
39492 -47440 -390446 -510059 -494185 -593636 -795619 -711121 -148103 487267 698466 550460
39482 550460 439327 454012 402338 285757 285354 388971 453245 518379 651723 641664 320416
39471 320416 21808 147621 398507 109070 -648500 -1017687 -577792 76447 270863 143625
$$ packed form
39542e83047Q1786K44398N50516P49094N26490p4952n76603o05150l87070l92389
39532d66927n73480m06268K32230P15149M97827o3269j68946L13053O90103M41269
39522A210741r1225k75981j26208j92289n98669p40505j91080N33415O04286L4809
39512A67294l90761k82156o7323j15266j42735J16408K75557p7096n63302n12139
39502a591519K666L23320K54540K36345M84029O38181M02272k8104l35333m33837
39492d7440l43006j19613J5874r9451k01983Q4498N63018O35370K11199j48006
39482E50460j11133J4685n1674j16581m03J03617O4274O5134J33344j0059l21248
39471C20416k98608J25813K50886k89437p57570l69187M39895O54239J94416j27238
$$ plain form
39461 143625 175882 337746 238920 -168793 -564342 -815713 -1129491 -1612777 -1967630 -1749145
39451 -1749145 -894854 49172 371821 -7022 -372814 -111028 457994 570460 141062
39442 141062 -241053 -367538 -671292 -1267515 -1549617 -1146037 -572990 -402540 -390177 -62162
39432 -62162 336894 220356 -341461 -718470 -628262 -307932 58270 450665 664101 465352
39422 465352 51137 -211148 -422730 -933626 -1542305 -1603476 -1021960 -477392 -450294 -604929
39412 -604929 -423423 38658 370306 411254 303347 183391 107839 129477 260066 454181
39402 454181 669393 791740 580885 -5247 -497625 -356241 252618 584695 307713 -140445
39392 -140445 -325908 -370652 -436293 -245650 376877 932923 832937 297848 70342 345674
$$ packed form
39461A43625L2257J61864r8826m07713l95549k51371l13778m83286l54853K18485
39451a749145Q54291R44026L22649l78843l65792K61786N69022J12466m29398
39442A41062l82115j26485l03754n96223k82102M03580N73047J70450J2363L28015
39432f2162L99056j16538n61817l77009R0208L20330L66202L92395K13436j98749
39422D65352m14215k62285k11582n10896o08679o1171N81516N44568K7098j54635
39412f04929J81506M62081L31648M0948j07907j19956p5552K1638J30589J94115
39402D54181K15212J22347k10855n86132m92378J41384O08859L32077k76982m48158
39392a40445j85463m4744o5641J90643O22527N56046r9986n35089k27506K75332
$$ plain form
39382 345674 574476 330663 -160866 -467855 -469224 -263787 68969 404117 532141 382235
39372 382235 96500 -240335 -700912 -1181500 -1251368 -647859 238142 719188 597547 249411
39362 249411 -67906 -549604 -1287878 -1796339 -1526613 -677079 -16707 74889 -59560 -49654
39352 -49654 -40539 -297934 -675686 -845314 -794287 -720420 -615762 -334781 40816 258497
39342 258497 232392 24353 -366063 -835358 -965926 -452280 338022 718284 564926 322799
39332 322799 137018 -369527 -1269764 -1927829 -1807784 -1210796 -782622 -668038 -611734 -594009
39322 -594009 -828108 -1234134 -1389726 -1057150 -471981 -62360 -57348 -372672 -743810 -950464
39312 -950464 -943609 -747972 -360232 86834 225449 -116650 -478152 -252050 370857 531043
$$ packed form
39382C45674K28802k43813m91529l06989j369K05437L32756L35148J28024j49906
39372C82235k85735l36835m60577m80588o9868O03509Q86001M81046j21641l48136
39362B49411l17317m81698p38274n08461K69726Q49534O60372R1596j34449R906
39352d9654R115k57395l77752j69628N1027P3867J04658K80981L75597K17681
39342B58497k6105k08039l90416m69295j30568N13646P90302L80262j53358k42127
39332C22799j85781n06545r00237o58065J20045N96988M28174J14584N6304J7725
39322e94009k34099m06026j55592L32576N85169M09621N012l15324l71138k06654
39312i50464O855J95637L87740M47066J38615l42099l61502K26102O22907J60186
$$ plain form
39302 531043 -75876 -739951 -810758 -595606 -699623 -1017720 -1010429 -606959 -193447 54764
39292 54764 248269 383934 392700 395344 429959 171868 -555628 -1262466 -1360833 -988334 -651712
39281 -651712 -362001 126307 496934 215698 -421964 -559033 -121935 85097 -228328 -379054
39271 -379054 34765 420218 256258 1194 270173 793663 900331 523462 71706 -272217
39261 -272217 -506037 -442576 4127 466589 582506 506970 515008 491728 327835 360017 765431
39250 765431 945583 310022 -629862 -833977 -258076 105514 -262775 -765363 -781658 -591864
39240 -591864 -772647 -1251310 -1464899 -1153335 -610935 -312537 -495748 -949278 -1126547 -698005
39230 -698005 -32002 178247 -190894 -559765 -512948 -349116 -506135 -838625 -869159 -526335
$$ packed form
39302E31043o06919o64075p0807K15152j04017l18097P291M03470M13512K48211
39292E4764J93505J35665Q766K644L4615k58091p27496p06838r8367L72499L36622
39281f51712K89711M88308L70627k81236o37662j37069M37098K07032l13425j50726
39271c79054M13819L85453j63960k55064K68979N23490J06668l76869m51756l43923
39261b72217k33820O3461M46703M62462J15917p5536Q038k3280j63893L2182M05414
39250G65431J80152o35561r39884k04115N75901L63590l68289n02588j6295J89794
39240e91864j80783m78663k13589L11564N42400K98398j83211m53530j77269M28542
39230f98005O66003K10249l69141l68871M6817J63832j57019l32490l0534L42824
$$ plain form
39220 -526335 -211291 -195515 -302466 -232045 40345 285287 313760 151047 -60919 -261740
39210 -261740 -490339 -692250 -656755 -300968 83551 112451 -162906 -261863 106367 652051
39200 652051 880502 693823 429782 381345 471496 432310 182912 -59904 -38984 231145
39190 231145 459600 386389 47990 -275954 -338456 -148569 25984 -97773 -488969 -770072
39180 -770072 -656025 -351910 -266633 -378268 -259505 193754 508913 357664 109250 261410
39170 261410 633211 625163 129350 -312678 -242451 217456 612812 604533 181834 -326021
39160 -326021 -524623 -444353 -548352 -979573 -1136607 -491984 452790 696884 97179 -520407
39150 -520407 -597194 -427254 -369181 -247626 114512 404425 295993 -48304 -335065 -574878
$$ packed form
39220e26335L15044J5776j06951P0421K72390K44942K8473j62713k11966k00821
39210b61740k28599k01911L5495L55787L84519K8900k75357r8957L68230N45684
39200F52051K28451j86679k64041m8437R0151l9186k49398k42816K0920K70129
39190B31145K28455p3211l38399l23944o2502J89887J74553j23757l91196k81103
39180g70072J14047L04115Q5277j11635J18763M53259L15159j51249k48414J52160
39170B61410L71801q048m95813m42028P0227M59907L95356q279m22699n07855
39160c26021j98602Q0270j03999m31221j57034O44623R44774K44094n99705o17586
39150e20407p6787J69940N8073J21555L62138K89913j08432l44297k86761k39813
$$ plain form
39140 -574878 -790065 -709874 -197317 335785 371311 -59274 -480062 -532072 -198149 272112
39130 272112 448164 34367 -691730 -1099835 -1042889 -1012827 -1229640 -1171881 -458538 360642
39120 360642 504294 32034 -408604 -545938 -527253 -324185 133057 415166 -12250 -882039
39110 -882039 -1332716 -1051717 -549551 -262782 -86634 71997 -23093 -426840 -752246 -733954
39100 -733954 -614130 -694403 -887909 -966736 -915369 -810912 -639795 -405571 -159442 155282
39090 155282 577194 824094 539996 -87067 -433566 -299390 -162394 -392052 -725721 -788664
39080 -788664 -640173 -485861 -304432 -101318 -100201 -333771 -476854 -431812 -581092 -1038841
39070 -1038841 -1214648 -711089 -133451 -257291 -803363 -912973 -563873 -515953 -908472 -973232
$$ packed form
39140e74878k15187Q0191N12557N33102L5526m30585m20788n2010L33923M70261
39130B72112J76052m13797p26097m08105N6946L0062k16813N7759P13343Q19180
39120C60642J43652m72260m40638j37334J8685K03068M57242K82109m27416q69789
39110h82039m50677K80999N02166K86769J76148J58631r5090m03747l25406J8292
39100g33954J19824q0273j93506p8827N1367J04457J71117K34224K46129L14724
39090A55282M21912K46900k84098o27063l46499J34176J36996k29658l33669o2943
39080g88664J48491J54312J81429K03114J117k33570j43083M5042j49280m57749
39070a038841j75807N03559N77638j23840n46072j09610L49100M7920l92519o4760
$$ plain form
39060 -973232 -386755 54845 -384104 -1235091 -1462034 -796444 103643 545472 411064 67938
39050 67938 -9796 297291 498385 -2979 -994313 -1504488 -1060626 -377686 -328864 -731573
39040 -731573 -828035 -582817 -624842 -1019248 -1036197 -339225 405489 495779 134654 -68955
39030 -68955 -28909 -36823 -38931 283776 816279 994083 590025 74233 4250 355968 664196
39019 664196 625523 333537 7425 -271670 -483121 -479629 -81704 590445 1047250 879737
39009 879737 230743 -371091 -626260 -693119 -797777 -902773 -872143 -697624 -391092 110754
38999 110754 730416 1149142 1148117 867420 512492 31274 -626836 -1147320 -1136220 -671417
38989 -671417 -204376 34348 184853 351185 413381 288218 74654 -118789 -266512 -351799
$$ packed form
39060i73232N86477M41600m38949q50987k26943O65590R00087M41829j34408l43126
39050F7938p7734L07087K01094n01364r91334n10175M43862O82940M8822m02709
39040g31573r6462K45218m2025l94406j6949O96972P44714R0290l61125k03609
39030f8955M0046p914k108L22707N32503J77804m04058n15792o9983L51718L08228
39019F64196l8673k91986l26112k79095k11451L492L97925O72149M56805j67513
39009H79737o48994o01834k55169o6859j04658j04996L0630J74519L06532N01846
38999A10754O19662M18726j025k80697l54928m81218o58110n20484J1100M64803
38989f71417M67041K38724J50505J66332O2196j25163k13564j93443j47723q5287
$$ plain form
38979 -351799 -413174 -583093 -823058 -767079 -205429 398746 362729 -262929 -700141 -465765
38969 -465765 104501 463964 489063 332249 113274 -16292 91726 279247 210722 -40281
38959 -40281 -12230 340735 420468 -125028 -821705 -1076275 -951052 -771429 -467105 104412
38949 104412 581163 508039 77227 -152425 -84821 -62679 -190766 -267927 -276926 -385262 -536726
38938 -536726 -542005 -471529 -479944 -409525 -102440 102511 -165682 -531056 -328215 246729 318623
38927 318623 -264593 -649347 -369754 -93607 -459350 -973275 -792550 -39036 473117 477238
38917 477238 402626 424457 191815 -356788 -607029 -90301 729555 968448 471328 -7889
38907 -7889 149089 600992 581046 12640 -416854 -325624 -212914 -633707 -1259973 -1324170
$$ packed form
38979c51799o1375j69919k39965N5979N61650O04175l6017o25658m37212K34376
38969d65765N70266L59463K5099j56814k18975j29566J08018J87521o8525k51003
38959d0281K8051L52965P9733n45496o96677k54570J25223J79623L04324N71517
38949A04412M76751p3124m30812k29652O7604K2142j28087p7161q999j08336j51464
38938e36726n279P0476q415P0419L07085K04951k68193l65374K02841N74944P1894
38927C18623n83216l84754K79593K76147l65743n13925J80725P53514N12153M121
38917D77238p4612K1831k32642n48603k50241N16728Q19856K38893m97120m79217
38907g889J56978M51903j9946n68406m29494R1230J12710m20793o26266o4197
$$ plain form
38897 -1324170 -752404 -215373 -97909 -67490 189792 401065 206686 -188642 -269634 85961
38887 85961 489104 552003 302279 98971 229113 584656 783268 679755 608333 900470
38877 900470 1305497 1231454 511849 -420659 -1100760 -1381691 -1224265 -622647 101765 372647
38867 372647 5478 -506205 -599745 -310769 -110875 -276011 -640109 -850216 -692069 -252644
38857 -252644 121814 106334 -287948 -728551 -890212 -710296 -390539 -241417 -410501 -656586
38847 -656586 -577132 -190828 4238 -219530 -403958 -131218 250082 196474 -106340 -135198
38837 -135198 -67312 -512103 -1287055 -1454207 -739572 10014 97234 -130973 -52276 318443
38827 318443 651036 893800 1063152 976689 638237 419822 508993 666037 797689 1142536
$$ packed form
38897a324170N71766N37031J17464L0419K57282K11273j94379l95328q0992L55595
38887H5961M03143O2899k49724k03308J30142L55543J98612j03513p1422K92137
38877I00470M05027p4043p19605r32508o80101k80931J57426O01618P24412K70882
38867C72647l67169n11683r3540K88976J99894j65136l64098k10107J58147M39425
38857b52644L74458j5480l94282m40603j61661J79916L19757J49122j69084k46085
38847f56586P9454L86304J95066k23768j84428K72740L81300n3608l02814k8858
38837a35198O7886m44791p74952j67152P14635P49586Q7220k28207P8697L70719
38827C18443L32593K42764J69352q6463l38452k18415Q9171J57044J31652L44847
$$ plain form
38817 1142536 1566336 1423116 610817 34122 382122 1088469 1212203 777399 454348
38808 454348 389804 214443 -96571 -205845 -96647 -60178 -114921 -52119 64513 9684
38798 9684 -121828 -65453 118305 170113 75466 -61930 -345159 -802067 -1054442 -808030
38788 -808030 -416905 -392678 -596040 -529464 -233186 -233747 -696128 -1233309 -1524857 -1597556 -1513153
38777 -1513153 -1239650 -828653 -379430 97613 533902 738549 722806 739950 737816 285709
38767 285709 -562556 -960825 -422698 318801 332678 -190825 -476241 -474699 -645371 -858559
38757 -858559 -631582 -207967 -282859 -767773 -892108 -467614 -13699 306154 768916 1126479
38747 1126479 745410 -137042 -461903 67004 544258 354021 22299 113595 284646 42009
$$ packed form
38817A142536M23800j43220q12299n76695L48000P06347J23734m34804l23051
38808D54348o4544j75361l11014j09274J09198L6469n4743O2802J16632n4829
38798I684j31512N6375J83758N1808r4647j37396k83229m56908k52375K46412
38788h08030L91125K4227k03362O6576K96278n61m62381n37181k91548p2699Q4403
38777a513153K73503M10997M49223M77043M36289K04647j5743J7144k134m52107
38767B85709q48265l98269N38127P41499J3877n23503k85416J542j70672k13188
38757h58559K26977M23615p4892m84914j24335M24494M53915L19853M62762L57563
38747A126479l81069q82452l24861N28907M77254j90237l31722R1296J71051k42637
$$ plain form
38737 42009 -387706 -570883 -584988 -654496 -624042 -297988 138813 402831 408584 108835 -450355
38726 -450355 -834150 -629028 -207403 -300589 -750924 -660635 47154 349477 -210990 -760000
38716 -760000 -596109 -306167 -553753 -828677 -467837 -44837 -500129 -1460315 -1691121 -950343
38706 -950343 -238898 -280756 -744210 -1019893 -941065 -608869 -150955 216048 338861 362823
38696 362823 468058 522988 390867 326272 561666 762597 521707 200950 535290 1405286
38686 1405286 1762632 1001719 -208985 -818237 -669586 -451651 -624795 -901858 -837233
38677 -837233 -512454 -335028 -362020 -264223 11418 46572 -315718 -520144 -59755 688831
38667 688831 996353 850294 777003 827050 608821 250552 354029 878851 1056524 671623
$$ packed form
38737D2009m29715j83177j4105o9508L0454L26054M36801K64018N753k99749n59190
38726d50355l83795K05122M21625r3186m50335R0289P07789L02323n60467n49010
38716g60000J63891K89942k47586k74924L60840M23000m55292r60186k30806P40778
38706i50343P11445m1858m63454k75683P8828L32196M57914L67003J22813K3962
38696C62823J05235N4930j32121o4595K35394K00931k40890l20757L34340Q69996
38686A405286L57346p60913j210704o09252J48651K17935j73144k77063O4625
38677h37233L24779J77426k6992R7797K75641L5154l62290k04426M60389P48586
38667F88831L07522j46059p3291N0047k18229l58269J03477N24822J77673l84901
$$ plain form
38657 671623 442905 736891 898864 446219 -8726 200391 623455 476851 1586 38907
38647 38907 591465 798728 278941 -349413 -408982 8156 378725 501495 622088 937831
38637 937831 1231866 1176310 943807 1130908 1847354 2346086 2057439 1529443 1590015 1985732
38627 1985732 1868152 1376327 1503067 2371764 2920689 2548940 1886107 1588893 1515355 1482362
38617 1482362 1733751 2231583 2514211 2592999 2948019 3466412 3625411 3827951 5035534
38608 5035534 6910608 8096035 8620380 10012472 12600157 14975431 16794795 19597842
38600 19597842 23943856 28471807 32943341 39199250 47723471 56774576 66774565 81580216
38592 81580216 103264476 131024458 168689666 225192154 297762227 359007197 374200081
$$ packed form
38657F71623k28718K93986J61973m52645m54945K09117M23064j46604m75265L7321
38647C8907N52558K07263n19787o28354n9569M17138L70569J22770J20593L15743
38637I37831K94035n5556k32503J87101P16446M98732k88647n27996O0572L95717
38627A985732j17580m91825J26740Q68697N48925l71749o62833k97214p3538l2993
38617A482362K51389M97832K82628P8788L55020N18393J58999K02540J207583
38608E035534J875074J185427N24345J392092K587685K375274J819364K803047
38600A9597842M346014M527951M471534O255909Q524221R051105R999989J4805651
38592H1580216K1684260K7759982L7665208N6502488P2570073O1244970J5192884
$$ plain form
38585 374200081 335055978 268179198 207195536 164571799 133989233 109450376 91599017
38578 91599017 79985947 70226726 59983454 51166877 44999884 39747324 34302159 29859834
38570 29859834 26914857 24039670 20718467 18402464 17674163 16981553 15266230 13534873
38562 13534873 12728315 12078345 10728932 9271221 8547172 8309642 8019843 7778258 7669848
38553 7669848 7280199 6540594 6038846 5950355 5700719 5171965 5116984 5784677 6221841 5661433
38543 5661433 4677952 4214559 4239399 4123829 3745459 3482487 3502818 3637358 3710454 3640116
38533 3640116 3443418 3304194 3337240 3265076 2751261 2032964 1711733 1946013 2396011 2859219
38523 2859219 3282733 3280019 2522937 1627257 1664534 2593612 3152042 2641722 1855342 1732330
$$ packed form
38585C74200081l9144103o6876780o0983662m2623737l0582566k4538857j7851359
38578I1599017j1613070r759221j0243272q816577o166993n252560n445165m442325
38570B9859834k944977k875187l321203k316003p28301o92610j715323j731357
38562A3534873q06558o49970j349413j457711p24049k37530k89799k41585j08410
38553G669848l89649p39605n01748q8491k49636n28754n4981O67693M37164n60408
38543E661433r83481m63393K4840j15570l78370k62972K0331J34540P3096p0338
38533C640116j96698j39224L3046p2164n13815p18297l21231K34280M49998M63208
38523B859219M23514k714p57082q95680L7277R29078N58430n10320p86380j23012
$$ plain form
38513 1732330 2024406 2014805 1802770 1969804 2412949 2421885 1801689 1188139 1171211 1607214
38503 1607214 1943651 1916973 1755446 1797012 2045347 2200929 2124424 2046263 2151837 2222124
38493 2222124 2018857 1794156 1947683 2322441 2385522 2057327 1787877 1788379 1795293 1722731 1941102
38482 1941102 2643720 3432491 3839323 3880015 3824569 3757954 3631000 3473449 3334702 3223516
38472 3223516 3215168 3357015 3405179 2998837 2206226 1556838 1415619 1667751 2111979 2728418
38462 2728418 3361429 3585120 3245934 2865194 3128709 4061759 4942647 5010299 4185991 3176729
38452 3176729 2869196 3496381 4440333 4981649 5070246 5107714 5240320 5382071 5790348 6919431
38442 6919431 8570851 9840162 10239003 10380309 11166892 12679732 14286775 15578648 16745062
$$ packed form
38513A732330K92076r601k12035J67034M43145Q936o20196o13550j6928M36003
38503A607214L36437k6678j61527M1566K48335J55582p6505p8161J05574P0287
38493B222124k03267k24701J53527L74758O3081l28195k69450N02O914p2562K18371
38482A941102P02618P88771M06832M0692n5446o6615j26954j57551j38747j11186
38472C223516q348J41847M8164m06342p92611o49388j41219K52132M44228O16439
38462B728418O33011K23691l39186l80740K63515R33050Q80888O7652q24308j009262
38452C176729l07533O27185R43952N41316Q8597L7468J32606J41751M08277J129083
38442F919431J651420J269311L98841J41306P86583J512840J607043J291873J166414
$$ plain form
38433 16745062 18132972 19821902 21664352 23480678 25099551 26296867 26811747 26521582
38425 26521582 25611134 24409148 22972468 21071303 18786164 16802851 15684141 15050269
38417 15050269 14026618 12441537 10994236 10174054 9626988 8831034 7865231 7132467 6686313
38408 6686313 6245031 5690243 5214560 5028062 5102992 5169422 4906538 4238000 3448824 2886760
38398 2886760 2606331 2485684 2557533 2894429 3245012 3196392 2728541 2231283 1932362 1703158
38388 1703158 1492964 1515748 1846600 2227673 2489633 2839587 3490373 4239468 4635987 4438892
38378 4438892 3820361 3259888 3241301 3839662 4595795 5002429 5078106 5252306 5809993 6747861
38368 6747861 8026514 9567229 11110552 12507510 14065141 16193283 18867189 21915343
$$ packed form
38433A6745062J387910J688930J842450J816326J618873J197316N14880k90165
38425B6521582r10448j201986j436680j901165k285139j983313j118710o33872
38417A5050269j023651j585081j447301q20182n47066p95954r65803p32764m46154
38408F686313m41282n54788m75683j86498P4930O6430k62884o68538p89176n62064
38398B886760k80429j20647P1849L36896L50583m8620m67851m97258k98921k29204
38388A703158k10194K2784L30852L81073K61960L49954O50786P49095L96519j97095
38378D438892o18531n60473j8587N98361P56133M06634P5677J74200N57687R37868
38368F747861J278653J540715J543323J396958J557631K128142K673906L048154
$$ plain form
38360 21915343 25608127 30335475 35932045 42104048 49291745 57987356 67051042 73803403
38352 73803403 76250199 74462359 69586329 62620512 54680835 47278945 41291351 36276206
38344 36276206 31610205 27650844 24932450 22895001 20519649 17853653 15817969 14663944
38336 14663944 13642666 12220400 10710593 9547588 8696813 8019812 7617963 7534140 7530038
38327 7530038 7394020 7201523 7127624 7171681 7111489 6658094 5791907 5019250 4968083 5521215
38317 5521215 5755265 5088251 4079073 3629035 3782833 3899462 3691366 3424992 3284387
38308 3284387 3209521 3274680 3601518 3948005 3972732 3858051 4073391 4549997 4718593 4399349
38298 4399349 4026409 3890598 3775946 3526991 3402194 3594376 3859352 3897671 3742131 3538799
$$ packed form
38360B1915343L692784M727348N596570O172003P187697Q695611R063686O752361
38352G3803403K446796j787840m876030o965817p939677p401890n987594n015145
38344C6276206m666001l959361k718394k037449k375352k665996k035684j154025
38336A4663944j021278j422266j509807j163005q50775o77001m01849q3823m102
38327G530038j36018j92497p3899M4057o0192m53395q66187p72657n1167N53132
38317E521215K34050o67014j009178m50038J53798J16629k08096k66374j40605
38308C284387p4866O5159L26838L46487K4727j14681K15340M76606J68596l19244
38298D399349l72940j35811j14652k48955j24797J92182K64976L8319j55540k03332
$$ plain form
38288 3538799 3297655 3110560 3300858 4046720 5026155 5688148 5815335 5690013 5751577 6147355
38278 6147355 6604506 6782002 6747976 6931842 7534661 8250826 8728280 8989242 9170498 9234483
38268 9234483 9278034 9683950 10448116 10776781 10060627 8950098 8625862 9142291 9412815
38259 9412815 8871673 8164978 7904084 7680884 6912204 5952523 5600201 5851000 5854584 5041568
38249 5041568 3787762 2910919 2813097 3184193 3401713 3172136 2767094 2582400 2589534 2448120
38239 2448120 2075954 1776484 1779299 1965898 2110620 2116510 1961190 1673977 1411381 1319610
38229 1319610 1323411 1273059 1203259 1153148 890929 245905 -406420 -497409 -41074 467530
38219 467530 845264 1265995 1539006 1144999 196584 -407839 -166615 334575 342628 -26284
$$ packed form
38288C538799k41144j87095J90298P45862R79435O61993J27187j25322O1564L95778
38278F147355M57151J77496l4026J83866O02819P16165M77454K60962J81256O3985
38268I234483M3551M05916P64166L28665p16154j110529l24236N16429K70524
38259I412815n41142p06695k60894k23200p68680r59681l52322K50799L584q13016
38249E041568j253806q76843r7822L71096K17520k29577m05042j84694P134j41414
38239B448120l72166k99470K815J86599J44722N890j55320k87213k62596r1771
38229A319610L801n0352o9800n0111k62219o45024o52325r0989M56335N08604
38219D67530L77734M20731K73011l94007r48415o04423K41224N01190Q053l68912
$$ plain form
38209 -26284 -157303 133840 559381 885523 1018844 852631 451591 155905 168796 294891
38199 294891 344997 445708 657152 700214 442018 259009 490620 882777 1009941 915382
38189 915382 874934 836187 578733 182687 -115700 -306361 -439097 -346228 52362 452647
38179 452647 597387 694029 971577 1190612 1098821 976177 1118550 1160993 638864 -81636
38169 -81636 -230855 213133 616635 770872 981136 1131390 652415 -389765 -1077964 -864903
38159 -864903 -278315 -38934 -120192 -93531 136538 381017 556601 667714 693657 708295
38149 708295 802187 796783 461570 72464 191021 764355 1090165 891269 721695 967251
38139 967251 1164610 806081 170196 -228719 -433140 -644846 -588545 -31927 500723 375911
$$ packed form
38209b6284j31019K91143M25541L26142J33321j66213m01040k95686J2891J26095
38199B94891N0106J00711K11444M3062k58196j83009K31611L92157J27164r4559
38189I15382m0448l8747k57454l96046k98387j90661j32736R2869L98590M00285
38179D52647J44740R6642K77548K19035r1791j22644J42373M2443n22129p20500
38169h1636j49219M43988M03502J54237K10264J50254m78975j042180o88199K13061
38159h64903N86588K39381q1258K6661K30069K44479J75584J11113K5943J4638
38149G08295R3892n404l35213l89106J18557N73334L25810j98896j69574K45556
38139I67251J97359l58529o35885l98915k04421k11706N6301N56618N32650j24812
$$ plain form
38129 375911 -80080 -11895 636931 1082168 937156 654025 641345 721552 681088 696399
38119 696399 928055 1208089 1385357 1545306 1686344 1602893 1275984 968172 766892 469758
38109 469758 98135 45792 455066 874861 836692 406969 -92353 -518406 -773409 -652514
38099 -652514 -203350 109409 -8588 -234506 -154890 78927 68250 -146298 -227432 -163400
38089 -163400 -210137 -336107 -258355 17471 194312 206852 265364 367283 258334 -47209
38079 -47209 -178675 28673 289808 313865 118922 -183285 -499151 -549347 -45825 716898
38069 716898 937495 309086 -458981 -512181 76793 534849 453327 159342 108527 319217
38059 319217 464668 291841 -94725 -284879 4636 483975 503659 -128526 -799929 -801098
$$ packed form
38129C75911m55991O8185O48826M45237j45012k83131j2680Q0207m0464J5311
38119F96399K31656K80034J77268J59949J41038q3451l26909l07812k01280k97134
38109D69758l71623n2343M09274M19795l8169m29723m99322m26053k55003J20895
38099f52514M49164L12759j17997k25918P9616K33817j0677k14548q1134O4032
38089a63400m6737j25970P7752K75826J76841J2540N8512J01919j08949l05543
38079d7209j31466K07348K61135K4057j94943l02207l15866n0196N03522P62723
38069G16898K20597o28409p68067n3200N88974M58056q1522k93985n0815K10690
38059C19217J45451j72827l86566j90154K89515M79339J9684o32185o71403j169
$$ plain form
38049 -801098 -152423 541316 821510 636286 116152 -461578 -612516 -48401 814434 1149558
38039 1149558 630896 -242433 -805310 -922769 -910198 -1000877 -1078668 -860061 -242604 528469
38029 528469 1072789 1268023 1308252 1317700 1118870 552623 -166459 -651327 -773961 -693110
38019 -693110 -581491 -511199 -467385 -330112 -51097 43765 -490900 -1438788 -1881229 -1348852
38009 -1348852 -534335 -302367 -468605 -312987 96677 60482 -455325 -713843 -446325 -195181
37999 -195181 -238533 -158802 190080 242854 -256588 -647527 -373407 112864 134614 -126572
37989 -126572 -60616 320889 495012 290999 9531 -104181 6287 363677 782174 801158
37979 801158 246524 -400117 -605361 -459077 -342863 -286401 -129223 20607 4349 -13047
$$ packed form
38049h01098O48675O93739K80194j85224n20134n77730j50938N64115Q62835L35124
38039A149558n18662q73329n62877j17459J2571r0679p7791K18607O17457P71073
38029E28469N44320J95234M0229R448j98830n66247p19082m84868j22634Q0851
38019f93110J11619P0292M3814J37273K79015R4862n34665r47888m42441N32377
38009a348852Q14517K31968j66238J55618M09664l6195n15807k58518K67518K51144
37999a95181m3352P9731L48882N2774m99442l90939K74120M86271K1750k61186
37989a26572O5956L81505J74123k04013k81468j13712J10468L57390M18497J8984
37979H01158n54634o46641k05244J46284J16214N6462J57178J49830j6258j7396
$$ plain form
37969 -13047 116385 122783 -224954 -576221 -464126 -40716 183788 64464 -216012 -574180
37959 -574180 -873003 -714251 -5816 608657 546026 185053 299312 923752 1491499 1748897
37949 1748897 1781487 1505171 963734 757342 1273392 1876188 1832072 1594546 2068472 3164114
37939 3164114 4513821 7012930 11546989 16219684 17263286 13573678 8380647 5293943
37931 5293943 4431494 3788409 2711855 2058948 1998574 1798178 1429010 1562227 2039214
37922 2039214 1920744 1147445 734738 1070829 1293460 774895 136772 201018 738439 920123
37912 920123 535592 169611 344218 877387 1121371 735224 139519 11176 321815 318100
37902 318100 -320578 -863894 -562345 205262 502800 185025 -112605 -94942 -69217 -167678
$$ packed form
37969a3047J29432O398l47737l51267J12095M23410K24504j19324k80476l58168
37959e74180k98823J58752P08435O14473o2631l60973J14259O24440N67747K57398
37949A748897L2590k76316n41437k06392N16050O02796m4116k37526M73926J095642
37939C164114J349707K499109M534059M672695J043602l689608n193031l086704
37931E293943q62449o43085j076554o52907o0374k00396l69168J33217M76987
37922B039214j18470p73299m12707L36091K22631n18565o38123O4246N37421J81684
37912I20123l84531l65981J74607N33169K43984l86147n95705j28343L10639l715
37902C18100o38678n43316L01549P67607K97538l17775k97630J7663K5725r8461
$$ plain form
37892 -167678 -151291 -49543 -215145 -590226 -629815 -170426 262646 261504 68577 22120
37882 22120 -4544 -259599 -603713 -695321 -449073 -72695 189117 244880 252895 500769 968664
37871 968664 1157119 719926 111935 83710 603047 889843 565806 119479 50604 181006
37861 181006 131508 -41153 -73995 19238 72300 107576 239474 423785 516846 426118 117578
37850 117578 -298126 -475074 -176715 256944 224089 -264978 -521452 -156872 394554 602963
37840 602963 570224 635365 706029 492302 115535 -25183 154298 382704 480518 487427 422044
37829 422044 234894 -34826 -290549 -506061 -641598 -559168 -235851 64505 75206 -104193
37819 -104193 -156902 -9358 94031 -12732 -144650 6849 436735 743135 614549 404380
$$ packed form
37892a67678J6387J01748j65602l75081l9589M59389M33072j142j92927m6457
37882B2120k6664k55055l44114r1608K46248L76378K61812N5763Q015K47874M67895
37871I68664J88455m37193o07991k8225N19337K86796l24037m46327o8875J30402
37861A81006m9498j72661l2842R3233N3062L5276J31898J84311R3061r0728l08540
37850A17578m15704j76948K98359M33659l2855m89067k56474L64580N51426K08409
37840F02963l2739O5141P0664k13727l76767j40718J79481K28406R7814O909o5383
37829D22044j87150k69720k55723k15512j35537Q2430L23317L00356J0701j79399
37819a04193n2709J47544J03389j06763j31918J51499M29886L06400j28586k10169
$$ plain form
37809 404380 970582 2705997 4874179 6207188 6090901 4900211 3348174 1957287 1076475
37800 1076475 831659 925858 931062 864569 1031969 1298018 1147364 600351 351708 700911
37790 700911 1059856 955533 806832 1095333 1412393 1127401 526933 388402 695789 708889
37780 708889 232023 -90716 138090 490007 478387 250292 171675 224261 187688 79149
37770 79149 76790 223189 440547 651493 715439 461566 -20689 -310166 -97957 393514
37760 393514 631099 385845 -20888 -122830 134849 365334 291420 159680 387437 871608
37750 871608 992673 407791 -474750 -993396 -931727 -530741 -112339 49124 -212826 -686312
37740 -686312 -829814 -443788 -25602 -51670 -202894 141369 834682 1048425 434841 -381554
$$ packed form
37809D04380N66202J735415K168182J333009j16287j190690j552037j390887q80812
37800A076475k44816R4199N204o6493J67400K66049j50654n47013k48643L49203
37790G00911L58945j04323j48701K88501L17060k84992o00468j38531L07387J3100
37780G08889m76866l22739K28806L51917j1620k28095p8617N2586l6573j08539
37770G9149k359J46399K17358K10946O3946k53873m82255k89477K12209M91471
37760C93514K37585k45254m06733j01942K57679K30485p3914j31740K27757M84171
37750H71608J21065n84882q82541n18646O1669M00986M18402J61463k61950m73486
37740f86312j43502L86026M18186k6068j51224L44263O93313K13743o13584q16395
$$ plain form
37730 -381554 -597194 -58133 797193 1394455 1336681 686133 34902 -92352 57257 -183052
37720 -183052 -819156 -1084238 -596043 32957 139779 -11652 237969 850724 1192713 1020524
37710 1020524 716936 583862 497814 357368 336397 469580 407643 -95814 -708970 -847927
37700 -847927 -351678 414034 1019985 1290265 1236867 987148 816913 976277 1349201 1489831
37690 1489831 1147890 582379 188185 1633 -181234 -352147 -278990 106468 607253 1022803
37680 1022803 1234091 1099310 640587 304971 561389 1139001 1167271 307233 -708214
37671 -708214 -976521 -476313 137820 428841 434168 304419 152722 115914 181069 90686
37661 90686 -242132 -413923 -15893 717521 1156413 1075463 828042 795134 1010037 1280224
$$ packed form
37730c81554k15640N39061Q55326N97262n7774o50548o51231j27254J49609k40309
37720a83052o36104k65082M88195O29000J06822j51431K49621O12755L41989j72189
37710A020524l03588j33074q6048j40446k0971J33183o1937n03457o13156j38957
37700h47927M96249P65712O05951K70280n3398k49719j70235J59364L72924J40630
37690A489831l41941n65511l94194j86552j82867j70913P3157L85458N00785M15550
37680A022803K11288j34781m58723l35616K56418N77612K8270q60038j015447
37671g08214k68307N00208O14133K91021N327j29749j51697l6808O5155r0383
37661I0686l32818j71791L98030P33414M38892q0950k47421l2908K14903K70187
$$ plain form
37651 1280224 1389931 1245012 1032959 1084471 1373449 1424976 990592 474631 328022 396310
37641 396310 334016 271754 471930 661780 414278 -43547 -134334 132318 277060 270312
37631 270312 534786 1082926 1453771 1509729 1501429 1338771 674078 -192591 -402369 229767
37621 229767 884731 892401 453135 9872 -270014 -161342 558096 1386574 1363808 467552
37611 467552 -178976 46305 398561 128334 -330191 -330387 -197740 -447111 -639307 -151572
37601 -151572 542943 560929 122944 164198 708207 855083 334237 -73270 206197 808290
37591 808290 1136480 1009553 479349 -251118 -615255 -130140 790219 1165030 751252 323377
37581 323377 445493 687709 438398 -117661 -358468 -202452 -191531 -658805 -1186480 -1069216
$$ packed form
37651A280224J09707j44919k12053N1512K88978N1527m34384n15961j46609O8288
37641C96310o2294o2262K00176J89850k47502m57825r0787K66652J44742o748
37631B70312K64474N48140L70845N5958q300j62658o64693q66669k09778O32136
37621B29767O54964P670m39266m43263k79886J08672P19438Q28478k2766q96256
37611D67552o46528K25281L52256k70227m58525j96J32647k49371j92196M87735
37601a51572O94515J7986m37985M1254N44009J46876n20846m07507K79467O02093
37591H08290L28190j26927n30204p30467l64137M85115R20359L74811m13778m27875
37581C23377J22116K42216k49311n56059k40807J56016J0921m67274n27675J17264
$$ plain form
37571 -1069216 -263742 357104 1595 -881206 -1008147 6407 1041746 1070357 617627
37562 617627 786479 1429964 1456779 699584 211603 590003 1171016 1247978 1072477 1126462
37552 1126462 1246310 1101219 904951 996796 1146826 871524 173813 -482979 -736369 -560744
37542 -560744 -187311 -11462 -277890 -664633 -541098 165803 785407 812702 525870 378500
37532 378500 279579 -47943 -397098 -346546 14809 183335 -5987 -179147 2724 420335
37522 420335 722338 742144 594812 459365 338057 82575 -296021 -475919 -194657 316610
37512 316610 565071 431421 247100 249450 333928 376524 402259 374384 233661 207454 594737
37501 594737 1131606 1121719 428543 -195720 -92313 468371 796885 705162 514821 493404
$$ packed form
37571a069216Q05474O20846l55509q82801j26941J014554J035339K8611m52730
37562F17627J68852O43485K6815p57195m87981L78400N81013P6962j75501N3985
37552A126462J19848j45091j96268R1845J50030k75302o97711o56792k53390J75625
37542e60744L73433J75849k66428l86743J23535P06901O19604K7295k86832j47370
37532C78500r8921l27522l49155N0552L61355J68526j89322j73160J81871M17611
37522D20335L02003J9806j47332j35447j21308k55482l78596j79898K81262N11267
37512C16610K48461j33650j84321K350Q4478M2596K5735k7875j40723k6207L87283
37501E94737N36869r887o93176o24263J03407N60684L28514r1723j90341k1417
$$ plain form
37491 493404 672483 949089 1056404 734288 191268 22107 391801 746828 653519 393393
37481 393393 304353 128652 -362361 -636342 -104129 798364 1100102 688274 365331 573604
37471 573604 894829 894049 688506 487105 225617 -101088 -287278 -304931 -358466 -403187 -133222
37460 -133222 385325 639234 473161 401296 762590 1084520 760849 -15243 -496842 -323290
37450 -323290 238587 812747 1211017 1284760 921871 277826 -269461 -497400 -519859 -549840
37440 -549840 -611612 -550159 -275981 44208 93626 -227229 -588110 -539848 -49455 444108
37430 444108 553330 345892 145601 98946 76909 -74242 -291971 -304295 96778 731656
37420 731656 1087423 857974 328462 -4831 -78069 -187635 -365658 -303049 52664 337175
$$ packed form
37491D93404J79079K76606J07315l22116n43020j69161L69694L55027r3309k60126
37481C93393q9040j75701m91013k73981N32213R02493L01738m11828l22943K08273
37471E73604L21225p80k05543k01401k61488l26705j86190j7653n3535m4721K69965
37460a33222N18547K53909j66073p1865L61294L21930l23671p76092m81599J73552
37450c23290N61877N74160L98270P3743l62889o44045n47287k27939k2459k9981
37440e49840o1772O1453K74178L20189M9418l20855l60881M8262M90393M93563
37430D44108J09222k07438k00291m6655k2037j51151k17729j2324M01073O34878
37420G31656L55767k29449n29512l33293p3238j09566j78023O2609L55713K84511
$$ plain form
37410 337175 386655 500795 797813 824497 265040 -387060 -430581 63994 463208 528394
37400 528394 518566 485757 198339 -221474 -314312 -82451 -77103 -454188 -637243 -279956 109399
37389 109399 9265 -261605 -181081 4027 -242662 -632863 -356976 561696 1131888 784671
37379 784671 95124 -199170 -187557 -323421 -532708 -392072 88526 413697 256489 -199319
37369 -199319 -523191 -424350 13634 327680 106667 -410718 -469614 213722 928491 819381
37359 819381 -4901 -679266 -726779 -484298 -438624 -649304 -918173 -1114523 -1173154 -1056059
37349 -1056059 -848855 -697013 -590707 -398311 -112039 140594 290447 311970 110261 -277405
37339 -277405 -463790 -92301 581775 911907 704624 409363 375933 402455 232675 42923
$$ packed form
37410C37175M9480J14140K97018K6684n59457o52100m3521M94575L99214O5186
37400E28394r828l2809k87418m19813r2838K31861N348l77085j83055L57287L89355
37389A09399j00134k70870Q0524J85108k46689l90201K75887R18672N70192l47217
37379G84671o89547k94294J1613j35864k09287J40636M80598L25171j57208m55808
37369a99319l23872R8841M37984L14046k21013n17385n8896O83336P14769j09110
37359H19381q24282o74365m7513K42481M5674k10680k68869j96350n8631J17095
37349a056059K07204J51842J06306J92396K86272K52633J49853K1523k01709l87666
37339b77405j86385L71489O74076L30132k07283k95261l3430K6522j69780j89752
$$ plain form
37329 42923 84245 181114 4682 -344171 -432361 -124146 222096 236685 -8938 -138935
37319 -138935 40545 318310 388788 303217 407751 773131 974822 696665 291957 316360
37309 316360 651859 625456 3355 -669511 -837746 -541917 -89664 372853 703883 655476
37299 655476 269770 12334 160333 378923 242381 -137262 -362014 -347102 -295753 -307118
37289 -307118 -355387 -445176 -484869 -268237 102158 103504 -476951 -1012313 -757835 115132
37279 115132 753423 739093 397571 69213 -294264 -704618 -864961 -581545 -116307 87025
37269 87025 -152280 -651074 -1017458 -907602 -354634 163961 205052 -129639 -374671 -292022
37259 -292022 -5480 333267 640496 722239 419053 -31378 -159291 116373 356602 187949
$$ packed form
37329D2923M1322R6869j76432l48853q8190L08215L46242J4589k45623j29997
37319a38935J79480K77765P0478q5571J04534L65380K01691k78157m04708K4403
37309C16360L35499k6403o22101o72866j68235K95829M52253M62517L31030m8407
37299F55476l85706k57436J47999K18590j36542l79643k24752J4912N1349j1365
37289c07118m8269q9789l9693K16632L70395J346n80455n35362K54478Q72967
37279A15132O38291j4330l41522l28358l63477m10354j60343K83416M65238K03332
37269H7025k39305m98794l66384J09856N52968N18595M1091l34691k45032Q2649
37259b92022K86542L38747L07229Q1743l03186m50431j27913K75664K40229j68653
$$ plain form
37249 187949 -273624 -681756 -871617 -903203 -913717 -1014648 -1166850 -1148782 -833111 -432668
37239 -432668 -219509 -100206 165134 389434 90237 -726146 -1399011 -1441671 -1120424 -932573
37229 -932573 -871133 -581365 -24973 403200 371355 -41060 -481316 -646737 -498221 -263184
37219 -263184 -188282 -240486 -162898 106119 229456 -146763 -877152 -1360701 -1155990 -484927
37209 -484927 -35330 -219056 -696841 -776950 -249624 415822 746230 794380 798813 680785
37199 680785 260265 -291989 -670437 -910657 -1162884 -1172339 -596583 233107 559327 283420
37189 283420 106587 398058 640622 361060 -58212 -22117 348455 521360 388811 190160
37179 190160 -83672 -548092 -875336 -559226 297098 1025822 1241029 1139237 957163 675438
$$ packed form
37249A87949m61573m08132j89861l1586j0514j00931j52202J8068L15671M00443
37239d32668K13159J19303K65340K24300k99197q16383o72865m2660L21247J87851
37229i32573O1440K89768N56392M28173l1845m12415m40256j65421J48516K35037
37219b63184P4902n2204P7588K69017J23337l76219p30389m83549K04711O71063
37209d84927M49597j83726m77785q0109N27326O65446L30408M8150M433j18028
37199F80785m20520n52254l78448k40220k52227r455N75756Q29690L26220k75907
37189B83420j76833K91471K42564k79562m19272L6095L70572J72905j32549j98651
37179A90160k73832m64420l27244L16110Q56324P28724K15207j01792j82074k81725
$$ plain form
37169 675438 355220 253660 419963 583886 593578 560767 449532 20599 -582125 -723649
37159 -723649 -160319 436704 385663 50004 278920 973986 1068867 104479 -965427 -1017671
37149 -1017671 -248985 213511 -113292 -584383 -486054 67715 505622 589266 507270 456781
37139 456781 457000 469105 475721 487667 570870 759562 889194 724396 364366 258344 598053
37128 598053 931301 692765 -29707 -594893 -592441 -185413 296380 715168 977434 882883
37118 882883 383638 -166911 -286266 105267 570158 632063 298443 -437 1222 54170
37108 54170 -198244 -605346 -643779 -180708 284538 298228 10947 -180515 -201106 -171752
37098 -171752 -20422 352350 717692 767782 603749 575128 736957 850400 806527 655317
$$ packed form
37169F75438l20218j01560J66303J63923R692l2811j11235m28933o02724j41524
37159g23649N63330N97023n1041l35659K28916O95066R4881r64388j069906n2244
37149a017671P68686M62496l26803m71091R8329N53769M37907Q3644q1996n0489
37139D56781K19J2105O616J1946Q3203J88692J29632j64798l60030j06022L39709
37128E98053L33248k38536p22472n65186K452M07028M81793M18788K62266r4551
37118H82883m99245n50549j19355L91533M64891O1905l33620k98880J659N2948
37108E4170k52414m07102l8433M63071M65246J3690k87281j91462k0591K9354
37098a71752J51330L72772L65342N0090j64033k8621J61829J13443m3873j51210
$$ plain form
37088 655317 362667 -3452 -4164 674383 1518633 1613458 830073 -19740 -330408 -369380
37078 -369380 -574614 -809454 -703382 -269713 218497 624066 872731 802213 423130 69316
37068 69316 -4686 68534 94765 138623 243968 166745 -250748 -696316 -762529 -532503 -439160
37057 -439160 -656364 -934857 -963101 -648718 -122554 338983 480139 307568 81090 -3717
37047 -3717 37591 173161 419155 637623 605414 402675 354029 428407 161358 -547052 -1047913
37036 -1047913 -809659 -278104 -306996 -958361 -1454151 -1256230 -666363 -286290 -296524 -426909
37026 -426909 -397533 -225800 -146676 -272462 -401632 -307004 -135323 -205514 -413290 -277535
37016 -277535 292968 762521 742278 526057 529318 657689 628045 472741 283128 -95758
$$ packed form
37088F55317k92650l66119p12O78547Q44250R4825p83385q49813l10668l8972
37078c69380k05234k34840J06072M33669M88210M05569K48665p0518l79083l53814
37068F9316p4002P3220K6231M3858J05345p7223m17493m45568o6213K30026R3343
37057d39160k17204k78493k8244L14383N26164M61537J41156j72571k26478q4807
37047c717M1308J35570K45994K18468l2209k02739m8646P4378k67049p08410n00861
37036a047913K38254N31555k8892o51365m95790J97921N89867L80073j0234j30385
37026d26909K9376J71733P9124j25786j29170R4628J71681p0191k07776J35755
37016b77535N70503M69553k0243k16221L261J28371k9644j55304j89613l78886
$$ plain form
37006 -95758 -605402 -675730 -12156 733013 784701 385364 330401 671464 784021 547115
36996 547115 470084 642826 545696 73130 -180540 54239 258954 49674 -224346 -233026
36986 -233026 -271832 -589431 -768073 -389741 195985 382370 163349 -92303 -316219 -586783
36976 -586783 -686465 -489367 -473754 -1095225 -1856304 -1816391 -972642 -297333 -300130 -403251
36966 -403251 -60702 303585 57883 -522608 -650065 -247366 -24370 -369171 -848598 -965280
36956 -965280 -814553 -675677 -440550 76504 567557 531858 63803 -189468 69512 396851
36946 396851 298988 -98041 -368409 -455277 -613523 -829105 -720224 -87086 714092 1091634
36936 1091634 810656 171371 -370484 -668116 -876302 -1014354 -801341 -138402 491495
$$ packed form
37006i5758n09644p0328O63574P45169N1688l99337n4963L41063J12557k36906
36996E47115p7031J72742r7130m72566k53670K34779K04715k09280k74020q680
36986b33026l8806l17599j78642L78332N85726J86385k19021k55652k23916k70564
36976e86783r9682J97098J5613o21471p61079L9913Q43749O75309k797j03121
36966d03251L42549L64287k45702n80491j27457M02699K22996l44801m79427j16682
36956i65280J50727J38876K35127N17054M91053l5699m68055k53271K58980L27339
36946C96851r7863l97029k70368q6868j58246k15582J08881O33138Q01178L77542
36936A091634k80978o39285n41855k97632k08186j38052K13013O62939O29897
$$ plain form
36927 491495 530948 147340 9741 278590 439851 268905 227832 552173 679809 176938
36917 176938 -404955 -347960 80075 178552 114990 612852 1500846 1711585 880496 -73584
36907 -73584 -296703 -51953 -1560 -208399 -374160 -455873 -496615 -310377 159930 539998
36897 539998 496537 167409 -199803 -601822 -929835 -788415 -141742 339696 140206 -307421
36887 -307421 -290936 111100 330450 355846 633713 1054635 950916 248210 -205185 168416
36877 168416 784911 708059 -45564 -568379 -290294 358519 616712 380366 242822 627276
36867 627276 1181260 1212399 563599 -230477 -624175 -583080 -383940 -241752 -267775 -450794
36857 -450794 -485124 34280 994516 1688111 1644627 1177745 777223 410191 -73508 -298382
$$ packed form
36927D91495L9453l83608j37599K68849J61261j70946m1073L24341J27636n02871
36917A76938n81893N6995M28035R8477o3562M97862Q87994K10739q31089r54080
36907g3584k23119K44750N0393k06839j65761q1713m0742J86238M70307L80068
36897E39998m3461l29128l67212m02019l28013J41420O46673M81438j99490m47627
36887c07421J6485M02036K19350K5396K77867M20922j03719p02706m53395L73601
36877A68416O16495p6852p53623n22815K78085O48813K58193k36346j37544L84454
36867F27276N53984L1139o48800p94076l93698M1095J99140J42188k6023j83019
36857d50794l4330N19404R60236O93595m3484m66882m00522l67032m83699k24874
$$ plain form
36847 -298382 139665 815163 941346 578785 501439 840050 820097 102918 -559136 -502689
36837 -502689 -165577 -252114 -561338 -462475 -60350 21025 -230381 -216645 169668 316241
36827 316241 -67030 -428794 -223981 296908 526842 307006 -78225 -380666 -491113 -301978
36817 -301978 165457 612013 711478 443921 33886 -300033 -411614 -263057 -64890 -144709
36807 -144709 -477660 -607251 -275603 157062 239916 74350 -797 -84767 -480697 -922258
36797 -922258 -732893 139852 886673 895271 519347 439293 692591 801485 598947 427570
36787 427570 554816 770091 670203 179057 -312715 -333363 135583 600970 641873 386654
36777 386654 159750 -125833 -728272 -1333161 -1234076 -404304 301620 347307 253547 642012
$$ packed form
36847b98382M38047O75498J26183l62561p7346L38611j9953p17179o62054N6447
36837e02689L37112q6537l09224R8863M02125Q1375k51406J3736L86313J46573
36827C16241l83271l61764K04813N20889K29934k19836l85231l02441j10447J89135
36817c01978M67435M46556R9465k67557m10035l33919j11581J48557J98167p9819
36807a44709l32951j29591L31648M32665Q2854j65566p5147q3970l95930m41561
36797i22258J89365Q72745P46821Q598l75924q0054K53298J08894k02538j71377
36787D27570J27246K15275r9888m91146m91772k0648M68946M65387M0903k55219
36777C86654k26904k85583o02439o04889R9085Q29772P05924M5687r3760L88465
$$ plain form
36767 642012 1153089 1036281 424660 216134 802568 1593484 1810735 1253588 304605 -392089
36757 -392089 -342183 295467 744910 541099 180131 368727 945081 1202476 1020944 876921
36747 876921 871335 635703 219509 172759 586480 892573 843865 873255 1186026 1310196
36737 1310196 949578 544534 540459 768121 973386 1267567 1592232 1477907 904887 669088
36727 669088 1195926 1677012 1215823 251340 -89859 376963 885306 1023366 1034055 963734
36717 963734 528976 -129777 -466829 -418919 -462114 -656471 -455585 307351 1029883 1265427
36707 1265427 1329746 1574830 1694124 1282020 620760 338940 542835 766415 640109 237717
36697 237717 -137042 -214853 101241 620654 944372 823511 387491 -46543 -252341 -139131
$$ packed form
36767F42012N11077j16808o11621k08526N86434P90916K17251n57147r48983o96694
36757c92089M9906O37650M49443k03811l60968J88596N76354K57395j81532j44023
36747H76921n586k35632m16194m6750M13721L06093m8708K9390L12771J24170
36737A310196l60618m05044m075K27662K05265K94181L24665j14325n73020k35799
36727F69088N26838M81086m61189r64483l41199M66822N08343J38060J0689p0321
36717I63734m34758o58753l37052M7910m3195j94357K00886P62936P22532K35544
36707A265427O4319K45084J19294m12104o61260k81820K03895K23580j26306m02392
36697B37717l74759p7811L16094N19413L23718j20861m36020m34034k05798J13210
$$ plain form
36687 -139131 249950 665887 805928 684852 639124 817010 935505 774173 627025 880866
36677 880866 1310503 1273035 638231 68305 149244 593431 668102 222139 -169148 -92188
36667 -92188 140380 45980 -273388 -321584 53179 545716 917987 1157565 1124304 592631
36657 592631 -194759 -552895 -238758 154984 69263 -201831 -70183 331451 343315 -185503
36647 -185503 -716008 -856439 -764342 -630818 -354035 61733 283005 127747 -94925 -38949
36637 -38949 151578 82164 -295121 -616358 -574167 -237692 91005 210338 174455 144599
36627 144599 141717 77531 65685 448106 1277578 1993330 1995887 1442332 1035405 1042800 1024977
36616 1024977 650810 258683 283992 514652 354988 -331997 -1028347 -1182548 -757602 -132564
$$ packed form
36687a39131L89081M15937J40041j21076m5728J77886J18495j61332j47148K53841
36677H80866M29637l7468o34804n69926Q0939M44187P4671m45963l91287P6960
36667i2188K32568r4400l19368m8196L74763M92537L72271K39578l3261n31673
36657E92631p87390l58136L14137L93742q5721k71094J31648M01634J1864n28818
36647a85503n30505j40431R2097J33524K76783M15768K21272j55258k22672N5976
36637c8949J90527o9414l77285l21237M2191L36475L28697J19333l5883k9856
36627A44599k882o4186j1846L82421Q29472P15752K557n53555m06927P395j7823
36616A024977l74167l92127K5309K30660j59664o86985o96350j54201M24946O25038
$$ plain form
36606 -132564 353482 670020 952618 1171164 1084265 634928 226925 309838 735803 891577
36596 891577 533936 113809 104576 378314 522295 461633 405429 387173 264162 85134
36586 85134 82072 297291 525189 632013 640429 482031 10194 -614042 -859302 -390795
36576 -390795 471019 1086568 1178466 961005 707774 510846 476825 787747 1342632 1596222
36566 1596222 1108787 191059 -334073 -61912 589878 1002777 1082145 1142953 1298721 1285211
36556 1285211 855288 119798 -528961 -723820 -400915 118929 401150 355348 310820 523049
36546 523049 795749 816151 689349 803990 1227831 1577651 1523555 1142245 722687 479260
36536 479260 510325 775361 1015104 925724 527165 164477 46688 -2327 -199314 -417784
$$ packed form
36606a32564M86046L16538K82598K18546q6899m49337m08003Q2913M25965J55774
36596H91577l57641m20127r233K73738J43981o0662n6204j8256j23011j79028
36586H5134l062K15219K27898J06824Q416j58398m71837o24236k45260M68507
36576c90795Q61814O15549R1898k17461k53231j96928l4021L10922N54885K53590
36566A596222m87435r17728n25132K72161O51790M12899P9368O0808J55768j3510
36556A285211m29923p35490o48759j94859L22905N19844K82221m5802m4528K12229
36546E23049K72700K0402j26802J14641M23841L49820n4096l81310m19558k43427
36536D79260L1065K65036K39743q9380l98559l62688j17789m9015j96987k18470
$$ plain form
36526 -417784 -361561 -4604 370281 552710 619443 687047 603077 101112 -707466 -1234254
36516 -1234254 -1035168 -400074 3049 21498 124174 557443 952875 1057388 1267815 1886510
36506 1886510 2314729 1766345 570385 -73578 336265 1046065 1206000 868595 555499
36497 555499 478838 591801 897998 1261439 1282209 789376 198532 32032 301058 627794
36487 627794 738245 600926 344359 256405 575414 1081159 1236501 947595 769339 1075958
36477 1075958 1485662 1497513 1258540 1209117 1342722 1369002 1315367 1395554 1515428 1475518
36467 1475518 1442707 1619099 1655664 1101439 327369 231833 966129 1675637 1670950 1190238
36457 1190238 776885 557152 471272 619430 914248 860678 219142 -416997 -237476 746377
$$ packed form
36526d17784N6223L56957L74885J82429O6733O7604q3970n01965q08578n26788
36516a234254J99086O35094M03123J8449J02676M33269L95432J04513K10427O18695
36506A886510M28219n48384j195960o43963M09843P09800J59935l37405l13096
36497E55499p6661J12963L06197L63441K0770m92833n90844j66500K69026L26736
36487F27794J10451j37319k56567q7954L19009N05745J55342k88906j78256L06619
36477A075958M09704J1851k38973m9423J33605K6280n3635Q0187J19874l9910
36467A475518l2811J76392L6565n54225p74070r5536P34296P09508m687m80712
36457A190238m13353k19733q5880J48158K94818n3570o41536o36139J79521R83853
$$ plain form
36447 746377 1733351 2110247 1976823 1718623 1471261 1139013 680615 211290 -65836 49465
36437 49465 614566 1383148 1849796 1622717 853195 226595 351964 1099447 1691728 1563720
36427 1563720 979884 630044 776924 1086323 1212050 1187300 1176983 1161195 1032041 818237
36417 818237 666755 690400 872962 1028002 908825 550140 419302 920750 1768523 2221190
36407 2221190 1997777 1557730 1346678 1227892 943476 707898 892877 1387569 1752211
36398 1752211 1879538 2055027 2404487 2701071 2757669 2655066 2507998 2313303 2129212 2133281
36388 2133281 2356082 2541951 2411663 1966621 1476599 1261155 1483417 2020706 2520983
36379 2520983 2714008 2680277 2718052 2992770 3437368 3895145 4163472 4004181 3402928 2789921
$$ packed form
36447G46377R86974L76896j33424k58200k47362l32248m58398m69325k77126J15301
36437D9465N65101P68582M66648k27079p69522o26600J25369P47483N92281j28008
36427A563720n83836l49840J46880L09399J25727k4750j0317j5788j29154k13804
36417H18237j51482K3645J82562J55040j19177l58685j30838N01448Q47773M52667
36407B221190k23413m40047k11052j18786k84416k35578J84979M94692L64642
36398A752211J27327J75489L49460K96584N6598j02603j47068j94695j84091M069
36388B133281K22801J85869j30288m45042m90022k15444K22262N37289N00277
36379B520983J93025l3731L7775K74718M44598M57777K68327j59291o01253o13007
$$ plain form
36369 2789921 2703154 3207803 3909073 4514789 5050245 5523241 5810837 5987276 6331650 6835401
36359 6835401 7142435 7211684 7560076 8491973 9553375 10238749 10837211 11979909 13669722
36350 13669722 15468443 17443602 20121493 23533616 27178586 31123821 36313593 43378270
36342 43378270 51856326 61179278 71874304 84997683 100414611 115982979 128263779
36335 128263779 133925199 131233620 121172518 107133063 92830409 80208398 69359349
36328 69359349 59936691 51892098 45037389 38905724 33448270 29256902 26666893 25055860
36320 25055860 23433677 21419240 19278818 17298635 15555456 14137020 13134726 12393469
36312 12393469 11567405 10496580 9385358 8599463 8359520 8556860 8784800 8655112 8165245
$$ packed form
36369B789921q6767N04649P01270O05716N35456M72996K87596J76439L44374N03751
36359F835401L07034O9249L48392R31897J061402O85374N98462J142698J689813
36350A3669722J798721J975159K677891L412123L644970L945235N189772P064677
36342D3378270Q478056R322952J0695026J3123379J5416928J5568368J2280800
36335A28263779N661420k691579j0061102j4039455j4302654j2622011j0849049
36328F9359349r422658q044593o854709o131665n457454m191368k590009j611033
36320B5055860j622183k014437k140422j980183j743179j418436j002294p41257
36312A2393469q26064j070825j111222p85895k39943J97340K27940j29688m89867
$$ plain form
36303 8165245 7628602 7205626 6749228 6222851 5939044 6107021 6418188 6450304 6287425 6319842
36293 6319842 6556179 6603117 6301187 5915281 5653313 5452486 5318055 5375738 5435281 5044328
36283 5044328 4260974 3837373 4210922 4807683 4914016 4798962 5203342 5986094 6221432
36274 6221432 5676768 5241512 5554870 6047850 5910620 5344558 5121408 5339245 5435522 5243230
36264 5243230 5216277 5558339 5853413 5800157 5749917 6164881 6907563 7431256 7488683 7360254
36254 7360254 7455743 7883362 8391195 8641412 8555916 8398255 8478315 8837783 9306154 9751017
36244 9751017 10115314 10321266 10360060 10416972 10692784 11134892 11515389 11705720 11720629 11619850
36234 11619850 11542890 11670533 11955340 12104822 12035106 12035425 12228991 12284904 12030532 11853055
$$ packed form
36303H165245n36643m22976m56398n26377k83807J67977L11167L2116j62879L2417
36293F319842K36337M6938l01930l85906k61968k00827j34431N7683N9543l90953
36283E044328p83354m23601L73549N96761J06333j15054M04380P82752K35338
36274F221432n44664m35256L13358M92980j37230n66062k23150K17837R6277j92292
36264E243230k6953L42062K95074n3256n0240M14964P42682N23693N7427j28429
36254G360254R5489M27619N07833K50217q5496j57661Q0060L59468M68371M44863
36244I751017L64297K05952L8794N6912K75812M42108L80497J90331J4909j00779
36234A1619850p6960J27643K84807J49482o9716L19J93566N5913k54372j77477
$$ plain form
36224 11853055 11988256 11984822 11574965 11457037 12249685 13241040 13412609 13264339 14125652 15870284
36214 15870284 17018138 17194144 17696348 19259023 21089742 22761309 25188756 28766549
36206 28766549 32321893 35172928 38665364 44337644 52016259 61073174 72084990 85846137
36198 85846137 102342202 122236246 147703223 180452676 221402834 273719284 340970982
36191 340970982 416113436 475004309 490000248 453865077 386477627 316153836 258294722
36184 258294722 213156104 176933771 147976304 124786896 105082452 88267582 75388787
36177 75388787 66036598 58002034 50278636 43868528 39258323 35413780 31738894 28906356
36169 28906356 27106879 25294259 22865742 20569159 19097192 18106498 17197524 16623171
$$ packed form
36224A1853055J35201l434m09857j17928P92648R91355J71569j48270Q61313J744632
36214A5870284J147854J76006N02204J562675J830719J671567K427447L577793
36206B8766549L555344K851035L492436N672280P678615R056915J1011816J3761147
36198H5846137J6496065J9894044K5466977L2749453M0950158N2316450O7251698
36191C40970982P5142454N8890873J4995939l6135171o7387450p0323791n7859114
36184B58294722m5138618l6222333k8957467k3189408j9704444j6814870j2878795
36177G5388787r352189q034564p723398o410108m610205l844543l674886k832538
36169B8906356j799477j812620k428517k296583j471967r90694r08974n74353
$$ plain form
36161 16623171 16428829 15984891 14979903 13983467 13515248 13322688 12967016 12412006 11738036
36152 11738036 10945054 10247774 9935914 9850576 9617753 9320964 9212968 8956620 8089014
36143 8089014 7082738 6865112 7347222 7578023 7334341 7279150 7459583 7075502 6062286
36134 6062286 5466013 5701919 5813149 5175072 4620741 4945197 5464581 5181251 4445146
36125 4445146 4248407 4563000 4613244 4341495 4386298 4807518 4942172 4546201 4165042 4223581
36115 4223581 4459310 4474112 4345207 4447791 4928983 5507895 5740430 5521056 5297726 5561990
36105 5561990 6154625 6480892 6447552 6616109 7220568 7656881 7362129 6689655 6425729 6842060
36095 6842060 7698172 8787792 9941807 10796386 11128918 11258364 11653493 12321026 13010625
$$ packed form
36161A6623171j94342m43938j004988r96436m68219j92560l55672n55010o73970
36152A1738036p92982o97280l11860q5338k32823k96789j07996k56348q67606
36143H089014j006276k17626M82110K30801k43682n5191J80433l84081j013216
36134F062286n96273K35906J11230o38077n54331L24456N19384k83330p36105
36125D445146j96739L14593N0244k71749M4803M21220J34654l95971l81159N8539
36115D223581K35729J4802j28905J02584M81192N78912K32535k19374k23330K64264
36105E561990N92635L26267l3340J68557O04459M36313k94752o72474k63926M16331
36095F842060Q56112J089620J154015Q54579L32532J29446L95129O67533O89599
$$ plain form
36086 13010625 13814911 15057876 16686242 18244004 19441614 20378123 21212997 21962327 22653760
36077 22653760 23413873 24340784 25433780 26622173 27727094 28453270 28576867 28145600 27428141
36068 27428141 26675004 25904220 24858408 23266092 21285440 19549575 18534848 18012943
36060 18012943 17396472 16438545 15232291 13773346 12080236 10577539 9686751 9102325 8195751
36051 8195751 7116386 6647992 6868886 6896257 6271350 5671068 5754402 6152961 6224875 6050858
36041 6050858 5954762 5673664 4812329 3666567 2837574 2384734 2028557 1816021 1899079 2007051
36031 2007051 1839471 1662526 1818850 1975269 1618761 1016722 863463 1166079 1322843
36022 1322843 1197486 1246558 1564363 1651919 1299051 955807 982878 1140840 1081327 848564
$$ packed form
36086A3010625Q04286J242965J628366J557762J197610R36509Q34874P49330O91433
36077B2653760P60113R26911J092996J188393J104921P26176J23597m31267p17459
36068B7428141p53137p70784j045812j592316j980652j735865j014727n21905
36060A8012943o16471r57927j206254j458945j693110j502697q90788n84426r06574
36051H195751j079365m68394K20894K7371o24907o00282Q3334L98559P1914j74017
36041F050858r6096k81098q61335j145762q28993m52840l56177k12536Q3058J07972
36031B007051j67580j76945J56324J56419l56508o02039j53259L02616J56764
36022A322843j25357M9072L17805Q7556l52868l43244K7071J57962n9513k32763
$$ plain form
36012 848564 660441 604306 730336 1074743 1456339 1603228 1570114 1667679 1922183 2013264
36002 2013264 1826340 1628729 1561110 1389990 983729 659176 770915 1209214 1568577 1641742
35992 1641742 1518265 1317285 1054978 766678 594040 655423 852553 914794 727709 521511
35982 521511 546229 649917 496342 178127 187311 682321 1249145 1569090 1810504 2081356
35972 2081356 2066493 1658280 1410949 1769551 2276186 2201534 1611345 1107880 836161 539206
35962 539206 350466 631382 1115293 1134367 734555 643607 986083 985828 274386 -421827
35952 -421827 -422420 -129755 -258805 -659193 -686793 -334754 -162391 -272233 -154055 400143
35942 400143 902529 904671 606280 422374 332592 70317 -261193 -244879 178930 560008
$$ packed form
36012H48564j88123n6135J26030L44407L81596J46889l3114R7565K54504R1081
36002B013264j86924j97611o7619j71120m06261l24553J11739M38299L59363P3165
35992A641742j23477k00980k62307k88300j72638O1383J97130O2241j87085k06198
35982E21511K4718J03688j53575l18215R184M95010N66824L19945K41414K70852
35972B081356j4863m08213k47331L58602N06635p4652n90189n03465k71719k96955
35962E39206j88740K80916M83911J9074l99812r0948L42476k55p11442o96213
35952d21827n93K92665j29050m00388k7600L52039J72363j09842J18178N54198
35942D00143N02386K142k98391j83906q9782k62275l31510J6314M23809L81078
$$ plain form
35932 560008 636776 756058 1215384 1542953 1056741 16651 -522688 -156234 293886 -9563
35922 -9563 -793460 -1266848 -1238523 -976943 -459561 397968 1071509 906608 188074 -131538
35912 -131538 185047 382350 -23949 -517966 -449301 45371 401965 408082 234122 84052
35902 84052 144238 518145 922579 818000 146044 -415175 -268853 321067 602287 247028
35892 247028 -420067 -905585 -963015 -676320 -377609 -363242 -527281 -448027 15867 458836
35882 458836 474090 231809 216209 528910 768388 581263 92519 -261620 -200835 141783
35872 141783 378665 258609 -123558 -512660 -779023 -920192 -916926 -796862 -744832 -879432
35862 -879432 -965957 -661741 -60934 334315 265767 17305 -75298 -79058 -173275 -172624 268986
$$ packed form
35932E60008P6768J19282M59326L27569m86212j040090n39339L66454M50120l03449
35922i563p83897m73388K8325K61580N17382Q57529O73541j64901p18534l19612
35912a31538L16585J97303m06299m94017O8665M94672L56594O117j73960j50070
35902H4052O0186L73907M04434j04579o71956n61219J46322N89920K81220l55259
35892B47028o67095m85518n7430K86695K98711J4367j64039P9254M63894M42969
35882D58836J5254k42281j5600L12701K39478j87125m88744l54139O0785L42618
35872A41783K36882j20056l82167l89102k66363j41169L266J20064N2030j34600
35862h79432q6525L04216O00807L95249o8548k48462r2603l760r4217O51M41610
$$ plain form
35851 268986 1039436 1537087 1402980 1028162 1075802 1632117 2186210 2465558 2833859 3625463
35841 3625463 4609203 5669976 7531722 10765338 14131407 15146283 12844866 9051749
35833 9051749 6228542 4901357 4057223 3217978 2806533 2854983 2745195 2310979 2075380
35824 2075380 2192622 2111787 1539073 884443 488630 192606 -54288 68304 572807 928499
35814 928499 865954 777195 960027 1087162 820945 385176 108874 -93993 -379450 -559521
35804 -559521 -430228 -133551 133604 393237 590613 440911 -118642 -689622 -899279 -795779
35794 -795779 -573281 -289543 -23721 98705 181556 428477 668972 539582 176978 68883
35784 68883 142398 -188899 -880687 -1078485 -454060 197195 212662 17824 168517 307546
$$ packed form
35851B68986P70450M97651j34107l74818M7640N56315N54093K79348L68301P91604
35841C625463R83740J060773J861746L233616L366069J014876k301417l793117
35833I051749k823207j327185q44134q39245m11445M8450j09788m34216k35599
35824B075380J17242q0835n72714o54630l95813k96024k46894J22592N04503L55692
35814I28499o2545q8759J82832J27135k66217m35769k76302k02867k85457j80071
35804e59521J29293K96677K67155K59633J97376j49702n59553n70980k09657J03500
35794g95779K22498K83738K65822J22426Q2851K46921K40495j29390l62604j08095
35784F8883P3515l31297o91788j97798O24425O51255J5467j94838J50693J39029
$$ plain form
35774 307546 -72824 -546528 -398683 154452 336903 28436 -290343 -497670 -833172 -1151156
35764 -1151156 -1054520 -687030 -600048 -859629 -989209 -779756 -502219 -316542 -79911 227487
35754 227487 415133 435106 376007 179236 -173801 -317723 107742 793062 1038663 694409
35744 694409 300276 262871 389367 328682 50582 -240448 -364759 -262028 -43476 61039
35734 61039 -7352 -9316 212036 385402 128292 -519015 -1147095 -1453940 -1446464 -1303366 -1225360
35723 -1225360 -1263753 -1180780 -728985 -146816 23902 -239313 -298026 202781 766038 788364
35713 788364 407707 190201 357278 688464 833101 471335 -381772 -1070468 -931444 -382369
35703 -382369 -493169 -1203158 -1115857 339640 1774117 1801288 1008974 803275 1282576 1611721
$$ packed form
35774C07546l80370m73704J47845N53135J82451l08467l18779k07327l35502l17984
35764a151156R6636L67490Q6982k59581j29580K09453K77537J85677K36631L07398
35754B27487J87646J9973n9099j96771l53037j43922M25465O85320K45601l44254
35744F94409l94133l7405J26496o0685k78100k91030j24311J02731K18552J04515
35734F1039o8391j964K21352J73366k57110o47307o28080l06845P476J43098P8006
35723a225360l8393Q2973M51795N82169J70718k63215n8713N00807N63257K2326
35713G88364l80657k17506J67077L31186J44637l61766q53107o88696J39024N49075
35703c82369j10800p09989Q7301J455497J434477K7171p92314k05699M79301L29145
$$ plain form
35693 1611721 1679135 1913718 2102867 1867851 1765028 2477231 3495447 4065597 4705237
$$ packed form
35693A611721O7414K34583J89149k35016j02823P12203J018216N70150O39640
$$ [...]
##END NTUPLES=NMR SPECTRUM
##END=
