##TITLE=31Pdec_LR-741-RM6
 , 24 sc
 15.11.2021
##JCAMPDX= 6.0         $$ Bruker NMR JCAMP-DX V2.0
##DATA TYPE= NMR SPECTRUM
##DATA CLASS= NTUPLES
##ORIGIN= UXNMR, Bruker Analytische Messtechnik GmbH
##OWNER= root
$$ XWIN-NMR		Version 3.5
$$ Tue Nov 16 11:47:20 2021 Russian Standard Time (UT+4h)  she@DPX200
##.OBSERVE FREQUENCY= 81.013821
##.OBSERVE NUCLEUS= ^31P
##.ACQUISITION MODE= SIMULTANEOUS
##.ACQUISITION SCHEME= undefined
##.AVERAGES= 24
##.DIGITISER RES= 16
##SPECTROMETER/DATA SYSTEM= spect
##.PULSE SEQUENCE= zgpg30
##.SOLVENT NAME= CDCl3
##.SHIFT REFERENCE= (INTERNAL, CDCl3, 0, 248.564)
##AUDIT TRAIL= $$ (NUMBER, WHEN, WHO, WHERE, WHAT)
$$ ##TITLE= Audit trail, XWIN-NMR		Version 3.5
$$ ##JCAMPDX= 5.01
$$ ##ORIGIN= Bruker BioSpin GmbH
$$ ##OWNER= she
$$ F:/spectra/data/she/nmr/P31/1/pdata/1/auditp.txt
$$ ##AUDIT TRAIL=  $$ (NUMBER, WHEN, WHO, WHERE, WHAT)
(   1,<2021-11-16 11:46:09.31 +0400>,<she>,<DPX200>,
      <created by zg, POWCHK disabled, PULCHK disabled
       configuration hash MD5:
       00 E9 B6 7A A2 85 ED C7 34 08 36 98 17 FE 4E 26
       data hash MD5: 32K
       16 D9 6A E8 E5 7F 9B 68 50 1D 75 CE 25 4F C0 90>)
(   2,<2021-11-16 11:46:11.65 +0400>,<she>,<DPX200>,
      <Start of raw data processing
       efp BC_mod = 2 LB = 1 FT_mod = 6 PKNL = 1 PHC0 = -9172.154 PHC1 = 56.66953 SI = 64K 
       data hash MD5: 64K
       EB 39 5E 31 53 BE A6 86 E8 12 83 47 8A BE 08 77>)
(   3,<2021-11-16 11:46:32.84 +0400>,<she>,<DPX200>,
      <pk PHC0 = -28.92323 PHC1 = 54.20002 
       data hash MD5: 64K
       4B 75 CF 69 6D 53 78 FB BE 73 E7 0C 26 2B 05 0A>)
$$ ##END=
$$ 
$$ hash MD5
$$ 23 F9 C3 C3 D8 54 0B 2B 05 0C 26 E0 B3 FD 10 E7
##$RELAX= 
##$RELAX= 
##$RELAX= 
##$RELAX= 
##$RELAX= 
##$RELAX= 
##$RELAX= 
##$RELAX= 
$$ Bruker specific parameters
$$ --------------------------
##$DU= <F:/spectra>
##$EXPNO= 1
##$NAME= <P31>
##$PROCNO= 1
##$TYPE= <nmr>
##$USER= <she>
##$AMP= (0..31)
100 100 100 100 100 100 100 100 100 100 100 100 100 100 100 100 100 100 
100 100 100 100 100 100 100 100 100 100 100 100 100 100 
##$AQSEQ= 0
##$AQ_mod= 1
##$AUNM= <au_zg>
##$AUTOPOS= <>
##$BF1= 81.014009
##$BF2= 200.13
##$BF3= 200.13
##$BF4= 200.13
##$BF5= 200.13
##$BF6= 200.13
##$BF7= 200.13
##$BF8= 200.13
##$BYTORDA= 1
##$CFDGTYP= 0
##$CFRGTYP= 5
##$CHEMSTR= <none>
##$CNST= (0..31)
1 1 145 1 1 1 1 1 1 1 1 1 1 1 1 1 1 1 1 1 1 1 1 1 1 1 1 1 1 1 1 1 
##$CPDPRG= <waltz16>
##$CPDPRG1= <>
##$CPDPRG2= <waltz16>
##$CPDPRG3= <>
##$CPDPRG4= <mlev>
##$CPDPRG5= <mlev>
##$CPDPRG6= <mlev>
##$CPDPRG7= <mlev>
##$CPDPRG8= <mlev>
##$CPDPRGB= <>
##$CPDPRGT= <>
##$D= (0..31)
0 1 0 0 0 0 0 0 0 0 0 0.03 2e-05 3e-06 0 0 0 0 0 0 0 0 0 0 0 0 0 0 0 0 
0 0 
##$DATE= 1637048768
##$DBL= (0..7)
120 120 120 11 120 120 24 19 
##$DBP= (0..7)
150 150 150 150 150 150 150 150 
##$DBP07= 0
##$DBPNAM0= <>
##$DBPNAM1= <>
##$DBPNAM2= <>
##$DBPNAM3= <>
##$DBPNAM4= <>
##$DBPNAM5= <>
##$DBPNAM6= <>
##$DBPNAM7= <>
##$DBPOAL= (0..7)
0.5 0.5 0.5 0.5 0.5 0.5 0.5 0.5 
##$DBPOFFS= (0..7)
$$ [...]
##$SUBNAM2= <"">
##$SUBNAM3= <"">
##$SUBNAM4= <"">
##$SUBNAM5= <"">
##$SUBNAM6= <"">
##$SUBNAM7= <"">
##$SUBNAM8= <"">
##$SUBNAM9= <"">
##$SW= 501.771253377433
##$SWIBOX= (0..15)
0 1 3 0 0 0 0 0 0 0 0 0 0 0 0 0 
##$SW_h= 40650.406504065
##$TD= 32768
##$TD0= 1
##$TE= 0
##$TE2= 300
##$TE3= 300
##$TEG= 300
##$TL= (0..7)
0 120 53 12 22 120 120 120 
##$TP= (0..7)
150 150 150 150 150 150 150 150 
##$TP07= 0
##$TPNAME0= <>
##$TPNAME1= <>
##$TPNAME2= <>
##$TPNAME3= <>
##$TPNAME4= <>
##$TPNAME5= <>
##$TPNAME6= <>
##$TPNAME7= <>
##$TPOAL= (0..7)
0.5 0.5 0.5 0.5 0.5 0.5 0.5 0.5 
##$TPOFFS= (0..7)
0 0 0 0 0 0 0 0 
##$TUNHIN= 0
##$TUNHOUT= 0
##$TUNXOUT= 0
##$USERA1= <user>
##$USERA2= <user>
##$USERA3= <user>
##$USERA4= <user>
##$USERA5= <user>
##$V9= 5
##$VALIST= <valist>
##$VCLIST= <CCCCCCCCCCCCCCC>
##$VD= 0
##$VDLIST= <DDDDDDDDDDDDDDD>
##$VPLIST= <PPPPPPPPPPPPPPP>
##$VTLIST= <TTTTTTTTTTTTTTT>
##$WBST= 1024
##$WBSW= 4
##$XGAIN= (0..3)
0 0 0 0 
##$XL= 0
##$YL= 0
##$YMAX_a= 16415
##$YMIN_a= -20054
##$ZGOPTNS= <>
##$ZL1= 120
##$ZL2= 120
##$ZL3= 120
##$ZL4= 120
##$ABSF1= 0
##$ABSF2= 0
##$ABSG= 0
##$ABSL= 0
##$ALPHA= 0
##$AQORDER= 0
##$ASSFAC= 0
##$ASSFACI= 0
##$ASSFACX= 0
##$ASSWID= 0
##$AUNMP= <proc_1d>
##$AZFE= 0.1
##$AZFW= 0.5
##$BCFW= 0
##$BC_mod= 2
##$BYTORDP= 0
##$COROFFS= 0
##$CY= -3
##$DATMOD= 1
##$DC= 0
##$DFILT= <>
##$DTYPP= 0
##$F1P= 0
##$F2P= 0
##$FCOR= 1
##$FTSIZE= 65536
##$FT_mod= 6
##$GAMMA= 0
##$GB= 0
##$INTBC= 1
##$INTSCL= 5.30512e-09
##$ISEN= 30
##$LB= 1
##$LEV0= 0
##$LPBIN= 0
##$MAXI= 10000
##$MC2= 0
##$MEAN= 0
##$ME_mod= 0
##$MI= 50
##$NCOEF= 0
##$NC_proc= -5
##$NLEV= 6
##$NOISF1= 182.463
##$NOISF2= 159.3651
##$NSP= 0
##$NTH_PI= 0
##$NZP= 0
##$OFFSET= 248.5645
##$PC= 4
##$PHC0= -9201.077
##$PHC1= 110.8696
##$PH_mod= 1
##$PKNL= yes
##$PPARMOD= 0
##$PSCAL= 0
##$PSIGN= 0
##$REVERSE= no
##$SF= 81.014009
##$SI= 65536
##$SIGF1= 159.3651
##$SIGF2= -187.1042
##$SINO= 113.3802
##$SIOLD= 16384
##$SREGLST= <1H.CDCl3>
##$SSB= 0
##$STSI= 65536
##$STSR= 0
##$SW_p= 40650.406504065
##$SYMM= 0
##$S_DEV= 0
##$TDeff= 32768
##$TDoff= 0
##$TI= <>
##$TILT= no
##$TM1= 0
##$TM2= 0
##$TOPLEV= 0
##$USERP1= <user>
##$USERP2= <user>
##$USERP3= <user>
##$USERP4= <user>
##$USERP5= <user>
##$WDW= 1
##$XDIM= 65536
##$YMAX_p= 474535737
##$YMIN_p= -33960199
$$ End of Bruker specific parameters
$$ ---------------------------------
##NTUPLES= NMR SPECTRUM
##VAR_NAME=  FREQUENCY,     SPECTRUM/REAL,   SPECTRUM/IMAG
##SYMBOL=    X,             R,               I
##VAR_TYPE=  INDEPENDENT,   DEPENDENT,       DEPENDENT
##VAR_FORM=  AFFN,          ASDF,            ASDF
##VAR_DIM=   65536,         65536,           65536
##UNITS=     HZ,            ARBITRARY UNITS, ARBITRARY UNITS
##FACTOR=    0.620285442955139, 1,           1
##FIRST=     20137.2065510759, 0,            0
##LAST=      -20513.1999529892, 0,           0
##MIN=       -20513.1999529892, -33960199,   0
##MAX=       20137.2065510759, 474535737,    0
$$ Real data points
##PAGE= N=1
##DATA TABLE= (X++(R..R)), XYDATA
$$ [...]
39221B54577N28676K10624l85447n55549k29203n243q3854p5587P3904m5520l40261
39210f52883j40183N69723Q42404J87523o09547o83642k89836j29260j97429p6665
39200a179795J89287K99385L47381N33837N86154J81798l48146m40941j89038
39191b0078j18138k65862j82311K30770N42611M80900K41435M8725j19999k79621
39181E58432k90362q8260J73491K70648P9950k99734m94449j63631M58359O54350
39171H58794J49693m05308k90418K70967M87525J61369j49202o5674J29125N7030
39161A203901k07760l59256k80926m9269K41944M83844N26141K91993j13981m40777
39151A295854m41785r8810K52387J85282l10780p47240o92620k42377K05634M33649
$$ plain form
39221 254577 783253 993877 608430 52881 -176322 -181565 -265419 -341006 -267102 -312622 -652883
39210 -652883 -793066 -223343 619061 806584 197037 -486605 -776441 -905701 -1103130 -1179795
39200 -1179795 -990508 -691123 -343742 190095 776249 958047 609901 168960 -20078
39191 -20078 -138216 -404078 -586389 -355619 186992 667892 909327 958052 838053 558432
39181 558432 268070 179810 353301 623949 703899 404165 -90284 -253915 204444 858794
39171 858794 1008487 603179 312761 583728 1071253 1232622 1083420 1017746 1146871 1203901
39161 1203901 996141 636885 355959 306690 548634 1032478 1558619 1850612 1736631 1295854
39151 1295854 854069 755259 1007646 1192928 882148 134908 -557712 -800089 -594455 -160806
39141a60806M58067K93731o0264m63266o60533m74713N2672O10838P59622L60650
39131G15998j49048k22761P2757J98341k668j37923n2739j22755m73262n72959
39121g47019q0292M80511M71206R9907m437J97829K51113M9333q8152l9954K2871
39110F12916O3373J55686J39024j75756n36701m97376p8145K77079L29842J93277
39100D83219m2031l50556n13747k95952J39841L91410L43961J82865M983j83552
39090A60441k15277N2399L84391M02636Q9320k80071n35425n96440l21918J85889
39080f74055M04250L8595m02171k43307L71033P22511N24994O5492m13362p66443
39070c72463o23913J50230Q22090N20278m17206p64881j63347M22052K34879k49654
$$ plain form
39141 -160806 297261 590992 530728 67462 -593071 -1067784 -1015112 -404274 355348 715998
39131 715998 566950 344189 416946 615287 612619 474696 421957 299202 -174060 -747019
39121 -747019 -827311 -346800 124406 224313 219876 417705 668818 718151 629999 590045 612916
39110 612916 676289 831975 970999 795243 258542 -238834 -316979 -39900 289942 483219
39100 483219 441188 90632 -423115 -719067 -579226 -187816 156145 339010 343993 160441
39090 160441 -54836 -2437 381954 784590 873910 593839 58414 -538026 -859944 -674055
39080 -674055 -269805 -231210 -633381 -876688 -505655 216856 741850 807342 393980 -372463
39070 -372463 -996376 -846146 -24056 496222 79016 -685865 -849212 -427160 -192281 -441935
39060d41935k81833K7081J33635P336P318K02646L60806L69535K65464M2576k65801
39049D26828m89017n02766l38402l4990L59434O09588M61306M1317k64172l45829
39039g6703l84436l59533q1409K48455J37476l62411n40338l4275O11827P49592
39029i1755M68250K20893P4750j49972l24917j70708J60922J80797k14293n04244
39019c50277k16424L78373N15616q5939p60221o85448J2818M32917J93454q7637
39009f52768J13336L70911J30162k56814j37763K61539K20347k08624l31893p2073
38999e63640l4515l09142k65535K89738P38828O83266M37797K34763j51668o64977
38989C94915p46975k60664J82876K11874K05176M23938M73585J11979k05536j17863
$$ plain form
39060 -441935 -723768 -696687 -563052 -555716 -548398 -345752 15054 384589 650053 692629 426828
39049 426828 -62189 -564955 -903357 -938347 -578913 30675 491981 533298 269126 -76703
39039 -76703 -461139 -820672 -902081 -653626 -516150 -878561 -1418899 -1453174 -841347 -91755
39029 -91755 376495 597388 672138 522166 197249 26541 187463 368260 153967 -350277
39019 -350277 -566701 -188328 327288 241349 -518872 -1204320 -1191502 -758585 -565131 -652768
39009 -652768 -539432 -168521 -38359 -295173 -432936 -171397 48950 -159674 -491567 -563640
38999 -563640 -598155 -907297 -1172832 -883094 -144266 539000 976797 1211560 1059892 394915
38989 394915 -352060 -612724 -429848 -217974 -12798 411140 884725 996704 791168 673305
38979F73305M1162n3987j52977q1503j87685n59490n84025L9147N99682M44190
38969A77819L2415R0300L60553J54187l59625m40961n1628J46739o3706k03520
38959a57427J0600K63331K21324l8391k60248k82992q4443J65402K05263N5497
38949I7916N1001K76126L24361o4030n05640n00445j18940K13042K98756K02184
38939B74331K8518l2771J80413M12080J92890l38831m60520k0158K07962j97305
38929B46609n13908q1445M94218K77831m59134o80415j73313L30990L94577K61592
38919I7602J29704o6322j73808O2814L89403K71264k33543m99014k75751J5773
38909b81878J7839j10455j05434Q417J01990J74474K49304K41690M4240k94083
$$ plain form
38979 673305 714467 660480 507503 426000 238315 -321175 -905200 -866053 -266371 177819
38969 177819 210234 300534 661087 815274 455649 14688 -36940 109799 46093 -157427
38959 -157427 -146827 116504 337828 299437 39189 -243803 -328246 -162844 42419 97916
38949 97916 148917 425043 749404 685374 179734 -320711 -439651 -226609 72147 274331
38939 274331 302849 270078 450491 862571 1055461 716630 256110 235952 443914 246609
38929 246609 -267299 -348744 145474 423305 -35829 -716244 -889557 -558567 -163990 97602
38919 97602 227306 160984 -12824 49990 439393 710657 477114 -21900 -297651 -281878
38909 -281878 -264039 -374494 -479928 -471511 -369521 -195047 54257 295947 340187 46104
38899D6104m86224k36447K66806L45361k30683o10406L8174J024714Q89456l12657
38889G34198r10264k01463M35164j22407q43384l37577P41085P94256q1301l92172
38879a83865K57259P53395M52445l7723j65709j44629j59104l8888J02166p1357
38869G63990l32910j54831K55706K11728j92791j87454K79269M11125k5516l15988
38859G12328r3998O1105k81743o53643m88838N2273M65223N37773L31678J1466
38849F53624j61462o8618O3665P8065K21446N70566N94614O401m92228k41553
38839A224520J61924j66252p35736l91019O52637J036678M20163j58122j41127
38830A903666j03196l22890k60856J59343K10639k38232l56745J34461M31167
$$ plain form
38899 46104 -440120 -676567 -409761 -64400 -295083 -905489 -867315 157399 1046855 734198
38889 734198 -176066 -377529 57635 -64772 -908156 -1245733 -504648 289608 208307 -183865
38879 -183865 73394 826789 1279234 1241511 1075802 931173 772069 733181 835347 763990
38869 763990 431080 276249 531955 743683 550892 363438 642707 1053832 1028316 712328
38859 712328 618330 679435 397692 -255951 -744789 -692516 -227293 310480 642158 653624
38849 653624 492162 423544 487209 565274 786720 1357286 1951900 1958301 1466073 1224520
38839 1224520 1386444 1220192 484456 93437 746074 1782752 2202915 2044793 1903666
38830 1903666 1800470 1477580 1216724 1376067 1586706 1348474 991729 1126190 1557357
38821A557357J36448o8652J78074K15044k63027m57143P6494M64453l7942p32882
38811A068224o23249M9460M11521L31665K31954J63815l6126j77025o0136M9122
38801A409225j01276k64160j82058m9035m0022P5184M27635O89648N77544K17061
38791B759746j96884n37147m83288J30403O82067L86459m07750n96117o1022J96060
38781A872527j51379k21664L90151P90547L02702m39841o33570m32530k49811
38772A227132J3361L73262M02233P9107L2120M15855N66055K24479k940J62369
38762C493033K21364N3003K17572O70379N74609j13963l38034K66972P73574O54814
38752F473323M92798N51501L81906K58732J032692K116767J889490O53418O19271
$$ plain form
38821 1557357 1693805 1625153 1803227 2018271 1755244 1298101 1374595 1839048 1801106 1068224
38811 1068224 444975 494435 905956 1237621 1469575 1633390 1597264 1420239 1360103 1409225
38801 1409225 1307949 1043789 861731 812696 772674 847858 1275493 1965141 2542685 2759746
38791 2759746 2562862 2025715 1542427 1672830 2354897 2741356 2333606 1737489 1676467 1872527
38781 1872527 1721148 1499484 1889635 2680182 2982884 2543043 1909473 1476943 1227132
38772 1227132 1240493 1613755 2015988 2095095 2127215 2543070 3109125 3333604 3330664 3493033
38762 3493033 3714397 3767400 3984972 4655351 5229960 5115997 4777963 5044935 5818509 6473323
38752 6473323 6966121 7517622 7899528 8158260 9190952 11307719 13197209 13850627 14469898
38743A4469898K201315L205691K727719K692282M117046N216786N032763N445005
38735D5108505P445485R155655J0039037J2930067J8892965K4929938L0644181
38728A59145833M0800206N4160708N5594556L0674483j2633599m7608832n6501004
38721B23632351m6193197l3878889k6691294k1230505j5295179j1025759r216056
38714F0101472p920101o416568n744272n633933m670447l129196k541770k872080
38706B1173105k755229j992109j472904j274397r45029q89393j471585j680942
38698H691517o95333K64103k59330j345062j135417N0398M10419k58509n71129
38689E151657j65164J4159k41395k41262r5835n29383j117220o96587M82763R15530
$$ plain form
38743 14469898 16671213 19876904 22604623 25296905 29413951 34630737 39663500 45108505
38735 45108505 52553990 61709645 71748682 84678749 103571714 128501652 159145833
38728 159145833 199946039 254106747 309701303 340375786 327742187 280133355 223632351
38721 223632351 177439154 143560265 116868971 95638466 80343287 69317528 60101472
38714 60101472 52181371 45764803 40020531 34386598 29716151 26586955 24045185 21173105
38706 21173105 18417876 16425767 14952863 13678466 12733437 11844044 10372459 8691517
38698 8691517 7996184 8260287 8000957 6655895 5520478 5570876 5981295 5722786 5151657
38689 5151657 4986493 5000652 4759257 4517995 4422160 3892777 2775557 2078970 2561733 3477263
38679C477263K22735m00837k55923K0713j00638k87236k91583l27793l18294L9991
38669A778398M11706K00697k75834k15057K02270R4284m88746o32411k18731m6889
38659H09687k43017o8471M98118N22267j77150n40908j0089N78939M56239O7186
38649A892801N1076J27598j96397o29722n95549j52775K23884L46595L18725K18978
38639A605214J20387Q0038n0661l94584o06443k39500M16910N71734J17837j77392
38629A443540J20989M98607M17178J12059L207l9940k69078l85049M9898P70514
38619B721925R79881L61573m86133p42721k87166K27945K04203j71356k32087
38610B576064K01721N53450L22384k30322n18212l89881r8553J63560L10971K35099
$$ plain form
38679 3477263 3699998 3299161 3043238 3063951 2963313 2676077 2384494 2056701 1738407 1778398
38669 1778398 2190104 2390801 2114967 1899910 2102180 2196464 1707718 1075307 856576 809687
38659 809687 566670 498199 996317 1518584 1341434 800526 790437 1369376 1825615 1892801
38649 1892801 1943877 2071475 1875078 1245356 649807 497032 720916 1067511 1386236 1605214
38639 1605214 1725601 1805639 1754978 1360394 753951 514451 931361 1503095 1620932 1443540
38629 1443540 1564529 2063136 2480314 2592373 2595580 2555640 2286562 1901513 1951411 2721925
38619 2721925 3701806 4063379 3577246 2834525 2547359 2775304 2979507 2808151 2576064
38610 2576064 2777785 3331235 3653619 3423297 2905085 2515204 2416651 2580211 2891182 3126281
38600C126281J7503n580K49838L75266J09119j78734p8427K03075K76224K36922
38590D331487L46039M54176L39304K19278L26926M03197K41747K43573P02056
38581G607783J055075P09892J43098K25765Q54829J259432J302597J403991J498747
38572A6061209J251802J059401J561307K278036K068862R63811J76324J44305
38564B5565057l2647q61777j562853j493341j228325j468108j887086j863440
38556A5167480j525073j299849j118617p92539n90149p55180r50902p98004n16891
38547F820276m87024n96644n44849l91912l32678k89718j57478r7287k14023k93369
38537C415294j85004p0002o5003P368J73206J26214j76980k57361J40699N29547
$$ plain form
38600 3126281 3143784 3138204 3388042 3763308 3872427 3693693 3615266 3818341 4094565 4331487
38590 4331487 4677526 5131702 5471006 5690284 6017210 6420407 6662154 6905727 7607783
38581 7607783 8662858 9372750 9515848 9741613 10596442 11855874 13158471 14562462 16061209
38572 16061209 17313011 18372412 19933719 22211755 24280617 25244428 25420752 25565057
38564 25565057 25532410 24670633 23107780 21614439 20386114 18918006 17030920 15167480
38556 15167480 13642407 12342558 11223941 10431402 9841253 9086073 8135171 7337167 6820276
38547 6820276 6333252 5736608 5191759 4799847 4467169 4177451 4019973 3922686 3708663 3415294
38537 3415294 3230290 3160288 3095285 3102653 3275859 3402073 3225093 2967732 3108431 3637978
38527C637978L83711m2947j25786J98025M13634J86350k78779n71620n08867k68475
38517C023224j75126k53881r2978N61434J225970J202970O19264L05210N81066
38508F997153Q82418Q00720P48742J186629J829508K154741K230130K499894L063278
38499B2393213L655944M166082M779373N664545O675084P266523O731533M777545
38491F6109842J866158j234563m025858o081475o762229n935619m682067m252495
38483C5001694m412652l939521k740158k085254k440333k596888j711242p95743
38475A4279903j056041j875134j812079q44396k03316l95801p21164o11798l04633
38466F455541j53627j85889l80044o55220o28516n7756N75582N89981Q6088k57055
$$ plain form
38527 3637978 4021689 3978742 3852956 4050981 4464615 4650965 4372186 3800566 3291699 3023224
38517 3023224 2848098 2594217 2501239 3062673 4288643 5491613 6110877 6416087 6997153
38508 6997153 7879571 8680291 9429033 10615662 12445170 14599911 16830041 19329935 22393213
38499 22393213 26049157 30215239 34994612 40659157 47334241 54600764 61332297 66109842
38491 66109842 67976000 66741437 62715579 56634104 49871875 43936256 39254189 35001694
38483 35001694 30589042 26649521 23909363 21824109 19383776 16786888 15075646 14279903
38475 14279903 13223862 11348728 9536649 8692253 8488937 8093136 7371972 6760174 6455541
38466 6455541 6301914 6116025 5735981 5080761 4452245 4394489 4970071 5560052 5646140 5389085
38456E389085k25974k09548l82435m63384l01162r3971L095J029j32322l48803
38446C235610l38112M5996L82585K34830j37261j98139Q76M6612j9789J20449
38436C373657K93538R5354k18728l2067M83574M96729j03680m50382q4834L43156
38426D196317J83174k42587l06712l5594J77223K86759M52914N71993M69093K77292
38416F029872K16420K48780K66386L18443L71152K05577j29096j61106L11710
38407G678138P55772N96823O0345k03623q0971l38j32383k03465j10790j33678
38397H225830l85362n51695m17793k68957m68704q97782j113530r13732m88087
38388B720188j21946K0559q6375k94986l32071j08904Q7672k9935k69288k12581
$$ plain form
38456 5389085 5163111 4953563 4571128 4107744 3806582 3712611 3715706 3716735 3584413 3235610
38446 3235610 2897498 2943494 3326079 3560909 3423648 3225509 3226385 3272997 3253208 3373657
38436 3373657 3667195 3762549 3543821 3511754 3995328 4492057 4388377 3937995 3853161 4196317
38426 4196317 4379491 4136904 3830192 3794598 3971821 4258580 4711494 5283487 5752580 6029872
38416 6029872 6246292 6495072 6761458 7079901 7451053 7656630 7527534 7366428 7678138
38407 7678138 8433910 9030733 9091078 8887455 8806484 8806146 8673763 8470298 8359508 8225830
38397 8225830 7840468 7288773 6870980 6602023 6133319 5235537 4122007 3208275 2720188
38388 2720188 2598242 2618801 2532426 2237440 1905369 1796465 1884137 1854202 1584914 1372333
38378A372333P1654N0018m05720o93907l64788J51243K06803n8882m7593K15379
38368D96540J37895l23882m69393l337M12166J84436k96257l35345r300J00632
38358a05845q4302j02831J94106L90201J65302k62017m78515l52654o9086J05384
38348f00257M0759j30244j14959K00331N70182O44369L24777j84654n51745n11344
38338c12785q9750L21969L46247Q3462q3446r7543j96772k91940p663N04680N17567
38327F94026j49118o58900l44546K70881L03375j75997m20223k01998P1969J72743
38317d37788K01601J29478q1018q3183L75548P67367L92240m47576p52581k84998
38307b20910J75166J23557l4765J01535K40750M7128k01996r7799K37368L95915
$$ plain form
38378 1372333 1443987 1494005 1088285 394378 29590 180833 387636 328754 281161 496540
38368 496540 634435 310553 -158840 -162177 249989 434425 138168 -197177 -206477 -105845
38358 -105845 -190147 -292978 -98872 291329 456631 194614 -283901 -636555 -705641 -600257
38348 -600257 -559498 -689742 -804701 -604370 -34188 610181 934958 750304 198559 -312785
38338 -312785 -402535 -80566 265681 349143 265697 168154 -28618 -320558 -328221 176459 694026
38327 694026 544908 -113992 -458538 -187657 115718 -60279 -480502 -682500 -610531 -437788
38317 -437788 -236187 -106709 -187727 -270910 104638 872005 1264245 816669 64088 -220910
38307 -220910 -45744 77813 43048 144583 385333 432461 230465 132666 370034 765949
38297G65949K44608q4614m54546p12780o90373m09635q0519J78795L68733L92515
38287d81867J71657n9713Q258K50016K59830j3895k31719j99259R366L22296N54971
38276E89941K74863n45121j031942m61100M53723M36768l31876m51074L57474
38267g08344P38134K3392n82319p3747O10973K31579o07077n38566K18888L37520
38257c49567l01164n23550L5051M13579Q2859k65638p5340K02668J03766m3823
38247g21159J25547L16090J84886m6405q2924m4147n1348O0580K39168O4361m76732
38236d32083p06760k37743L67527M49943J98692J32088J59710j06243m79083m21956
38226a075908L4870L17257J89353j5430m7191m7477j22623j01496J28703L95578
$$ plain form
38297 765949 1010557 925943 471397 -241383 -931756 -1341391 -1421910 -1243115 -874382 -481867
38287 -481867 -310210 -369923 -361665 -111649 148181 134286 -97433 -296692 -287326 34970 589941
38276 589941 864804 319683 -712259 -1173359 -719636 -282868 -614744 -1065818 -708344
38267 -708344 29790 53182 -529137 -602884 8089 239668 -367409 -905975 -687087 -349567
38257 -349567 -650731 -1174281 -1139230 -725651 -642792 -908430 -983770 -781102 -677336 -721159
38247 -721159 -595612 -279522 -94636 -141041 -223965 -268112 -319460 -258880 -19712 44649 -432083
38236 -432083 -1138843 -1376586 -1009059 -559116 -360424 -228336 -68626 -174869 -653952 -1075908
38226 -1075908 -1041038 -723781 -534428 -549858 -597049 -644526 -767149 -868645 -739942 -344364
38216c44364M77735L26530J7051k95506l96299k28861l4374k7394n7306Q9846
38206d72942K15016j1478l80089l14578K24019N75850L28612r6693j23590J60928
38196A05055K74475R3316j19043k25070k90834k52986L9763M32710N00932J02492
38186F60810l68253m35149j07273J45366l8624m36812m33536K16157R27016Q86700
38176A016402J20837m70262l08719J24630J36290r7609L4866L94247K30001m95147
38166F85536q44682k92678M17081L30732l83138q01620n58012j02188J44813K21720
38156a182436K36192J42592K4252J21185M03053M86008J69289k37517l25947j03633
38146b66962J01994Q5608q4531k34743k23498l841K72118K90732o4248m26756
$$ plain form
38216 -344364 133371 459901 476952 181446 -214853 -443714 -478088 -505482 -562788 -472942
38206 -472942 -257926 -269404 -649493 -964071 -740052 -164202 164410 67717 -55873 105055
38196 105055 379530 472846 353803 128733 -162101 -415087 -375324 57386 558318 660810
38186 660810 292557 -142592 -249865 -104499 -143123 -579935 -1013471 -797314 129702 1016402
38176 1016402 1137239 666977 358258 482888 619178 521569 556435 950682 1180683 685536
38166 685536 -159146 -451824 -34743 295989 -87149 -888769 -1446781 -1548969 -1404156 -1182436
38156 -1182436 -946244 -803652 -779400 -658215 -255162 230846 400135 162618 -163329 -266962
38146 -266962 -164968 -79360 -163891 -398634 -622132 -625973 -353855 -63123 -127371 -554127
38136e54127k96891K60537N74509K40269k60429k17216K25224K50420l25532o60475
38126g63711j62968N13863M21618k32207m50133r460L16615J18326o0213K25498
38116h2772N58013M26072N6357o5167L6367N8801j1807m6098r2052j48935l5764
38105F53015J65301M5212l79328m68009J3508L56997K9789l83547j64152K85154
38095A53940J62742k90019k07069L77904N98504K03448j72423j49113Q875J26629
38085H13418K73498K43414j33373k85175M01583J351364J565833J450855K202292
38076G883709L253927K374197q91273l776171l663428j463890n6293m32851j149729
38067B078198r79890l01863Q6485M9267k17656n36898n66525o8681N44474O14744
$$ plain form
38136 -554127 -851018 -590481 -15972 224297 -36132 -253348 -28124 222296 -103236 -763711
38126 -763711 -926679 -412816 8802 -223405 -673538 -682998 -366383 -248057 -308270 -82772
38116 -82772 475241 901313 957670 892503 928870 987671 975864 929766 837714 688779 653015
38105 653015 818316 863528 484200 16191 29699 386696 416485 32938 -131214 153940
38095 153940 316682 26663 -180406 197498 796002 999450 827027 677914 686789 813418
38085 813418 1086916 1330330 1196957 911782 1313365 2664729 4230562 5681417 7883709
38076 7883709 11137636 13511833 12620560 8844389 5180961 3717071 3660778 3227927 2078198
38067 2078198 1098308 796445 882930 932197 714541 177643 -388882 -457563 86911 701655
38057G01655J73081j82703k47490l28997m75426l39793J27315N05670N19390K92892
38047G45594l0980m18481o79844n61060j40082K30303L32614J69114j49733l14707
38037h17262J2546N71785N58423j88534o87544k28073M12031J79439m63563k97413
38027i48165N30718P24776P9637k09499K60127L41073n49239j171850m04262Q53965
38017d92719J010383R7332n76248m62942j36285K0284J94945L16841q811o29041
38007f66261q30011l64427K36429M95713M76315L42578R3112j21890j3427L31044
37997b0825M51334J86571j31080k68404l60643m44246k80201J08861K65480J2339
37987d80814j41850K35799P23498N87611j11295n53635k98419J53756J25091l05301
$$ plain form
38057 701655 874736 692033 444543 115546 -359880 -699673 -572358 -66688 452702 745594
38047 745594 714614 296133 -383711 -944771 -1084853 -854550 -521936 -352822 -502555 -817262
38037 -817262 -804716 -232931 325492 136958 -550586 -778659 -366628 -187189 -650752 -948165
38027 -948165 -417447 307329 386966 177467 437594 778667 229428 -942422 -1346684 -492719
38017 -492719 517664 614996 38748 -424194 -560479 -540195 -345250 -28409 -37220 -666261
38007 -666261 -1496272 -1860699 -1624270 -1128557 -652242 -309664 -216552 -338442 -351869 -20825
37997 -20825 430509 617080 486000 217596 -143047 -587293 -867494 -758633 -493153 -480814
37987 -480814 -622664 -386865 336633 924244 812949 259314 -39105 114651 239742 -65559
37977f5559m64311k7866N36002N52484j8891n25726m03503J69683N33968L52656
37967F38937n7271j94095M8628L54797L73030K6959m36267o23286l51595R7985
37957a22178K50217L1854j35277L1231K60750K24071J16000K92432N75613N34341
37947B059054L40177N77942J093538Q88504l97969j658609j659227o62223P9630
37938F60817M1553k60028m11344n32688n76190k15542L56691M56938L8725j16345
37928e57413K78880M65761j5979m01873M3340O90583N25110j77726l60266M1572
37918E31989J29806k96041m40094n807K66713o5562l93337j74556J54276M9415
37908b43198j63710N1416M24501L27270j66828m34355k63154J1121J64335K75072
$$ plain form
37977 -65559 -529870 -557736 -21734 530750 511859 -13867 -417370 -247687 286281 638937
37967 638937 581666 387571 436199 790996 1164026 1190985 754718 131432 -220163 -122178
37957 -122178 128039 159893 24616 55847 316597 540668 656668 949100 1524713 2059054
37947 2059054 2399231 2977173 4070711 4959215 4561246 2902637 1243410 581187 660817
37938 660817 702370 442342 30998 -501690 -1077880 -1293422 -936731 -479793 -441068 -557413
37928 -557413 -278533 187228 171249 -230624 -187284 503299 1028409 850683 490417 531989
37918 531989 661795 365754 -74340 -80147 186566 121004 -272333 -446889 -292613 -243198
37908 -243198 -406908 -355492 69009 396279 229451 -204904 -468058 -456937 -292602 -17530
37898a7530L46847K62796Q2917k5876j00914k73506m40771l87448j41558R6479
37888e98564K56001L37122K24336j03521l40015j89847J82464L67200K29033q7773
37878B76436m54586p03591n41371K8365M40343K51696j39710p3857K92408K59721
37868c64146j61260k02537L13692N55964M6562m40270m5983P69671Q68436J05872
37858A446001n51632m98599k14985l26764o46390n72296l4680M30922M26916J39034
37848d02473O04J51495L52539L20104O3m49878p80620p37408k48340L54153N43533
37837h96228K54385P1854M13542P80848L96019n27631q84236j97229O73792P17143
37827H02259N0907m69567m24551m3701L58801N58773L29680k23077m81041o0976
$$ plain form
37898 -17530 329317 592113 675030 649154 548240 274734 -166037 -553485 -695043 -598564
37888 -598564 -342563 -5441 218895 115374 -224641 -414488 -232024 135176 364209 276436
37878 276436 -178150 -881741 -1423112 -1394747 -954404 -702708 -842418 -916275 -623867 -364146
37868 -364146 -525406 -727943 -414251 141713 188275 -251995 -297978 471693 1340129 1446001
37858 1446001 894369 395770 180785 -145979 -792369 -1364665 -1399345 -968423 -541507 -402473
37848 -402473 -401869 -250374 102165 422269 422332 -27546 -808166 -1545574 -1793914 -1439761 -896228
37837 -896228 -641843 -569989 -156447 624401 1020420 492789 -391447 -588676 85116 802259
37827 802259 853166 383599 -40952 -84653 274148 832921 1162601 939524 458483 397507
37817C97507M97258M28541j15112l65925k02320k27880n92756o66115j15233N05823
37807d56212N96936K74853m8374k45515k94575r2784K09682K33357K5520R4205
37797B97093M77480M82372j98054q16070o14454P7395M45064L29688P8748k08440
37787C50822n18592m80349Q7722N72558L53565j58161j51472K47231K58050j67740
37777C93634l24370l6863J10674j02233k12870l5359L7868r7419l8365K30692
37767g4611J77229k39520l31350J20515L90920M0557l15786j06905J97775l4663
37757a75839m55543l40988J85281M09205J67555n5595L2950K55529L75503K83905
37747F81963n2996m37669m83985j60416N0834j20477k80001l8789L40519M28871
$$ plain form
37817 397507 894765 1323306 1208194 842269 639949 412069 -180687 -846802 -962035 -456212
37807 -456212 140724 415577 367203 121688 -172887 -265671 -55989 177368 202888 297093
37797 297093 774573 1256945 1058891 242821 -371633 -294238 150826 480514 559262 350822
37787 350822 -167770 -648119 -560397 12161 365726 207565 56093 303324 561374 393634
37777 393634 69264 32401 143075 40842 -172028 -207387 -169519 -266938 -305303 -74611
37767 -74611 102618 -136902 -468252 -347737 43183 83740 -232046 -338951 -141176 -175839
37757 -175839 -631382 -972370 -787089 -377884 -210329 -265924 -232974 22555 398058 681963
37747 681963 628967 191298 -292687 -453103 -402269 -522746 -802747 -841536 -501017 -72146
37737g2146K84129J32205r9893m10431m32681j01744j2499m34358o27873P69P15776
37726a058746N03314k22098k44409M27395N76609j72370p43503l83240K25449
37717a091599K11927j48449r2865L62418N74695K73630k04243m35536k56205J95375
37707f10852N09215L13457k50011o03436m12768P2530M16596M23741J46434j76089
37697a71183j80292K34323O03808M20889r7000k85308l5547J11721q2915k21171
37687B97325o0847N0589j47521l24606j23745K44368L56845J62172j04197k69187
37677H1196k54663p3701N5066o1948j78793J12869O25684O84328J52006k95105
37667H46939j94043M7179j01065m74169o05921m39740j83947J09788L83288L94245
$$ plain form
37737 -72146 211983 344188 244295 -166136 -598817 -700561 -713060 -1147418 -1775291 -1774522 -1058746
37726 -1058746 -555432 -777530 -1021939 -594544 -17935 -190305 -933808 -1317048 -1091599
37717 -1091599 -879672 -1028121 -1120986 -758568 -183873 89757 -114486 -550022 -806227 -610852
37707 -610852 -101637 211820 -38191 -641627 -1054395 -981865 -565269 -141528 4906 -171183
37697 -171183 -351475 -117152 486656 907545 810545 525237 489690 601411 518496 297325
37687 297325 236478 287067 139546 -185060 -308805 -64437 292408 454580 350383 81196
37677 81196 -173467 -247168 -192102 -254050 -432843 -319974 305710 990038 1142044 846939
37667 846939 652896 700075 599010 124841 -481080 -920820 -1104767 -994979 -611691 -217446
37657b17446J17391p4164L521L9554j15672o5979L50509N10962n9616p30734n94195
37646h35869J21316M05217M1114j70362J96504N45598K96046k34547m33943k94867
37636c63793k00437k00775l1802L19377N22316L70875L9751j75560j84521j07745
37626a2314q1212j33097k03368k11354j05182R4319K70037K82885J21061o6673
37616d4898j36165r4494l6816k0857o3938j54698j96924q6158P7889N4373j56970
37605h59656k58297j27107j3565m7402L3237L19865L79407k1250l00314J34029
37595g61053Q33927Q79311K36257l21095m55594m87782m84314j63402K61775J94025
37585b67945k68305l89075o7180L7199j87008q4200L92428M13221j66421l63246
$$ plain form
37657 -217446 -100055 -174219 -170698 -131144 -246816 -312795 37714 548676 489060 -241674 -835869
37646 -835869 -714553 -309336 -268222 -438584 -242080 303518 599564 365017 -68926 -363793
37636 -363793 -564230 -765005 -796807 -477430 44886 415761 455512 279952 95431 -12314
37626 -12314 -93526 -226623 -429991 -641345 -746527 -652208 -382171 -99286 21775 -44898
37616 -44898 -181063 -275557 -312373 -333230 -397168 -551866 -748790 -834948 -757059 -702686 -859656
37605 -859656 -1117953 -1245060 -1258625 -1306027 -1272790 -952925 -573518 -594768 -895082 -761053
37595 -761053 72874 952185 1188442 867347 411753 -76029 -560343 -723745 -461970 -267945
37585 -267945 -536250 -925325 -992505 -955306 -1142314 -1226514 -834086 -420865 -587286 -950532
37575i50532J78470M22811k05528o47213k0558P47970M96639j63068k0382N32812
37565C71421K68482n90251p20100J6768M42319J11954j78352J4727K08741J48980
37555I4689J52968J83309j11939l78441N9152P45187N15846m82631q04729o1006
37545h7595M20427j20875o05787n4498O98542M42213m10826n85479O7835N93948
37535C57905M58276j0155l75447m34319p6327M98421P08342L01550k16293l48834
37525H63119l21660m92588n96986k52782K40553L23427N5980q8043k0167j0686
37515b99833j07767j43335j03868l3194J60549L82801K18317l95119p77775l81469
37505a480693L24707N01517J60729P901K53178L55815j3432m26916l36940J59780
$$ plain form
37575 -950532 -772062 -349251 -554779 -1201992 -1222550 -474580 22059 -141009 -161391 371421
37565 371421 639903 49652 -670448 -653680 -211361 -99407 -277759 -263032 -54291 94689
37555 94689 247657 430966 319027 -59414 -262 744925 1260771 778140 -26589 -87595
37545 -87595 332832 211957 -393830 -448328 250214 692427 281601 -303878 -236043 357905
37535 357905 816181 806026 430579 -3740 -80067 418354 1126696 1428246 1211953 863119
37525 863119 541459 48871 -548115 -800897 -560344 -236917 -180937 -268980 -289147 -299833
37515 -299833 -407600 -550935 -654803 -687997 -527448 -144647 73670 -321449 -1099224 -1480693
37505 -1480693 -1155986 -654469 -493740 -485839 -232661 123154 109722 -317194 -654134 -494354
37495d94354M48887J46204m25155n76726j28466K75012N0349l85700k27095L25392
37485i91652K65072m87536p28193J23792R27245N25405m49172o37391n4473K13693
37475a293210o7077r2411L84821O22324J97596l62717m96607k57066J21453M99277
37465g43617N70728J26482l51375j69261M56097O21958J41129k31446j06678J5379
37455C29396k02039l49007j24330J30060J59882K05603K92073K0300n03013n11998
37445e53073J02007L57021k32333o88565j22991P23423O48475j00131l92746j01464
37435c60377M498j29837J49554O88732N38817l15863o76352j9128O30263L56397
37425H66704k60937k60682J37755R0975l91108n75686k79579m0118j16006j48539
$$ plain form
37495 -494354 -45467 100737 -324418 -901144 -1029610 -754598 -704249 -1089949 -1317044 -991652
37485 -991652 -726580 -1214116 -1942309 -1818517 -891272 -365867 -815039 -1452430 -1506903 -1293210
37475 -1293210 -1360287 -1452698 -1067877 -445553 -247957 -610674 -1107281 -1364347 -1242894 -743617
37465 -743617 -172889 -46407 -397782 -567043 -110946 511012 652141 420695 314017 329396
37455 329396 127357 -221650 -345980 -215920 -56038 149565 441638 461938 -41075 -553073
37445 -553073 -451066 -94045 -326378 -1014943 -1137934 -414511 233964 133833 -258913 -360377
37435 -360377 -355879 -485716 -336162 352570 891387 575524 -100828 -119956 510307 866704
37425 866704 605767 345085 482840 573815 182707 -392979 -672558 -712676 -828682 -977221
37415i77221J21035M47569N15253K95223r9944m97631n73787j33328M38678M63775
37405c78j21299n61781k60021L93920N52008O6384l54941j77655K33964K13102
37395a6697j95755l20944P1653L76614Q6598l78642l10348J78882L87072J81338
37385E9771Q2323J83706l6113n49378m80832M09464R50594K29871q02788o69507
37375f22889K78423L82154o32312j176680l30139P64486P87295J56088l202K64032
37365a32744J51318l22711m47848j69739p9741k25998p4988L64339M59913J09718
37355c68481l8412K55140L99220N2908k57874q4846J58817m3445m00063l34305
37345f61341M5195K05151J09170J51179L12756J28971m17652o31361o1059P20192
$$ plain form
37415 -977221 -856186 -408617 106636 401859 301915 -195716 -769503 -902831 -464153 -378
37405 -378 -121677 -683458 -943479 -549559 2449 68833 -286108 -463763 -229799 -16697
37395 -16697 -212452 -533396 -461743 -85129 1469 -377173 -687521 -508639 -121567 59771
37385 59771 142094 325800 289687 -259691 -740523 -331059 619535 849406 46618 -622889
37375 -622889 -344466 37688 -594624 -1771304 -2101443 -1336957 -549662 -393574 -396776 -132744
37365 -132744 18574 -304137 -751985 -921724 -1001465 -1227463 -1302451 -938112 -478199 -368481
37355 -368481 -406893 -151753 247467 300375 42501 -42345 116472 73027 -327036 -661341
37345 -661341 -616146 -410995 -301825 -150646 162110 291081 -126571 -757932 -818991 -98799
37335i8799P67568K9577n46194k89925K62364J42113o05573r23055k87212M83612
37325a065524M48308n8953m3429N26461P16710J91568k75971j18350J78076M1256
37315E40152k17601r8210J02990j58720o02632n03237R0658M06411J66402p9497
37305c53284N8325K54989J48054q5417j67694k02196l20541k79171J33326N83456
37295b30153N69214J53988j28700m9557P4078k9223j58460k6322K10748J38609
37285E24222k82358n92389m28232j1426J58919q027q0684K58135O85218N86154
37275H09532j06845o94209m99785K60076O83582K87173m15927o50453l95372k29207
37265i51435l06626j24453N17164R54129N57324k34680m42407P7169M75428J68925
$$ plain form
37335 -98799 668769 698346 152152 -137773 124591 266704 -338869 -1261924 -1549136 -1065524
37325 -1065524 -617216 -676169 -719598 -193137 523573 715141 439170 320820 498896 540152
37315 540152 322551 224341 327331 168611 -434021 -937258 -846600 -440189 -273787 -353284
37305 -353284 -294959 -39970 108084 22667 -145027 -347223 -667764 -946935 -813609 -230153
37295 -230153 339061 493049 364349 314792 388870 359647 201187 174865 385613 524222
37285 524222 241864 -350525 -778757 -790183 -631264 -639291 -719975 -461840 223378 809532
37275 809532 702687 8478 -491307 -231231 452351 739524 323597 -326856 -722228 -951435
37265 -951435 -1258061 -1382514 -865350 88779 646103 411423 -30984 46185 521613 690538
37255F90538m05555n24885j41869K34654K69179N4582j47212j26878J58186M60716
37245E21456L75814j89210p85750q52943l11649L82644O94982M48225o9179l54593
37235a40203j62840K31725L61948J30779j46239k24626j77727j43588j30716j36244
37225e37731j65076r0019J78429L65724J10878l59882l75510J64538N06968J50836
37215e0845l27823j28023N23432O78914M3480o51745o71430j06149M40237N62031
37205C12079K90724p8008k43666j41531L0194J03151J31456J43902m8327m75163
37195B4811o70712k02549N48440O90334q762p62713p90963k49619J78510K42733
37185a000490K10471K09576M8284k54921k72855K05972O89513N35657j48918o10179
$$ plain form
37255 690538 284983 -239902 -381771 -147117 122062 176644 29432 -97446 60740 521456
37245 521456 897270 708060 -77690 -930633 -1242282 -859638 -164656 283569 214390 -140203
37235 -140203 -303043 -71318 290630 421409 275170 50544 -127183 -270771 -401487 -537731
37225 -537731 -702807 -792826 -614397 -248673 -137795 -497677 -873187 -708649 -201681 -50845
37215 -50845 -378668 -506691 16741 695655 739135 87390 -584040 -690189 -249952 312079
37205 312079 602803 524795 281129 139598 169792 272943 404399 548301 499974 24811
37195 24811 -645901 -848450 -300010 390324 381562 -381151 -1172114 -1421733 -1243223 -1000490
37185 -1000490 -790019 -580443 -532159 -787080 -1059935 -853963 -164450 371207 222289 -387890
37175c87890m45495l5143J46122J46995J77177J09903j81280l70505j40998J88679
37165g92435J34942j01731P236L16515K47222o4875R1619O17811N26125l79363
37155F03066r30371l64484M30691L53527j82550q8967N42584O97481J48393l34412
37145H74958l23133j69165j36223p9005K909n1636o7533J79444L31605j4964l74826
37134A72431m1646N01937J43597q90059j093323k3061R05640N90938j83969k49705
37124a67220J19257L2609l32540k00958K87029L58027K7386k7292J82796k0254
37114B58840n98922o48058J07884P19530L86833l95102o35979j93446K96082M30366
37104b71972L58195K62331J04264q0490q1691J14507J55267k08108o31748n05957
$$ plain form
37175 -387890 -833385 -868528 -722406 -575411 -398234 -288331 -469611 -840116 -981114 -792435
37165 -792435 -657493 -759224 -751988 -435473 -188251 -253126 -161507 456304 982429 603066
37155 603066 -327305 -691789 -261098 92429 -90121 -179088 363496 1060977 1209370 874958
37145 874958 551825 382660 246437 167432 170341 118705 51172 230616 562221 547257 172431
37134 172431 130785 632722 776319 -113740 -1207063 -1230124 -324484 266454 82485 -167220
37124 -167220 -47963 -15354 -347894 -548852 -261823 96204 123590 96298 279094 258840
37114 258840 -340082 -988140 -880256 -160726 226107 -168995 -804974 -998420 -702338 -271972
37104 -271972 86223 348554 452818 372328 290637 405144 560411 352303 -279445 -785402
37094g85402J96022P47467N61099m7825l49000k06692q4285j59533j00066J78203
37084e0012K26495j42387l99989j11303L30262L37308M5754n1475q275j98960
37074b2582m45122k36148K51634K65946k66419m94916J3013N21487K61877l68755
37064e19985m57016N1511M15797K84760K3287q6436k02761l65632k76598R4821
37054a038252K81749O1782r6482J99843N13451K19011m09516n16455J6069L78377
37044c90423J11497k29888q8624J49930j20931n96529m87010J81738N75334L39230
37034e55676J7850J8717J1204k46511k70395L06423Q50556N25091l59965o97020
37024c99726k00986K42479K9672k57339R9172P12684O65444o4305n84814m23971
$$ plain form
37094 -785402 -589380 158087 719186 671361 322361 115669 31384 -128149 -228215 -50012
37084 -50012 176483 34096 -365893 -477196 -146934 190374 236128 184653 176378 -22582
37074 -22582 -467704 -703852 -452218 -186272 -452691 -947607 -934594 -413107 -151230 -519985
37064 -519985 -977001 -925490 -509693 -224933 -201646 -288082 -490843 -856475 -1133073 -1038252
37054 -1038252 -756503 -694721 -791203 -591360 -77909 141102 -268414 -784869 -768800 -390423
37044 -390423 -278926 -508814 -597438 -447508 -568439 -1164968 -1651978 -1470240 -894906 -555676
37034 -555676 -537826 -519109 -507905 -754416 -1024811 -718388 132168 657259 297294 -399726
37024 -399726 -600712 -358233 -328561 -585900 -486728 225956 891400 827095 242281 -181690
37014a81690r0000j32955l38484k34826J15338L21648L28074L50783L58811J45512
37004F42211j68961k24376j8461O9103q2642j58498j3005L2267k45376n23979
36994f91717l97750J4389K60986J56442r4437k05438l3209L24571N09031K35626
36984G8494k21983k47596K40841N86310L34766j43913l71650n11638q07643q39913
36974a903925j73672O47303P19188J79598k7923K77541L01085k07462l90379K56476
36964c22170Q88628N58346l04799n72706j05269K01933j10145m49208j82902M13191
36954A4899N76277Q2486n01283n28641j5692M32487L83319O9840k2486J21860
36944F13066P7780l04805o14223m42592O8784M37358L90285N9022k25374k35591
$$ plain form
37014 -181690 -271690 -404645 -743129 -977955 -862617 -540969 -212895 137888 496699 642211
37004 642211 473250 248874 230413 299516 216874 58376 45371 77638 -167738 -691717
36994 -691717 -1089467 -1075078 -814092 -657650 -752087 -957525 -990734 -666163 -157132 78494
36984 78494 -143489 -391085 -150244 436066 770832 626919 255269 -256369 -1064012 -1903925
36974 -1903925 -2077597 -1430294 -711106 -531508 -559431 -281890 19195 -188267 -578646 -322170
36964 -322170 566458 1124804 820005 247299 142030 343963 233818 -215390 -398292 14899
36954 14899 591176 673662 172379 -356262 -371954 60533 443852 513692 491206 613066
36944 613066 690846 386041 -228182 -670774 -601990 -164632 225653 284675 59301 -176290
36934a76290n9090p163j91584l12903r8122K27406K63866O6493j2970K8693n9347
36923c31011j29629K05712P10686O10251k13631q63479o47739J5934L76162L86691
36913A19947L97732L60436L5458l47476l12807J33015N11927M94371J30815l56173
36903A167245o70025n45982q4840K39746J74277J19J8006J09455R8612R3994J22616
36892G23223o5293m11026l49537K55671N89257K4292p56264o64882J66417O47379
36882A59237L72413k2812q0242p7049k38853l02228j12518P0777R2581R8555P5791
36871C5652j51240l63472j19576L63794L15458l32358o32151k0013P53492P10056
36861E59642K2153m20845l50653k24066k58610j83598O6433J28938j38959l28788
$$ plain form
36934 -176290 -235380 -242543 -434127 -747030 -845152 -617746 -353880 -287387 -300357 -271664 -331011
36923 -331011 -460640 -254928 455758 1066009 852378 -11101 -658840 -642906 -266744 119947
36913 119947 517679 878115 913573 566097 253290 386305 898232 1392603 1523418 1167245
36903 1167245 497220 -48762 -133602 106144 280421 280540 298546 408001 506613 600607 723223
36892 723223 657930 246904 -102633 153038 742295 766587 10323 -654559 -488142 159237
36882 159237 531650 508838 428596 351547 112694 -189534 -302052 -231275 -138694 -40139 35652
36871 35652 -115588 -479060 -598636 -234842 80616 -251742 -883893 -903906 -150414 559642
36861 559642 581795 160950 -189703 -413769 -672379 -855977 -789544 -660606 -799565 -1128353
36851a128353p6539L62592M54182J22779j62795l3324L09905M02678J35571j69709
36841B16987k52887j85699q1494J22142L79033L71163j4582l23094j10820L02789
36831D23538K24075l45191o53298l13103J45533J16906k04267k10574J83815M63693
36821a68873K63396j67270k90399J03664O57081P93286L22200l48483o78692n55178
36811f9268k32550R9011L71199L97601K2228m78028n79867k07204J58659J87076
36801c31143J01910J84575K82113J13230k36039m42023l69999j12179K17335M85526
36791a06694N08305K57123k2667q9526J8324J26451J74820J64523L7995j92740
36781H75914l53989l38593k83366l32356l64649j60099K66328O60993P61908M28623
$$ plain form
36851 -1128353 -1204892 -842300 -388118 -265339 -428134 -461458 -151553 251125 386696 216987
36841 216987 -35900 -221599 -303093 -180951 198082 569245 554663 231569 120749 423538
36831 423538 647613 302422 -350876 -663979 -518446 -401540 -605807 -816381 -632566 -168873
36821 -168873 94523 -72747 -363146 -259482 397599 1190885 1513085 1164602 485910 -69268
36811 -69268 -301818 -202807 168392 565993 588221 110193 -469674 -676878 -518219 -331143
36801 -331143 -229233 -44658 237455 350685 114646 -327377 -697376 -809555 -592220 -106694
36791 -106694 401611 658734 636067 546541 564865 691316 866136 1030659 1068654 875914
36781 875914 521925 183332 -100034 -432390 -797039 -957138 -690810 -29817 732091 1160714
36771A160714k62140q90392r07946k58059M04286M36856J6845j52506J44427L85699
36761G7784J50918k67509l62406j52330k3269m9540M5875K93365L42790P7788
36751A33466q9271J50988M39040K56115k35205l99621r7570J36592l8551l00439
36741d4456k74965r4789k5049P354J22183J31170q4718k06125K7217K73868R1033
36730g7277k97593l35646k5158J58380R8976J13816K62304K68361J30091J19152
36720D15406J40232j75729o38681n51526J65873O79290M29535j00144k54798j60383
36710e0925k31803l27414r8318K37659K05998q1843q0131L10165O15271N11968
36700A010627J67382j44794l28249l45475j95739m6179p9233k02689j77364M10
$$ plain form
36771 1160714 898574 8182 -899764 -1157823 -753537 -316681 -299836 -452342 -307915 77784
36761 77784 228702 -38807 -401213 -553543 -576812 -626352 -580477 -287112 55678 133466
36751 133466 44195 195183 634223 890338 655133 255512 157942 294534 255983 -44456
36741 -44456 -319421 -414210 -439259 -431905 -309722 -178552 -263270 -469395 -442178 -168310 -77277
36730 -77277 -374870 -710516 -735674 -577294 -478318 -364502 -102198 166163 296254 415406
36720 415406 555638 379909 -258772 -810298 -644425 34865 464400 364256 109458 -50925
36710 -50925 -282728 -610142 -708460 -470801 -264803 -346646 -426777 -116612 498659 1010627
36700 1010627 1178009 1033215 704966 359491 163752 117573 38340 -164349 -341713 -341303
36690c41303J14085Q1527J9200j3034o0004r2810n5709p5311l29295o62251o16065
36679b030970O962P76073J006850M96896k15792m15072j5820L46985J44528l48372
36669b47732m77963j54969J10873Q3914J04715L48585M06498p383m52106l73515
36659f59083P0103L36131L28933L19955K97470M9002k49363j96413J06733J36938
36649E40406j83931l27902k5593K85439J38744l00740n50862m30616r2868K66320
36639f81603M82761M47914K57271J28766O9427r4200k76073j33318L10592N09992
36629A021529J85594j73466m2438K98385K43220j09596j41335J66209J13335n26420
36619A035017r64411n01219M00283P42779L34873j37705j93242m1849Q87m1514
$$ plain form
36690 -341303 -227218 -145691 -126491 -139525 -199529 -292339 -348048 -423359 -752654 -1414905 -2030970
36679 -2030970 -2024008 -1247935 -241085 255811 40019 -375053 -390873 -43888 100640 -247732
36669 -247732 -725695 -880664 -769791 -685877 -581162 -232577 173921 166538 -285568 -659083
36659 -659083 -588980 -252849 76084 396039 693509 742511 493148 296735 403468 540406
36649 540406 356475 28573 2980 288419 427163 126423 -424439 -855055 -947923 -681603
36639 -681603 -198842 249072 506343 635109 704536 610336 334263 200945 511537 1021529
36629 1021529 1207123 1033657 991219 1289604 1532824 1423228 1281893 1448102 1561437 1035017
36619 1035017 70606 -430613 -30330 712449 1047322 909617 716375 674526 675413 633899
36609F33899r5309k25827l12014k6232N58810Q05120L58631k29493k30754K18142
36599A454973L87974P7170k10472j76559j12866k11774j60391K07299L94102q4431
36589A565025q21272r12457j74036N58172M90569j41535m36017n334N56338M83305
36579A162758j59057n97640l88576R7256L42738L69319M12443L37767o1015m54113
36569A061880l38681R7495J80826j78523l73833j67845m5493k14546j12545N55906
36559D64641J053037O19301l07792o99309l75011q316N2358R6866K56746K25251
36549A377772j03152l71196l06550l5344K40805M20791L39345o6647m14711k56679
36539H24434J64172J55070l36941n68852j47952L80404M52464L04162L51564L72368
$$ plain form
36609 633899 538590 312763 749 -25483 533327 1338447 1697078 1467585 1236831 1454973
36599 1454973 1842947 1920117 1709645 1533086 1420220 1208446 1048055 1255354 1649456 1565025
36589 1565025 743753 -168704 -342740 215432 706001 564466 128449 123115 679453 1162758
36579 1162758 1003701 406061 17485 114741 457479 826798 1239241 1577008 1515993 1061880
36569 1061880 723199 820694 1001520 822997 449164 281319 235826 21280 -91265 464641
36559 464641 1517678 2136979 1829187 1129878 754867 746551 798909 895775 1152521 1377772
36549 1377772 1274620 903424 596874 561530 802335 1223126 1562471 1495824 1081113 824434
36539 824434 988606 1143676 806735 237883 89931 470335 922799 1226961 1578525 1950893
36529A950893j13m17549k58943K97836M69192R3546j43166J28250L37512o9346
36519B388112o41148n01227L63769J017409P72989j7478n26199m36936j09858
36510B309433L5426p475K8159K79443N78082O14110K58198k33599l79587N1168
36500C533358P32210J082181Q93088N07354L25070L41802L36662L34805N75959
36491H662489J047268J383313J389486J416594J935199K846554L551541L755524
36483B5987968L890374M557886N824224P357215R044766J1062255J3462032J6214126
36475I7400846J9509835K3070700K4790617K1208974J0742465l614135j5928514
36468A77180788k2077021k2399574j9858232j6786546j3931311j1460416r527569
$$ plain form
36529 1950893 1950780 1533231 1274288 1572124 2041316 2134862 1991696 2119946 2457458 2388112
36519 2388112 1746964 1245737 1609506 2626915 3399904 3382426 2856227 2419291 2309433
36510 2309433 2344859 2337384 2365543 2644986 3223068 3837178 4095376 3861777 3482190 3533358
36500 3533358 4265568 5347749 6240837 6748191 7073261 7415063 7751725 8086530 8662489
36491 8662489 9709757 11093070 12482556 13899150 15834349 18680903 22232444 25987968
36483 25987968 29878342 34436228 40260452 47617667 56662433 67724688 81186720 97400846
36475 97400846 116910681 139981381 164771998 185980972 196723437 193109302 177180788
36468 177180788 155103767 132704193 112845961 96059415 82128104 70667688 61140119
36461F1140119p988283o515662n150421m220302l725429l296997k765033k322752
36453B5155240k120815k086682k120528k102539j788376j116515n26511m84129
36445A2809145p55956p14776l49240l05183p86718j116261p34923m8138J96715
36436H194665p4933l84194m83449m66551l27828N346K85485J36765l33154n78453
36426E973699l61782m6051l382j05016j8883K65096M70953M38865K53150M2964
36416F909613j47519k90422l01609r3634K84457N59270L99820j79839o71233n73630
36406E895274l3487L12662J78191m9801L1646K69068L36619L10216M05660M31409
36396H087457P4389m10517m17273J01340N42531N60511M56005M80823L87954J7863
$$ plain form
36461 61140119 53151836 46636174 41485753 37265451 33540022 30243025 27477992 25155240
36453 25155240 23034425 20947743 18827215 16724676 14936300 13819785 13293274 12809145
36445 12809145 12053189 11338413 10989173 10683990 9897272 8781011 8046088 7997950 8194665
36436 8194665 8119732 7735538 7252089 6785538 6457710 6463056 6748541 6885306 6552152 5973699
36426 5973699 5611917 5565866 5562484 5457468 5438585 5703681 6174634 6613499 6866649 6909613
36416 6909613 6762094 6471672 6170063 6076429 6360886 6920156 7319976 7140137 6468904 5895274
36406 5895274 5861787 6174449 6352640 6302839 6334485 6603553 6940172 7250388 7656048 8087457
36396 8087457 8161846 7751329 7334056 7435396 7977927 8538438 8994443 9475266 9863220 9881083
36386I881083k25636M6712N59042P60579N61982K73677R7043O6614K20987M61500
36376A2703583N21705M00031M57129P40783O96854L1786o40026o27945j89427
36367A4094473j5475j03960L4369L48036L05605j52962n23597n21904k92058J5758
36357A3188285K61440J82440j32987o7396N45514Q89753M80461J89347P85677
36348A6322534J394866J013457O37566J787451L619046M025718L251057L577750
36340C5629445N438429O944888P652822R415982J2683142J5547364J7742385K1778807
36332A32833264K8553661L6252035M5511953N9227475P2150495O7289808L2717046
36325D74535737j9356598n9802014p0867095o0388215m6601160l7621463l0693358
$$ plain form
36386 9881083 9655447 9702159 10261201 11021780 11583762 11857439 11954482 12021096 12242083 12703583
36376 12703583 13225288 13625319 14082448 14823231 15520085 15551871 14911845 14283900 14094473
36367 14094473 14078998 13975038 14009407 14357443 14663048 14510086 13986489 13464585 13172527 13188285
36357 13188285 13449725 13632165 13499178 13431782 13977296 14867049 15347510 15536857 16322534
36348 16322534 17717400 18730857 19368423 21155874 24774920 28800638 32051695 35629445
36340 35629445 41067874 48012762 55665584 65081566 77764708 93312072 111054457 132833264
36332 132833264 161386925 197638960 243150913 302378388 374528883 441818691 474535737
36325 474535737 455179139 395377125 324510030 264121815 217520655 179899192 149205834
36318A49205834k3792491j8955173j6543710j3904803j0204031p554644o769762
36311E1481220o007063m319348l149026l396217l792871l171622k127236j547657
36303B3970180j322042j202371j337570j423087q37407k5134k03549j306745j810758
36294A4501517j081737l02676m41250q50479p04751m01193n33849o73581k65219
36285I246782K07200M8118l99364m00248j42588l22178p86165o80685J11241O27449
36275G509562J50161p73026j012590k79188N18818M09468l97118p72555k10696
36266E142836M54936K83002l70784m50523J36353M48050N9776l65936k93747j01375
36256D942588j96435k32190J59076N48697L58373j60096l10243N99K57432J85873
$$ plain form
36318 149205834 125413343 106458170 89914460 76009657 65805626 58250982 51481220
36311 51481220 45474157 41154809 38005783 34609566 30816695 27645073 25517837 23970180
36303 23970180 22648138 21445767 20108197 18685110 17847703 17822569 17619020 16312275 14501517
36294 14501517 13419780 13117104 12675854 11825375 11120624 10719431 10185582 9512001 9246782
36285 9246782 9453982 9502100 9102736 8702488 8559900 8237722 7451557 6770872 6882113 7509562
36275 7509562 7659723 6886697 5874107 5594919 6113737 6523205 6126087 5353532 5142836
36266 5142836 5597772 5880774 5509990 5059467 5195820 5643870 5703646 5337710 5043963 4942588
36256 4942588 4746153 4513963 4673039 5221736 5580109 5420013 5109770 5110369 5367801 5553674
36246E553674J5033j9978M1011Q3909P5505M3325P9782K45202L70891K19136o7092
36235F640398o7191K18825K92324L5669M8817O47194J154245Q83234K97258L19689
36225A0470462Q59228J041416P49070P93257J402430J678021J046577K92536M06303
36216A8739300J110555J403189J114436R71549J272729J440637J052997N25092
36208B7630484L71611L49833j22382r69494j447568j168110p00095q78663j694330
36199B1371286k231142j807902q74325m42757p87682j209134j149441r49104j125894
36190A0793905j424956j224430n96808k28474l49952m74570k78241k8532M7953
36181F235895J21538J93295j18634p98221j110808o35987l7203j29800o76167
$$ plain form
36246 5553674 5568707 5548729 5589740 5673649 5749154 5792479 5872261 6117463 6488354 6707490 6640398
36235 6640398 6573207 6792032 7084356 7120025 7168842 7816036 8970281 9853515 10150773 10470462
36225 10470462 11329690 12371106 13120176 13913433 15315863 16993884 18040461 18332997 18739300
36216 18739300 19849855 21253044 22367480 23339029 24611758 26052395 27105392 27630484
36208 27630484 28002095 28351928 28229546 27260052 25812484 24644374 23944279 23065616 21371286
36199 21371286 19140144 17332242 16457917 16015160 15227478 14018344 12868903 11919799 10793905
36190 10793905 9368949 8144519 7547711 7319237 6969285 6494715 6216474 6187942 6235895
36181 6235895 6357433 6550728 6432094 5633873 4523065 3887078 3849875 3720075 3043908
36172C043908q58235n37434k12894l8455K09770L69888N4555m59212m43933R0949
36162A218907L39824m913l11614j32495J28436O1541p1995M720J8270k11761k63953
36151G74967J27324M30148J22770l73062k94590L09377P21602N65899O4579m38451
36141B010563o52498l36785L20698O28708K40938k82994l38595k32835n23664
36132H33536q52823m34794N16528R31154M73088m4677k7281R6420j83098n49961
36122G58092m44674L6352L54198K53376j25724n20377o11518j63605N90456J020307
36112A146883Q31693M15740K19234J42076j05346l98370l99174j62081r6186l64604
36102A229865o49164n50017l9983M96407O09890K27885k34762l25447q5554P9766
$$ plain form
36172 3043908 2185673 1648239 1435345 1396890 1606660 1976548 2031103 1571891 1127958 1218907
36162 1218907 1558731 1553818 1242204 1109709 1238145 1299686 1227691 1232411 1250681 1038920 774967
36151 774967 902291 1332439 1455209 1082147 787557 1096934 1818536 2384435 2449014 2010563
36141 2010563 1358065 1021280 1341978 1970686 2211624 1928630 1590035 1357200 833536
36132 833536 -19287 -454081 62447 993601 1466689 1422012 1394731 1491151 1308053 758092
36122 758092 313418 349770 703968 957344 831620 311243 -300275 -463880 126576 1146883
36112 1146883 1978576 2394316 2613550 2755626 2650280 2251910 1852736 1690655 1594469 1229865
36102 1229865 580701 30684 -9299 487108 1096998 1324883 1090121 764674 679120 758886
36092G58886J9935k5853M0531m2762l67332n29654k06821K55300K74378j31307
36082D5301l96337k27626P5583J65145J12292J75651L70821M65073K80044j14959
36072I50988m41002m14115k2339L79168L75618n8949n11800n53097j33134M14333
36062a4329O56171L93421j35853m27703k59916P516p0035l32835k56785J30100
36052c10248J85076k62311m42246J86824Q93228O35958k92642o19547r317M88887
36042D53662J46324l98949l42327K1422J9528j94008r4846J20250p6463m18488
36032g63895j69340N53643P84175J19720p04542q25986k05244N47574P85692K71378
36022C93175n16335o65777O9521P62062N37696j24292k02111K11244K34632j45210
$$ plain form
36092 758886 778821 752968 793499 750737 383405 -146249 -353070 -97770 176608 45301
36082 45301 -351036 -578662 -503079 -337934 -225642 -49991 320830 785903 1065947 950988
36072 950988 509986 95871 73532 452700 828318 769369 257569 -295528 -428662 -14329
36062 -14329 641842 1035263 899410 471707 211791 219307 149272 -183563 -440348 -310248
36052 -310248 -125172 -387483 -829729 -642905 250323 886281 593639 -25908 -35225 453662
36042 453662 599986 201037 -141290 -119868 -100340 -294348 -389194 -268944 -345407 -763895
36032 -763895 -933235 -379592 404583 524303 -180239 -1006225 -1211469 -663895 121797 393175
36022 393175 -123160 -788937 -719416 42646 580342 456050 253939 465183 699815 554605
36012E54605j52607J60624n4170o71866n28579M69602Q82648P8088o31836j72492
36002f5983N40683K88338l89242l03952K90117L20938j55072k15695K06203L25557
35992H41892n8034l83962l75777k11859P8092M68403N68812K51171J24315N45143
35982A848196Q60127N58272L03558P29989J248013J386661K088905L811073M495438
35973A7330232J945119k363856m562957l460968j668787j336608j540244q60978
35965C480953J1113j51751q50580r02854m42612l18209m77200l40092j8101M9796
35955D0463L8409K79184M45598J17740l63402m14031j09471R4421P7225k8752
35945A77384j45886j10641K01297M08399M4563m46949j77369N83588N82501l17462
$$ plain form
36012 554605 401998 562622 508452 -163414 -691993 -222391 660257 738345 106509 -65983
36002 -65983 474700 763038 373796 69844 359961 680899 525827 310132 516335 841892
35992 841892 783858 399896 24119 -187740 -109648 358755 927567 1178738 1303053 1848196
35982 1848196 2708323 3266595 3570153 4300142 5548155 6934816 9023721 12834794 17330232
35973 17330232 19275351 16911495 12348538 8887570 7218783 5882175 4341931 3480953
35965 3480953 3492066 3340315 2489735 1586881 1144269 826060 348860 8768 -9333 40463
35955 40463 78872 358056 803654 921394 557992 143961 34490 128911 206136 177384
35945 177384 31498 -79143 122154 530553 575116 128167 -49202 534386 1116887 799425
35935G99425p41278r9574L74655j80621o89866p5517P49521M56248l60472k57160
35925b4639N19624M99338m92365j130753p64845j59202j769n1342N5227K43712
35915a307014L99602M90715L22529j10845k73769J56804N63729K68841l03477
35906B07115l08441J18222K12492n9817j29727K6813K2395K0787L64124N51846
35896A025809r3840r76041q50255J86280P72283L83271j02894r8905p8358l04494
35886a37144k28240L00532N13062N2725l30619r4885J71611r8627l82570l3753
35876b67908N18375M98699Q3249p065K30563J83848k33132m30157j32509J96731
35866F40694P8431l44449o03178n16919k71458m1270J99839M45904M76208J58342
$$ plain form
35935 799425 58147 -41427 333228 152607 -537259 -612776 136745 592993 232521 -24639
35925 -24639 494985 994323 501958 -628795 -1393640 -1552842 -1554611 -1605953 -1550726 -1307014
35915 -1307014 -907412 -416697 -94168 -205013 -478782 -321978 241751 510592 207115
35906 207115 -101326 16896 229388 169571 39844 66657 89052 109839 473963 1025809
35896 1025809 931969 -44072 -894327 -708047 64236 447507 344613 245708 167350 -137144
35886 -137144 -365384 -64852 448210 500935 170316 75431 247042 148415 -234155 -267908
35876 -267908 250467 749166 832415 825350 1055913 1239761 1006629 576472 443963 640694
35866 640694 719125 374676 -228502 -745421 -1016879 -1058149 -858310 -412406 63802 222144
35856B22144j94880j62578J11364R3230k10640j66994L59308N59033q2474q10935
35846b83422o49769J41316N42368K80712p4052k07198k88558k96874l2464L05463
35836e62478L62443K95406M42830N91096L69221M3592N5605J61448l1529j56072
35826A571562K30359O33300N18523N24124J290493J924767J614364J907969M569766
35817A4785227P436105N896387n57377o512793p150157l884033j353305j197019
35809G463035j608190j342057r51130o93302p9947N29208J81436p54653r19855
35800A824545k49556j0517m61976m47767L49931O84789p9334p94657m18191L62589
35790G59856M14241p8034k26020J9964M7936k09490k42953Q7950L64568L04409
$$ plain form
35856 222144 27264 -135314 -23950 69280 -141360 -308354 50954 609987 527513 -283422
35846 -283422 -933191 -791875 -249507 31205 -42847 -250045 -538603 -835477 -867941 -562478
35836 -562478 -200035 95371 538201 1129297 1498518 1542110 1597715 1759163 1727634 1571562
35826 1571562 1801921 2435221 2953744 3477868 4768361 6693128 8307492 10215461 14785227
35817 14785227 22221332 28117719 27560342 21047549 13897392 10013359 8660054 7463035
35809 7463035 5854845 4512788 3561658 2868356 2788409 3317617 3499053 2744400 1824545
35800 1824545 1574989 1564472 1102496 654729 1004660 1689449 1610115 815458 397267 759856
35790 759856 1174097 1096063 870043 890007 937943 728453 485500 573450 938018 1242427
35780A242427Q5691l3998n2617j23906k97593m06276k41703J03538K37356p87
35770E12132k41957j36075O6957n7350l40758k71518J31088L43954K00928O4563
35760B71964J08519R6977k1875L0345K46177K19327j21009k90682o0087J25086
35750F04742q6222l23830j30399K35491K11239j41868k26223J63362N30351L80452
35740A217095j44589n07121m27646j04633J39059K30681K89396L25521K03444
35731A221207q9123l44837l85296k25771N3526L54911M38084J09889l41028l46299
35721D45263R1928K81248r1847l86761n0539L86643J56512m12059m01376J64351
35711A83363M08453J13366k4631K50807L22154p9681l39699j13780K2578l22731
$$ plain form
35780 1242427 1328118 1294120 1241503 1117597 820004 413728 172025 275563 512919 512132
35770 512132 270175 134100 201057 143707 -197051 -468569 -337481 6473 207401 271964
35760 271964 380483 477460 455585 485930 732107 951434 830425 539743 479656 604742
35750 604742 518520 194690 64291 299782 511021 369153 142930 306292 836643 1217095
35740 1217095 1072506 565385 137739 33106 172165 402846 692242 1017763 1221207
35731 1221207 1132084 787247 401951 176180 229706 584617 1022701 1132590 791562 445263
35721 445263 537191 818439 726592 339831 289292 675935 832447 420388 19012 183363
35711 183363 591816 705182 680551 931358 1253512 1173831 834132 720352 742930 420199
35701D20199n74038k26537K08703J23106j17570N1093K56645r3442n31904j99791
35691f83536N45220N10100l84077q32834r8718R07139R95705K63246l21396k60000
35681F40849J41998L76453J83120l14951o09739k57801M38190O14247k0759p13452
35671D78155o92763j85226Q2190l2218j04243L9134J76915K31440L22209L25366
35661F40959j2524m71388m56926J31200O39018N04954m3822m01752l52411j47876
35651B9432p5320k02340l82287l48259J4452M04619L92898N7559o2209J86977
35641A5522K68528j61231n70896l11477L18080M55567n6248n03619l82235M7326
35631h80683L79814N79045O56714M30842q1643m92538n51736m23980k46348Q2055
$$ plain form
35701 420199 -153839 -380376 -171673 -48567 -166137 -115044 141601 48159 -483745 -683536
35691 -683536 -138316 371784 -12293 -845127 -943845 -36706 958999 1222245 900849 640849
35681 640849 782847 1159300 1342420 1027469 417730 159929 598119 1212366 1191607 478155
35671 478155 -214608 -399834 -317644 -349862 -454105 -414971 -238056 -6616 315593 640959
35661 640959 628435 157047 -299879 -168679 470339 975293 931471 529719 177308 29432
35651 29432 -45888 -248228 -630515 -978774 -964322 -559703 -166805 -109246 -171455 15522
35641 15522 284050 122819 -448077 -759554 -441474 14093 -42155 -545774 -928009 -880683
35631 -880683 -500869 78176 734890 1165732 1084089 591551 39815 -384165 -630513 -548458
35621e48458L95176J59732o34366j046408l32252Q65467J239007N17870l24787
35612B90981m87895j67797J12946K21829J97223j7850k55233r2863M40231O35842
35602H77414Q5631n49987l82361L89346P30354K48288l41724l68746r7527q5771
35592E04917k43580j31856J58864J32169k10836k99179N0136K63732o2871m41365
35582b79869k25888L33877M53742L9547j92518J37183N24837M31915N2907j57456
35572A118277k02335k87456k59606R6805M57529L00011k45383n11643k81121l5726
35562A49352q7191q5441K78559O16055L89437k20686n57828m35225k62954k44061
35552d59983n8878M26769O94914K95172l19976l13629K74289M82254j60523q37397
$$ plain form
35621 -548458 -153282 6450 -627916 -1674324 -2006576 -1141109 97898 615768 290981
35612 290981 -196914 -364711 -251765 -29936 167287 149437 -105796 -198659 241572 877414
35602 877414 963045 413058 30697 420043 1150397 1398685 1056961 688215 590688 504917
35592 504917 261337 129481 288345 420514 209678 -89501 -39365 224367 161496 -279869
35582 -279869 -505757 -171880 281862 321409 128891 266074 790911 1222826 1275733 1118277
35572 1118277 915942 628486 368880 465685 923214 1223225 977842 466199 185078 149352
35562 149352 62161 -23280 255279 871334 1260771 1040085 482257 47032 -215922 -459983
35552 -459983 -518861 -92092 602822 897994 578018 264389 538678 1020932 860409 23012
35542B3012n56624M06985Q72034L50860m45242p24138n15725k32939J5201K58543
35532e48033L06724N1150j90841r3115J55575J64569m0921j35536k7974J46688
35522b11714L68434N98224M97162j57899q80181r02791k23051L63576L59668J14065
35512g4507R8363K13922J49018l4464q4732l2920q7054k26668k36561n3438J69013
35501b00028K78605K34706O7907j35049k55857k30668p8287J26323K19151J5076
35491D1879l79237m76097J5003O35178O73254J68304j64377n6457k4008l40260
35481I3182m56540J5384M35543M4219p26227p80936j1200N46668K73521k13908
35471g80294j32198L22447M21270K3789l22285k06593J86111M20942L10686K5737
$$ plain form
35542 23012 -533612 -126627 745407 1096267 651025 -73113 -588838 -821777 -806576 -548033
35532 -548033 -241309 -190159 -381000 -474115 -318540 -153971 -194892 -330428 -358402 -211714
35522 -211714 156720 754944 1252106 1094207 214026 -688765 -911816 -548240 -188572 -74507
35512 -74507 23856 237778 386796 352332 267600 234680 147626 -79042 -315603 -369041 -200028
35501 -200028 78577 313283 381190 246141 -9716 -240384 -318671 -192348 26803 41879
35491 41879 -337358 -813455 -798452 -163274 509980 678284 513907 457450 433442 93182
35481 93182 -363358 -347974 87569 131788 -594439 -1375375 -1386575 -839907 -566386 -780294
35471 -780294 -912492 -590045 -168775 -144986 -467271 -673864 -487753 -66811 243875 269612
35461B69612j40979p4073Q6085J76377K16865K44148R3233l44585p37947o22353
35451h33617j17773J53102Q169J4419N20879R23243M72776n29840j045986o84074
35441a118702p7906J69909K25392M29125N67311K42481l59542o14093k81134K46165
35431e70994N21312N03234L53405J09016k27277m66653l68110K7497L77779L92670
35421F51879J04668k38708m43107m69827l69984k22324r3404K5651J98022L86755
35411d70379M26054K82820K10969L93753N39253K13510m24342o90596l28295J10076
35401B62823J21793k6464Q3316J76647k17399p41684n65618K83308Q25949N28761
35391G31432k7247j68760m6438r1251k35566k25647j74330k44386k31334R016
$$ plain form
35461 269612 128633 54560 140645 317022 533887 778035 871268 526683 -211264 -833617
35451 -833617 -951390 -798288 -790119 -775700 -254821 668422 1141198 611358 -434628 -1118702
35441 -1118702 -1196608 -1026699 -801307 -372182 195129 437610 78068 -536025 -817159 -570994
35431 -570994 -49682 453552 806957 915973 688696 222043 -146067 -118570 259209 651879
35421 651879 756547 517839 74732 -395095 -765079 -987403 -1080807 -1055156 -857134 -470379
35411 -470379 -44325 238495 449464 843217 1382470 1595980 1171638 481042 152747 262823
35401 262823 384616 358152 441468 618115 400716 -340968 -906586 -623278 202671 731432
35391 731432 704185 535425 488987 397736 162170 -63477 -237807 -482193 -713527 -704511
35381g04511J62156K3264j1966L55869O20053K02982m94670o14363j21789K92305
35371b90670L60852L63105K60566k52008q22703o42343K21787O97356K55293l38533
35361a87298k62487K19667M06756K25989L8270o1533j66186k05746j46322j44152
35351b83042j54726J28133O17556P04424J79841l29037l02190o6117o6903p5831
35341C52108K28272N02735L05626j08601k87657l54500n30159m53624J40261N98419
35331C92880K14637n20933o14624j35274Q4508k97K65096P24879M56971n08082
35321C59761r48773l44026L25960K45388j9327K61906O54901M16971j66784l21700
35311D64277o0340L6278j25274j88001r6269k9662R6368L40257L00023k64976
$$ plain form
35381 -704511 -542355 -519091 -531057 -175188 444865 647847 153177 -461186 -582975 -290670
35371 -290670 70182 433287 693853 441845 -380858 -1023201 -801414 -104058 151235 -187298
35361 -187298 -449785 -230118 176638 402627 440897 379364 213178 7432 -138890 -283042
35351 -283042 -437768 -309635 307921 1012345 1192186 863149 560959 494842 427939 352108
35341 352108 580380 1083115 1388741 1280140 992483 637983 107824 -345800 -205539 392880
35331 392880 607517 86584 -528040 -663314 -578806 -579103 -314007 410872 867843 359761
35321 359761 -589012 -933038 -607078 -361690 -381017 -119111 535790 952761 785977 464277
35311 464277 403937 440215 314941 126940 30671 1009 97377 437634 737657 472681
35301D72681p30220l81385L85309N72272J10783j38576J06551J42032l79834p47009
35291e87396l43451L34694M73595J25242j02728p7393j22823k60075j99729K3027
35281g37037P6597k0662R0027L90770M01059q959l01588q0340K76337J98206k33793
35270E0617m77330k97499Q8929M18800M99284J42124n20610q49504m10262K59993
35260a095458K68255l06982m88940R4416O49439M98842Q0659Q7169L19968J69304
35250B76672k65227l72569o8510J67358J64915K29770M40868M38306J9034n33604
35240D97013p96044n53042J22695P98148Q69233K41867l84214l73261k6018l1762
35230C64615l49208l70312j745K46463J84640J20184J05281j40034m82057m27054
$$ plain form
35301 472681 -257539 -638924 -253615 318657 429440 290864 397415 539447 159613 -587396
35291 -587396 -930847 -596153 -122558 2684 -100044 -177437 -300260 -560335 -760064 -737037
35281 -737037 -660440 -681102 -591075 -200305 200754 191795 -109793 -190133 86204 284410 50617
35270 50617 -426713 -724212 -635283 -216483 282801 424925 -95685 -945189 -1355451 -1095458
35260 -1095458 -827203 -1134185 -1623125 -1528709 -879270 -380428 -299769 -212600 107368 276672
35250 276672 11445 -361124 -429634 -262276 -97361 132409 573277 1011583 1030617 497013
35240 497013 -299031 -852073 -729378 68770 938003 1179870 795656 422395 396377 364615
35230 364615 15407 -354905 -356650 -110187 74453 194637 299918 159884 -322173 -749227
35220g49227n9911k2622l44501k69236L91512P41884K19110l99204j86417M80632
35210a97980N70592j4199m50509l34869j12901j83326l09357r6354M09703Q03698
35200H4498P88409M43575P0818k05076n35912q94693q19104r2380N72174K99617
35190b88074n52554p04827J74677R27274O32674j37442m23046k77188k29652j78586
35180a056744J80485M51813J32898l40975k02456L35704M30987K9136j48159Q7432
35170i9879J74602q4098k24074o9879k4837j94853j28952K59716L58608j39399
35160a73045o20388m43248J08389K95077m1534m01023l59343J4142L66316M14810
35150h39847J36785k40028m25427k68346J80791O47656O89361J23715n00521l71701
$$ plain form
35220 -749227 -809138 -831760 -1176261 -1445497 -1053985 -312101 -92991 -492195 -678612 -197980
35210 -197980 372612 358413 -92096 -426965 -539866 -723192 -1032549 -1128903 -719200 84498
35200 84498 872907 1316482 1387300 1182224 646312 -248381 -1067485 -1159865 -587691 -288074
35190 -288074 -840628 -1545455 -1370778 -443504 189170 51728 -371318 -648506 -878158 -1056744
35180 -1056744 -876259 -424446 -291548 -632523 -834979 -499275 -68288 -39152 -187311 -99879
35170 -99879 74723 -9375 -233449 -303328 -328165 -523018 -651970 -392254 -33646 -173045
35160 -173045 -793433 -1236681 -1128292 -833215 -874749 -1275772 -1635115 -1620973 -1254657 -839847
35150 -839847 -703062 -943090 -1368517 -1636863 -1456072 -808416 -119055 4660 -495861 -867562
35140h67562L86727O33123j65382r33209m70403O56157Q73676n0238p52235m01900
35130a091246K52747L30917Q8950J20722K89129K15559P6536J46126J41247k32370
35120C38317n69370l32430K48355N31534M05461K21171P3594j70031l34064j21704
35110B90833K53166K61126j33605m36166m04698l06192l11562j88641J97812N30010
35100b47917M63245J14218j31482j00804Q0570K16223J70178q3343l59368l43488
35090b21968K2901L51429K49654j19293k36127J6594J97336M7602p0545J62209
35080C99792L57725K2603m76953l64776K16387K81046m08837q42780l27429M23505
35070g19717N02013K15317K98997M84374Q6264n13128l76417K55764K37978m77517
$$ plain form
35140 -867562 -480835 152288 -13094 -946303 -1416706 -760549 113127 62889 -689346 -1091246
35130 -1091246 -838499 -507582 -418632 -297910 -8781 206778 283314 429440 570687 338317
35120 338317 -231053 -563483 -315128 216406 621867 843038 916632 746601 412537 290833
35110 290833 543999 805125 671520 235354 -169344 -475536 -787098 -975739 -777927 -247917
35100 -247917 215328 329546 198064 97260 177830 394053 564231 480888 121520 -221968
35090 -221968 -199067 152362 402016 282723 46596 63190 260526 308128 237583 399792
35080 399792 757517 780120 303167 -61609 154778 435824 26987 -815793 -1143222 -719717
35070 -719717 -217704 -2387 296610 780984 867248 354120 -22297 233467 471445 -6072
35060f072o61905Q3893N94458J05513n02465l01041J49303j0639l01415J76642
35050f73728R55701Q27545j26383n99880j03393M14356K06390k13869j42754J34164
35040F78149o7995o32934p65000j44280N94898O46732K1626m66141k06402M24002
35030H2655N54422p96n17663m16710K319J89741J70929K30905K17708j70787o63412
35019c20689o76205j97441K20659L10087L12769L60376K65504L5095j4159J45460
35009D41456Q2549l79426p35308m53561K47918O55996M36130o1409l11608j77422
34999b54685Q4152K20835K40182K45454J77787o6516l29856l31504j49852j62149
34989c26152l61622k31733L81546P97304M31096k42506l54269M2844J41019k73911
$$ plain form
35060 -6072 -667977 -584084 10374 115887 -386578 -687619 -538316 -548955 -850370 -673728
35050 -673728 281973 1109518 983135 383255 279862 694218 900608 686739 543985 678149
35040 678149 610154 -22780 -787780 -932060 -337162 309570 331196 -134945 -341347 82655
35030 82655 637077 636281 118618 -298092 -295773 -106032 64897 295802 513510 342723 -320689
35019 -320689 -996894 -1194335 -973676 -663589 -350820 9556 275060 310155 295996 441456
35009 441456 524005 144579 -590729 -1044290 -796372 -140376 295754 234345 -77263 -254685
34999 -254685 -170533 50302 290484 535938 713725 647209 317353 -14151 -164003 -326152
34989 -326152 -687774 -919507 -537961 259343 690439 447933 93664 136508 277527 3616
34979C616n36639k54521J17154J34151L7625J56304K70132P5636j96209j54933
34969c47684J00774J99830J02799L5655K8147n3004j67581j88283j84025k49648
34959g23020j99737J63911N84686N90134J81240j41258r5031M2636n0137k46438
34949A06986k32109q882J46371R8906k5024q9147q8180k4988J50461L99796N36728
34938I70918M15868J01119k30036m55627m98631k86967R9394L44142K02316j35989
34928E26507k44760k8945J94038K15162J83519K09983J14170j74663l29129j11692
34918E54190J39912k8846m47437n46493k22900O0581M6717J3431K01952M00107
34908A71214L24641M7305j94741l11018k70801j786L84260N23529K24344k29877
$$ plain form
34979 3616 -533023 -787544 -670390 -536239 -498614 -342310 -72178 3458 -192751 -347684
34969 -347684 -246910 -47080 55719 91374 119521 66517 -101064 -289347 -473372 -723020
34959 -723020 -922757 -758846 -174160 415974 597214 455956 360925 403561 353424 106986
34949 106986 -125123 -134005 12366 111272 86248 -2899 -91079 -116067 34394 434190 970918
34938 970918 1386786 1487905 1257869 802242 303611 16644 116038 460180 662496 526507
34928 526507 281747 252802 446840 662002 845521 1055504 1169674 995011 665882 554190
34918 554190 694102 665256 217819 -328674 -551574 -490993 -444276 -430845 -228893 171214
34908 171214 495855 543160 348419 37401 -233400 -235186 149074 672603 896947 667070
34898F67070m40014l84951l20158l29955k46441L5430L69924N05191L34097J9835
34888B10028j29824n425J32336O448k12836j13280K75374M09950P533n02054n66343
34877d88093k17310J33714L05434L57353K32335j47367n40582n80811k73544O6372
34867a152499L10318N49745O85892M62182k3652k90401j11434J98974K97535K27926
34857A154586J27746p5126l69995m28968o5950L37002L08262L451m6349K05798
34847A150457K76077J699j47805J52730N07837M02919J2920r5064J34297K01699
34837B597766q8298k80969l207L92043L03713k12775m60440l5356O18588P70610
34827C601675K97515k36806l11557K6884M24011P12754R26911J009284Q41107
$$ plain form
34898 667070 227056 -157895 -478053 -808008 -1054449 -1019019 -649095 -143904 190193 210028
34888 210028 80204 74779 207115 213563 727 -112553 162821 572771 580304 78250 -488093
34877 -488093 -705403 -571689 -266255 91098 323433 176066 -364516 -945327 -1218871 -1152499
34867 -1152499 -842181 -292436 393456 855638 831986 541585 430151 629125 926660 1154586
34857 1154586 1282332 1207206 837211 408243 342293 679295 987557 991008 944659 1150457
34847 1150457 1426534 1428233 1280428 1433158 1940995 2343914 2356834 2261770 2396067 2597766
34837 2597766 2509468 2228499 2225292 2617335 2921048 2708273 2247833 2212477 2831065 3601675
34827 3601675 3899190 3662384 3350827 3377711 3801722 4514476 5441387 6450671 7291778
34818G291778N28839L42296L42875L99366O03855J228216K113846K630733K596517
34809A8078321K730271L668105M987768N917494O644985Q019074J0112555J2033362
34801G2191935J3080358J2962930J0824842N566014k099207r111595j2711738
34794I0703539j2940251j1681826j0142830q448588o902506n996461n390587m340246
34786B4860244l100785k573965k608668k141636j163464r23779j719969k101197
34778H526781j099508J88679L23508l93733p79966o94959p41578q20346m32217
34769D076661P7004k2868m70145m32255m7554j74811p36622p41670k7293M23727
34759A924174J53516j19503R3776K63399j6067k54033o2373J18497n3108j56567
$$ plain form
34818 7291778 7820617 8162913 8505788 8905154 9509009 10737225 12851071 15481804 18078321
34809 18078321 20808592 24476697 29464465 35381959 42026944 50046018 60158573 72191935
34801 72191935 85272293 98235223 109060065 114626079 112526872 103415277 90703539
34794 90703539 77763288 66081462 55938632 47490044 40587538 34591077 29200490 24860244
34786 24860244 21759459 19185494 16576826 14435190 13271726 12347947 10627978 8526781
34778 8526781 7427273 7615952 7939460 7545727 6765761 6070802 5329224 4508878 4076661
34769 4076661 4153665 4130797 3660652 3228397 3180843 3006032 2269410 1527740 1500447 1924174
34759 1924174 2077690 1958187 2051963 2315362 2299295 2045262 1982889 2101386 2048278 1891711
34749A891711M8620K4851m28184n01550K24093P21613N5214r04128p20297L06726
34739G18669O66316Q1605k69407P7833K15899l06706o23910j63547K90632R534
34729F96918l95807j14404M01510K51000l42724m61176m0071J75864j7992j02329
34719E0789P2123P4953j27754L239N14071O27322p4367q67497q47783j48834L73683
34708c50055L23466N6062l0837L1325L1817p4797j78937j85600j00898j0052L5466
34697d53040J08214K88316M63227M19803J81208M1453J47755K43546J5208m20027
34687A035663n82336j99345M08808O01572J22292n18499n60866L1619M29170M8361
34677H16439n32577l40660M92688P96832O0207p73521o66413P4118M21259J74824
$$ plain form
34749 1891711 1940331 1965182 1536998 1035448 1259541 1981154 2036368 1132240 411943 718669
34739 718669 1384985 1466590 1197183 1275016 1490915 1184209 560299 396752 687384 696918
34729 696918 301111 186707 588217 839217 496493 35317 -4754 171110 153118 50789
34719 50789 122912 197865 70111 73350 587421 1214743 1140376 272879 -574904 -723738 -350055
34708 -350055 -26589 29473 -1364 29961 61778 -13019 -191956 -377556 -478454 -488506 -453040
34697 -453040 -344826 -56510 406717 826520 1007728 1049181 1196936 1440482 1455690 1035663
34687 1035663 453327 253982 662790 1264362 1386654 868155 307289 338908 768078 816439
34677 816439 283862 -56798 435890 1232722 1292929 519408 -147005 -72887 348372 523196
34667E23196L14J71076K24992o0906k34685k0115J25227k07381n72568k68115
34657c18965N38442R14642L82295m80711p99779l90724K36876N93688N97966L51327
34647A625057p9155n10363n72993j09375M66371N38303L2471n05165o18557m07085
34637a40491j86581n3392J1199m2931j24399O9567N52091P72105K95534m54584
34627F98118o52789j56069L80461M33761J38564j59376l65085m94211m80150l15957
34617i72733j21116L2617J32574Q5931j28846k46572m4463K02894R3503j57093
34607a123304J8837N15250N56825o9721n78967l67593J09443J75627k3037K1776
34597g64864K29711K08255P5947K07127M30197K89095p0865r7213J70634J36098
$$ plain form
34667 523196 523510 694586 919578 858672 623987 603872 729099 521718 -50850 -318965
34657 -318965 219477 1134119 1516414 1035703 235924 -154800 82076 675764 1273730 1625057
34647 1625057 1545902 1035539 462546 353171 819542 1357845 1390316 885151 266594 -140491
34637 -140491 -327072 -380464 -369265 -412196 -536595 -467028 85063 857168 1152702 698118
34627 698118 45329 -110740 269721 703482 842046 682670 317585 -176626 -656776 -972733
34617 -972733 -1093849 -1061232 -928658 -842727 -971573 -1218145 -1262608 -1059714 -966211 -1123304
34607 -1123304 -1104467 -589217 -32392 -102113 -681080 -1048673 -939230 -763603 -786640 -764864
34597 -764864 -535153 -326898 -250951 -43824 386373 675468 604603 507390 678024 814122
34587H14122k81189m56093j38426R1023j83783m71287j60482M62157O04308J09994
34577C90344l63307k44543L09630P05980N51891n1660o53357q23468m99889k6776
34567g05155J80368K8032j85726q9656L36211O61111M48693j61935n20324k45270
34557b53651K83894M53592K13178q071k4998q3465l33129n51330m97113k09774
34547a010867J25774L17411J61785l24544o50638k95630M81811P90039K85621
34538a19238l08168k20465L02839M52465K9030m15005m32412j22196K36845M90231
34528a06074N10250K29005j40932k62309j20099p799m5104o6965l8875j57578
34518b06480l87021l24959J85283O63854N77772O3165l19717l57170k72294j68618
$$ plain form
34587 814122 532933 76840 -61586 29437 -154346 -625633 -786115 -323958 280350 390344
34577 390344 27037 -217506 92124 798104 1349995 1298335 644978 -178490 -678379 -705155
34567 -705155 -524787 -496755 -682481 -772137 -435926 225185 673878 511943 -8381 -253651
34557 -253651 30243 483835 697013 688942 663944 580479 247350 -303980 -801093 -1010867
34547 -1010867 -885093 -567682 -405897 -730441 -1381079 -1676709 -1194898 -404859 -119238
34538 -119238 -427406 -647871 -345032 107433 136463 -278542 -710954 -833150 -596305 -106074
34528 -106074 404176 633181 492249 229940 109841 102042 56938 -10027 -48902 -206480
34518 -206480 -593501 -918460 -733177 -69323 508449 571614 251897 -105273 -377567 -546185
34508e46185R9446M55930N06071J20157k74728k60782J3197J36934M0128o3183
34498B26985j28304k60519l43964j33923K64649M24011J95968p4491p4062P2328
34488A68678R8312N53p5786j14037j51829j17251L3898J59999J07553p5737k42433
34477b08080l16771k59743o2471J14676M6563j77072j73174J53792L90752K23319
34467b68209r0779j75840j11265j51699k03864n7241J31966R4361l5461L0447
34457h37584J68997O9032j69669k19304j21074j14609q1263J85404L80400J29283
34447f10387j84436M7423M53810J24488p36618q67499O5726Q50888O37754J64341
34437e4510K67098M12973j37027p36155l42194N91820P35852K8504l21387R6165
$$ plain form
34508 -546185 -446739 9191 515262 635419 360691 99909 113106 250040 290168 226985
34498 226985 98681 -161838 -505802 -639725 -375076 48935 244903 170412 96350 168678
34488 168678 266990 267543 191757 77720 -74109 -191360 -157462 2537 110090 34353 -208080
34477 -208080 -524851 -784594 -847065 -732389 -685826 -862898 -1036072 -882280 -491528 -268209
34467 -268209 -358988 -534828 -646093 -797792 -1001656 -1058897 -926931 -832570 -868031 -837584
34457 -837584 -668587 -599555 -769224 -988528 -1109602 -1224211 -1305474 -1120070 -739670 -610387
34447 -610387 -794823 -747400 -293590 -169102 -905720 -1773219 -1707493 -856605 -218851 -54510
34437 -54510 212588 625561 488534 -247621 -589815 2005 737857 766361 444974 541139
34427E41139L25678k02030p16616m42476K14587M85710L89469L35948K31499k27708
34417I35200p51067p05577p0061M45226K87863k97252o16183l15228K79133N60507
34407b47439L07463j44331l82222l41682j41551J86488N13436M67261p8012n82941
34397d43530m34593J74669N10028L37535Q5278m567j70537m53237m43648j6810
34387h59412K96829P8622l19646l11075J01178M46135M49577J98034j40198m11000
34377d70956m44776k17601N3078J50964R2217K9380Q4136L02714N58130N23776
34367F61062O0065m18396l90341j7929N8354k44985l00184J57155N30654L23643
34357D19098q5244j43196N867m1214j70796r8969l9912k75821m38033n3037M71535
$$ plain form
34427 541139 866817 664787 -51829 -494305 -279718 205992 595461 931409 1162908 935200
34417 935200 184133 -521444 -591505 -146279 141584 -155668 -771851 -1087079 -807946 -247439
34407 -247439 60024 -84307 -466529 -808211 -949762 -763274 -249838 217423 139411 -443530
34397 -443530 -878123 -703454 -193426 144109 229387 224820 54283 -398954 -842602 -859412
34387 -859412 -562583 -483961 -803607 -1114682 -1013504 -567369 -117792 80242 -59956 -470956
34377 -470956 -915732 -1133333 -1080255 -929291 -837074 -807694 -723558 -420844 137286 661062
34367 661062 721127 302731 -87610 -105539 -47185 -292170 -592354 -435199 95455 419098
34357 419098 333854 190658 196525 155311 -15485 -114454 -154366 -430187 -868220 -921257 -449722
34346d49722L39353k66615l06976M83385J040508M62019o85308j117913m52382
34337i53651M76758P07451J30043n63878o46243n9122N63069O14876J96455j14111
34327C51647p2046j532j86053m12205l21119O0881L88736M40212K76495M5159
34317E70175j86609l85495m40531j94360L32871P79227P00388J06963m47428m95777
34307C39424j88586L2244O8416J18823J65280k1759l72514m81409k02767J08512
34297d34336J32858L7345J55091M39319N00451J19415m40517o54510k70442L55893
34287e9433N67795J50133l99102n11850k37882M000J11002K62974L64883J17171
34277C69691l53388n33603l03230q6582o3671J24202N81270P30888J80327n28969
$$ plain form
34346 -449722 -110369 -376984 -683960 -200575 839933 1301952 616644 -501269 -953651
34337 -953651 -476893 230558 360601 -203277 -849520 -908642 -345573 269303 465758 351647
34327 351647 279601 278069 92016 -320189 -641308 -580427 -191691 248521 525016 570175
34317 570175 383566 -1929 -442460 -636820 -303949 475278 1175666 1282629 835201 339424
34307 339424 150838 183082 251498 370321 535601 513842 141328 -340081 -542848 -434336
34297 -434336 -301478 -264133 -109042 330277 830728 950143 509626 -144884 -415326 -59433
34287 -59433 508362 658495 259393 -252457 -490339 -486339 -375337 -112363 252520 369691
34277 369691 16303 -517300 -820530 -907112 -970783 -846581 -265311 465577 645904 116935
34267A16935o39737k38337M4519N3734J04271J81277l5606l80425k57978L50406
34257g00941P03138M16252N2512J53355L41302K9996m80653m42052P5463K61549
34247D09921q7719k35387J97625M90842m964o69363m84832L00542M58636k97075
34237G8226p86445j45220Q33673Q68450J7285n79213m22221j28769k11737l33406
34227h09377p3538K89757K51265j06053k45132P8401N50900O87027K92339l53449
34217E62140o95464m57453j1625P9034j21279l319N78599R29377M78334l52052
34207I86292p10417m01053R2936L79256L97826J20454l71235o26505k77181K93751
34197a15876L78135K1679p1950J95623N7840p33410j186451m74496O53659Q47207
$$ plain form
34267 116935 -522802 -761139 -716620 -662886 -558615 -377338 -412944 -793369 -1051347 -700941
34257 -700941 2197 418449 470961 624316 965618 995614 514961 72909 148372 409921
34247 409921 322202 86815 284440 775282 770318 100955 -383877 -83335 375301 78226
34237 78226 -708219 -853439 -19766 848684 865969 286756 -135465 -264234 -475971 -809377
34227 -809377 -882915 -593158 -341893 -447946 -693078 -614677 -63777 623250 915589 562140
34217 562140 -133324 -590777 -602402 -523368 -644647 -647966 -69367 860010 1338344 986292
34207 986292 275875 -125178 -32242 347014 744840 865294 494059 -132446 -409627 -115876
34197 -115876 262259 283938 211988 407611 465451 -267959 -1454410 -1928906 -1275247 -428040
34187d28040R5902m04486j48044J29835n2313j04395M10149P93482L21178m38586
34177A74682m32141K38049N51821K04418r4675N5690J93431k6138k53247k07454
34167D04436j84678l70452l96372o0785K05827J14052O7490L56557M97222R1173
34157G24470l14416r2348L14110J11617m21853l76759J87349L06101k49104o11151
34147d21984k91032J24513J03884l2380Q1377J68967j3730j15098J14281K63715
34137a7487K917k63574j06434J57162O1083j74869r7937J58252K12994J75138
34127A07245L06873L33669j09787o35360n50032J5846K71538L008j84046O8801
34117c72245L49884K40725n1923j19021Q2838L36589M43231K25463l42231q54481
$$ plain form
34187 -428040 -332138 -736624 -884668 -754833 -807146 -911541 -501392 292090 613268 174682
34177 174682 -257459 -19410 532411 736829 642154 697844 891275 865137 611890 404436
34167 404436 219758 -150694 -547066 -607851 -402024 -287972 -220482 136075 633297 724470
34157 724470 410054 317706 631816 743433 321580 -55179 132170 438271 189167 -421984
34147 -421984 -713016 -588503 -484619 -516999 -435622 -266655 -280385 -395483 -281202 -17487
34137 -17487 -14570 -278144 -384578 -227416 -166333 -341202 -439139 -280887 -67893 107245
34127 107245 414118 747787 638000 2640 -547392 -531546 -260008 -257000 -441046 -372245
34117 -372245 -22361 218364 166441 47420 130258 466847 910078 1135541 793310 -61171
34107f1171p63335j41222K87406J30049j15487J35024O03767N68788J3220l04737
34097C52302P126L86822J97126k90853l40953P9349K65076p2441l56853j54522
34087G2179P4431j88818n26273k46878L48790L64464j93126m08703k3825J51816
34077e75943k71560n24058m0776M91877L08631j06489J06342O70219O78511J52274
34067H89028j00740N9118k2950m99018p26349m39315j96789l34662l44419K35115
34057a480981R55902J019058L28032m38207o30167k52671J43254J05484j96369
34048d46665k43252M1640J93467N2430Q8392M66607N02025k28471q88048n03129
34038i65004M00124M90185k89420o63896q9509M69486J78343m43048n03559j5849
$$ plain form
34107 -61171 -824506 -965728 -678322 -548273 -663760 -528736 75031 643819 657039 352302
34097 352302 359428 746250 943376 652523 311570 390919 655995 583554 226701 72179
34087 72179 146610 -42208 -568481 -815359 -466569 -102105 -295231 -703934 -727759 -575943
34077 -575943 -847503 -1371561 -1412337 -920460 -611829 -718318 -611976 58243 736754 889028
34067 889028 788288 847406 824456 325438 -400911 -840226 -1037015 -1371677 -1716096 -1480981
34057 -1480981 -525079 493979 822011 383804 -246363 -499034 -355780 -250296 -446665
34048 -446665 -689917 -648277 -454810 -402380 -313988 152619 654644 426173 -461875 -965004
34038 -965004 -564880 -74695 -364115 -1028011 -1117520 -648034 -469691 -912739 -1416298 -1432147
34028a432147M34777N90202N20982K73967k4819j58573j91944l81012n71840l10228
34018a250635K97791N51453J97580k18109k68461j55180o7547J47730L91933K47073
34008a26372j71456j88985K50010L58323j08111l23797J45238M74583k585n65480
33998b58632l10966L09572L05231k03582l37258M0884L10238K26090M4622j76294
33988e0095m69624m75529M2593N42150M28722M2519K9540J97171l113l26636k02991
33977b45293O3158j93853o08517k64252O05305Q15930J46803l54452j48573Q9123
33967i4621j38423l48321j27348J62975K10458K42473K70943q9558o20553m56496
33957i88471M20566Q19908J66255m88739j63373M61957K75706l76414l69541K54787
$$ plain form
34028 -1432147 -997370 -407168 113814 387781 362962 204389 12445 -368567 -940407 -1250635
34018 -1250635 -952844 -401391 -203811 -421920 -690381 -845561 -913108 -765378 -373445 -126372
34008 -126372 -297828 -486813 -236803 121520 13409 -310388 -165150 309433 306848 -258632
33998 -258632 -569598 -260026 45205 -158377 -495635 -454751 -144513 81577 126199 -50095
33988 -50095 -519719 -995248 -952655 -410505 18217 60736 90276 287447 284334 -42302 -245293
33977 -245293 -182135 -375988 -984505 -1248757 -643452 172478 319281 -35171 -183744 -94621
33967 -94621 -233044 -581365 -708713 -545738 -335280 -92807 178136 88578 -531975 -988471
33957 -988471 -567905 252003 418258 -70481 -233854 228103 503809 127395 -242146 12641
33947A2641M26151j45098o10076m34027o8166R645j3333J59667M05100N10684
33937B53188N18285M91529L31833n58l66084o02783n75227j83665L58400M68222
33927F93140j05399p07888n11207K84530O96671M16712J78757M31909N44758p5006
33917A846977q17822p14982j588J93258l81377o99295r0596O93806O40824m1211
33907F27994l93498j77933L4882J4262J22099L68594J75073n93257j155111q42552
33897a819447Q051O45267Q15834O36690J67250l24563k67529L55923O14780j09849
33887G22407r89286q33659J03646N31892R7328k84572o9205K12703J35175N4338
33877c19233J64780j0923n91716p95344j61453N32200M02027j87767k83840J81305
$$ plain form
33947 12641 438792 293694 -316382 -750409 -818575 -808930 -822263 -662596 -257496 253188
33937 253188 771473 1263002 1594835 1594277 1228193 625410 50183 -133482 224918 693140
33927 693140 587741 -120147 -631354 -346824 349847 766559 945316 1377225 1921983 1846977
33917 1846977 1029155 314173 312585 505843 124466 -574829 -665425 28381 669205 627994
33907 627994 234496 56563 91445 105707 227806 596400 771473 178216 -976895 -1819447
33897 -1819447 -1811396 -1166129 -350295 286395 453645 129082 -138447 217476 832256 722407
33887 722407 -266879 -1100538 -996892 -465000 -367672 -652244 -721449 -508746 -373571 -319233
33877 -319233 -154453 -165376 -757092 -1552436 -1713889 -1181689 -779662 -967429 -1251269 -1069964
33867a069964M80920L05922K5475o0578J3448K13895M61363M04253j47956p11018
33857h4240o38689j9195M99483O14430M99969K11952l24118p74941n95823R9686
33847e11486N07090J86815l73659m95067j51004K02742K88339J92513J10353J48024
33837A04660K68397L05041J29146j57327l17658k55048m2575K45794N01788M57922
33827A240140o3017p35017r06057l44946M24349P02074L62035j29659l11621j63701
33817G4580J2094p588j48646j78568Q256K84948M31997L19371m417l06234l11910
33806A73883j2613K26918P8319k76494l58861o4446K30121K73567K35659K59513
33796G65566J71206j00429k36610k4743K11093R1503j97073k15343K5082J54743
$$ plain form
33867 -1069964 -589044 -283122 -257647 -318225 -304777 -90882 370481 774734 626778 -84240
33857 -84240 -722929 -742124 -242641 371789 871758 1083710 759592 -15349 -611172 -511486
33847 -511486 -4396 182419 -191240 -686307 -837311 -634569 -346230 -153717 -43364 104660
33837 104660 373057 678098 807244 649917 332259 77211 34636 280430 782218 1240140
33827 1240140 1177123 442106 -463951 -808897 -384548 317526 679561 549902 238281 74580
33817 74580 86674 79086 -69560 -248128 -239872 45076 477073 796444 792027 485793 173883
33806 173883 161270 388188 466507 190013 -168848 -233294 -3173 270394 506053 765566
33796 765566 936772 836343 599733 574990 786083 877586 680513 465170 490252 644995
33786F44995Q2973M1204P1388k8262k34428k39481L7144K57499J37134j69933
33776F00233l24119k57836k10854l54718n00288k92151K56397O10197L60431j27241
33766b39949j68941J98168K69563j38328l35272O6110M38868J98931j89397o5143
33756C4610K42128O1534l24289j82180K48192J16957m25425l70498L26279N14901
33746B42209j98431o87694j47922N88383M74275j10861k28706q480j66257n04953
33736g48437k21450N61495Q39730L05924k37209k10865j3464j19624k77704q2215
33726b03819K72029L26136O0621j81294k20819j30943K2070K07132L01023J90667
33716F42803l1901j49719q2761L9368N8445k9354q8781l2302M2442k2143j82011
$$ plain form
33786 644995 727968 769172 840560 812298 577870 338389 375533 633032 770166 600233
33776 600233 276114 18278 -192576 -547294 -1047582 -1339733 -1083336 -473139 -112708 -239949
33766 -239949 -408890 -210722 58841 -79487 -414759 -348649 90219 289150 99753 34610
33756 34610 276738 338272 13983 -168197 79995 196952 -228473 -598971 -272692 242209
33746 242209 43778 -643916 -791838 -203455 270820 159959 -68747 -77227 -243484 -748437
33736 -748437 -969887 -408392 431338 737262 500053 289188 275724 156100 -121604 -203819
33726 -203819 68210 394346 454967 273673 52854 -78089 -56019 151113 452136 642803
33716 642803 610902 461183 378422 417790 476235 446881 358100 325798 368240 346097 164086
33705A64086k05856k7520R8225l4889k20207j07133K46567M03316J59692j60892
33695C15389j65322Q2833K00724K5578k22762l06014k58150k06227r5068J80635
33685d48384M57864M22225Q9138j44158p4665J953j78207l41941j23169K41837
33675i7507K18052j46348k63904M2121K78863J36330m2371N5636J48082r7180
33665B31774m26961l93564l0542L05059M59235M42884J88407k29308m34541k34748
33655a22305M8932J26275J97871M06641L51996j87657n63095j57290M33942J77309
33645G12619o91708r34161k50642L20281J70970j3771L18996N40204K8704o12149
33635d10657n24792q327J00175j38534o5013K60829K12957j30940m2019N23851
$$ plain form
33705 164086 -41770 -69290 28935 -5954 -226161 -333294 -86727 316589 476281 315389
33695 315389 150067 232900 433624 459202 236440 -69574 -327724 -533951 -629019 -448384
33685 -448384 9480 431705 520843 376685 302020 303973 125766 -216175 -339344 -97507
33675 -97507 120545 -25803 -289707 -247586 31277 167607 125236 180872 328954 231774
33665 231774 -195187 -588751 -619293 -314234 145001 587885 776292 546984 112443 -122305
33655 -122305 -73373 52902 250773 657414 1009410 821753 258658 101368 535310 712619
33645 712619 20911 -913250 -1163892 -843611 -672641 -686412 -367416 172788 201492 -410657
33635 -410657 -935449 -943776 -843601 -982135 -1047148 -786319 -573362 -704302 -746321 -222470
33625b22470P46428K85212k07049k30648j62658l78043m91978j06277L48962K48405
33615a70116j91681k44594J97631N11489K89124j84302m43278l74687j45389N5191
33605g00612R0832n8290k20142j80034O5260L21089M13678K67776j07389n02737
33595f10569n22435j7562N74286O67031K73251o2680q1993r3566l01107l63449
33585e38793J3854M52843L78838r9546l32854q3287K10616J77276j7758j33787
33575B7402k76825n14276m86221J08811Q77061J101874O78323J89127K9026o0409
33565A673893m24382q85021r89286o21178r0656K56982L16307K07692J46640K44334
33555a64675L45332J90605j87919m33965l42888j39436j04789j67211j13084J4324
$$ plain form
33625 -222470 523958 809170 602121 371473 208815 -169228 -661206 -767483 -418521 -170116
33615 -170116 -361797 -606391 -408760 102729 391853 207551 -235727 -610414 -755803 -700612
33605 -700612 -609780 -668070 -888212 -1068246 -1002986 -681897 -268219 -443 -107832 -610569
33595 -610569 -1133004 -1150566 -576280 90751 364002 301322 219329 125763 -175344 -538793
33585 -538793 -524939 -72096 306742 207196 -125658 -208945 1671 178947 161189 27402
33575 27402 -249423 -763699 -1249920 -1141109 -264048 837826 1516149 1705276 1734302 1673893
33565 1673893 1249511 364490 -624796 -1245974 -1336630 -1079648 -763341 -555649 -409009 -164675
33555 -164675 180657 371262 183343 -250622 -593510 -732946 -837735 -1004946 -1118030 -1103706
33545a103706M7558N7061K01650L13717O5285m23466n64569o0626O33608Q40841
33535G353M54699l5820k10459j50568j62329k66952j93581J12029K66724J0306
33525a68598k37712R5689O88569N26085n56425j304215o82777N42527Q20836K2276
33515b53745n19765q8358N39538N54351K49336J29397n1415n54541q13471k84554
33505a093227M65475N07818l5224k92122m9402J21543l0152j61246j15761r6619
33495g78917o7999J67863L18058p6853o48008n17938K50234N76643L5177m73011
33485a214751k04560L05578K95547R677J6522Q3255k60967o26998l18815L87033
33475a528479N99233K47248R0968L49410L89970o4694m14547k05029J56140J37425
$$ plain form
33545 -1103706 -1056148 -999087 -797437 -483720 -418435 -841901 -1406470 -1467096 -833488 7353
33535 7353 462052 426232 215773 65205 -97124 -364076 -557657 -445628 -178904 -168598
33525 -168598 -406310 -310621 377948 904033 347608 -956607 -1639384 -1096857 -276021 -253745
33515 -253745 -773510 -861868 -322330 232021 481357 610754 559339 4798 -808673 -1093227
33505 -1093227 -627752 -119934 -155158 -447280 -496682 -375139 -405291 -566537 -682298 -778917
33495 -778917 -846916 -679053 -360995 -437848 -1085856 -1603794 -1353560 -776917 -741740 -1214751
33485 -1214751 -1419311 -1113733 -818186 -808509 -791987 -708732 -969699 -1596697 -1915512 -1528479
33475 -1528479 -929246 -681998 -591030 -241620 148350 83656 -330891 -535920 -379780 -242355
33465b42355j17271j77795m8K08740L71665M28345K41841m8018J0015N12229R10321
33454B097669P60389L41920J12446p397k70713m49007k26878M2746k33198q24693
33444A343284q69245j92397L59750J45691m22663o04293k90198J65699N24886
33435A60514O11744J99057n09123p49458j89331L78039Q6227o14050n62963K83232
33425i06112P39321K37923l37228j28323L99155L80498k4995p5464K07740J61694
33415F54209k73870m29520o1581K33386j5315m48351m46267O3202O32120P99046
33405G07059M15066k39304n90755l32977J44168K27501q2937k65478j41205n3851
33395b12713j44681j13856J11019J32987j79917l40685l2847K98035J28451l21305
$$ plain form
33465 -242355 -359626 -537421 -537469 -328729 42936 471281 713122 665104 675119 1187348 2097669
33454 2097669 2858058 3199978 3312424 3305027 3034314 2585307 2358429 2401175 2167977 1343284
33444 1343284 474039 281642 641392 787083 364420 -239873 -530071 -364372 160514
33435 160514 772258 971315 462192 -287266 -476597 -98558 -12331 -626381 -1189344 -906112
33425 -906112 -166791 71132 -266096 -394419 4736 385234 360239 284775 492515 654209
33415 654209 380339 -49181 -110762 122624 107309 -341042 -787309 -724107 -91987 707059
33405 707059 1122125 882821 292066 -40911 103257 330758 247821 -17657 -158862 -212713
33395 -212713 -357394 -471250 -360231 -227244 -407161 -747846 -780693 -482658 -354207 -675512
$$ [...]
##END NTUPLES=NMR SPECTRUM
##END=
