##TITLE=31Pdec_LR-741-RM5
 , 24 sc
 11.11.2021
##JCAMPDX= 6.0         $$ Bruker NMR JCAMP-DX V2.0
##DATA TYPE= NMR SPECTRUM
##DATA CLASS= NTUPLES
##ORIGIN= UXNMR, Bruker Analytische Messtechnik GmbH
##OWNER= root
$$ XWIN-NMR		Version 3.5
$$ Thu Nov 11 10:54:53 2021 Russian Standard Time (UT+4h)  she@DPX200
##.OBSERVE FREQUENCY= 81.013821
##.OBSERVE NUCLEUS= ^31P
##.ACQUISITION MODE= SIMULTANEOUS
##.ACQUISITION SCHEME= undefined
##.AVERAGES= 24
##.DIGITISER RES= 16
##SPECTROMETER/DATA SYSTEM= spect
##.PULSE SEQUENCE= zgpg30
##.SOLVENT NAME= Acetone
##.SHIFT REFERENCE= (INTERNAL, Acetone, 0, 248.564)
##AUDIT TRAIL= $$ (NUMBER, WHEN, WHO, WHERE, WHAT)
$$ ##TITLE= Audit trail, XWIN-NMR		Version 3.5
$$ ##JCAMPDX= 5.01
$$ ##ORIGIN= Bruker BioSpin GmbH
$$ ##OWNER= she
$$ F:/spectra/data/she/nmr/P31/1/pdata/1/auditp.txt
$$ ##AUDIT TRAIL=  $$ (NUMBER, WHEN, WHO, WHERE, WHAT)
(   1,<2021-11-11 10:53:18.07 +0400>,<she>,<DPX200>,
      <created by zg, POWCHK disabled, PULCHK disabled
       configuration hash MD5:
       00 E9 B6 7A A2 85 ED C7 34 08 36 98 17 FE 4E 26
       data hash MD5: 32K
       F3 49 F2 0F D0 D2 75 02 D7 CF 6B E7 31 BD B0 7A>)
(   2,<2021-11-11 10:53:48.95 +0400>,<she>,<DPX200>,
      <Start of raw data processing
       efp BC_mod = 2 LB = 1 FT_mod = 6 PKNL = 1 PHC0 = -8815.687 PHC1 = 72.26939 SI = 64K 
       data hash MD5: 64K
       06 37 87 F6 0E 1A 0B 23 E0 8C 56 45 81 C1 5F 62>)
(   3,<2021-11-11 10:54:14.35 +0400>,<she>,<DPX200>,
      <pk PHC0 = -3.73127 PHC1 = 5.6 
       data hash MD5: 64K
       0F A0 74 D6 A7 1C 90 0B CB F1 C3 E3 28 03 41 2D>)
(   4,<2021-11-11 10:54:20.43 +0400>,<she>,<DPX200>,
      <abs ABSG = 5 
       data hash MD5: 64K
       05 E8 46 A1 36 F1 26 DB 02 6B CA B4 9C 15 15 97>)
$$ ##END=
$$ 
$$ hash MD5
$$ 5F 9B CD B8 93 D2 9B 60 4A D6 B4 80 30 A3 BE A3
##$RELAX= 
##$RELAX= 
##$RELAX= 
##$RELAX= 
##$RELAX= 
##$RELAX= 
##$RELAX= 
##$RELAX= 
$$ Bruker specific parameters
$$ --------------------------
##$DU= <F:/spectra>
##$EXPNO= 1
##$NAME= <P31>
##$PROCNO= 1
##$TYPE= <nmr>
##$USER= <she>
##$AMP= (0..31)
100 100 100 100 100 100 100 100 100 100 100 100 100 100 100 100 100 100 
100 100 100 100 100 100 100 100 100 100 100 100 100 100 
##$AQSEQ= 0
##$AQ_mod= 1
##$AUNM= <au_zg>
##$AUTOPOS= <>
##$BF1= 81.014009
##$BF2= 200.13
##$BF3= 200.13
##$BF4= 200.13
##$BF5= 200.13
##$BF6= 200.13
##$BF7= 200.13
##$BF8= 200.13
##$BYTORDA= 1
##$CFDGTYP= 0
##$CFRGTYP= 5
##$CHEMSTR= <none>
##$CNST= (0..31)
1 1 145 1 1 1 1 1 1 1 1 1 1 1 1 1 1 1 1 1 1 1 1 1 1 1 1 1 1 1 1 1 
##$CPDPRG= <waltz16>
##$CPDPRG1= <>
##$CPDPRG2= <waltz16>
##$CPDPRG3= <>
##$CPDPRG4= <mlev>
##$CPDPRG5= <mlev>
##$CPDPRG6= <mlev>
##$CPDPRG7= <mlev>
##$CPDPRG8= <mlev>
##$CPDPRGB= <>
##$CPDPRGT= <>
##$D= (0..31)
0 1 0 0 0 0 0 0 0 0 0 0.03 2e-05 3e-06 0 0 0 0 0 0 0 0 0 0 0 0 0 0 0 0 
0 0 
##$DATE= 1636613597
##$DBL= (0..7)
120 120 120 11 120 120 24 19 
##$DBP= (0..7)
150 150 150 150 150 150 150 150 
##$DBP07= 0
##$DBPNAM0= <>
##$DBPNAM1= <>
##$DBPNAM2= <>
$$ [...]
##$SUBNAM3= <"">
##$SUBNAM4= <"">
##$SUBNAM5= <"">
##$SUBNAM6= <"">
##$SUBNAM7= <"">
##$SUBNAM8= <"">
##$SUBNAM9= <"">
##$SW= 501.771253377433
##$SWIBOX= (0..15)
0 1 3 0 0 0 0 0 0 0 0 0 0 0 0 0 
##$SW_h= 40650.406504065
##$TD= 32768
##$TD0= 1
##$TE= 0
##$TE2= 300
##$TE3= 300
##$TEG= 300
##$TL= (0..7)
0 120 53 12 22 120 120 120 
##$TP= (0..7)
150 150 150 150 150 150 150 150 
##$TP07= 0
##$TPNAME0= <>
##$TPNAME1= <>
##$TPNAME2= <>
##$TPNAME3= <>
##$TPNAME4= <>
##$TPNAME5= <>
##$TPNAME6= <>
##$TPNAME7= <>
##$TPOAL= (0..7)
0.5 0.5 0.5 0.5 0.5 0.5 0.5 0.5 
##$TPOFFS= (0..7)
0 0 0 0 0 0 0 0 
##$TUNHIN= 0
##$TUNHOUT= 0
##$TUNXOUT= 0
##$USERA1= <user>
##$USERA2= <user>
##$USERA3= <user>
##$USERA4= <user>
##$USERA5= <user>
##$V9= 5
##$VALIST= <valist>
##$VCLIST= <CCCCCCCCCCCCCCC>
##$VD= 0
##$VDLIST= <DDDDDDDDDDDDDDD>
##$VPLIST= <PPPPPPPPPPPPPPP>
##$VTLIST= <TTTTTTTTTTTTTTT>
##$WBST= 1024
##$WBSW= 4
##$XGAIN= (0..3)
0 0 0 0 
##$XL= 0
##$YL= 0
##$YMAX_a= 17688
##$YMIN_a= -21346
##$ZGOPTNS= <>
##$ZL1= 120
##$ZL2= 120
##$ZL3= 120
##$ZL4= 120
##$ABSF1= 248.5645
##$ABSF2= -253.2056
##$ABSG= 5
##$ABSL= 3
##$ALPHA= 0
##$AQORDER= 0
##$ASSFAC= 0
##$ASSFACI= 0
##$ASSFACX= 0
##$ASSWID= 0
##$AUNMP= <proc_1d>
##$AZFE= 0.1
##$AZFW= 0.5
##$BCFW= 0
##$BC_mod= 2
##$BYTORDP= 0
##$COROFFS= 0
##$CY= -3
##$DATMOD= 1
##$DC= 0
##$DFILT= <>
##$DTYPP= 0
##$F1P= 0
##$F2P= 0
##$FCOR= 1
##$FTSIZE= 65536
##$FT_mod= 6
##$GAMMA= 0
##$GB= 0
##$INTBC= 1
##$INTSCL= 5.30512e-09
##$ISEN= 30
##$LB= 1
##$LEV0= 0
##$LPBIN= 0
##$MAXI= 10000
##$MC2= 0
##$MEAN= 0
##$ME_mod= 0
##$MI= 50
##$NCOEF= 0
##$NC_proc= -5
##$NLEV= 6
##$NOISF1= 182.463
##$NOISF2= 159.3651
##$NSP= 0
##$NTH_PI= 0
##$NZP= 0
##$OFFSET= 248.5645
##$PC= 4
##$PHC0= -8819.418
##$PHC1= 77.86938
##$PH_mod= 1
##$PKNL= yes
##$PPARMOD= 0
##$PSCAL= 0
##$PSIGN= 0
##$REVERSE= no
##$SF= 81.014009
##$SI= 65536
##$SIGF1= 159.3651
##$SIGF2= -187.1042
##$SINO= 113.3802
##$SIOLD= 16384
##$SREGLST= <1H.CDCl3>
##$SSB= 0
##$STSI= 65536
##$STSR= 0
##$SW_p= 40650.406504065
##$SYMM= 0
##$S_DEV= 0
##$TDeff= 32768
##$TDoff= 0
##$TI= <>
##$TILT= no
##$TM1= 0
##$TM2= 0
##$TOPLEV= 0
##$USERP1= <user>
##$USERP2= <user>
##$USERP3= <user>
##$USERP4= <user>
##$USERP5= <user>
##$WDW= 1
##$XDIM= 65536
##$YMAX_p= 386265102
##$YMIN_p= -60086730
$$ End of Bruker specific parameters
$$ ---------------------------------
##NTUPLES= NMR SPECTRUM
##VAR_NAME=  FREQUENCY,     SPECTRUM/REAL,   SPECTRUM/IMAG
##SYMBOL=    X,             R,               I
##VAR_TYPE=  INDEPENDENT,   DEPENDENT,       DEPENDENT
##VAR_FORM=  AFFN,          ASDF,            ASDF
##VAR_DIM=   65536,         65536,           65536
##UNITS=     HZ,            ARBITRARY UNITS, ARBITRARY UNITS
##FACTOR=    0.620285442955139, 1,           1
##FIRST=     20137.2065510759, 0,            0
##LAST=      -20513.1999529892, 0,           0
##MIN=       -20513.1999529892, -60086730,   0
##MAX=       20137.2065510759, 386265102,    0
$$ Real data points
##PAGE= N=1
##DATA TABLE= (X++(R..R)), XYDATA
$$ [...]
41565 -605368 -858621 -394943 261022 327876 -158809 -512872 -372878 21499 366766 582351
41555 582351 616772 445542 276595 351152 523025 429848 107081 -6719 208576 269381
41545 269381 -220723 -938627 -1245360 -1016109 -693056 -589036 -532151 -290456 2782 111655
41535 111655 162616 459799 877258 880876 322469 -211411 -198336 21035 -232549 -876659
41525 -876659 -1163340 -843060 -485083 -464339 -412732 -92649 -61888 -760448 -1484731 -1172092
41515 -1172092 32447 892390 750407 235863 127140 296890 212425 -87072 -76876 436829
41505 436829 1051373 1277602 1043366 680906 539961 622004 610517 322821 14907 35881
41495 35881 291091 371420 183857 72401 244398 455028 406511 109626 -338815 -973094
41485 -973094 -1652672 -1849929 -1186115 -73784 601273 500633 201370 384716 917400
41476 917400 1043474 416905 -418991 -750911 -611780 -619762 -1024296 -1387089 -1300708 -944319
41466 -944319 -662027 -419766 -79198 147108 28087 -144557 72944 488950 467429 -92970
41456 -92970 -568009 -521446 -276924 -354307 -750437 -1034319 -881110 -334471 244392 410729
41446 410729 49654 -435115 -597320 -521829 -558020 -614386 -274592 382439 693568 298913
41436 298913 -405944 -855634 -842371 -359052 448987 980932 537482 -653061 -1412812 -1070314
41426 -1070314 -346626 -278039 -829398 -1212650 -1109564 -844926 -638119 -400580 -146603 -3140
41416 -3140 116615 363281 577309 504241 252093 103025 11025 -276477 -724649 -1060351
41406 -1060351 -1191597 -1184481 -979179 -551398 -207205 -264071 -526896 -486643 36787 782894
41396 782894 1423970 1698871 1387408 585583 -150046 -346268 -156466 -14106 -3303 8488
41386 8488 -66676 -291862 -306620 187672 752362 701575 133912 -214608 -67959 139687
41376 139687 91280 -29760 -33226 33149 184356 456961 567981 224296 -266782 -367828
41366 -367828 -225901 -420131 -811635 -591753 349580 1068633 930969 442025 277054 329611
41356 329611 275215 297053 575969 706344 352279 -11342 269112 1032068 1593515 1698226
41346 1698226 1551640 1221212 678327 225427 227748 508728 550291 221887 -149373 -340220
41336 -340220 -421662 -459484 -418972 -324178 -213780 -32939 189575 236336 21598 -214773
41326 -214773 -285207 -327538 -420400 -311079 84607 309204 -14278 -538749 -716271 -630458
41316 -630458 -693079 -823823 -655970 -338870 -339659 -541853 -356514 251869 657234 592630
41306 592630 470468 479263 182982 -603334 -1278768 -1310254 -1028466 -1013145 -1177847 -1086921
41296 -1086921 -805477 -745031 -859589 -671912 -80711 449242 601148 615567 793317 972069
41286 972069 780253 211408 -321117 -463135 -297313 -220591 -493446 -932973 -1094782 -796715
41276 -796715 -387057 -369804 -792798 -1182492 -1153130 -915951 -996147 -1497334 -1890316 -1645023
41266 -1645023 -888995 -215116 69711 187113 333701 259788 -307778 -1051491 -1294038 -847591
41256 -847591 -274669 -180204 -523636 -824600 -841884 -783503 -911695 -1179194 -1306219 -1091321
41246 -1091321 -599702 -111104 103075 9968 -165777 -194360 -89931 -31276 -54875 28807
41236 28807 335706 647556 623519 260615 -29124 117413 583522 913839 823512 449264
41226 449264 112877 -43866 -136260 -305510 -496770 -540358 -455079 -517546 -853105 -1070270
41216 -1070270 -660546 166132 474242 -249274 -1266031 -1386713 -453494 494109 529017
41207 529017 -191781 -862521 -954157 -508069 73335 270487 -174032 -861784 -1036281 -508675
41197 -508675 71884 143633 -5596 180171 608225 812695 847685 1141412 1533635 1284865
41187 1284865 260999 -614426 -529755 110316 287241 -240199 -729285 -545608 75609
41178 75609 480932 428666 226899 221740 397820 509381 468580 458495 606558 673982 310862
41167 310862 -340783 -599704 -54867 781349 1016851 515903 21683 29249 67876 -486162
41157 -486162 -1294350 -1422654 -724421 -144981 -446656 -1220529 -1530774 -1088714 -344558 236633
41147 236633 484279 357187 16626 -62587 425486 1086927 1254244 857973 365303 -23573
41137 -23573 -451919 -725416 -390204 315177 443860 -289229 -891371 -453024 537719 1003138
41127 1003138 872494 944406 1431676 1634951 1102328 257270 -329271 -589043 -622766 -344523
41117 -344523 185216 565606 583870 561466 789946 937478 456061 -588213 -1490560 -1664016
41107 -1664016 -1144363 -410697 31292 -54095 -465682 -683825 -395723 83617 164181 -218760
41097 -218760 -478439 -195213 283725 391361 217895 319885 718740 722149 -20686 -846001
41087 -846001 -920244 -368818 7571 -96240 -240010 -76179 215060 398528 493885 460901
41077 460901 116516 -448523 -869396 -1078805 -1328624 -1490900 -1044279 -78097 452784 21455
41067 21455 -605151 -485982 98766 199391 -316900 -765808 -840227 -822529 -732603 -271472
41057 -271472 325738 347360 -258908 -669971 -416746 -27808 -38617 -111273 284942 901445
41047 901445 1090528 806267 585227 688529 811387 633506 256447 30753 172328 577156
41037 577156 903820 882027 601055 390478 384609 382944 195477 -100521 -357267 -583839
41027 -583839 -809760 -894388 -670163 -205875 212104 357140 289363 310944 626257 1005716
41017 1005716 961084 397117 -138940 -128993 210571 275863 -43925 -315977 -308363 -226685 -162798
41006 -162798 113859 614198 881392 592770 57620 -179223 22972 393090 663554 783425
40996 783425 854850 966435 989390 612259 -191109 -879853 -935759 -612939 -564399 -789717
40986 -789717 -640287 47144 590650 513822 220447 195619 210748 -113372 -515273 -512378
40976 -512378 -197521 19993 141088 424144 774616 893596 816942 735983 517319 9739
40966 9739 -402475 -249905 167508 121158 -403322 -685413 -459125 -314160 -665669 -1084374
40956 -1084374 -1072328 -864956 -907218 -1013434 -701353 -89018 218353 80101 37655 452606
40946 452606 944879 971692 596550 302202 247020 146623 -130448 -291014 -108616 161911
40936 161911 153389 -59720 -132770 -54975 -175336 -597961 -927828 -776151 -257088 203374
40926 203374 379462 385525 400699 421494 315622 81269 -17064 297407 907496 1359031
40916 1359031 1412095 1264889 1091214 753980 273304 112010 491615 861690 718141 539616
40906 539616 1032245 1750143 1562075 415830 -531913 -653885 -501864 -460998 -85822 669332
40896 669332 860133 36495 -788562 -598437 178034 652506 920801 1382416 1559124 946439
40886 946439 281755 507299 1090335 917881 326909 503250 1186753 908406 -440386
40877 -440386 -1221592 -642264 90774 -87500 -458446 -15077 748500 711230 -145173 -953863
40867 -953863 -1237984 -1083505 -632928 -179454 -215974 -718739 -940800 -508031 -67074 -212524
40857 -212524 -488192 -225974 275921 287758 -143219 -385275 -240254 27674 343677 745686
40847 745686 949970 701616 305796 195980 270846 223327 136792 157458 32184 -360610
40837 -360610 -514921 -83977 352902 168333 -193892 5921 390161 56966 -704414 -669961
40827 -669961 330437 1027383 601747 -226759 -438990 -40036 353983 417397 126823 -405910
40817 -405910 -704942 -236003 691841 1064801 582620 139509 417289 844945 635050 105572
40807 105572 107226 641355 931985 600014 -4283 -471657 -675120 -572581 -262201 -134654
40797 -134654 -440631 -807037 -685437 -179431 92881 -86330 -266152 -21596 493448 781471
40787 781471 531301 -106309 -601404 -500445 46709 426210 386648 340840 541466 476623
40777 476623 -307039 -1203320 -1211725 -425752 45434 -325033 -858889 -861713 -565984 -467237
40767 -467237 -475999 -323028 -241706 -574761 -1062953 -1176567 -941750 -838863 -995079 -1037420
40757 -1037420 -740240 -342717 -153966 -190412 -265529 -195025 77454 359638 319847 -68634
40747 -68634 -390963 -380096 -343113 -548127 -525243 282094 1330889 1392600 325495 -513334
40737 -513334 -91643 899440 1152209 547917 -33832 -226210 -449680 -852535 -1023128 -854448
40727 -854448 -765343 -828332 -538835 193304 634853 308527 -237561 -343403 -274237 -604194
40717 -604194 -1098470 -1099970 -688208 -488619 -482834 -36899 801676 1057213 230712 -915886
40707 -915886 -1479099 -1578929 -1789414 -2035156 -1846708 -1333084 -1063643 -1110446 -964116 -437704
40697 -437704 -1077 -64133 -445976 -744422 -815702 -697498 -412025 -57634 159031 141361
40687 141361 -40166 -350602 -784148 -1136248 -1128624 -829578 -589892 -495603 -312344 -64287
40677 -64287 -123085 -497024 -629807 -300005 -131999 -631871 -1218634 -968691 -1413 698002
40667 698002 680504 428332 380317 403746 355634 374217 390943 89946 -379347 -377203 215758
40656 215758 699701 662159 608353 954556 1179104 716608 19583 -157558 1500 -184055
40646 -184055 -635661 -757737 -641149 -863748 -1204446 -796419 310813 971849 674476
40637 674476 281990 509036 760497 276189 -494622 -642960 -265837 -141474 -349109 -250213
40627 -250213 321629 797695 804333 556574 263030 -129921 -472536 -377073 113880 397505
40617 397505 138109 -248588 -255995 -27105 -43518 -346911 -503248 -252029 191713 528532
40607 528532 747967 925910 866207 288844 -608242 -1132849 -870080 -206560 226098 374805
40597 374805 576822 773731 587662 142226 19483 233810 83965 -613543 -1011545 -550601
40587 -550601 26286 -186251 -780261 -723868 -33433 405956 419193 685720 1303059 1448182
40577 1448182 757607 -38392 -282641 -251325 -365156 -411012 -148907 47259 -165581 -396115
40567 -396115 -145873 313270 362235 -6718 -301613 -360317 -455952 -694829 -828958 -642597
40557 -642597 -181877 324392 532253 163344 -607080 -1147501 -1038159 -555734 -261404 -347778
40547 -347778 -634368 -925411 -1072341 -922048 -489697 7210 450895 870420 1083337 771476
40537 771476 128565 -150702 109196 174468 -454878 -1141653 -1064306 -526155 -407078 -670055
40527 -670055 -455851 404184 985491 593836 -309741 -828745 -684473 -230210 146005 329987
40517 329987 457266 749860 1198344 1421872 1091938 413538 -108857 -258685 -146082 120321
40507 120321 375291 252871 -354096 -882611 -749565 -241062 -76261 -234531 -28596 668282
40497 668282 1137091 914606 384485 39155 -102331 -79716 252899 709164 707092 133318
40487 133318 -341914 -213741 169435 248230 991 -332815 -670696 -820898 -452652 181732
40477 181732 180363 -734643 -1525575 -1174017 -162738 222623 -339236 -1034874 -1242842 -1102565
40467 -1102565 -844492 -436671 -2714 126534 -48650 -149083 -27061 42139 -145160 -466756
40457 -466756 -764593 -986120 -1016982 -768790 -434823 -269884 -152298 203190 630796 612692
40447 612692 53613 -518452 -658729 -504232 -400727 -372628 -169625 351836 1010710 1362036
40437 1362036 1037084 201585 -458839 -470802 -135545 -45004 -240205 -301938 -126280 -46665
40427 -46665 -202191 -353403 -407840 -583027 -889837 -974236 -717365 -537349 -778822 -1155806
40417 -1155806 -1143735 -683166 -169522 107003 213453 305872 334498 106741 -384750 -786631
40407 -786631 -703633 -224345 129579 121435 131316 485399 836372 698977 281279 136015
40397 136015 201836 -25231 -433335 -309681 407280 779616 196161 -704390 -997135 -741878
40387 -741878 -610816 -686173 -412760 388907 1149547 1283018 844758 331067 92628 61277
40377 61277 -60308 -394285 -700831 -697533 -500422 -477687 -659849 -662872 -313284 36392 25794
40366 25794 -228699 -417050 -481925 -503572 -434060 -254370 -151719 -246419 -365206 -353791 -369907
40355 -369907 -580325 -814354 -830909 -703896 -621912 -512812 -191647 293817 746029 1045793
40345 1045793 1056104 602373 -128064 -513937 -273438 2542 -363157 -1063564 -1181694 -534514
40335 -534514 55213 -84659 -676496 -1058635 -1019178 -769042 -493043 -276876 -230427 -376378
40325 -376378 -552596 -625742 -661461 -721426 -666844 -381433 -64367 -40050 -292655 -432479
40315 -432479 -216412 81251 7762 -432161 -729121 -525435 -77223 122198 -27287 -252436
40305 -252436 -381837 -424563 -282873 137817 519316 343094 -351216 -898954 -889436 -634504
40295 -634504 -533802 -499108 -353879 -296592 -504101 -685411 -513338 -148740 116245 339298
40285 339298 551609 359260 -412985 -1063556 -784835 153966 790982 842953 825295 926878
40275 926878 769311 385619 412528 951463 1143712 420436 -542089 -740503 -183847 332219
40265 332219 415164 372882 492631 622263 502614 122920 -323892 -600562 -503738 40106
40255 40106 879785 1669950 2027828 1769535 1123106 636321 697829 1176593 1634687 1747806
40245 1747806 1385112 580702 -256959 -435100 229257 953127 895811 294030 131 92211
40235 92211 -143658 -839596 -1177947 -701819 -69487 -20265 -374262 -612806 -744792 -956069
40225 -956069 -1003819 -668694 -343302 -472325 -781491 -735485 -434669 -377180 -593018 -690479
40215 -690479 -570853 -456537 -370877 -220165 -256878 -802479 -1547939 -1751884 -1193607 -427773
40205 -427773 -40152 -79786 -261808 -353646 -329091 -403565 -821702 -1373083 -1392401 -614286
40195 -614286 292902 541272 250014 63466 78230 -77238 -329823 -242224 54340 -36207
40185 -36207 -440825 -357232 407124 978492 734068 218940 175888 404432 276754 -190978
40175 -190978 -518495 -592750 -612266 -516738 -149224 248974 341150 290759 436766 575368
40165 575368 248750 -372677 -628092 -387456 -213242 -395686 -544086 -386128 -302838 -655459
40155 -655459 -1099739 -1060880 -550129 -54529 133874 58006 -216306 -607888 -845395 -698482
40145 -698482 -311447 38992 387683 873166 1223936 1001252 353169 -65480 -53253 -128995
40135 -128995 -573360 -840158 -416740 256939 400855 83227 32626 407842 557889 93993
40125 93993 -522551 -704027 -461902 -130537 128551 251670 159219 13533 151391 472846
40115 472846 391063 -254065 -768597 -571852 -72898 31076 -139017 -10270 310193 169459
40105 169459 -480999 -961609 -944836 -820533 -821533 -607191 -37801 364960 165992 -354321
40095 -354321 -748564 -1045955 -1375465 -1445908 -994353 -413382 -322704 -694158 -933119 -722276
40085 -722276 -315407 -59360 -47284 -214610 -408052 -383671 -74055 175027 -23948 -506578
40075 -506578 -689378 -342389 107376 166361 -105449 -257881 -85734 114044 -45459 -482181
40065 -482181 -672138 -336333 81398 -59788 -666711 -974240 -627999 -143845 130 110440
40055 110440 548855 799621 137054 -1028031 -1456869 -806535 -117119 -283141 -872958
40046 -872958 -961005 -455828 27017 141738 13593 -228137 -506890 -584788 -345321 -146927
40036 -146927 -380291 -800521 -828195 -430693 -154693 -293454 -564668 -672127 -661571 -595627
40026 -595627 -370664 -45320 80968 -71593 -199073 -101712 32988 20130 -49276 -149567
40016 -149567 -509386 -1147085 -1611371 -1574763 -1365734 -1494061 -1905303 -2129056 -1956692 -1560507
40006 -1560507 -1132756 -812533 -769708 -935602 -878011 -436932 -234579 -904540 -1965044 -2232701
39996 -2232701 -1400271 -425056 -152553 -326096 -339248 -251622 -454106 -826788 -922490 -736504
39986 -736504 -665225 -807906 -870343 -757448 -758543 -1028432 -1269024 -1117276 -626047 -188335
39976 -188335 -88400 -239874 -331177 -168695 143078 357491 353423 175242 -105270 -410667
39966 -410667 -613899 -682753 -811239 -1158858 -1523481 -1582004 -1384533 -1212545 -1012240 -504154
39956 -504154 126294 305083 2493 -122742 176001 257557 -261605 -651144 -144842 730480
39946 730480 875881 288300 -51714 192318 290223 -233231 -848165 -914492 -533016 -136962
39936 -136962 95906 55518 -448828 -1216364 -1569072 -1203953 -691003 -654557 -854398 -617931
39926 -617931 86987 588187 444259 -38980 -296595 -178775 12701 18835 -12860 240244
39916 240244 695577 769613 116908 -724749 -856466 -154212 566607 582904 14960 -567718
39906 -567718 -829245 -755491 -483957 -303868 -477356 -829788 -861344 -472948 -179277 -337729
39896 -337729 -599142 -491697 -157627 -53095 -212380 -298876 -193036 -59499 43483 169091
39886 169091 163359 -213548 -803670 -1051619 -624465 161954 641619 459774 -79745 -332368
39876 -332368 -45967 296802 79380 -581718 -947088 -659057 -164823 28047 11553 71453
39866 71453 83122 -222682 -691212 -899311 -704246 -304394 29966 1451 -613193 -1530522
39856 -1530522 -1953249 -1443339 -536115 -54932 -116342 -291262 -405048 -550970 -563318 -185503
39846 -185503 333791 457427 125529 -269936 -570790 -874636 -964810 -461538 410188 917099
39836 917099 802599 512393 321465 -38269 -650658 -1031128 -839125 -399757 -143484 -18068
39826 -18068 203478 496005 779401 1082554 1226264 855922 106754 -325897 -171669 -51933
39816 -51933 -470533 -943106 -797793 -322915 -284900 -633488 -598911 14864 511375 390079
39806 390079 4700 -105554 60113 207493 247560 236986 156954 30980 2726 62422
39796 62422 -70451 -561596 -1145691 -1407622 -1232671 -794773 -248480 343917 858374 1106044
39786 1106044 1013909 701283 368875 174086 181699 337177 468562 385591 38253 -416923
39776 -416923 -731098 -763748 -577054 -345208 -206855 -215857 -366967 -599817 -816564 -960709
39766 -960709 -1028072 -950770 -617397 -164699 -69430 -622965 -1388212 -1592748 -1118134 -656323
39756 -656323 -710492 -913337 -690635 -188077 2709 -183284 -200799 212893 617184 522119
39746 522119 52487 -304616 -365212 -395148 -683985 -1147305 -1360568 -980091 -165568 510323
39736 510323 691608 618466 640700 559781 -64957 -996714 -1332982 -695013 130632 190984
39726 190984 -378009 -657524 -283195 168160 129743 -226146 -404479 -254218 62857 408561
39716 408561 655781 607807 261149 -38997 -14411 141107 85775 -115417 -150211 -47754
39706 -47754 -127898 -362222 -295226 245795 817695 982631 868360 797963 709975 357832
39696 357832 -146418 -438354 -454833 -480586 -666974 -851066 -865266 -731538 -527408 -309402
39686 -309402 -168815 -132728 -46578 201250 412065 332341 100617 69437 208132 104766
39676 104766 -373396 -832325 -895698 -637720 -329130 -86731 74963 157680 274185 510025
39666 510025 616738 273851 -225529 -111630 741382 1395734 1038470 130658 -239845 169614
39656 169614 619980 566293 245351 38499 -93475 -298896 -443152 -343228 -95765 118145
39646 118145 370309 850087 1439014 1639011 1041725 -139274 -1107610 -1199898 -562801 50349
39636 50349 163299 595 -32567 68682 83721 11387 2622 44650 24278 -53193 -170750
39625 -170750 -415110 -704491 -666926 -157588 357188 370254 71661 34401 341280 551499
39615 551499 417102 94148 -274801 -628680 -686220 -169728 627470 1041384 873593 541656
39605 541656 378218 299348 187209 64085 -122965 -342962 -183694 596650 1302061 982759
39595 982759 -43254 -387063 408709 1161687 884010 245494 366345 1057803 1333618
39586 1333618 1047946 874632 999785 950815 619799 457790 600028 646147 430712 282816
39576 282816 350983 282963 -219749 -980319 -1607201 -1815384 -1476263 -732537 -57300 159497
39566 159497 37296 -91198 -215730 -475876 -673914 -490719 -44359 290480 474539 681298
39556 681298 769462 492413 71452 -96661 -134170 -354963 -437813 162096 1052198 1199873
39546 1199873 520590 98545 503719 947034 632755 -37661 -343931 -501105 -1127198
39537 -1127198 -1993709 -2234375 -1575152 -622996 -37964 36446 -169721 -321163 -203674 16948
39527 16948 -54419 -424168 -586545 -280239 62135 -21321 -350298 -527715 -601102 -784113
39517 -784113 -902480 -698320 -406244 -461532 -836283 -1152594 -1240435 -1131562 -760033 -151317
39507 -151317 340979 461830 455402 586840 610345 247793 -174686 -209177 -72683 -241468
39497 -241468 -546976 -458333 -51905 131311 57952 163805 398962 225503 -343779 -593617
39487 -593617 -221438 179058 50653 -365545 -506622 -200299 318719 636676 326012 -567426
39477 -567426 -1182411 -669882 567298 1222443 804073 167512 95917 268647 85180 -336386
39467 -336386 -589102 -716894 -890208 -900956 -587597 -285949 -305655 -416658 -360572 -366817
39457 -366817 -624432 -772128 -523699 -297327 -551409 -941583 -845284 -344400 14238 81946
39447 81946 29679 -232011 -794523 -1221558 -1060605 -624986 -500204 -565799 -357467 -107653
39437 -107653 -419620 -1069652 -1219777 -808120 -607238 -780502 -566196 253076 724157 174849
39427 174849 -678581 -819389 -352959 -45290 -56688 15590 256971 421833 526885 709088
39417 709088 696290 156231 -541644 -646102 -117485 283747 130172 -78806 267280 973193
39407 973193 1332110 1068028 599605 433919 584969 656475 354882 -192620 -621170 -735607
39397 -735607 -649072 -561066 -547346 -593594 -669049 -679048 -489999 -116568 235035 421359 535357
39386 535357 702936 843620 812313 686013 700095 909640 1086808 1003002 717880 531176
39376 531176 656249 949194 1006969 611025 35769 -225696 -41548 231204 234633 10488
39366 10488 -189677 -276900 -325577 -364117 -373881 -390740 -413618 -308435 -4669 307376 411793
39355 411793 421250 595061 807262 559114 -301641 -1151294 -1185920 -363748 515609 691747
39345 691747 185148 -410612 -659395 -604466 -470924 -331786 -160246 -14845 22208 30342
39335 30342 190594 512346 755603 702702 432590 227650 209204 147534 -278510 -1014773
39325 -1014773 -1524319 -1289839 -430964 335515 446421 92568 -63699 290479 739307
39316 739307 616951 -221113 -1179799 -1501552 -1035341 -333948 48337 156154 326601 497645
39306 497645 281449 -282075 -588437 -296869 186648 364835 322732 335858 276542 -8687
39296 -8687 -122907 345812 959106 919829 340341 153436 689038 1228917 1216778 1023916
39286 1023916 1066742 968964 253443 -720435 -1211132 -1090814 -757432 -402599 -16018 162409
39276 162409 -116583 -573261 -733540 -680779 -838166 -1091931 -852554 -63775 556499 535483
39266 535483 312336 522168 1079910 1436559 1444741 1441107 1546203 1401538 794304 180601
39256 180601 184227 661027 733836 -30386 -890710 -850137 -53950 393612 -781 -490625
39246 -490625 -291557 318041 606492 507399 471620 611774 681944 631675 531017 206366
39236 206366 -369799 -588370 108420 1213337 1659569 1246639 689778 313062 -267656
39227 -267656 -1033097 -1262270 -757402 -333414 -501405 -612329 -57371 535520 251134 -611846
39217 -611846 -1034950 -853964 -759272 -937007 -813817 -223000 164653 -130554 -693026 -899467
39207 -899467 -751529 -648609 -716799 -715541 -426347 61699 366624 139444 -467555 -823498
39197 -823498 -593093 -248945 -367780 -678348 -481192 125111 292738 -202764 -552225 -240087
39187 -240087 83898 -309441 -968739 -922223 -176519 329657 104734 -399215 -688213 -844858
39177 -844858 -1032342 -1032925 -658642 -201170 -89861 -340800 -627214 -692511 -452104 92733
39167 92733 734011 999804 574463 -228933 -709106 -555903 -162474 -68134 -307694 -497135
39157 -497135 -422871 -287622 -368149 -654879 -926492 -1016758 -876805 -513723 -54661 220138
39147 220138 138078 -98499 -142928 -7767 -54838 -401136 -658411 -491070 -162604 -173626
39137 -173626 -499525 -604795 -235787 199632 217062 -86210 -239872 -104647 -45112 -394809
39127 -394809 -1011794 -1471000 -1512684 -1149179 -481192 332202 949258 997087 492185 -98653
39117 -98653 -383849 -429058 -416856 -220731 265942 596732 197623 -658144 -983452 -418598
39107 -418598 223521 161485 -251906 -261018 13341 -102066 -554064 -619156 -204493 -76749
39097 -76749 -565709 -977564 -730557 -251293 -148785 -187584 174761 719576 754667 216952
39087 216952 -273895 -368213 -320324 -379031 -445662 -407455 -310070 -119724 250198 613714 631504
39076 631504 323987 72010 44816 26986 -103701 -127388 156171 641222 1075752 1202988
39066 1202988 757369 -246475 -1181564 -1275339 -558225 132201 246382 74976 -10326 -202197
39056 -202197 -675700 -942748 -466760 417566 882591 721356 440616 346132 190159 -230896
39046 -230896 -707375 -973019 -978621 -722148 -244480 131462 33656 -362918 -457646 -114672
39036 -114672 80230 -269771 -700328 -533749 182111 834739 1059654 937294 620593 261613
39026 261613 143263 373836 549327 230496 -310738 -380544 94873 419899 141499 -397187
39016 -397187 -737440 -920537 -1058571 -882237 -263696 258943 116856 -421378 -645346 -433704
39006 -433704 -212940 -58227 367901 959160 1064899 490800 -86686 -46434 402263 719496
38996 719496 775759 684375 376117 -172438 -646137 -787837 -786297 -860316 -799892 -385920 65914
38985 65914 120951 -70175 -38903 221770 298517 44125 -292769 -500202 -485171 -104147
38975 -104147 551622 887075 427407 -432948 -935829 -1050409 -1322704 -1763669 -1785470 -1310012
38965 -1310012 -1017600 -1241959 -1463823 -1244375 -875432 -703070 -565124 -369779 -486062
38956 -486062 -971640 -1090418 -305343 772035 1139982 704261 137388 -181807 -368957
38947 -368957 -465745 -407511 -394564 -632770 -823400 -518828 126673 549236 604296 598177 583867
38936 583867 288751 -226140 -466295 -206819 212258 437138 494083 477569 268137 -204313
38926 -204313 -697436 -875474 -664495 -310922 -185980 -496761 -1052043 -1384089 -1237061 -816206
38916 -816206 -438800 -165312 50850 149307 165583 336335 681709 823549 614780 579150
38906 579150 1195228 2044637 2274272 1698220 855931 187823 -207126 -189884 296554 791893
38896 791893 739015 352291 374512 938959 1374253 1207431 656876 41132 -556255 -883711
38886 -883711 -572440 127505 382155 -111691 -693036 -757154 -550789 -534412 -582518 -345570
38876 -345570 85083 400297 576295 689343 576165 118860 -429231 -778997 -973422 -1107390
38866 -1107390 -1033703 -680260 -293765 -31393 294897 715544 811463 400388 83920 509191
38856 509191 1366798 1725460 1202457 268742 -471100 -764089 -549926 121486 895278 1211432
38846 1211432 776572 -179156 -1099890 -1468581 -1122904 -383554 226144 471864 470353 293344
38836 293344 -106962 -497701 -405526 159964 493772 99589 -593786 -862414 -681629 -592432
38826 -592432 -843287 -1177533 -1301475 -1107394 -579602 107111 542835 514827 317320 283875
38816 283875 254029 -83680 -570475 -781748 -653537 -420421 -122431 300916 590625 423516
38806 423516 14948 -91949 179467 383582 299733 210186 351224 553994 565807 369236
38796 369236 72483 -236028 -469124 -602227 -725745 -842696 -764864 -453172 -214319 -217986
38786 -217986 -120752 357046 779858 537918 -169423 -573511 -431838 -162964 35985 393707
38776 393707 828183 850571 433862 202535 431461 568897 160120 -405822 -557202 -389347
38766 -389347 -319420 -354281 -274435 -194463 -347166 -527324 -308058 282332 761738 837220
38756 837220 675936 542739 465056 284553 -133614 -718653 -1123994 -970588 -296830 370893
38746 370893 531501 168261 -367457 -705271 -593047 8991 753249 1071763 766900 245257
38736 245257 -42070 -147687 -351610 -593810 -571441 -272018 -8063 63289 95578 173557
38726 173557 110018 -212210 -526628 -463381 -87179 83191 -291191 -848847 -871433 -178266
38716 -178266 568630 626028 28864 -586154 -850335 -946628 -1041386 -899840 -285762 548926
38706 548926 1035360 843666 159987 -471817 -562074 -128363 234861 -23220 -693042 -1002655
38696 -1002655 -587755 90564 427967 393309 317223 294898 140991 -236104 -691711 -965245
38686 -965245 -792936 -108801 699957 1004505 635062 119894 -14123 125048 180606 229571
38676 229571 581898 1097629 1277319 1021082 792497 952534 1365600 1768372 2106984 2338279
38666 2338279 2276898 1885713 1447628 1221996 1140527 1016275 819397 573964 263667 72349
38656 72349 401522 1282507 2023645 1915445 1163008 627733 699049 968308 1054647 1113286
38646 1113286 1287917 1287688 956982 760499 1131959 1711540 1853184 1600159 1461422 1433122
38636 1433122 1061150 430405 213834 582557 909542 846306 866966 1294044 1567674 1133921
38626 1133921 451413 366720 880630 1239968 998756 379517 -198916 -412080 -81843 554039
38616 554039 877912 675260 552760 1052636 1749227 1882378 1524618 1361270 1595022 1874328
38606 1874328 2093605 2418100 2647399 2413701 1965633 1931418 2316503 2536909 2436151 2439652
38596 2439652 2666201 2733307 2561203 2571582 2920315 3245049 3343293 3497140 4026644 5011132
38586 5011132 6354186 7639255 8272827 8399900 9117082 10929219 12759592 13707421 14920418
38577 14920418 18015359 22392898 26266120 29823034 34854001 41556082 48683556 56964609
38569 56964609 69127490 86360117 108824004 140050544 184172538 234354330 269355243
38562 269355243 269540061 236166517 189740079 149724911 120885830 98762188 80677513
38555 80677513 67261820 57947558 50474773 43836275 38448744 34060409 29829902 25871447
38547 25871447 22820380 20402510 17973541 15842955 14607066 13772516 12447237 10883594
38539 10883594 9992903 9731589 9228727 8236063 7328972 6861922 6667210 6588871 6511505 6114981
38529 6114981 5318673 4647566 4490468 4403622 3834322 3074739 2763330 2895488 3077653 3291660
38519 3291660 3621211 3698966 3270280 2850965 2936231 3006914 2313701 1271617 976149 1539000
38509 1539000 2009751 1909584 1783988 2106022 2553723 2611467 2189386 1491774 872028 849486
38499 849486 1614726 2480122 2497105 1697425 1069096 1212054 1687216 1853014 1689951 1524675
38489 1524675 1469438 1454368 1463317 1496099 1520712 1549423 1565362 1446396 1224899 1241457 1657578
38478 1657578 2031836 1882741 1468454 1388219 1562872 1357643 705644 309792 559069 983229
38468 983229 1069711 969034 1030242 1199676 1290152 1387868 1578291 1649872 1481834 1406362 1759927
38457 1759927 2303116 2496383 2227199 1924424 2011812 2491577 3014174 3187456 2891429 2420205
38447 2420205 2225244 2431234 2735522 2848847 2826097 2837326 2849629 2763939 2693157 2815084
38437 2815084 3020929 3015694 2813739 2845918 3374397 3976914 3931652 3146824 2410102 2525601
38427 2525601 3425580 4416978 5124912 5761079 6483027 6990581 6978108 6652761 6553295 7044584
38417 7044584 8112157 9419072 10486115 11116454 11710953 12805808 14278095 15531380
38409 15531380 16528671 17889430 19655161 20789301 20521061 19485196 18740911 18229861 17133867
38400 17133867 15368969 13716019 12624616 11808114 10979303 10172851 9372937 8562711 8029936
38391 8029936 7846718 7260463 5593984 3625121 2892663 3536827 4072479 3612295 3019217
38382 3019217 3246530 3767040 3606262 2989911 2818998 3088792 2989666 2342199 1898572 2181625
38372 2181625 2806706 3102046 2865557 2374853 2016909 2002856 2227562 2399613 2415682 2467331
38362 2467331 2677517 2887104 2961742 3017701 3146608 3233314 3278459 3567809 4237272 4972885
38352 4972885 5439246 5735951 6157742 6776624 7521182 8383971 9294967 10086754 10842783
38343 10842783 11991102 13826839 16241042 19075593 22346715 25985638 29911644 34556307
38335 34556307 40564741 47487141 53418725 56559323 56642940 54357617 50150616 44489873
38327 44489873 38635020 33892692 30243430 26727399 23112959 20174142 18292394 16839100
38319 16839100 15216687 13609475 12318908 11129767 9824247 8726208 8205276 8035640
38311 8035640 7705335 7085405 6417266 5854392 5348025 4848279 4357681 3860698 3366754
38302 3366754 2973646 2805247 2913702 3217480 3481167 3466877 3207604 2969510 2833139 2589735
38292 2589735 2242456 2210840 2658305 3023624 2788196 2378987 2590197 3306339 3628747 3258087
38282 3258087 2889039 3040077 3302928 3143279 2791367 2826959 3299787 3737617 3794317 3551315
38272 3551315 3330720 3398175 3697786 3840138 3591497 3322099 3589700 4335112 4989101 5338794
38262 5338794 5642209 5830946 5404092 4413807 3774539 4084513 4785275 5075848 5081689 5409768
38252 5409768 6008075 6312568 6306189 6583245 7330024 7958548 7952167 7551827 7340552 7483624
38242 7483624 7642871 7485403 7077397 6768161 6731068 6705298 6339826 5742169 5378266 5358162
38232 5358162 5209145 4583991 3820952 3442125 3386721 3180076 2691756 2276119 2210279 2377312
38222 2377312 2522186 2525926 2408283 2290426 2347822 2596285 2742507 2425589 1603091 609896
38212 609896 -86851 -158884 329675 832856 777809 287108 105693 548124 934621 532442
38202 532442 -296805 -530327 102690 838347 1030423 893368 875561 905258 679003 295668
38192 295668 115394 166751 124351 -161217 -462021 -553841 -521969 -555225 -622427 -542231 -294610
38181 -294610 -65487 20574 24110 179 -105164 -251211 -223389 33767 213275 50137
38171 50137 -270544 -447412 -579704 -880347 -1076620 -744546 -164345 -72472 -471817 -535098
38161 -535098 28217 397391 -51454 -689864 -624904 -71723 123692 -173895 -458060 -634005
38151 -634005 -1016072 -1448941 -1397662 -894070 -518201 -414230 -182570 180452 138295 -373899
38141 -373899 -645267 -256372 267129 282996 -75895 -263475 -97037 231800 549740 763678
38131 763678 824330 861131 1069435 1341037 1354948 1099057 867167 699266 374127 28969
38121 28969 112476 527312 544644 -86045 -639777 -475558 58958 317044 336681 482306
38111 482306 613075 370555 -21149 268 431152 700556 530940 248230 216052 395076
38101 395076 502966 315382 -168701 -649758 -734604 -414415 -150916 -300792 -699100 -986443
38091 -986443 -1014015 -728838 -97742 565679 680074 175179 -289881 -279408 -182509 -374894
38081 -374894 -454768 -30436 372202 115373 -362983 -245961 169837 -86100 -905230 -1114247
38071 -1114247 -331424 485668 639271 591991 787942 756419 103287 -598937 -741738 -692935
38061 -692935 -1012709 -1355748 -1115946 -635940 -737124 -1333327 -1510427 -903553 -111839 295789
38051 295789 403823 442113 335589 14060 -318410 -479575 -551332 -650338 -703221 -577855
38041 -577855 -281853 8754 39755 -273243 -576998 -348435 335206 683901 274036 -179652
38031 -179652 207798 1081994 1299309 669021 195873 397749 489953 -183213 -884491 -570352
38021 -570352 418403 835199 381583 -23261 182965 422178 66766 -560351 -777818 -523592
38011 -523592 -212191 -50786 6007 -43815 -138502 -44874 207103 129103 -471543 -903184
38001 -903184 -444063 464285 709921 134214 -259197 96877 456603 -30577 -997622 -1424873
37991 -1424873 -1014310 -296959 279585 657063 763504 497160 69574 -189377 -321751
37982 -321751 -539608 -643202 -233556 516397 918613 688715 261936 81258 105216 171013
37972 171013 304499 431132 254800 -286851 -810648 -959632 -747973 -279945 449166 1248925
37962 1248925 1659158 1487445 1108663 987421 1185971 1482202 1607108 1273822 473205
37953 473205 -141850 179391 1107499 1391776 601484 -139337 211024 1105860 1454878 1388617
37943 1388617 1734722 2249374 1858189 589871 -182450 281963 1122716 1322077 1000691
37934 1000691 722007 525908 339748 470613 933075 1051337 514093 105226 539000
37925 539000 1315587 1804821 2782137 5410741 8902604 10750003 9637270 6905057 4634529
37916 4634529 3376976 2480124 1681523 1293501 1264705 1106167 703691 425993 370128 157152
37906 157152 -355545 -705238 -457398 150342 512744 405889 142790 66785 155835 176698
37896 176698 46713 -102065 -159949 -169972 -166892 -50332 214536 387715 212107 -147338
37886 -147338 -248689 -32345 34909 -306945 -596954 -268783 457541 801723 479693 28943
37876 28943 -7490 241736 331350 171184 52443 215182 630458 1063259 1184903 801913
37866 801913 130769 -357351 -509376 -628607 -849559 -771465 -129340 502219 292577 -667374
37856 -667374 -1412100 -1382841 -1029456 -921932 -883280 -452915 228382 568474 376186 58937
37846 58937 7263 185695 350165 331213 58174 -394298 -712705 -578198 -112346 145158
37836 145158 -134505 -627215 -716524 -205832 482173 780034 533338 96812 -35063 326203
37826 326203 939561 1422748 1632936 1708562 1739764 1532644 860361 -68572 -619156 -398005
37816 -398005 188627 327198 -202008 -715551 -518652 165287 523495 261138 -101281 -70046
37806 -70046 190747 302469 310505 487324 779497 905764 877173 971403 1201135 1227518 895468
37795 895468 490592 283189 110955 -304644 -775611 -706996 183648 1397068 2093858 2003795
37785 2003795 1720404 1965103 2695469 3181052 2892970 1987069 898838 -83259 -653741
37776 -653741 -420265 527734 1329433 1225963 553990 264814 548411 640316 80241 -590295
37766 -590295 -727193 -535511 -582105 -802348 -651076 -69108 331671 123838 -351072 -447619
37756 -447619 -18270 443116 392488 -129325 -499338 -205774 512568 911572 642346 122367
37746 122367 -118146 -117094 -204821 -340410 -209090 110629 115699 -339592 -672152 -305732
37736 -305732 470773 777988 251527 -487345 -631633 -209843 11755 -417175 -1070058 -1292679
37726 -1292679 -1043959 -733800 -506797 -228486 -66356 -407594 -1066388 -1250821 -672345
37717 -672345 -93194 -259635 -784850 -732771 47113 880080 1312208 1415640 1175705 440419
37707 440419 -437519 -752089 -481365 -399884 -827078 -1056037 -545575 58841 -150421 -915990
37697 -915990 -1173150 -574635 169362 396622 187616 -79384 -193074 -20697 442774 796068
37687 796068 560789 -65700 -363742 -168816 -127182 -554210 -761047 -127995 724212 665658
37677 665658 -317598 -1092054 -949701 -403186 -223891 -408168 -492004 -362996 -270921 -342953
37667 -342953 -524836 -784965 -986055 -770160 -28443 656495 561593 -185965 -691353 -478650
37657 -478650 -64743 -74294 -281137 -35057 654477 1076763 826331 296273 47483 169688
37647 169688 493748 994098 1602250 1931952 1651145 988886 466790 241413 145010 258751
37637 258751 841671 1622260 1829822 1245876 635380 660765 898455 603272 34927 110709
37627 110709 847932 1153946 419579 -572984 -838663 -546997 -487948 -720557 -630078 -100022
37617 -100022 268866 175851 84565 407690 823110 777051 278996 -173881 -234456 20888
37607 20888 299005 363552 229610 193850 492084 874239 814435 246850 -282360 -395304
37597 -395304 -386310 -600496 -742594 -375796 167051 90954 -658740 -1206537 -953774 -347311
37587 -347311 -81887 -72363 220439 763597 926684 469728 -32512 30032 494604 694717
37577 694717 315904 -317351 -718483 -732373 -539831 -379254 -354535 -414867 -437374 -353631
37567 -353631 -216918 -120725 -73720 -27229 -16711 -167444 -510173 -868018 -995756 -805075
37557 -805075 -428588 -104978 -7318 -110476 -213446 -176998 -127021 -261780 -438612 -215180
37547 -215180 521962 1199623 1131846 350284 -440908 -686034 -426979 49412 587040 1016096
37537 1016096 1013552 460776 -227188 -472184 -214897 27458 -183778 -705723 -1057568 -1014229
37527 -1014229 -786384 -632418 -485387 -123203 380478 647020 512958 284906 265811 276186
37517 276186 -20982 -506656 -751139 -676011 -569562 -452371 -17303 651918 920285 496618
37507 496618 -39334 -38578 344809 585699 667931 892316 1108985 889756 362518 134339
37497 134339 331770 411815 100485 -129086 170910 702853 880937 640906 386521 368423
37487 368423 492025 608462 680074 703785 671076 560439 272857 -293393 -992749 -1425166
37477 -1425166 -1342702 -946807 -642072 -599005 -672476 -634321 -371537 38191 349117 349430 107351
37466 107351 -112549 -214133 -344393 -525946 -493851 -123058 198116 -38823 -736275 -1170090
37456 -1170090 -807010 48771 604558 508264 208744 288348 643286 652374 126559 -365765
37446 -365765 -341634 -132315 -319867 -765187 -811831 -325510 141820 261099 331295 605021
37436 605021 843773 826700 725094 629019 263698 -387616 -705581 -235003 541413 816725
37426 816725 537409 280623 316225 421364 466835 557151 647947 592055 529008 685753 824153
37415 824153 467473 -279134 -704782 -429052 115498 292196 -49133 -612502 -1011556 -982296
37405 -982296 -587835 -270318 -357517 -541725 -279937 341231 718210 735007 957905 1614815
37395 1614815 2081292 1786742 1044895 489043 163342 -271211 -799613 -1115438 -1192209 -1246005
37385 -1246005 -1265829 -1062583 -688550 -375695 -133485 191906 521299 592305 388560 200547
37375 200547 275040 640822 1174397 1579680 1472756 825101 170133 -1584 102293 -55338
37365 -55338 -478704 -679573 -512137 -367960 -465684 -535744 -406143 -358787 -601337 -839687
37355 -839687 -744821 -494541 -461287 -622102 -663705 -478545 -178989 231121 797296 1287765
37345 1287765 1314443 829867 215202 -180062 -329329 -302157 -37951 458389 869639 773850
37335 773850 112018 -701029 -1181554 -1199139 -948265 -630144 -337594 -206508 -399144 -791756
37325 -791756 -915621 -494418 79765 141428 -400770 -965994 -1109256 -1042192 -1152922 -1350955
37315 -1350955 -1227841 -688086 -78842 254977 276167 127516 -74694 -268939 -392707 -350774
37305 -350774 -59234 391468 661397 484345 85825 -64509 -21187 -405620 -1374085 -2074779
37295 -2074779 -1733467 -873334 -630253 -1057164 -1110004 -413595 50919 -484516 -1282733 -1204799
37285 -1204799 -418494 1936 -213539 -326904 -23161 66167 -452908 -973221 -825572 -286997
37275 -286997 -44754 -150317 -150776 70462 244858 332271 543471 800341 780499 548514
37265 548514 550079 819809 782773 163059 -436063 -349543 136566 210512 -220900 -421935
37255 -421935 -18759 395839 167002 -470197 -828132 -764758 -657856 -610357 -351194 86937
37245 86937 252526 9075 -191370 -29450 222302 305152 494825 1002766 1329612 911025
37235 911025 115109 -176343 153024 410880 327997 418977 869669 984929 293740 -546431
37225 -546431 -683104 -352563 -381504 -764749 -702803 14144 609729 511796 124748 31388
37215 31388 93108 -122585 -496195 -558427 -284361 -81772 -71517 49263 356363 431319
37205 431319 -11774 -607502 -779568 -477816 -128200 20248 95441 151721 -28723 -467737
37195 -467737 -688550 -267026 494321 860398 587043 153002 46347 240143 499266 773493
37185 773493 1021688 1012875 670519 361540 444680 697830 607909 141957 -199925 -119252
37175 -119252 92560 31913 -250686 -365276 -123504 214514 260386 26911 22155 628256
37165 628256 1441425 1611023 960981 310702 357885 722964 643577 191993 23954 161240
37155 161240 -29005 -607764 -786729 -180312 523577 603230 265266 20216 -199620 -597317
37145 -597317 -788354 -382350 121096 -45780 -620726 -606027 169623 769105 611027 266835
37135 266835 377437 611775 350701 -213544 -441985 -339896 -458981 -843677 -890414 -365818
37125 -365818 156605 163335 -99168 -203000 -301433 -727993 -1179759 -1030877 -378596 -39042
37115 -39042 -363021 -744845 -613080 -257510 -175636 -165211 233191 773231 802057 358881
37105 358881 139705 362725 506308 326740 286621 626386 794292 316779 -403196 -729556
37095 -729556 -683303 -585473 -352503 108216 256095 -413640 -1287555 -1178666 38062 1214723
37085 1214723 1491735 1221149 1037284 828333 210142 -538335 -724460 -232332 309827
37076 309827 355016 29046 -192198 -130609 -51901 -222142 -482291 -423680 13837 359818
37066 359818 203524 -239405 -421280 -162357 264769 595486 705169 402849 -357166 -1023799
37056 -1023799 -809248 255221 1121621 943570 130119 -218846 310728 1055135 1172607
37047 1172607 580419 -57879 -88808 463953 961613 873547 345831 -82830 -192171 -199357
37037 -199357 -235513 -138999 134086 319222 264707 178409 230642 271987 210511 295338 668399
37026 668399 963399 786044 355674 211567 438613 636287 553105 299649 -16417 -401228
37016 -401228 -685153 -560873 -55063 348470 205532 -448811 -1181788 -1487644 -1090003 -217185
37006 -217185 445042 400189 -59175 -237418 6168 145226 -110213 -364675 -253135 -67966
36996 -67966 -214310 -444536 -225806 328591 505413 -26915 -788004 -1130318 -911855 -421591
36986 -421591 -60 132986 -8150 -105888 118967 412978 221259 -451942 -889902 -658701
36976 -658701 -264419 -339774 -603299 -319498 430484 753399 280911 -267732 -160298 337697
36966 337697 479270 124153 -205183 -119139 258082 604949 716158 519506 72358 -419840
36956 -419840 -733581 -781487 -606877 -344059 -197552 -240253 -201353 231462 826555 941808
36946 941808 424596 -83779 -42646 258036 276597 76246 56906 198520 197657 95208 123878
36935 123878 129909 -198206 -686280 -926378 -1004196 -1229892 -1295117 -610888 487497 848762
36925 848762 75168 -894438 -1130243 -820939 -579139 -406941 20436 600638 966504 1030344
36915 1030344 874573 462425 -105106 -413036 -230709 160627 470088 778456 1064360
36906 1064360 908617 180212 -493901 -525340 -176723 10686 109429 414081 609141 199878
36896 199878 -494318 -679984 -328377 -218929 -710006 -1250567 -1267673 -877677 -505770 -320753
36886 -320753 -250220 -168373 57837 408186 595971 420966 140108 143325 417217 697612
36876 697612 892983 899303 365689 -691079 -1397289 -1021494 -220319 -260729 -1099351 -1417342
36866 -1417342 -699196 2927 -169133 -581686 -327763 302113 538558 513515 817820 1227076
36856 1227076 1032823 376912 132863 491217 688010 284851 -191740 -176237 141693 334013
36846 334013 416336 559875 611503 403026 196241 303635 477741 202085 -479147 -921174
36836 -921174 -733837 -236867 106568 306064 581728 801262 646990 227651 12930 93207
36826 93207 5437 -469992 -792149 -350761 619639 1289459 1250569 833290 492183 343268
36816 343268 324868 380251 391751 286824 260643 528055 827445 626294 -67060 -583686
36806 -583686 -509698 -262579 -428419 -916819 -1176873 -956747 -421132 254276 930915 1289881
36796 1289881 1081842 607486 478621 779314 890767 389810 -247980 -256162 296110 510774
36786 510774 -107230 -912177 -976735 -361133 32198 -224207 -563723 -395598 37175 183954
36776 183954 58266 10944 1724 -222001 -425140 -96060 666801 1159668 1032884 618760
36766 618760 217045 -265241 -757374 -793598 -216847 417010 539543 254668 -23270 -184819
36756 -184819 -286146 -187430 215712 667958 858719 834913 790907 696186 458543 220809
36746 220809 168266 237923 287366 329817 361687 226780 -89067 -305911 -243765 -71487 66187
36735 66187 295047 610659 662214 303492 -51395 -28147 160579 195630 224624 439425
36725 439425 546113 289365 83508 383310 773134 514925 -226227 -585122 -320297 -45019
36715 -45019 -119471 -189442 24700 285187 402468 517477 581332 254420 -388080 -712179
36705 -712179 -421073 4692 100077 60983 223127 464020 559538 629577 769205 700072
36695 700072 278894 -61874 101743 513753 667908 586870 622820 747912 635125 287108
36685 287108 19536 -96184 -249092 -394059 -254383 145873 398137 244108 -141193 -438975
36675 -438975 -457793 -129370 437819 909129 1053675 1092942 1361436 1672346 1492018 792601
36665 792601 213607 192740 427511 496290 556841 964704 1494768 1503256 825787 56985
36655 56985 -160919 188957 652474 871047 809636 574572 241771 -102208 -296615 -229827
36645 -229827 -30081 12731 -180834 -323789 -182387 -34374 -363380 -1097205 -1579790 -1454587
36635 -1454587 -1125128 -1035209 -947859 -447395 193911 327420 -44640 -266096 -61119 130569
36625 130569 -25423 -302829 -505836 -806304 -1137996 -951689 -78128 780318 998982 892817
36615 892817 969562 920499 238029 -623050 -758627 -264624 -83504 -445634 -579655 -135397
36605 -135397 204949 -79101 -508709 -473793 -124334 148215 388467 663343 651364 270300
36595 270300 97905 500710 910336 683641 161240 76114 354003 374809 100822 24154
36585 24154 176390 111101 -182061 -235706 -25612 -75498 -485495 -671735 -349157 -32392
36575 -32392 -178607 -478953 -477048 -354259 -511459 -718249 -335764 680325 1561085 1660956
36565 1660956 1237413 1022507 1215988 1296452 900888 477554 663751 1242743 1328975 632916
36555 632916 -119715 -294959 -207285 -374292 -529613 -138895 494479 534925 -85299 -523212
36545 -523212 -269779 210166 301794 92306 102799 591965 1363834 1958025 1916126 1178530
36535 1178530 274427 -202925 -279142 -372708 -505506 -326148 90316 176867 -192667 -372347
36525 -372347 106759 812023 1051956 806278 586940 716618 1148924 1696035 2013296 1622188
36515 1622188 431714 -874439 -1394871 -961121 -254467 7430 -239519 -516529 -372458
36506 -372458 219754 901123 1269052 1196790 862532 537829 387689 397160 409121 294577
36496 294577 133159 102829 156975 50752 -212348 -296583 -105566 -35137 -297690 -423285
36486 -423285 17439 565030 475915 -52940 -119102 455135 833488 509769 86326 282226
36476 282226 847068 1022756 642241 217148 172384 440134 706243 767693 700427 776597
36466 776597 1084523 1246563 810025 -47219 -563174 -274067 441252 814947 450236 -408288
36456 -408288 -1103721 -1069554 -368671 335049 606456 814650 1451740 2167364 2168715 1451850
36446 1451850 860479 891899 1197476 1365743 1445896 1520256 1477130 1423050 1664301 2116424
36436 2116424 2402701 2624325 3222478 3952833 3957691 3147316 2527159 2717376 3089630 2900712
36426 2900712 2374762 2041335 1840562 1561280 1411280 1487258 1399941 1056961 1051928 1617094
36416 1617094 2012366 1705857 1331224 1626136 2231570 2472109 2515324 2697483 2474291 1292984
36406 1292984 -68613 -332250 479528 1254690 1463755 1464093 1470075 1427378 1652759 2384737
36396 2384737 2920455 2456097 1607668 1739586 2819055 3356904 2657242 1746105 1677192
36387 1677192 2165851 2461512 2521647 2653166 2767092 2625589 2326440 2115807 2107032 2362276
36377 2362276 2806917 3030056 2715932 2241354 2219332 2540749 2607370 2407753 2488415 2907456
36367 2907456 3181087 3294477 3736078 4416055 4627953 4296683 4166943 4455053 4457206 3936885
36357 3936885 3747901 4435384 5252717 5345305 5044027 5160019 5712925 6191962 6507283 6886728
36347 6886728 7271668 7511463 7762564 8093246 8123898 7669201 7314930 7709242 8626472 9371486
36337 9371486 9836970 10526548 11684931 12968594 13960523 14646089 15389125 16606103 18362140
36328 18362140 20255833 21934244 23657729 25955981 28845049 32022442 35794192 40959690
36320 40959690 47616626 55008419 62941930 72487394 84777608 99958098 117952825 139508532
36312 139508532 165789429 197588602 235400057 278884109 324477838 363779658 386265102
36305 386265102 385249002 361975484 324521374 282929762 244374940 211285671 182910672
36298 182910672 158187546 136998360 119299102 104364918 91517057 80815294 72324076
36291 72324076 65317286 58987821 53423564 49035759 45453156 41918105 38484016 35804477
36283 35804477 33804990 31557850 28655146 25873087 24112911 23250832 22427181 21139449
36275 21139449 19695670 18697056 18313329 18156343 17823550 17345462 16879516 16214844 15097023
36266 15097023 13920073 13381463 13395276 13165314 12533509 12310116 12843712 13263777 12841351
36257 12841351 12186823 12193047 12566467 12453815 11911755 11625672 11627025 11461288 11313063 11749435
36247 11749435 12476770 12541770 11821198 11242425 11384831 11830016 12081894 12221422 12391623
36238 12391623 12446196 12422238 12690468 13347513 14018213 14470613 14900065 15441933 15924002 16258283
36228 16258283 16591438 16924860 17035747 16911302 16885651 17252560 18011870 18939293 19648358
36219 19648358 19823459 19758465 20317634 21843243 23467113 24149234 24046046 24101186 24624207
36210 24624207 25165716 25538143 25950030 26236221 25978735 25397494 25121052 25014759 24274311
36201 24274311 22863883 21828806 21816686 22155371 21816736 20621836 19166293 18141755 17951238
36192 17951238 18429075 18812599 18545954 18098098 18332050 19165132 19681337 19536173 19357786
36183 19357786 19729982 20668646 22121547 24067737 26124297 28001788 30289292 33785371
36175 33785371 38233719 42919720 48306594 55676621 65378009 77093343 91674618 110847702
36167 110847702 135414392 166064104 205056028 252291811 297961738 323953572 317674136
36160 317674136 283705296 238986854 197849159 164470755 137416909 115593240 98389372
36153 98389372 84227989 71866558 61612552 53809028 47538354 41906199 37199676 33717259
36145 33717259 30714742 27544544 24731197 22903209 21595576 20067966 18514656 17562229
36137 17562229 17202231 16987110 16721185 16314904 15509728 14333682 13317674 12766989 12331452
36128 12331452 11698541 11120664 10834677 10558536 10010609 9388551 8946713 8626383 8401563
36119 8401563 8393386 8383588 7907044 7096446 6653413 6679416 6434835 5672070 5220340 5639371
36109 5639371 6248257 6251045 5944583 5934829 5962841 5518944 4963954 4958284 5260644 5162083 4750370
36098 4750370 4690136 4997047 5053747 4709438 4419434 4368296 4328785 4337729 4668248 5141048
36088 5141048 5255514 5013722 4871695 4886282 4676278 4259430 4163255 4599723 5210877 5719493
36078 5719493 6176528 6501608 6463351 6219296 6214081 6428989 6378164 5951151 5595218 5557627
36068 5557627 5651458 5899918 6633102 7707706 8415040 8519004 8665458 9357268 10221229
36059 10221229 10771519 11226252 11959508 12708816 13030225 13153941 13687791 14694125 15681278
36050 15681278 16374052 16934669 17479302 17868957 18018734 18066724 18181254 18390559 18571968
36041 18571968 18495756 18010892 17285116 16654749 16147303 15453060 14497122 13650190 13133438
36032 13133438 12602792 11653237 10410636 9284401 8434197 7816469 7437329 7178359 6681560
36023 6681560 5835944 5120071 5041015 5473880 5948613 6285352 6484614 6321228 5643535 4844883
36013 4844883 4415859 4195301 3696289 3020337 2726176 2846544 2817952 2481909 2372893 2748896
36003 2748896 3050909 2747361 2150161 1884066 1945348 1838800 1440906 1186916 1378454 1702471
35993 1702471 1626549 1114683 736396 998166 1705232 2209776 2253335 2208632 2383284 2535602
35983 2535602 2387614 2176763 2219317 2289043 2004666 1537546 1300177 1212875 1016484 1044792
35973 1044792 1753891 2598450 2442603 1220164 150832 33161 338797 382227 328307
35964 328307 437039 297331 -378365 -984584 -894887 -444181 -207910 47809 755703 1465225
35954 1465225 1448393 1003602 1061323 1711535 2181596 2158081 2086663 2178154 2139161 1968835
35944 1968835 2041759 2256338 2068138 1576953 1583430 2215093 2477487 1715685 672587 416448
35934 416448 881469 1199419 983601 548012 186530 -54521 -52506 328318 881930 1192439
35924 1192439 1075959 621075 -10811 -504745 -386934 422723 1210228 1134694 279967 -411062
35914 -411062 -294979 298811 665791 601044 421605 366326 312290 80111 -219455 -288406
35904 -288406 -36803 262842 276561 -20473 -366672 -533689 -493609 -333097 -176812 -153474
35894 -153474 -228841 -103817 446805 1105555 1203011 517098 -394375 -844216 -746445 -471662
35884 -471662 -228280 59884 384308 550681 490491 380763 354483 314216 162647 45286
35874 45286 186418 563540 915264 1061413 1064058 1031183 907533 593193 202856 32712
35864 32712 220717 552702 691395 552728 388161 494871 859218 1098508 821243 95593
35854 95593 -531632 -592344 -177647 285978 593444 809515 858469 487803 -262520 -917400
35844 -917400 -1074230 -803105 -428089 -188419 -214761 -507405 -793689 -730465 -372712 -90619
35834 -90619 47047 319345 680786 686381 338796 290192 780484 1115904 792398 416250
35824 416250 752617 1508532 1944549 2136491 2659442 3496965 4292752 5262327 6810211
35815 6810211 8751198 11111932 15010445 20911840 26289231 27243970 22998290 16941383
35807 16941383 12514042 9845497 7400536 5037132 3722299 3447292 3279456 2931077
35799 2931077 2781374 2725282 2307051 1710873 1467240 1436954 1124520 681166 549870 459795
35789 459795 -98526 -701046 -522533 138330 155486 -610360 -1083627 -725333 -255931 -271800
35779 -271800 -311747 125740 598342 451126 -137169 -478406 -289992 195250 642634 772980
35769 772980 488455 130351 219589 723563 1048736 978045 1041520 1607676 2180114 2109356
35759 2109356 1565893 1220492 1236182 1182479 855206 623010 846214 1317335 1481631 1087498
35749 1087498 485871 262392 580626 964845 843851 255007 -179513 12050 634950
35740 634950 1115799 1150963 953911 907138 1049978 990689 420851 -344255 -589467 -37161
35730 -37161 801096 1237884 1091761 608540 78238 -196971 59448 694461 1074328 853409
35720 853409 480939 498721 709674 625433 382740 473798 805048 853614 656007 773394
35710 773394 1246487 1461060 1206406 1009405 1147090 1158686 739573 353959 424897 553895
35700 553895 174210 -476400 -669486 -199367 450445 777202 680084 374008 222678 494825
35690 494825 1008147 1200932 795056 160940 -204044 -281345 -346212 -469655 -544652 -579913
35680 -579913 -617589 -526701 -196838 210144 492417 729462 1057530 1275895 1053542 480955
35670 480955 60104 103336 433321 755074 1043146 1380494 1636439 1632469 1599071 2095977
35660 2095977 3304427 4769013 6232064 8334732 11652066 15057508 16150440 13923727
35652 13923727 10192072 7541692 6504967 5762875 4574659 3598255 3356745 3302885 2833419
35643 2833419 2176846 1776587 1640856 1758622 2350830 3211507 3552929 3050887 2382224
35634 2382224 2206349 2268407 2051215 1658423 1442205 1350255 1260489 1396103 1786885 1904881
35624 1904881 1513296 1281710 1773223 2371166 2121456 1221401 699356 876441 1119181
35615 1119181 1018359 897452 1092378 1472103 1767701 1814226 1488513 925549 657381 965183
35605 965183 1291824 961274 274602 104474 527877 743418 380462 14614 189620 694189
35595 694189 1067651 1168122 993256 546287 123535 152864 498241 493922 -64317 -537041
35585 -537041 -383015 51553 109938 -217375 -365103 9894 657994 1033985 778584 64795
35575 64795 -450175 -252165 402608 783951 635741 429170 581412 883518 933350 739375
35565 739375 577012 506781 349151 27325 -264959 -213543 303683 971380 1233027 936379
35555 936379 599217 724936 1094966 1202014 1130431 1330548 1655871 1467306 783883 462940
35545 462940 934857 1538232 1524710 1028162 571291 280179 145759 434064 1141424 1531595
35535 1531595 970716 -94851 -685169 -538191 -135526 258870 795658 1366238 1518461
35526 1518461 1163341 752786 598533 511315 265452 -9603 -63166 179477 645452 1139899
35516 1139899 1319281 985424 452170 282363 609338 1033973 1203040 1124695 892059 524074
35506 524074 187597 162308 411286 544687 385470 219802 294146 438177 454458 522250
35496 522250 833758 1083248 761919 -121076 -979264 -1300250 -1076234 -608982 -183437 19387
35486 19387 -46251 -213738 -209154 56753 385990 535696 469000 317692 207031 204886 350626
35475 350626 593135 726884 556277 189786 17642 228884 450358 149894 -560472 -863490
35465 -863490 -225032 813296 1221391 753698 190048 267812 822539 1166950 931489 270178
35455 270178 -433603 -764317 -489128 63754 126359 -583011 -1316393 -1202636 -487077 -210281
35445 -210281 -723978 -1277707 -1210389 -795680 -572805 -527262 -439693 -482693 -837079 -1103328
35435 -1103328 -771793 -69915 278742 23547 -434846 -725478 -810093 -679841 -329832 -39564
35425 -39564 -122170 -346929 -150825 498361 994957 975978 766830 755301 835733 749176 555239
35414 555239 481489 622407 984888 1513557 1939506 1974399 1758982 1681795 1663496 1189262
35404 1189262 242375 -429533 -318827 159550 387777 369053 365428 298944 109862 195925
35394 195925 801509 1377956 1287637 823623 752640 1069196 1030022 369071 -299074 -374496
35384 -374496 57176 549032 761635 535468 -24002 -464398 -397320 1914 283444 414218
35374 414218 709828 1164592 1396456 1264042 1027390 860858 676142 455335 308514 183705
35364 183705 -45905 -212650 -8765 501474 930876 1071174 952923 566566 7996 -288641
35354 -288641 -47903 271228 18277 -669700 -1075440 -924483 -511186 -19412 472038 537161
35344 537161 -60229 -537738 57948 1209159 1402586 385620 -413046 -70139 628755
35335 628755 776228 764197 1223711 1702403 1452211 669801 -13698 -507925 -853485 -674650
35325 -674650 4960 229294 -548345 -1355061 -1062736 -148767 146437 -202748 -235094 236604
35315 236604 497620 326531 192734 185587 -21965 -237839 33361 527126 537911 189807
35305 189807 183836 413781 175808 -305271 -49250 862943 1197530 609013 212641 603218
35295 603218 853785 253727 -397846 -210943 342783 493004 592559 1267386 2039928 2082895
35285 2082895 1690139 1747383 2220404 2352712 1987971 1554222 1041777 153634 -711625 -773565
35275 -773565 -140315 269408 103889 -95461 -3328 48460 -75978 25070 450506 646588
35265 646588 311609 -45615 103485 537430 751401 699545 620576 541485 418445 436680
35255 436680 704605 903331 697769 308665 203565 316479 81151 -672750 -1290438 -1031251
35245 -1031251 -20664 839600 878191 310794 -183047 -283002 -178967 -54732 173540 526126
35235 526126 749392 680729 547503 599008 649596 349479 -204324 -505229 -281453 198713
35225 198713 483373 357376 -75679 -489577 -544828 -243432 -9163 -141141 -305438 21272
35215 21272 650970 751161 -41527 -1046915 -1360774 -901894 -329183 -169034 -353485 -486728
35205 -486728 -298715 107628 324381 67777 -398845 -511388 -167783 108165 -27640 -190202
35195 -190202 79398 478279 348544 -270512 -662024 -514223 -331970 -572810 -943665 -909294
35185 -909294 -497470 -204579 -341799 -798685 -1259697 -1373593 -911500 -70707 524668 420676
35175 420676 -169760 -681164 -823631 -647386 -233952 280086 546819 343794 4973 62594
35165 62594 472055 648993 309863 -190078 -439256 -418300 -233186 116376 484081 537843
35155 537843 244195 4810 53043 126213 32547 86844 557129 1071470 1087042 670548
35145 670548 309430 182507 136012 183870 462579 783430 767472 405591 38990 -152228
35135 -152228 -200128 -10789 493571 962783 915724 448045 100946 37698 -52388 -217660
35125 -217660 -97894 359129 725132 843797 1056652 1385790 1232390 366981 -444976 -437460
35115 -437460 46229 132827 -263671 -456419 -126423 301601 439539 444707 576333 723460
35105 723460 632221 324694 43157 -120592 -352708 -808413 -1227523 -1061759 -182313 718073
35095 718073 838576 338322 163852 711253 1273435 1123845 550948 305419 488188 615577
35085 615577 497211 407546 513339 689694 858197 1053673 1191327 1126604 864477 431299
35075 431299 -238920 -967003 -1214913 -775561 -238717 -198257 -330133 33073 696506 841239
35065 841239 333919 -150542 -342129 -702685 -1302535 -1377816 -521105 509698 815659 563960
35055 563960 494677 707836 678975 215194 -283153 -428265 -204649 205430 530162 408637
35045 408637 -313686 -1278191 -1888318 -1898185 -1544401 -1168222 -903645 -680196 -378377 -21468
35035 -21468 155184 -22730 -332890 -385368 -233484 -360468 -903369 -1332449 -1185374 -703803
35025 -703803 -370466 -199804 53150 306895 311078 155896 73489 -85361 -573647 -1059205
35015 -1059205 -895503 -141278 347224 53693 -539505 -732522 -549021 -483971 -687109 -891623
35005 -891623 -952656 -959336 -866267 -490603 25281 159428 -332160 -971114 -1091323 -690043
34995 -690043 -390301 -553918 -821209 -716457 -369766 -273240 -505193 -638238 -405498 -39784
34985 -39784 147452 154920 102040 -15728 -173635 -203816 -60998 47086 7214 -231 101058
34974 101058 7756 -471923 -928392 -835814 -372851 -228179 -603054 -934772 -738933 -257165
34964 -257165 -13779 -84967 -149636 -65265 -22747 -142998 -216781 28730 560743 1095569
34954 1095569 1447736 1617555 1518542 924532 -64691 -748631 -478714 434211 955965 620610
34944 620610 122579 341279 1188611 1833049 1781544 1291905 875834 811281 1073462 1414060
34934 1414060 1551773 1483620 1439964 1366047 832315 -174022 -802326 -303654 832952 1424638
34924 1424638 1136996 707378 629821 474361 -208316 -1043431 -1371022 -1153470 -879822 -854067
34914 -854067 -954353 -915455 -584978 -36827 427312 548323 427197 358106 382503 339060
34904 339060 299145 482309 722215 569534 49260 -255622 -83941 109497 -75578 -371956
34894 -371956 -368283 -153743 -34224 -22363 8311 56670 221328 749495 1506139 1897599
34884 1897599 1732540 1605402 1926532 2172992 1761226 1100431 967195 1287032 1436746
34875 1436746 1394184 1577766 1766283 1289306 298673 -242329 -38216 94116 -377499 -796938
34865 -796938 -372038 590878 1141987 909833 310503 -137955 -235218 -43136 232927 418338
34855 418338 548925 681412 579167 23012 -592045 -597986 -100726 33768 -502663 -930858
34845 -930858 -613334 -44987 34752 -143296 125544 781646 1151278 1048177 847074 636458
34835 636458 206354 -163296 149736 997789 1361202 710656 -229591 -499110 -93123 341457
34825 341457 512417 611857 739891 771784 698830 657936 661693 639475 682491 904596 1101012
34814 1101012 916259 393229 1657 -3795 64007 -173600 -557639 -598765 -178470 283657
34804 283657 394207 237962 135257 153451 65213 -285201 -743167 -956010 -650116 108362
34794 108362 827388 924861 368035 -147934 45725 732084 1065883 687916 144986 69655
34784 69655 406531 745888 999243 1275692 1372317 965773 241449 -207024 -171342 -51682
34774 -51682 -149411 -183387 212510 828732 1062735 629819 -167092 -801736 -959189 -667820
34764 -667820 -183871 247811 593650 945928 1218472 1118773 581389 49577 30972 415557
34754 415557 554847 115471 -423898 -348664 383197 1091881 1204697 845081 494148 329023
34744 329023 165648 -52344 -56513 336069 848560 1004481 689301 258469 86052 178375
34734 178375 303081 362105 482187 759592 1075235 1256054 1325176 1429772 1532136 1379640
34724 1379640 887014 362054 155722 230418 334732 487568 910192 1480946 1706510 1401364
34714 1401364 984265 833882 747779 433752 175882 439978 1017582 1228420 969042 881732
34704 881732 1306205 1716103 1560789 1111400 956485 1075072 1036445 872637 1055178 1632980
34694 1632980 2048836 1946706 1589118 1253920 770809 33596 -489328 -293365 358016
34685 358016 707640 499794 213740 303009 675879 1046351 1379925 1770287 2175681 2513104
34675 2513104 2799723 2999420 2932365 2564116 2232674 2353046 2960780 3695951 4164404 4230598
34665 4230598 4093718 4162431 4677276 5377227 5784911 5916344 6353080 7407047 8624418
34656 8624418 9473021 10135450 11143324 12574319 14230653 16354868 19397500 23123400
34648 23123400 26756934 30224729 34618982 41147895 50111791 61189622 74409174 90673501
34640 90673501 111375069 136759988 163471332 183924660 190131112 179743059 158064915
34633 158064915 133462270 111250486 92313636 76048334 62559724 52050581 43900961
34626 43900961 37276140 31937257 27911646 24875369 22307372 19941342 17775906 15851854
34618 15851854 14162530 12623225 11142090 9871418 9161867 8963035 8591103 7585381
34610 7585381 6481786 6079038 6197039 5984292 5325000 4982866 5249221 5407416 4865328
34601 4865328 4000490 3459993 3298365 3230051 3138985 2939936 2501734 2084296 2263936 3017383
34591 3017383 3475452 3049225 2229041 1770361 1668148 1523811 1384312 1514133 1729501
34582 1729501 1660545 1405485 1306871 1323180 1193221 976964 881621 807806 617905 579086
34572 579086 959925 1456778 1621354 1579570 1681744 1735120 1343038 784803 714670 1077264
34562 1077264 1175431 833817 647382 935464 1246593 1150700 839963 670751 698898 901983
34552 901983 1279275 1503197 1088595 211931 -228331 250947 1029682 1240860 870436 560720
34542 560720 667840 975695 1146298 1084179 949961 989281 1188199 1060509 140718 -1195070
34532 -1195070 -1858336 -1267336 -57134 710964 685327 271498 -66830 -136909 91182 494317
34522 494317 796081 820607 648385 412688 182097 123962 384650 643417 285395 -672568
34512 -672568 -1339782 -1073349 -365922 -65735 -148387 28322 537402 762176 412876 -78980
34502 -78980 -293255 -334810 -441700 -587728 -679605 -746471 -743972 -501255 -19621 459266 787411
34491 787411 1031514 1192132 1120571 821328 547606 486015 590205 773996 986011 1061835
34481 1061835 840481 490895 366735 466328 450258 309855 509296 1165888 1555075 924359
34471 924359 -432914 -1391705 -1225240 -282964 516208 573711 1205 -631887 -874914 -798714
34461 -798714 -792709 -976533 -1047038 -800857 -480620 -347255 -218429 172036 581215 527870
34451 527870 86669 -101836 312975 972933 1371319 1401725 1157300 617067 -130124 -671337
34441 -671337 -694011 -451781 -419679 -602981 -606205 -352523 -262444 -575850 -910487 -787576
34431 -787576 -313761 32109 137513 339778 740435 881825 377144 -419117 -747533 -355237
34421 -355237 296051 732134 966278 1145196 1111232 698686 220673 178533 533252 728265
34411 728265 514406 311926 551539 1036008 1261572 1098863 807703 553149 264794 -93749
34401 -93749 -408498 -539974 -380086 89526 598940 680589 281361 41945 508640 1269243
34391 1269243 1473279 1106978 1004495 1498834 1876885 1524200 859465 574440 564792 318714
34381 318714 -87984 -175256 41235 139060 145670 503136 1173613 1558535 1436454 1248947
34371 1248947 1233860 990728 276873 -392058 -444923 -116829 -75901 -457090 -751984 -530861
34361 -530861 98028 681748 834805 549966 245114 354354 804615 1156604 1295064 1526798
34351 1526798 1848875 1718407 939370 202788 144294 333586 -24616 -684988 -577016 583057
34341 583057 1785177 2077186 1682290 1371157 1312564 1093667 558986 95839 135807 672600
34331 672600 1255809 1344393 797127 114150 -663 553062 1110425 1041475 492563 112582
34321 112582 219054 507653 525160 197019 -149805 -182362 54913 177291 -52587 -355842
34311 -355842 -267716 195846 516913 395395 137713 135308 301537 346050 327872 499078
34301 499078 733772 586576 -38357 -666005 -830113 -594531 -353535 -336464 -478934 -633389
34291 -633389 -731560 -794366 -884184 -1010572 -1045543 -813729 -319695 190786 451576 398189
34281 398189 141815 -179711 -454050 -578902 -505294 -293376 -70738 61052 60010 -65394
34271 -65394 -231348 -268062 -39183 360156 579294 312715 -330127 -867036 -968318 -849954
34261 -849954 -955026 -1295776 -1408142 -1039250 -544885 -364256 -399319 -300092 -142290 -282118
34251 -282118 -596501 -507203 59317 358505 -120007 -795136 -771081 -137522 196802 -152308
34241 -152308 -583815 -490013 -52656 197870 114838 -88407 -201077 -42356 525926 1283538
34231 1283538 1647929 1320256 678843 242528 70266 32761 265625 814311 1163453 809766
34221 809766 141851 24953 538103 868927 570920 167158 211141 429421 265674 -209898
34211 -209898 -443826 -167194 383125 807623 827287 446195 38385 -2777 145438 -111084
34201 -111084 -852744 -1380136 -1195540 -709571 -521839 -532552 -362989 -187901 -414301 -845998
34191 -845998 -931241 -659450 -490495 -529033 -480624 -317857 -262190 -188206 192138 609364
34181 609364 527110 156502 278996 934628 1229179 723722 100015 42099 319435 475061
34171 475061 600342 822761 776898 285769 -73192 186220 618567 608548 434400 723182
34161 723182 1285684 1411637 1030215 670296 470551 137813 -223394 -157865 246281 355596
34151 355596 -21388 -391923 -411050 -240093 -652 392159 752243 735384 558743 814189
34141 814189 1385907 1415038 640935 -107228 -193598 -66610 -260956 -350074 259654 1117091
34131 1117091 1273791 684093 137633 -4219 -110410 -370646 -443379 -155487 153391 222622
34121 222622 265428 528971 877929 1034381 912759 573446 144488 -119648 -29717 199587
34111 199587 151932 -148768 -188428 270964 760475 714687 216080 -182196 -173875 63434
34101 63434 216984 143220 -114872 -389221 -485135 -356319 -134733 86668 354693 624493
34091 624493 634085 236140 -298882 -574583 -548566 -438780 -268643 107315 533589 542579
34081 542579 -34679 -790641 -1260809 -1401321 -1330479 -970626 -350067 22632 -346184 -1115900
34071 -1115900 -1345598 -682213 153789 302773 -208532 -686733 -697115 -375466 -15383 223195
34061 223195 248585 70694 -59216 141176 558678 741372 492530 170617 230823 626317
34051 626317 863409 615385 127133 -65590 213995 539771 423590 18934 -26305 491716
34041 491716 936868 700268 122183 16950 468231 768849 578222 396509 605250 736470
34031 736470 250588 -460216 -556273 3471 423536 255774 -59090 -3975 239544 174270
34021 174270 -229805 -531696 -432993 -81367 175664 123531 -189504 -495547 -522297 -279430
34011 -279430 -51325 9199 139529 601464 1152120 1203604 585407 -132511 -269985 181797
34001 181797 623694 586710 169388 -220925 -308479 -80876 300018 600375 659094 530450
33991 530450 404693 364374 343562 322896 361590 406141 319268 170023 198021 369317 324825
33980 324825 -17785 -206527 67757 431165 427719 295450 521324 888525 737746 110140
33970 110140 -173947 299046 1000672 1312661 1217364 880434 270097 -409529 -576423 -69990
33960 -69990 471310 540606 497788 787174 1017700 622019 -11298 6229 688533 1180394
33950 1180394 1100920 985312 1235334 1442570 1104276 418369 -33978 -22346 238568 464677
33940 464677 510808 355876 50368 -351846 -765195 -922536 -512022 298000 787797 550973
33930 550973 138246 300366 848739 959516 465322 45827 104129 263961 174181 59862
33920 59862 168179 319964 358026 467375 705194 748929 458535 177385 131763 44180
33910 44180 -300482 -618969 -627325 -451455 -179248 387689 1077558 1115441 203706 -743907
33900 -743907 -730852 -89408 88771 -397792 -716042 -376179 161389 334013 159556 -94129
33890 -94129 -294335 -320831 -74325 244110 295746 119012 56628 163876 184069 135678 367326
33879 367326 913173 1316578 1257985 899362 478605 45521 -269055 -257187 -96363 -248501
33869 -248501 -638934 -539704 315799 1073858 820809 -100137 -542004 -130624 356499 229206
33859 229206 -208114 -305389 -99237 -173714 -691037 -1094338 -870321 -222422 254384 321461
33849 321461 200289 68473 -141462 -412416 -512026 -344570 -96981 131379 462056 768751
33839 768751 546219 -311496 -1012879 -766866 73719 448028 33743 -481310 -571839 -516200
33829 -516200 -649716 -727362 -455041 -92124 -34391 -189162 -231438 -188675 -319762 -602128
33819 -602128 -741846 -600322 -322149 -122195 -137523 -359058 -559150 -465393 -138324 49503
33809 49503 -66943 -237177 -249135 -224139 -236010 -46522 425816 739312 484721 -60648
33799 -60648 -319003 -254260 -299108 -533516 -498702 74636 805713 1142618 1033391 913844
33789 913844 1144045 1598138 1814161 1521861 954197 526444 294661 14036 -277008 -159948
33779 -159948 496923 1181681 1345239 1035594 636127 334992 202939 395315 803482 871918
33769 871918 334494 -169487 139332 1021654 1511423 1203298 524821 -138072 -736555 -992687
33759 -992687 -491668 438126 832297 436851 112894 452308 850878 617160 215157 494453
33749 494453 1230137 1458057 992306 572891 534638 336294 -350092 -944643 -801685 -142699
33739 -142699 333797 360755 170155 -30722 -180304 -145731 161204 503139 527762 270419
33729 270419 130323 306088 564289 674066 763026 1009545 1214280 1032044 564618 343825
33719 343825 626054 1033702 1108622 945181 952282 1170379 1229192 935714 498690 129279
33709 129279 -178351 -363538 -224611 156429 319013 68123 -147547 98065 485678 418776
33699 418776 -2920 -113610 250191 475664 130816 -413324 -643411 -670919 -860912 -1051250
33689 -1051250 -736223 67386 677332 573727 1725 -400137 -316409 53754 333676 320823
33679 320823 83321 -150756 -183211 35931 433538 857968 1060354 807720 212581 -166788
33669 -166788 146052 910446 1360440 1123380 662034 631312 1048635 1361101 1178831 666303
33659 666303 270484 286062 651212 992947 930724 497115 153199 196445 318791 60297
33649 60297 -440745 -590168 -213886 196577 242061 150996 308136 653286 881084 917769
33639 917769 840643 607055 268188 205360 674650 1276044 1388847 1055576 887716 1084389
33629 1084389 1138371 692554 142519 59133 417384 774785 924148 980865 1025605 1062304
33619 1062304 1229189 1660339 2123676 2123688 1476836 590638 54176 40378 191050 68216
33609 68216 -327140 -549273 -277155 212019 348447 16208 -321197 -328340 -254120 -423088
33599 -423088 -624538 -455103 -62954 -1835 -359992 -592772 -387022 -181218 -482949 -1054529
33589 -1054529 -1252860 -976314 -735286 -780161 -708328 -193915 323582 161425 -566697 -995280
33579 -995280 -710097 -390867 -852466 -1772886 -1979005 -992199 305192 801878 480820
33570 480820 177659 335242 578161 466173 93294 -240767 -510718 -811005 -1006640 -893814
33560 -893814 -591803 -467572 -685745 -1053287 -1296338 -1281722 -966455 -382913 210644 368589
33550 368589 -127633 -938065 -1444559 -1409900 -1202599 -1256509 -1447459 -1254408 -548518 78643
33540 78643 -2488 -636685 -1080915 -979150 -743945 -839733 -1082196 -985400 -546068 -227052
33530 -227052 -224810 -209669 104708 514364 643201 433457 118035 -72659 5536 375221
33520 375221 767656 746565 284140 -39867 230120 739550 826877 502365 325253 400082
33510 400082 223107 -357365 -777023 -666659 -432521 -462428 -401925 130891 643633 395690
33500 395690 -396449 -821891 -574744 -161102 90802 312950 345416 -300066 -1403068 -1855885
33490 -1855885 -1039757 307571 1114558 1236334 1147990 1016815 789702 706828 938878 1043521
33480 1043521 549828 -167740 -367023 -89049 -15081 -283645 -327093 62918 379706 324735
33470 324735 287434 563796 794216 610258 268531 184065 312273 445255 665886 993255
33460 993255 979600 284339 -582158 -720761 -5329 733785 717788 -937 -800868 -1147953
33450 -1147953 -901093 -292014 235473 348506 102207 -189110 -331920 -355236 -295575 -137428
33440 -137428 -4667 -148594 -592704 -959177 -851139 -358607 -4567 -144084 -545088 -677787
33430 -677787 -355789 80388 245321 176773 178571 353511 523505 539633 419719 194948
33420 194948 -126567 -416731 -481683 -296941 17762 433198 926314 1174034 753759 -195952
33410 -195952 -897823 -770192 -51486 637924 1043850 1278470 1346721 1087790 503810 -169755
33400 -169755 -698249 -957720 -888797 -521110 12067 567440 987272 1023293 570270 12975
33390 12975 -99372 124908 -47983 -830412 -1393429 -1013363 -215829 -74221 -724364 -1341859
33380 -1341859 -1372690 -992657 -457157 179945 661016 613793 203493 57506 406237 874709
33370 874709 1165753 1280104 1017082 66535 -1207087 -1879287 -1662582 -1230999 -1050209
33361 -1050209 -739489 -42860 469017 354432 181583 626605 1308070 1416580 1024028
33352 1024028 808116 802762 430287 -332130 -764306 -472587 96579 343603 149192 -232962
33342 -232962 -421279 -77133 678833 1126600 751403 27358 -208603 33215 62845 -251364
33332 -251364 -306004 136792 568634 624745 505056 292268 -262115 -936654 -917767 21147
33322 21147 996559 1214399 958600 795534 567328 -30506 -528179 -304212 287035 380511
33312 380511 -48209 -236657 76126 347472 254196 132580 204322 147697 -237805 -564446
33302 -564446 -422880 38750 409312 507636 349371 31502 -97273 423657 1516992 2406372
33292 2406372 2469737 1972551 1596451 1526540 1453661 1270271 1216029 1353189 1411672 1281776
33282 1281776 1230481 1412232 1525237 1262234 834161 656130 668150 432590 -85062 -322120
33272 -322120 87283 727557 954271 747972 602657 740103 903357 880024 763080 643232
33262 643232 472956 326375 372147 469442 238308 -293156 -582253 -362053 -62624 -111718
33252 -111718 -292081 -229102 -64121 -91752 -118530 155423 402916 71637 -605618 -768647
33242 -768647 -132662 662565 1016533 1026708 1000998 923482 685320 365919 22690 -400488
33232 -400488 -777435 -837335 -642628 -553080 -575451 -321048 180388 282189 -296557 -919876
33222 -919876 -950963 -636372 -488179 -327187 298421 1102568 1297577 716079 -8040 -320309
33212 -320309 -188247 251711 827290 1123272 813915 291424 346566 1088184 1755854 1760509
33202 1760509 1331241 923456 581692 213864 -34935 -97310 -248270 -616754 -780251 -325417
33192 -325417 430675 774755 536418 235564 296469 505869 364726 -261323 -974419 -1238599
33182 -1238599 -883899 -235184 256530 443762 442972 289523 -75011 -482738 -580593 -326075
33172 -326075 -112754 -220678 -446994 -474165 -277277 53865 515812 911057 783383 78688
33162 78688 -495386 -322629 199779 225318 -283857 -615590 -522016 -503201 -754602 -734028
33152 -734028 -176378 252377 -73830 -714456 -822238 -409145 -161961 -232494 -77864 467521
33142 467521 794937 492129 39917 58550 327107 167036 -410217 -610171 -11342 758506
33132 758506 867562 433776 299613 768570 1190802 1000057 574644 576431 861971 775341
33122 775341 347141 332286 902439 1169519 494027 -438703 -549437 112337 579382 420544
33112 420544 124569 101558 166612 168923 344205 713050 797605 391924 90938 507619
33102 507619 1298829 1521256 803037 -301958 -1057303 -1236316 -1058284 -771885 -448673
33093 -448673 -77878 234155 249815 -90751 -430528 -356052 -4723 66614 -274141 -469466
33083 -469466 -101267 465304 661781 545220 530378 598468 405048 34757 -22029 313015
33073 313015 518476 260348 -151648 -313207 -280342 -298326 -341749 -242151 -23622 170648
33063 170648 296083 321380 121761 -306479 -702542 -853633 -891728 -1034536 -1197340 -1162485
33053 -1162485 -1000898 -951808 -929244 -581312 56209 404757 139792 -197646 139791 980403
33043 980403 1341169 767798 3293 -37308 500235 761686 479065 199779 279359 421290
33033 421290 412338 571705 1060199 1385103 1147437 751790 721216 760147 289595 -403657
33023 -403657 -473291 118950 469940 102129 -372878 -234381 408231 982147 1153735 846408
33013 846408 128095 -583202 -743263 -443122 -390025 -791506 -917430 -265125 510160 526301
33003 526301 -10512 -253949 -106631 -247604 -922780 -1589125 -1798709 -1669261 -1367864 -834425
32993 -834425 -204896 126335 113668 180574 478098 553739 87682 -514612 -677975 -453439
32983 -453439 -324418 -458871 -595946 -564186 -504510 -556034 -617404 -512551 -235673 44856
32973 44856 166747 136084 121670 253504 430050 413743 141321 -163253 -236603 -51455
32963 -51455 208609 369916 390902 307584 138597 -121134 -424120 -650568 -737297 -777230
32953 -777230 -846834 -764282 -266805 503596 992589 911682 650601 722589 1044629 1168229
32943 1168229 1054920 1114553 1467567 1660825 1282733 509261 -136438 -302177 30075 597068
32933 597068 916304 597786 -175095 -694667 -487484 137229 495201 324583 -48542 -233294
32923 -233294 -216200 -263871 -521155 -766124 -594992 88436 832174 1062585 743818 396116
32913 396116 430439 720085 910540 869007 670734 410916 253257 434386 944012 1354174
32903 1354174 1231812 617826 -106136 -657526 -915635 -777946 -356515 -166886 -603241
32894 -603241 -1221118 -1100844 -97039 820693 817452 290588 184027 569903 650215 85901
32884 85901 -476208 -432799 -81889 6599 -58910 203543 711960 879138 512217 6224
32874 6224 -383841 -825997 -1310727 -1376826 -761265 127035 716420 894537 836694 611846
32864 611846 313343 209993 354486 359631 -10320 -337527 -114992 471832 850500 887098
32854 887098 818666 595815 7491 -630688 -673955 -116568 324810 246569 25367 47543
32844 47543 134807 68473 78312 348214 508817 150748 -467914 -746281 -598211 -502356 -728277
32833 -728277 -917137 -564453 272618 923484 820006 205982 -104989 197576 446917 -11294
32823 -11294 -707345 -636476 169466 550679 -103945 -957465 -967645 -302305 120014 -44233
32813 -44233 -412841 -680273 -819781 -670844 -59110 654169 754872 72942 -706837 -807368
32803 -807368 -203195 411051 375286 -259015 -780648 -592251 120193 652600 597457 60858
32793 60858 -787329 -1783673 -2385286 -1995507 -956456 -443901 -908588 -1366318 -855212 132512
32783 132512 498695 190332 -13977 62924 -84605 -466568 -478473 -35539 201789 -37813
32773 -37813 -173132 237814 794921 908990 565206 123655 -135951 -32823 460094 972400
32763 972400 1006359 597730 247312 136986 -16355 -256933 -221731 140095 355738 193025
32753 193025 -5854 -26058 -153657 -520147 -735592 -573665 -399622 -491104 -548211 -339895
32743 -339895 -205890 -369715 -367712 178699 747461 599603 -120411 -680150 -822611 -822610 -755973
32732 -755973 -451173 -20294 226206 303047 433417 555885 488335 391333 492272 556934
32722 556934 266263 -89150 -8015 285248 108883 -503660 -734632 -207379 493047 745363
32712 745363 649178 584129 622437 686731 777516 766077 431098 -69218 -253220 -68851 -61284
32701 -61284 -512565 -946424 -828862 -268975 326570 792371 1009403 713720 17893 -359018
32691 -359018 -4174 423742 23180 -1024318 -1683835 -1487472 -981831 -742406 -669087 -464253
32681 -464253 -197682 -53096 63573 291213 441462 195884 -429617 -1052938 -1329231 -1260467
32671 -1260467 -1116040 -1097954 -1098370 -848138 -323883 155495 350882 415404 571998 692943
32661 692943 527591 187027 305 -19166 -128317 -330099 -386099 -354695 -552161 -871424
32651 -871424 -756664 -109794 387507 247136 -101218 -72845 119191 -40759 -345318 -190000
32641 -190000 283768 316385 -148210 -202356 647370 1644347 1823674 1265439 713532 419129
32631 419129 61426 -434621 -712084 -597813 -337272 -141104 48025 242678 279559 145920
32621 145920 73789 118631 -33275 -574683 -1137177 -1166809 -631394 -36601 256875 423488
32611 423488 760110 1144984 1193953 878911 660291 875427 1239614 1202582 677305 129863
32601 129863 -31421 124330 284437 284119 171465 103317 263297 660967 946722 717304
32591 717304 115406 -226378 -33262 215139 57320 -183816 76512 667526 817182 282085
32581 282085 -302996 -344175 -27251 118953 -6446 -76220 121425 448812 660624 688972
32571 688972 677467 770168 867700 699741 239790 -126525 -63267 264421 500763 667479
32561 667479 991433 1305372 1174153 617637 145526 1253 -43476 -21139 417808 1218053
32551 1218053 1614447 1119295 310464 80123 482125 880039 914650 736953 517109 307648
32541 307648 244532 358919 336559 -28912 -322555 -11137 701801 1151047 1221527 1376179
32531 1376179 1693448 1653378 1038174 325508 -62557 -236827 -290874 15240 599439 770185
32521 770185 191802 -417909 -249913 371944 515352 89599 -120132 203348 442204 112318
32511 112318 -395730 -518528 -334233 -209507 -113621 186153 563147 689447 563420 409520
32501 409520 210442 -171454 -508688 -379547 156256 550381 514616 301046 126612 -151814
32491 -151814 -560395 -733320 -475395 -146337 -61891 52061 478603 792223 427371 -286262
32481 -286262 -452098 99798 651380 781260 861641 1142551 1201141 777119 420888 661781
32471 661781 1074728 896131 209391 -214863 -68511 189907 122760 -186004 -435889 -436987
32461 -436987 -111518 430992 829770 837482 681479 708634 809638 631584 226066 -27851
32451 -27851 -55087 -76882 -20715 429608 1133941 1486266 1270302 931033 792626 621140
32441 621140 263596 107200 440590 838952 718564 185268 -170268 -92731 195637 509416
32431 509416 885911 1289382 1496867 1329684 824283 216906 -148846 -81346 154364 31031
32421 31031 -553756 -1051701 -958769 -446036 1818 278251 584797 906818 1032395 977455
32411 977455 939594 876281 554944 32117 -301856 -213146 137580 462291 571314 357793
32401 357793 -122832 -549262 -611152 -395032 -211527 -91118 179357 536306 598483 247247
32391 247247 -144558 -204283 54492 435182 769187 814304 390097 -192096 -303035 127130
32381 127130 394575 59013 -327170 -90859 424744 373949 -219911 -526681 -301733 -219064
32371 -219064 -569214 -619858 142208 961944 846384 65270 -351892 -266206 -468008 -1120241
32361 -1120241 -1341934 -680587 48891 16079 -386686 -369345 -144861 -488858 -1255125 -1436562
32351 -1436562 -717556 32508 67848 -271268 -303470 -31960 77131 -153763 -592292 -1156624
32341 -1156624 -1702466 -1834564 -1332958 -600117 -243442 -324821 -401947 -197978 151048 433568
32331 433568 573691 533767 326735 118598 69919 123220 157076 211780 302097 210267 -153770
32320 -153770 -369730 11099 677517 816480 217456 -439782 -566163 -381680 -354908 -426144
32310 -426144 -258120 62144 111222 -182262 -408429 -285165 -38849 -35711 -255809 -315638
32300 -315638 47101 635439 982107 855577 505179 331574 380572 333439 15321 -292302
32290 -292302 -189742 296344 675219 518044 -52613 -448003 -212872 471930 964106 856358
32280 856358 364816 -38453 -161901 -83353 144408 423838 421209 -79734 -665573 -645411
32270 -645411 -1100 523656 449373 133450 26755 -76767 -537070 -1044768 -961468 -297074
32260 -297074 274179 330879 94056 -108101 -239066 -320600 -262983 -85143 52965 145304
32250 145304 315410 430109 170863 -371960 -644774 -410945 -138293 -289522 -660040 -840633
32240 -840633 -924782 -1177723 -1307232 -795835 123176 590309 358750 178163 608648 1129051
32230 1129051 1001298 511315 558796 1211326 1509622 848241 -158068 -529380 -123663
32221 -123663 435104 650149 490616 77513 -453140 -839149 -874425 -704086 -609077 -565446
32211 -565446 -397769 -277035 -538873 -973211 -893213 -128726 604083 661240 292721 72195
32201 72195 -10890 -284338 -580960 -449173 -46402 -51812 -599301 -984017 -663724 17217
32191 17217 402488 350106 152717 25915 25006 144597 163486 -287301 -1124144 -1595191 -1145125
32180 -1145125 -270591 32388 -433722 -905804 -820598 -517793 -529211 -687175 -416928 332036
32170 332036 945861 925649 411044 -179627 -699151 -1213834 -1595840 -1524901 -927383 -153587
32160 -153587 387731 580071 491249 165663 -267875 -499505 -345689 -10721 250040 540681
32150 540681 995238 1229710 739963 -154086 -461335 155595 847785 732341 -2964 -607670
32140 -607670 -848245 -997230 -1162025 -1256979 -1335702 -1353599 -926849 20084 717675 449008
32130 449008 -313930 -582137 -410098 -663933 -1300229 -1222414 -185275 502761 -72560 -906575
32120 -906575 -535023 776269 1472113 910119 -12470 -309590 6014 379974 493028
32111 493028 375931 230004 248036 327223 83889 -520621 -863194 -475117 115506 20089
32101 20089 -715054 -1182494 -920787 -396988 -125703 -38032 89899 225357 339748 538191
32091 538191 698548 484143 -48377 -326856 -6728 567286 863187 742707 353714 -158370
32081 -158370 -624140 -892938 -1069046 -1354874 -1563595 -1233916 -374744 368354 477172 74327
32071 74327 -438350 -756771 -591875 156254 924644 848521 -89952 -911644 -965728 -690086
32061 -690086 -628304 -500715 72701 637158 540144 -1636 -314002 -332623 -417602 -469078
32051 -469078 -132774 363392 474810 266672 209437 221690 -154147 -727000 -800032 -356360
32041 -356360 -115679 -300300 -342683 -36544 33001 -418239 -800032 -673446 -508224 -810265
32031 -810265 -1209763 -1102496 -652092 -465575 -652773 -823847 -752242 -533730 -305065 -187024
32021 -187024 -271497 -398714 -287379 -110907 -446546 -1324899 -1899129 -1541543 -751722 -410159
32011 -410159 -591534 -749281 -682212 -621149 -623178 -542563 -416618 -314056 -38334 452540
32001 452540 638909 121712 -567750 -591822 -21717 376015 386420 459792 639266 395418
31991 395418 -299177 -707811 -487098 -232111 -420495 -621388 -333064 85945 10907 -448575
31981 -448575 -755810 -860370 -1063855 -1235860 -944775 -314218 -30149 -374689 -836799 -886955
31971 -886955 -644806 -475735 -323030 101628 631116 665004 17367 -659180 -662760 -244961
31961 -244961 -309754 -1096890 -1784704 -1716542 -1407876 -1688188 -2294963 -2249101 -1486060 -1058565
31951 -1058565 -1503528 -2023055 -1800084 -1239896 -1153219 -1396438 -1238896 -638715 -191751 -52532
31941 -52532 128770 280960 -79299 -794303 -988311 -379074 189523 9755 -450426 -410468
31931 -410468 -57254 -147157 -711244 -1055226 -945831 -925591 -1302823 -1601698 -1366379 -896201
31921 -896201 -700341 -679028 -425333 -45880 -13752 -285614 -258402 231759 487478 -90936
31911 -90936 -1061222 -1446791 -963227 -265672 -71909 -469730 -1064971 -1404318 -1213532 -592434
31901 -592434 -53832 -41792 -350262 -365941 54022 370253 173355 -235782 -341183 -99672
31891 -99672 190916 376691 435212 266890 -94059 -285898 -55801 285838 262064 -78722
31881 -78722 -303323 -286270 -279559 -376832 -423894 -448833 -653757 -922197 -863700 -476570 -243252
31870 -243252 -361734 -396904 -7571 447441 457998 162860 89815 285473 240853 -294008
31860 -294008 -861077 -844713 -236791 353317 399029 27053 -181103 79210 457097 419645
31850 419645 -40974 -444152 -519597 -514161 -689795 -850360 -624142 -21242 557201 786049
31840 786049 703836 587494 662916 877070 896773 464224 -186804 -473127 -148032 368651
31830 368651 538564 385550 363485 671036 1005700 995049 621113 153399 -172929 -334903
31820 -334903 -467824 -693131 -981519 -1189068 -1226886 -1137541 -992507 -799532 -545441 -251404
31810 -251404 45242 297267 438966 452358 408244 345750 200451 -873 -25923 223310
31800 223310 419285 245829 -9670 152702 494866 186842 -894383 -1739318 -1519876
31791 -1519876 -698582 -229756 -187741 32859 483621 527749 -58432 -607980 -392347 564453
31781 564453 1645067 2211721 1942107 1018621 133958 -21873 557586 1213655 1345802
31772 1345802 922394 330377 -26961 -26044 58409 -180824 -719318 -1030034 -818050 -473929
31762 -473929 -410476 -373319 4070 370702 172862 -311711 -396902 -251855 -632253 -1354210
31752 -1354210 -1307912 -325944 225351 -600371 -1852231 -2041629 -1144131 -261392 85107
31743 85107 258195 477678 541588 487272 672626 1144676 1532915 1572783 1279852 732770
31733 732770 125059 -177063 -87675 -45254 -336146 -551416 -294081 29268 -97300 -235616
31723 -235616 373013 1353100 1511185 620925 -228167 -261754 86064 258865 477842 959620
31713 959620 1161805 601256 -221712 -496298 -220391 76405 302851 715665 1144323 1117591
31703 1117591 685079 410051 526788 710724 729209 718235 670456 236222 -641310 -1336330
31693 -1336330 -1241107 -647035 -458818 -1020184 -1634815 -1470607 -660029 -117142 -327464 -777169
31683 -777169 -758294 -314113 5314 17222 -8341 4455 -180905 -541874 -693628 -508858
31673 -508858 -291329 -138226 264358 888315 1050351 395124 -351560 -327787 152028 76724
31663 76724 -652283 -1042819 -563904 43526 -54979 -529368 -475743 168685 559183 181754
31653 181754 -519575 -861841 -718187 -356414 57057 404349 380007 -184923 -854113 -945532
31643 -945532 -439501 -69963 -312677 -721711 -636879 -201887 -144828 -671680 -1134790 -909433
31633 -909433 -187195 306543 153909 -353306 -542463 -65402 643677 764261 134882 -369234
31623 -369234 76438 1027365 1292623 597684 -76077 23520 440241 446693 187308 198207
31613 198207 352946 118104 -438163 -704582 -485312 -177874 -24244 115946 182527 -192403
31603 -192403 -968268 -1449838 -1114759 -312383 188289 89054 -267335 -411792 -189979 178829
31593 178829 307054 8224 -433446 -503137 -66600 412910 392034 -150787 -757328 -1013709
31583 -1013709 -877186 -547023 -187283 164743 488187 672534 585136 248474 -106141 -205701
31573 -205701 42415 466228 728131 582392 148073 -147429 -56618 160478 149582 75157
31563 75157 383790 969356 1145857 643926 48785 -124854 -235433 -831264 -1612200 -1796607
31553 -1796607 -1289874 -738916 -489355 -230653 215628 443051 101183 -479882 -652134
31544 -652134 -202723 469058 787786 543897 124999 144039 671005 1026781 640882 -122300
31534 -122300 -446883 -181528 99534 51420 -70894 -23941 83658 181303 363792 473660
31524 473660 158910 -442665 -669910 -257432 271237 427846 423561 648867 1001668 1150548
31514 1150548 1047388 795324 411716 90665 275222 1047575 1812861 1980532 1606284
31505 1606284 1031406 361811 -268230 -434540 -11966 392916 224524 -165711 -106439 284367
31495 284367 340807 -17114 -210944 -8777 192211 161990 173189 350537 352604 7510
31485 7510 -275255 -107938 238134 189308 -340560 -846271 -855473 -441510 -81165 -77942 -217722
31474 -217722 -107253 203327 225904 -250270 -802389 -954477 -757772 -485847 -136445 320256
31464 320256 543857 237230 -285836 -537353 -653670 -1094135 -1678824 -1686875 -954811 -156389
31454 -156389 161703 167798 170472 88029 -206759 -528824 -677676 -675597 -483447 60650 769319
31443 769319 1062093 734454 348600 482347 946234 1137772 876373 479689 219681 88470
31433 88470 -2904 -84027 -124298 -25565 254985 501244 401574 15354 -227834 -128558 37060
31422 37060 56880 161931 565521 993807 1067600 870715 722405 603136 256246 -257119
31412 -257119 -539475 -385871 -3902 289568 317317 10855 -580175 -1195468 -1488044 -1319487
31402 -1319487 -855776 -396969 -187562 -306420 -612885 -843420 -846296 -677057 -451318 -235568
31392 -235568 -104627 -107508 -101737 159808 648042 958208 748695 141092 -433558 -653537
31382 -653537 -501663 -218448 -134182 -367440 -646744 -640464 -460058 -527042 -914613 -1212453
31372 -1212453 -1149125 -933848 -820812 -767408 -730806 -837125 -981017 -753893 -148450 157247
31362 157247 -285784 -936062 -1007504 -617144 -496900 -793744 -927274 -612468 -284096 -332922
31352 -332922 -513815 -394958 4435 304537 259679 -38062 -324443 -432168 -441664 -514723
31342 -514723 -542921 -200024 483305 916936 674119 144636 6801 254948 304588 -36446
31332 -36446 -317200 -220343 -9016 -2 -62977 72970 330445 378606 52754 -494142 -961072
31321 -961072 -1155018 -1152767 -1158106 -1116226 -684873 179170 883114 885537 538337 685392 1452092
31310 1452092 2017391 1711438 815889 56907 -253098 -286706 -256697 -222549 -175410 -96366
31300 -96366 -4780 -4235 -158193 -347867 -438374 -508255 -657445 -695441 -378052 118127 377487
31289 377487 374555 458459 687362 696579 356678 47701 36796 27114 -346567 -879742 -987910
31278 -987910 -400404 521942 1085814 881780 263237 104578 797269 1639790 1656522 884236
31268 884236 262544 297589 542415 519756 411834 509570 618687 457824 195210 194638 555818
31257 555818 1136721 1652084 1634235 844286 -132982 -383080 35863 94003 -570938 -981243
31247 -981243 -406250 350206 191787 -537482 -720129 -303484 -178503 -508354 -525811 -27182
31237 -27182 198320 -279771 -836404 -873608 -689496 -757139 -896335 -746531 -488223 -500132
31227 -500132 -691395 -696556 -458432 -191164 2223 106880 -1127 -389347 -857597 -1159547
31217 -1159547 -1289843 -1340871 -1261134 -987704 -650531 -414454 -265616 -169464 -274513 -686694
31207 -686694 -1148046 -1242739 -920458 -551616 -399632 -280678 80548 525847 594215 195066
31197 195066 -180861 -153661 -82999 -564313 -1405212 -1693841 -1041958 -178767 60956 -170433
31187 -170433 -194896 42143 13578 -366772 -553196 -306541 -134412 -492487 -1047024 -1117349
31177 -1117349 -570738 50346 157149 -324505 -917339 -1029920 -561652 -80080 -189154
31168 -189154 -731769 -927674 -375966 412006 660422 246397 -268565 -370872 -121094 26220
31158 26220 -220037 -668039 -888102 -742239 -526839 -522672 -617096 -567863 -422395 -352705 -237159
31147 -237159 170683 704825 864508 491999 -28327 -351435 -548337 -717358 -609524 9186
31137 9186 813237 1095417 531659 -402267 -874112 -549033 75382 300682 122830 184338
31127 184338 755931 1221397 931429 173495 -261753 -218350 -213433 -455324 -569286 -388444
31117 -388444 -296906 -517850 -658802 -318347 309607 764533 859131 605856 23984 -630429
31107 -630429 -818371 -320244 359674 554857 214685 -177918 -271096 -124788 20322 -18745
31097 -18745 -259814 -502000 -497774 -287211 -165217 -216139 -156012 198914 585119 624261 278753
31086 278753 -195533 -517606 -470373 -27358 435154 383908 -187006 -631302 -445288 137144
31076 137144 591327 766525 764295 524810 11898 -415813 -312683 241270 703819 701401
31066 701401 328234 -79224 -197260 138453 759149 1211749 1203144 899663 612473 367339
$$ [...]
##END NTUPLES=NMR SPECTRUM
##END=
