##TITLE=31Pdec_LR-741-RM4
 , 24 sc
 9.11.2021
##JCAMPDX= 6.0         $$ Bruker NMR JCAMP-DX V2.0
##DATA TYPE= NMR SPECTRUM
##DATA CLASS= NTUPLES
##ORIGIN= UXNMR, Bruker Analytische Messtechnik GmbH
##OWNER= root
$$ XWIN-NMR		Version 3.5
$$ Tue Nov  9 10:54:27 2021 Russian Standard Time (UT+4h)  she@DPX200
##.OBSERVE FREQUENCY= 81.013821
##.OBSERVE NUCLEUS= ^31P
##.ACQUISITION MODE= SIMULTANEOUS
##.ACQUISITION SCHEME= undefined
##.AVERAGES= 24
##.DIGITISER RES= 16
##SPECTROMETER/DATA SYSTEM= spect
##.PULSE SEQUENCE= zgpg30
##.SOLVENT NAME= Acetone
##.SHIFT REFERENCE= (INTERNAL, Acetone, 0, 248.564)
##AUDIT TRAIL= $$ (NUMBER, WHEN, WHO, WHERE, WHAT)
$$ ##TITLE= Audit trail, XWIN-NMR		Version 3.5
$$ ##JCAMPDX= 5.01
$$ ##ORIGIN= Bruker BioSpin GmbH
$$ ##OWNER= she
$$ F:/spectra/data/she/nmr/P31/1/pdata/1/auditp.txt
$$ ##AUDIT TRAIL=  $$ (NUMBER, WHEN, WHO, WHERE, WHAT)
(   1,<2021-11-09 10:52:34.21 +0400>,<she>,<DPX200>,
      <created by zg, POWCHK disabled, PULCHK disabled
       configuration hash MD5:
       00 E9 B6 7A A2 85 ED C7 34 08 36 98 17 FE 4E 26
       data hash MD5: 32K
       5B AF 10 2C DF F7 C6 72 F7 99 5D 98 D7 6C EB E4>)
(   2,<2021-11-09 10:53:27.87 +0400>,<she>,<DPX200>,
      <Start of raw data processing
       efp BC_mod = 2 LB = 1 FT_mod = 6 PKNL = 1 PHC0 = -8885.187 PHC1 = 196.4694 SI = 64K 
       data hash MD5: 64K
       59 B5 44 BD 5A A9 0C E1 2E F4 12 24 46 E2 37 6C>)
(   3,<2021-11-09 10:53:49.37 +0400>,<she>,<DPX200>,
      <pk PHC0 = 18.05895 PHC1 = -25.6 
       data hash MD5: 64K
       28 6F 20 9D CE 76 27 FD 20 C2 07 E5 DE 74 D3 9A>)
(   4,<2021-11-09 10:53:53.46 +0400>,<she>,<DPX200>,
      <abs ABSG = 5 
       data hash MD5: 64K
       FA C8 C3 5E 30 A4 AE CE 40 97 A5 E1 1B 7B 63 F1>)
$$ ##END=
$$ 
$$ hash MD5
$$ 57 D1 40 DE 69 AE 7A 5E 0E D8 0B 78 81 5B AA AD
##$RELAX= 
##$RELAX= 
##$RELAX= 
##$RELAX= 
##$RELAX= 
##$RELAX= 
##$RELAX= 
##$RELAX= 
$$ Bruker specific parameters
$$ --------------------------
##$DU= <F:/spectra>
##$EXPNO= 1
##$NAME= <P31>
##$PROCNO= 1
##$TYPE= <nmr>
##$USER= <she>
##$AMP= (0..31)
100 100 100 100 100 100 100 100 100 100 100 100 100 100 100 100 100 100 
100 100 100 100 100 100 100 100 100 100 100 100 100 100 
##$AQSEQ= 0
##$AQ_mod= 1
##$AUNM= <au_zg>
##$AUTOPOS= <>
##$BF1= 81.014009
##$BF2= 200.13
##$BF3= 200.13
##$BF4= 200.13
##$BF5= 200.13
##$BF6= 200.13
##$BF7= 200.13
##$BF8= 200.13
##$BYTORDA= 1
##$CFDGTYP= 0
##$CFRGTYP= 5
##$CHEMSTR= <none>
##$CNST= (0..31)
1 1 145 1 1 1 1 1 1 1 1 1 1 1 1 1 1 1 1 1 1 1 1 1 1 1 1 1 1 1 1 1 
##$CPDPRG= <waltz16>
##$CPDPRG1= <>
##$CPDPRG2= <waltz16>
##$CPDPRG3= <>
##$CPDPRG4= <mlev>
##$CPDPRG5= <mlev>
##$CPDPRG6= <mlev>
##$CPDPRG7= <mlev>
##$CPDPRG8= <mlev>
##$CPDPRGB= <>
##$CPDPRGT= <>
##$D= (0..31)
0 1 0 0 0 0 0 0 0 0 0 0.03 2e-05 3e-06 0 0 0 0 0 0 0 0 0 0 0 0 0 0 0 0 
0 0 
##$DATE= 1636440753
##$DBL= (0..7)
120 120 120 11 120 120 24 19 
##$DBP= (0..7)
150 150 150 150 150 150 150 150 
##$DBP07= 0
##$DBPNAM0= <>
##$DBPNAM1= <>
##$DBPNAM2= <>
$$ [...]
##$SUBNAM3= <"">
##$SUBNAM4= <"">
##$SUBNAM5= <"">
##$SUBNAM6= <"">
##$SUBNAM7= <"">
##$SUBNAM8= <"">
##$SUBNAM9= <"">
##$SW= 501.771253377433
##$SWIBOX= (0..15)
0 1 3 0 0 0 0 0 0 0 0 0 0 0 0 0 
##$SW_h= 40650.406504065
##$TD= 32768
##$TD0= 1
##$TE= 0
##$TE2= 300
##$TE3= 300
##$TEG= 300
##$TL= (0..7)
0 120 53 12 22 120 120 120 
##$TP= (0..7)
150 150 150 150 150 150 150 150 
##$TP07= 0
##$TPNAME0= <>
##$TPNAME1= <>
##$TPNAME2= <>
##$TPNAME3= <>
##$TPNAME4= <>
##$TPNAME5= <>
##$TPNAME6= <>
##$TPNAME7= <>
##$TPOAL= (0..7)
0.5 0.5 0.5 0.5 0.5 0.5 0.5 0.5 
##$TPOFFS= (0..7)
0 0 0 0 0 0 0 0 
##$TUNHIN= 0
##$TUNHOUT= 0
##$TUNXOUT= 0
##$USERA1= <user>
##$USERA2= <user>
##$USERA3= <user>
##$USERA4= <user>
##$USERA5= <user>
##$V9= 5
##$VALIST= <valist>
##$VCLIST= <CCCCCCCCCCCCCCC>
##$VD= 0
##$VDLIST= <DDDDDDDDDDDDDDD>
##$VPLIST= <PPPPPPPPPPPPPPP>
##$VTLIST= <TTTTTTTTTTTTTTT>
##$WBST= 1024
##$WBSW= 4
##$XGAIN= (0..3)
0 0 0 0 
##$XL= 0
##$YL= 0
##$YMAX_a= 17367
##$YMIN_a= -20628
##$ZGOPTNS= <>
##$ZL1= 120
##$ZL2= 120
##$ZL3= 120
##$ZL4= 120
##$ABSF1= 248.5645
##$ABSF2= -253.2056
##$ABSG= 5
##$ABSL= 3
##$ALPHA= 0
##$AQORDER= 0
##$ASSFAC= 0
##$ASSFACI= 0
##$ASSFACX= 0
##$ASSWID= 0
##$AUNMP= <proc_1d>
##$AZFE= 0.1
##$AZFW= 0.5
##$BCFW= 0
##$BC_mod= 2
##$BYTORDP= 0
##$COROFFS= 0
##$CY= -3
##$DATMOD= 1
##$DC= 0
##$DFILT= <>
##$DTYPP= 0
##$F1P= 0
##$F2P= 0
##$FCOR= 1
##$FTSIZE= 65536
##$FT_mod= 6
##$GAMMA= 0
##$GB= 0
##$INTBC= 1
##$INTSCL= 5.30512e-09
##$ISEN= 30
##$LB= 1
##$LEV0= 0
##$LPBIN= 0
##$MAXI= 10000
##$MC2= 0
##$MEAN= 0
##$ME_mod= 0
##$MI= 50
##$NCOEF= 0
##$NC_proc= -5
##$NLEV= 6
##$NOISF1= 182.463
##$NOISF2= 159.3651
##$NSP= 0
##$NTH_PI= 0
##$NZP= 0
##$OFFSET= 248.5645
##$PC= 4
##$PHC0= -8867.128
##$PHC1= 170.8694
##$PH_mod= 1
##$PKNL= yes
##$PPARMOD= 0
##$PSCAL= 0
##$PSIGN= 0
##$REVERSE= no
##$SF= 81.014009
##$SI= 65536
##$SIGF1= 159.3651
##$SIGF2= -187.1042
##$SINO= 113.3802
##$SIOLD= 16384
##$SREGLST= <1H.CDCl3>
##$SSB= 0
##$STSI= 65536
##$STSR= 0
##$SW_p= 40650.406504065
##$SYMM= 0
##$S_DEV= 0
##$TDeff= 32768
##$TDoff= 0
##$TI= <>
##$TILT= no
##$TM1= 0
##$TM2= 0
##$TOPLEV= 0
##$USERP1= <user>
##$USERP2= <user>
##$USERP3= <user>
##$USERP4= <user>
##$USERP5= <user>
##$WDW= 1
##$XDIM= 65536
##$YMAX_p= 504566012
##$YMIN_p= -49425866
$$ End of Bruker specific parameters
$$ ---------------------------------
##NTUPLES= NMR SPECTRUM
##VAR_NAME=  FREQUENCY,     SPECTRUM/REAL,   SPECTRUM/IMAG
##SYMBOL=    X,             R,               I
##VAR_TYPE=  INDEPENDENT,   DEPENDENT,       DEPENDENT
##VAR_FORM=  AFFN,          ASDF,            ASDF
##VAR_DIM=   65536,         65536,           65536
##UNITS=     HZ,            ARBITRARY UNITS, ARBITRARY UNITS
##FACTOR=    0.620285442955139, 1,           1
##FIRST=     20137.2065510759, 0,            0
##LAST=      -20513.1999529892, 0,           0
##MIN=       -20513.1999529892, -49425866,   0
##MAX=       20137.2065510759, 504566012,    0
$$ Real data points
##PAGE= N=1
##DATA TABLE= (X++(R..R)), XYDATA
$$ [...]
39221F97406m73867m21227j79279Q917P1565J09795J37471L5343k05194l67867
39211e86937k25187J84275N29175M73980M9972l17829k66178R0272L39710K65334
39201E36587l5442l85051o13872n46754k05642R5411J39081R1861J17184N3903
39191g52734j16964K0145N29714O30025j28172p79676k56773P06696N33597n97689
39181b11831r56732j39854L09652l22701o56563K56219J140960O80358k42691
39172a43183j93318L71063J92955m18770l17286K75061L07310l4274J79241O00887
39162H19686J56761p58136p46491J19061M13155r7279j96364L54632L64892m07685
39152B2232o20080K43036Q77915M27653j78088r7060M4253k98270m16549R0834
$$ plain form
39221 697406 223539 -197688 -376967 -368050 -296485 -186690 -49219 -13876 -219070 -586937
39211 -586937 -812124 -627849 -98674 375306 425278 107449 -158729 -68457 271253 536587
39201 536587 501145 116094 -497778 -1044532 -1250174 -1154763 -1015682 -923821 -806637 -752734
39191 -752734 -869698 -849553 -319839 310186 182014 -597662 -854435 -147739 385858 -211831
39181 -211831 -1168563 -1308417 -998765 -1321466 -1978029 -1721810 -580850 99508 -143183
39172 -143183 -336501 34562 227517 -191253 -508539 -233478 73832 39558 218799 819686
39162 819686 976447 218311 -528180 -409119 4036 -93243 -289607 65025 429917 22232
39152 22232 -597848 -354812 523103 950756 772668 675608 719861 421591 5042 95876
39142I5876K84435l03816m97093M26749J111913L32379p05417l01392P80082N94679
39132A818395o59112j076400l17210P6330m17788n37433K51687P49040K47587
39123A35096k32704J10194M44408j8385m54226J01811R11034O53513m12662q99884
39113C38195m27821Q0969L5385j71271j66226j35232j55185P4880N23218O03920
39103F00832M5901n92217o53807j97771K45776L62318J93995p4242j79690O2945
39093a85960M07735L21678k18227m80389K2349O77518N47811k50189o94239l16664
39083a68577K84531N04635M79423M63409K47411k83047o47819m47556m0863O3113
39073D54660O753J13163J15719l06549o41940k00580N79518N79112k71560q18786
$$ plain form
39142 95876 380311 76495 -420598 6151 1118064 1450443 745026 443634 1223716 1818395
39132 1818395 1159283 82883 -234327 -157997 -575785 -1113218 -861531 -112491 135096
39123 135096 -97608 12586 456994 438609 -15617 86194 997228 1650741 1238079 338195
39113 338195 -89626 -8657 26728 -144543 -310769 -446001 -601186 -526306 -3088 600832
39103 600832 646733 54516 -599291 -797062 -551286 -188968 5027 -69215 -248905 -185960
39093 -185960 221775 543453 325226 -155163 -132814 544704 1092515 842326 148087 -168577
39083 -168577 115954 620589 1100012 1563421 1810832 1527785 879966 432410 391547 454660
39073 454660 461413 574576 690295 383746 -258194 -458774 120744 699856 428296 -390490
39063c90490m16348K40677L57124J15055J9026M7898M5058J94051M85743L95661
39053A093455k52131p29215m22564J53585J46648l07577m09814k7682K00656j8969
39043e73608k48476j08433K11289L77867L59435K93674K48697K10964J10751j15779
39033G66381l53965l70338j97259j67773l46193l03736J90579O39735M55175j60804
39023A51802m73494j79594L26268N12260J94436l70788o27961k24601M31608N43927
39013B83863N8195k16671N2694J26177m40406p70319l3112R59453Q51846q8388
39003G83332m02344J94749M75609j58857p59161m97169R8219K20589o422r5386
38993a46841n4028j1041K18774N80857N51617M9055k01498J68495M37616m6948
$$ plain form
39063 -390490 -806838 -566161 -209037 -93982 -74956 -27058 18000 212051 697794 1093455
39053 1093455 841324 112109 -310455 -156870 -10222 -317799 -727613 -755295 -554639 -573608
39043 -573608 -822084 -930517 -719228 -341361 18074 311748 560445 771409 882160 766381
39033 766381 412416 42078 -155181 -322954 -669147 -972883 -782304 -142569 312606 151802
39023 151802 -321692 -501286 -175018 337242 531678 160890 -467071 -691672 -260064 283863
39013 283863 342058 125387 178081 304258 -136148 -906467 -939579 19874 871720 783332
39003 783332 380988 575737 1051346 892489 133328 -363841 -265622 -45033 -51455 -146841
38993 -146841 -200869 -211910 6864 587721 1139338 1188393 986895 1155390 1593006 1546058
38983A546058p32283p33900k13146M7701m1289M1421L47007M00880J03093j33701
38973F31841j18194q1442j53972j95418j28437j2020J23186J64251j16227n96336
38963d82768o66635o2827N44779M28156p7585q5044M57511P30281L20429k81250
38953H25047n27334m32630k21525M389J02043m8811k03116k032L71715L74160
38943B41906J3516p4672L48403O88340M26005j20207l52327k42621j60799j94985
38933E72559j40310O033j5871k98039n69939n10761j30828K32200L09002K37501
38923c08453L45449N76901M62035j30705n91913l47802K66406M71874J67306q3167
38913H27931o7719j56892m49594m79589l7395L95708L81784J24836j1726n5233
$$ plain form
38983 1546058 813775 79875 -133271 -85570 -126859 -85438 261569 662449 765542 631841
38973 631841 513647 432205 278233 82815 -45622 -57642 65544 229795 113568 -482768
38963 -482768 -1149403 -1212230 -667451 -239295 -316880 -401924 55587 785868 1106297 825047
38953 825047 297713 -134917 -356442 -352053 -250010 -298821 -501937 -503969 -132254 241906
38943 241906 255422 180750 529153 1217493 1643498 1523291 1170964 928343 767544 572559
38933 572559 432249 438282 422411 124372 -445567 -956328 -1087156 -854956 -545954 -308453
38923 -308453 36996 613897 1075932 945227 353314 5512 271918 743792 911098 827931
38913 827931 760212 603320 153726 -325863 -363258 32450 414234 539070 527344 472111
38903D72111j20834n5138K08400L64755K03021k8306p2635p2903j82002k17142
38893D99327q6654q0661l00950l20974N8685K66196j48593n90708k54811M92884
38883d66259N81000p8569m53824l7916M46110L50107J24818L91226P47572L75478
38873A979743n53210r78531m34288L34977M57654M7656j78305k0803M8035j96217
38863E06711k70826K24257P88454N79035l44129r83046p31631j12683J29901P3788
38853a40169K00099L99315J68410l66118m27410K70119R98990R33170J50326n89205
38843A597527p66488n00357j90642m9677O153J17771K06646M5069l38162n26276
38833c98436k19982K86636M58643K47047P5536J27294R4364k34009n36682l83393
$$ plain form
38903 472111 351277 296139 504539 869294 1072315 1044009 971374 898471 716469 499327
38893 499327 412673 332012 31062 -289912 -231227 34969 -113624 -704332 -959143 -466259
38883 -466259 114741 36172 -417652 -455568 -9458 340649 465467 856693 1604265 1979743
38873 1979743 1426533 448002 13714 348691 806345 854001 675696 654893 702928 506711
38863 506711 235885 460142 1248596 1827631 1483502 500456 -231175 -343858 -213957 -140169
38853 -140169 59930 459245 627655 261537 -165873 104246 1103236 2036406 2186732 1597527
38843 1597527 831039 330682 140040 90363 96516 214287 420933 466002 127840 -398436
38833 -398436 -618418 -331782 126861 373908 449444 576738 671102 437093 -99589 -482982
38823d82982J44200N30383M39167N6590j76584p6371R1310l2834l90472n35697
38813d33290k47426J42043K34883J26482J43923K34217O8882l10265m35959r6941
38803e73451L23612L61164M5245k06481r9045K50181M44516K20659k07980l37699
38793B20721k0413K89735J59216j96753k47814Q1594L67439K88620q5533m86701
38783C70111o08121k72427K32828K92797j63454l60826J87898P62601M78961k30847
38773F89521k91158J90589J35847n17817n79264L13202R04242L20279n18256m48171
38763A99014J42568K24401j08500o7671K91521K69382j23707k21413R7204L25638
38753A028437L00301K83809K21686j40132n12256l71287O8547J16052k29590l24896
$$ plain form
38823 -482982 -338782 191601 630768 687358 510774 434403 525713 492879 102407 -433290
38813 -433290 -680716 -538673 -303790 -177308 -33385 200832 269714 -40551 -476510 -573451
38803 -573451 -249839 111325 156570 -49911 -148956 101225 545741 766400 558420 220721
38793 220721 200308 490043 649259 452506 204692 286286 653725 942345 856812 370111
38783 370111 -238010 -510437 -277609 15188 -148266 -509092 -321194 441407 920368 689521
38773 689521 398363 588952 724799 206982 -372282 -59080 845162 1165441 647185 199014
38763 199014 341582 565983 457483 389812 681333 950715 827008 605595 702799 1028437
38753 1028437 1328738 1612547 1834233 1694101 1181845 810558 879105 995157 765567 440671
38743D40671o7782j5885k39834j30741L91359N28230q4957o52119m03738K51269
38733A6473M49690J58791j8347N6209p1082n59523r04289n99097J84443P60102
38723e26630O63962J35169j76920J5841L17233K33408j29413k71801n7648J65139
38713C68340J64637Q4311L5511j13539l67161m14794p4012L51256M26498J49203
38703F10250p2919M8685L37992L79321M7543k85765k10009J30550K01563j22368
38693A064843l41078j16409J76138N9813k81674l52271j39532n737j5080M9732
38683I8745J62455J22533K3457Q1222J18373j68874n17071l35173L48260Q15746
38673G49673O30967J20165k10955k29830n6698J37466J31085j44667l87839k81652
$$ plain form
38743 440671 372889 357004 117170 -13571 377788 906018 821061 168942 -234796 16473
38733 16473 466163 624954 606607 662816 591734 32211 -872078 -1471175 -1286732 -526630
38723 -526630 137332 272501 95581 111422 428655 662063 532650 260849 203201 368340
38713 368340 532977 617288 652799 539260 172099 -242695 -316707 34549 461047 610250
38703 610250 537331 586016 924008 1303329 1350872 1065107 855098 985648 1187211 1064843
38693 1064843 723765 607356 783494 843307 561633 209362 69830 64093 49013 98745
38683 98745 261200 383733 407190 488412 606785 437911 -79160 -414333 -66073 749673
38673 749673 1380640 1500805 1289850 1060020 1003322 1140788 1271873 1127206 739367 457715
38663D57715K5606J97938K65496L99407M01918O5080k23273R26L75793K01047
38653B167653l49148m79930j35915j4371k14815p9153M38111M97448j26551m79216
38643A224113N4612P43428P08543J84052j43390k04170k20645q9505J74209R4979
38633B526226m41100p25967l09881J84561J01133j44332J00678M69179K03154
38624A963651m58612o07604r8215L43404K97314O8188J882J12613L26297N05123
38614B454041L66015j07949m10430j82750J70675R7050k31892k94985j22306j14568
38604A622901k40893j48694J11890J66874J849m7123J07917K30277J63080q5787
38594A882291m28735n28893L0484R73771J274912M79896m50551l68492M64143
$$ plain form
38663 457715 483321 681259 946755 1346162 1748080 1813160 1589887 1590813 1966606 2167653
38653 2167653 1818505 1338575 1202660 1188289 973474 894321 1332432 1829880 1703329 1224113
38643 1224113 1278725 2022153 2730696 2914748 2771358 2567188 2346543 2257038 2431247 2526226
38633 2526226 2085126 1359159 1049278 1233839 1334972 1190640 1291318 1760497 1963651
38624 1963651 1505039 897435 799220 1142624 1439938 1508126 1510008 1622621 1948918 2454041
38614 2454041 2820056 2712107 2301677 2118927 2289602 2386652 2154760 1859775 1737469 1622901
38604 1622901 1382008 1233314 1345204 1512078 1513927 1466804 1574721 1804998 1968078 1882291
38594 1882291 1453556 924663 955147 1928918 3203830 3683726 3233175 2864683 3328826
38585C328826Q57756M07721j91308l37079j42563P9195K16954K44200K28870L57627
38575E050199N54836L99052j34838l27893K91804J103107J243040Q61515P78195
38566I819017J266638J908378K335169K491791K492735K673578L326850M133623
38558C0447779M626466N341299P276212J0142700J3114508J7431444K4736491
38551A13116899L1071181K6864469P746706j6773494l1040761k9574558k0871210
38544H0539232j4898395j2660192j0124817o630477m688479m662562m502555l572119
38536A8799636k988847k802183j966330p66218n61737j269783j432020p00853
38528F311665j82421l61649n78787n43947o37753p30502l11372K60179J59282
$$ plain form
38585 3328826 4186582 4594303 4402995 4065916 3923353 4002548 4219502 4463702 4692572 5050199
38575 5050199 5605035 6004087 5869249 5541356 5833160 6936267 8179307 9040822 9819017
38566 9819017 11085655 12994033 15329202 17820993 20313728 22987306 26314156 30447779
38558 30447779 35074245 40415544 47691756 57834456 70948964 88380408 113116899
38551 113116899 144188080 171052549 178799255 162025761 130985000 101410442 80539232
38544 80539232 65640837 52980645 42855828 36225351 31536872 26874310 22371755 18799636
38536 18799636 15810789 13008606 11042276 10276058 9714321 8444538 7012518 6311665
38528 6311665 6129244 5767595 5188808 4644861 4007108 3276606 2965234 3225413 3384695
38519C384695l57106l20110J81384J74955l56617m47238L5471J89783j83886k75684
38509B025647P7014L9693n48916p20087r5738L93089J16522k73842j56833K2994
38499H79543j89479l04445J29019N24919J79341n12097o31551n3673N36476N94755
38489A152808J63688l32236m09409K6466M16989J90681l34090l55861J15477K72836
38479I07349q0895k16741J30453K22402k85765n62973j7141N44288J82163n80407
38469B42733n81114J45719N41396K08508j93656j32120J84437L82630L37874J1114
38459A147521m64954o06560j31777M34166M03531J7792N9562M60049L15766n21617
38449A113479r41294k03912Q11089P98413j18314o50895j95591N16646O48810
$$ plain form
38519 3384695 3027589 2707479 2888863 3063818 2707201 2259963 2295434 2485217 2301331 2025647
38509 2025647 2102661 2142354 1593438 873351 777613 1170702 1287224 1013382 856549 879543
38499 879543 690064 385619 514638 1039557 1218898 706801 75250 21577 558053 1152808
38489 1152808 1316496 984260 574851 601317 1018306 1208987 874897 519036 634513 907349
38479 907349 826454 609713 740166 962568 676803 113830 96689 640977 823140 242733
38469 242733 -338381 -192662 348734 557242 363586 231466 415903 798533 1136407 1147521
38459 1147521 682567 76007 -55770 378396 781927 799719 859281 1319330 1635096 1113479
38449 1113479 172185 -31727 779362 1577775 1459461 808566 612975 1129621 1778431
38440A778431K89954k5353j49972k22512k09999o9500m6435k84687l89595L0480
38430G00812N72797N02050m9467j74613L61161O72513J88360l47790n0034O48887
38420C024676O75864R076l73470n9193L33731K94913N7760q7581k42635l74905
38410C258236j17887N45578J046272J017425P52299N99756N07385M49164O50834
38401H709062J022638J016250M94338J35452M58785R86397R29568K48383n12531
38392A3488342j015681j220349j094738p95536p61459j090265j211019p29452
38384E569843j66077j98450n77093n67428j66604l5097l65516o50630n63295l16780
38374A962873j06299J21072K69834J14219j97553k57856r1677j20598l56688l09414
$$ plain form
38440 1778431 2068385 2043032 1893060 1670548 1460549 1391049 1344614 1059927 670332 700812
38430 700812 1273609 1775659 1726192 1551579 1912740 2585253 2773613 2425823 2375789 3024676
38420 3024676 3700540 3709616 3336146 3276953 3610684 3905597 3963357 3875776 3633141 3258236
38410 3258236 3140349 3685927 4732199 5749624 6501923 7101679 7609064 8058228 8709062
38401 8709062 9731700 10747950 11242288 11377740 11836525 12822922 13752490 14000873 13488342
38392 13488342 12472661 11252312 10157574 9362038 8600579 7510314 6299295 5569843
38384 5569843 5403766 5205316 4628223 4060795 3894191 3859094 3493578 2842948 2279653 1962873
38374 1962873 1856574 1977646 2247480 2361699 2164146 1906290 1814613 1694015 1337327 1027913
38364A027913J24484L64495N5273l34860k40358J61331L05214R0542j01414n1910
38354A400710O3386M8769j4263Q5811L64653N41998L46211o0820j75547J62700
38344B763608M59582K73031o6767K4756L90550L90558Q1013K38327R97767J388776
38334F941201P59445r2736L7465J096135J979499K149198K176650K652279L322498
38325B1021634L605665L440479L193856K948871K291857Q77368r95916k555275
38317C3828539l310225l480858l554047l581563l202178k309937j361587r23582
38309A2104562j128988j613895j789420j259848k94160K27742k07539r30700q73881
38300D233873j20058J80999l99321q85590n02349O2410j35877o73325m85112L30643
$$ plain form
38364 1027913 1152397 1516892 1572165 1237305 996947 1158278 1463492 1554034 1452620 1400710
38354 1400710 1464096 1512865 1498602 1584413 1949066 2491064 2837275 2776455 2600908 2763608
38344 2763608 3223190 3496221 3429454 3454210 3844760 4235318 4316331 4554658 5552425 6941201
38334 6941201 7700646 7607910 7645375 8741510 10721009 12870207 15046857 17699136 21021634
38325 21021634 24627299 28067778 31261634 34210505 36502362 37379730 36383814 33828539
38317 33828539 30518314 27037456 23483409 19901846 16699668 14389731 13028144 12104562
38309 12104562 10975574 9361679 7572259 6312411 6018251 6245993 6038454 5107754 4233873
38300 4233873 4113815 4294814 3895493 3009903 2507554 2569964 2434087 1760762 1275650 1606293
38290A606293P05366L44335J913L3857n7615m22901m32702J00104L57290j77727
38280B058213p54708m73679L30181O56367L03644q0041j19198p1623j56907k17938
38270A474311j29315n8009j96076m98578p16006n61674P714N54087M95923r1734
38260B80643l77495J69757R72750J073187L97200k71024m24188l14603k82233
38251A223994k05841J33193N47455O32970L10013n8405q2427K18544M51742L37703
38241C508941N3010o5745k9396p8864j40865R3148M87371M86357M8293j43753
38231D218497J77497K66599m03696j032243o13100L45414M70102l12375o36822
38222B479873R9655P68742L24665n90677p56426k30016k2030m00469o22577k51026
$$ plain form
38290 1606293 2311659 2655994 2657907 2691764 2634149 2211248 1778546 1878650 2235940 2058213
38280 2058213 1303505 829826 1160007 1816374 2120018 2039977 1920779 1849156 1692249 1474311
38270 1474311 1344996 1286987 1090911 592333 -123673 -685347 -677633 -123546 372377 280643
38260 280643 -96852 72905 1045655 2118842 2516042 2245018 1820830 1506227 1223994
38251 1223994 1018153 1151346 1698801 2331771 2641784 2583379 2500952 2719496 3171238 3508941
38241 3508941 3561951 3496206 3466810 3387946 3247081 3340229 3827600 4313957 4362250 4218497
38231 4218497 4395994 4662593 4258897 3226654 2613554 2958968 3429070 3116695 2479873
38222 2479873 2579528 3348270 3672935 3082258 2325832 2095816 2073786 1673317 1050740 799714
38212G99714K24332K47487m1796k03952j69194j69200k68869k80617p6678K03062
38202B64289K88302P9712k19667l16360j57307M2473J03792O8130K8246n3662
38192A27948k24303l52305k41133P5764K82134J06817l03259m40958l631O35251
38182c37675P49719J31670o17345q17681m63702k8872J73964J22931j15194l11694
38172a513879q9684N11644P85132K57097m48436l89145K70182N12446P2042k46495
38162b79096Q736K73026J00318o1337J95991M34698J97859j33638o3675J23284
38152G96166j9381k18231p0446O6516k79388o64720l80856K67516M40122K07455
38142A44753L04091O09782K44830p06434r80305j11086O56807K03735p60328q16606
$$ plain form
38212 799714 1024046 1271533 1229737 1025785 856591 687391 418522 137905 61227 264289
38202 264289 552591 632303 412636 96276 -61031 -18558 85234 153364 181610 127948
38192 127948 -96355 -448660 -689793 -614029 -331895 -225078 -528337 -969295 -972926 -337675
38182 -337675 412044 543714 -73631 -891312 -1355014 -1383886 -1209922 -1086991 -1202185 -1513879
38172 -1513879 -1603563 -1091919 -306787 -49690 -498126 -887271 -617089 -104643 -32601 -279096
38162 -279096 -270360 2666 102984 41647 237638 672336 870195 736557 672882 796166
38152 796166 776785 558554 488108 554624 275236 -389484 -770340 -502824 -62702 144753
38142 144753 448844 1058626 1303456 597022 -383283 -494369 162438 366173 -394155 -1210761
38132a210761O1887O40894L11507k27374j92467K53638M68964K51325o5595j45368
38122A46650J2028J59949P4084k24360m56153l58974j0017K19184J12284o6732
38112c92057J33636P09766J062150O78454j86188p84938p63958m35801j81700
38103a60636j0788J55432J94508M1549j06311j09051r2780j09678K7153L01115
38093A30513L35667K3773j89753q3813j32582o07411q43076k52195M87946L65340
38083g65591k32275l4677R49708J243567J82733r86893r47988r1846L97102L10751
38073B4591K62946M02596L32520k742k52840l27362l90992l39496L4819M61215
38063B05255M34397Q371k50239j12333O2404j4260j50391o6560J77800K98418
$$ plain form
38132 -1210761 -1148874 -507980 -196473 -423847 -616314 -362676 106288 357613 292018 146650
38122 146650 158678 318627 392711 168351 -287802 -646776 -656793 -437609 -325325 -392057
38112 -392057 -258421 451345 1513495 2191949 2005761 1220823 456865 21064 -160636
38103 -160636 -171424 -15992 178516 220065 113754 4703 -88077 -197755 -170602 130513
38093 130513 466180 489953 300200 216387 83805 -523606 -1366682 -1618877 -1130931 -765591
38083 -765591 -997866 -1032543 -82835 1160732 1343465 356572 -591416 -683262 -286160 24591
38073 24591 287537 690133 1022653 1019911 767071 439709 48717 -290779 -255960 205255
38063 205255 639652 648023 397784 285451 347855 333595 183204 116644 294444 592862
38053E92862J00396l55665p19872n81323K5627M98241L73515k0478n3482K32558
38043I2379K29531j81194l76917j7750L37948R7535l95239l77648J37080M01186
38033e3089J27803r4837J73848M51555J10250n15108n28189J44207N53209J07903
38023D77552n46800m89894J60709N19749K24871k30971l69751k60074r2596J65519
38013d41686M61054M93946J71532j39265j08548J01208J50949K5853p4758j22559
38003E17726k15417k92885k02274Q482J01036n3344l13194l93234j28686K93831
37993f77959M07036j6682n28271m16488L48935R55921P40622P934m28730k61806
37983A30512J03114J88670n4707l43248l96708j81218N7777O3910q6424q9907
$$ plain form
38053 592862 693258 337593 -382279 -963602 -937975 -439734 -66219 -86697 -140179 92379
38043 92379 321910 140716 -236201 -253951 83997 181532 -213707 -591355 -454275 -53089
38033 -53089 74714 -20123 153725 605280 715530 200422 -327767 -183560 369649 477552
38023 477552 -69248 -559142 -398433 121316 346187 115216 -254535 -514609 -607205 -441686
38013 -441686 19368 513314 684846 545581 437033 538241 689190 715043 640285 517726
38003 517726 302309 9424 -192850 -184368 -83332 -136676 -449870 -843104 -971790 -677959
37993 -677959 -270923 -287605 -815876 -1232364 -883429 72492 813114 821048 392318 130512
37983 130512 233626 422296 367589 24341 -372367 -553585 -495808 -431898 -518322 -608229
37973f08229R1394J56138J2848J440K85765M41015J00964l25263j84097L71190
37963C43165N47297J12567k80233j50169J10135l4655l91885m34699j76280l2631
37953c87388l4794J48141M45516L52227j77902m78278j61752K35474J20883j75572
37943a13445j1119L82125K55904k70543k74338L75362O26250o5187p31691l94956
37933b21638L53131L45758k67640l96853J15720L62805K5205j93381M6185J67877
37923C37169j20022k45524J06613L69897J85543R6496M51986O12989J30197j92211
37913A733133M94665J496214J412880J75123r41022j147441q81264p34988o88220
37904I19080n60833l81232j11946K97447M77148l1116q81314j097186l73751M56387
$$ plain form
37973 -608229 -516835 -360697 -347849 -346409 -60644 380371 481335 156072 -28025 343165
37963 343165 890462 1003029 722796 572627 682762 648107 256222 -178477 -354757 -387388
37953 -387388 -422182 -274041 171475 523702 345800 -132478 -294230 -58756 62127 -113445
37943 -113445 -124564 257561 513465 242922 -31416 343946 970196 905009 173318 -221638
37933 -221638 131493 477251 209611 -187242 -71522 291283 316488 123107 169292 337169
37923 337169 217147 -28377 78236 448133 633676 730172 1182158 1795147 1925344 1733133
37913 1733133 2227798 3724012 5136892 5312015 4370993 3223552 2342288 1607300 919080
37904 919080 358247 -22985 -134931 162516 639664 608548 -272766 -1369952 -1743703 -1287316
37894a287316N50058O6514k73224j42487K31078M86640M03088L5242k29617n4012
37884b14036L02437K30871k90810n24987k8482O24017O25924O5837k89992j31576
37874C69203Q2704m4867k63943j52171J88716K74036m5308l55309k63251M6339
37864a63851Q8065k04828l80839j61559J21105L9476k43269j98351K60324O25959
37854b17768N14117J42917o9733p1156p1702r2652L7181K76273L00896l0628l90596
37843C27149l97946j77845j70066l94571l44804J82163N94373L04044l01565l43818
37833g22886K13182M93742J07007k18932J53240O49918L16701o59395j107475
37824g74898m66366N24346Q58619M16378j59640l35256j26264J36821K12313J14374
$$ plain form
37894 -1287316 -737258 -670744 -943968 -1086455 -855377 -368737 34351 69593 -160024 -214036
37884 -214036 88401 319272 28462 -496525 -525007 99010 724934 790771 500779 369203
37874 369203 451907 407040 143097 -9074 179642 453678 408370 53061 -210190 -163851
37864 -163851 -75786 -280614 -661453 -823012 -701907 -662431 -905700 -1104051 -843727 -217768
37854 -217768 296349 439266 369533 298377 226675 134023 171204 447477 748373 717745 327149
37843 327149 -70797 -248642 -418708 -813279 -1158083 -975920 -381547 -77503 -379068 -722886
37833 -722886 -509704 -15962 91045 -127887 25353 675271 991972 332577 -774898
37824 -774898 -1241264 -716918 141701 558079 398439 63183 -63081 73740 286053 400427
37814D00427J809j7080N4651J52487J51105q2660m37682m94831n7148L78338J87351
37803B36767l85339m64948J12258M94432J74738j99123L4408M07678J73402l45252
37793B39021k97043K11066K98932j74971m10996m0726L46657K84742R9056J39768
37783F95506J61336q0355k81509j40262O3269o6609l70019l83579j6991L95763
37773b3450N70716N36555N05193N90106N90645J62425n95608r69246m98155J88256
37763A057437P2270p61677j131946m30991N16700O77029J73282j72547j26501
37754a26944j16015k72371j76356L55344Q14886O35303j2722m03061k01937R2012
37744E88139j14737n58204m13274M05589Q97013L43996n64067o91697j05628J65660
$$ plain form
37814 400427 402236 385156 439807 592294 743399 660739 223057 -271774 -328922 49416 236767
37803 236767 -148572 -613520 -501262 -6830 167908 -31215 3193 410871 584273 239021
37793 239021 -58022 153044 451976 277005 -133991 -174717 171940 456682 555738 695506
37783 695506 856842 776487 494978 354716 417985 351376 -18643 -402222 -419213 -23450
37773 -23450 547266 1083821 1589014 2179120 2769765 2932190 2336582 1367336 869181 1057437
37763 1057437 1129707 368030 -763916 -1194907 -678207 -1178 172104 -443 -126944
37754 -126944 -242959 -515330 -691686 -336342 478544 1113847 1101125 698064 496127 588139
37744 588139 473402 -84802 -498076 -92487 804526 1148522 584455 -107242 -212870 -47210
37734d7210j81961l53665J17142O09588M79518J2172k17973k34842l20537l49879
37724d87647q4483K63412L18766J07985j03072k37960k91984j19961K61511M83685
37714A10252L23814O6975L383n5192l33582n60371l85042n60J77327J67851K31698
37703b53447K97057J51529l7344n732J8105l11512o60654l86122L16871N05839
37693c65410o9245m80088l2473N96887L73617m51696o57065J15250Q10071N32380
37683C72228j70701k40228K62441L61600k06229o04397l27962r377k19013l53551
37673a135189L27522J169639Q58817m98805j316331p43341K44469M49487O8666
37664e75066n1988R2024p4429m60606l83086K45447O86544M18067k38937o40966
$$ plain form
37734 -47210 -229171 -582836 -465694 143894 623412 635584 417611 182769 -137768 -487647
37724 -487647 -572130 -308718 10048 118033 14961 -222999 -514983 -634944 -373433 110252
37714 110252 434066 501041 504424 449232 115650 -444721 -829763 -830323 -652996 -485145 -253447
37703 -253447 43610 195139 157795 152063 170168 -141344 -801998 -1188120 -871249 -365410
37693 -365410 -434655 -914743 -947216 -350329 23288 -428408 -1085473 -970223 -160152 372228
37683 372228 201527 -38701 223740 585340 379111 -225286 -553248 -562625 -781638 -1135189
37673 -1135189 -807667 361972 1220789 721984 -594347 -1337688 -1093219 -643732 -575066
37664 -575066 -627054 -535030 -609459 -1070065 -1453151 -1207704 -521160 -103093 -342030 -982996
37654i82996m78733J41393Q19928J014708M96419k66220n45519k29035J21683
37645I1628J20665q69M2738P7073j29608l15722p7611L87335M34098p5617m86348
37634F7762k64994K39575L73517J62880J17261K50046P8614l53247l41130K48987
37624E79271N00316j59599q64996n26725M45782P43962J38942l55807k19605o2056
37614B19485l11865m45934k370N83300P03580M09364N2283k33405l06958J6854
37604F84334M10684J98222n28074p84424j71691M18934K02667k93425k25391J81436
37594I3272J94540j35236k57863j88200k71190k92232J54468P06485O42426N2157
37584F98627l31777k95220k29577k29387l8959K05987J11233j57097q7354J96971
$$ plain form
37654 -982996 -1461729 -1320336 -500408 514300 1010719 744499 198980 -30055 91628
37645 91628 212293 211424 254162 331235 201627 -114095 -191706 195629 629727 554110 67762
37634 67762 -197232 42343 415860 578740 696001 946047 1024661 671414 330284 579271
37624 579271 1079587 919988 54992 -471733 -25951 718011 856953 501146 281541 219485
37614 219485 -92380 -538314 -540684 42616 746196 1155560 1207843 974438 667480 684334
37604 684334 1095018 1293240 765166 -19258 -190949 227985 430652 137227 -88164 93272
37594 93272 287812 152576 -105287 -293487 -564677 -856909 -702441 4044 646470 698627
37584 698627 366850 71630 -157947 -387334 -426293 -220306 -109073 -266170 -353524 -156553
37574a56553J01592l20035m04163q2839n887k88748k26473L91330P36207K58643
37564C074l77520l60896M3018J13785r3045j8903K75744J78874l70707o55327
37554a261903k09489N08471P52829M35616J15602J90767M12977K96716j71765
37545A069821m85857l02743J03704K70626J80403J21907P9882k46223p69056q67522
37535h45058k05940O37334P68225R1147n67105n06729K3095K94500J34810L0505
37525a45216K15610K39445k24054o38789l01026N05570Q06091L35884j48925j02893
37515E41697P1470j25784m21662k92032J51172L60897J39759k22066l75553j90533
37505c62635J61566K63509p7672m05497j79949K79180J99212k79051k02837N01775
$$ plain form
37574 -156553 -54961 -374996 -779159 -861998 -867885 -1156633 -1383106 -991776 -255569 3074
37564 3074 -374446 -735342 -692324 -578539 -671584 -690487 -414743 -235869 -606576 -1261903
37554 -1261903 -1471392 -962921 -210092 225524 341126 531893 944870 1241586 1069821
37545 1069821 583964 281221 384925 655551 835954 957861 1037743 791520 22464 -845058
37535 -845058 -1050998 -413664 354561 445708 -121397 -628126 -605031 -310531 -175721 -145216
37525 -145216 70394 309839 85785 -553004 -854030 -348460 457631 793515 644590 541697
37515 541697 613167 487383 65721 -226311 -75139 285758 425517 203451 -172102 -362635
37505 -362635 -201069 62440 -15232 -420729 -600678 -321498 -122286 -401337 -604174 -102399
37495a02399P05291l1911n89432j60896L37516q7986o80091k39563P17947Q03039
37485F71515O0256l10393p6581n4648l31790j63534M16395N48059J41178n2958
37475H47499J7753k93428p53244m00317N54933P74813M3465l75210n9543j32595
37465B24126r43810j092916J29715J218116P82751k19796j99678M83901M20786
37456H03195l92093p92710m75104r3401J70688N90601Q17655L06473m36611m25826
37446G2867J76667L54439j72j7948M60437N46214j17616p20602o22104k24848
37436i2666n6617M3582K84565L14154j14599n11896l41420J07223J61393k09492
37426d15773m05320j13408L07776M13845K45841J34370J66167J07319j79249m83469
$$ plain form
37495 -102399 602892 570981 -18451 -179347 158169 70183 -609908 -849471 -131524 671515
37485 671515 731771 421378 344797 290149 -41641 -205175 211220 759279 900457 847499
37475 847499 865252 571824 -181420 -581737 -26804 748009 791474 416264 356721 224126
37465 224126 -719684 -1812600 -1682885 -464769 317982 98186 -101492 382409 803195
37456 803195 411102 -381608 -856712 -950113 -779425 -188824 628831 935304 498693 72867
37446 72867 249534 603973 603801 585853 1046290 1592504 1474888 754286 132182 -92666
37436 -92666 -149283 -105701 178864 493018 378419 -133477 -474897 -367674 -206281 -415773
37426 -415773 -821093 -934501 -626725 -212880 32961 167331 333498 440817 261568 -221901
37416b21901n24222l07037m5744J35479K29344K13760J24170J10925J70813L0898
37406h3515l66035n36375j07254M64951M59664k4645k93475k09189k33733l64087
37396a293693n8503O04413P52773Q5402n63642n02274j19754j5314n8192O5929
37386a102855J67430O6026P0542L18994L57038o213j80988K00119N47483L14100
37376G51676o5626m0181O3982j80774l24620J23893N94649L16935l19167m24558
37366D96209j06652j05574l95202l90215j74899k56719l98817o833N46791L54317
37356d37594l71147m70394K63001P26256K86260l49877m01969l5570K94853N38171
37346D1990O64703M43786k2555k80741k84383m21120o31178l67402L49793P33131
$$ plain form
37416 -221901 -746123 -1053160 -1098904 -963425 -734081 -520321 -396151 -285226 -114413 -83515
37406 -83515 -449550 -985925 -1093179 -628228 -168564 -193209 -486684 -695873 -929606 -1293693
37396 -1293693 -1352196 -747783 4990 90392 -473250 -975524 -1095278 -1110592 -1168784 -1102855
37386 -1102855 -935425 -869399 -798857 -479863 -122825 -129038 -310026 -109907 437576 751676
37376 751676 686050 645869 709851 529077 204457 328350 922999 1239934 920767 496209
37366 496209 389557 283983 -111219 -501434 -676333 -933052 -1331869 -1338702 -791911 -437594
37356 -437594 -808741 -1279135 -1016134 -289878 -3618 -353495 -755464 -791034 -496181 41990
37346 41990 706693 1150479 1127924 847183 562800 141680 -489498 -856900 -507107 226024
37336B26024L89292j40764k96048j62763K7148K46090K67187k22131q17143o26702
37326a109810L28041Q89651M01574l74080n44727l50780l94050m52832j7634N74613
37316a050034N40911r8135n35317l42406P0264J50073j58116m99639n06409j11399
37306b540207L54424M79807K70962J10042J66650K01058N4635p6287k3860R6340
37296i06436J86660L11717L78595J36214l03506m35227j10751J66092N559k75445
37286h46528k00387J29922K56952L4725k70100l37394k5031N20254Q39451N61509
37276F63373n2690l40667j21278J05429k2173k36674j97059m970J29904K52085
37266A75280L77276L10868N2096q3542k4912j11548m06188m45243p1601J27120
$$ plain form
37336 226024 615316 474552 178504 15741 42889 288979 556166 334035 -483108 -1109810
37326 -1109810 -781769 107882 509456 135376 -409351 -760131 -1154181 -1607013 -1624647 -1050034
37316 -1050034 -509123 -607258 -1142575 -1484981 -1414717 -1264644 -1422760 -1922399 -2428808 -2540207
37306 -2540207 -2185783 -1705976 -1435014 -1324972 -1158322 -957264 -902629 -978916 -1002776 -906436
37296 -906436 -719776 -408059 -29464 106750 -196756 -631983 -742734 -576642 -571083 -846528
37286 -846528 -1046915 -916993 -660041 -625316 -895416 -1232810 -1257841 -737587 101864 663373
37276 663373 610683 270016 148738 254167 231994 -4680 -201739 -206709 -76805 175280
37266 175280 552556 863424 915520 831978 807066 695518 289330 -155913 -227514 -100394
37256a00394k42314o02798k56871M70378P10012L37800p381K631P5147M339l6976
37245C53573K0611j0660j27481o9118J51417J37189k59687o06880m71456l4584
37235i17076J80136K0524j62827o0906J96152K82623J25868p5949j85057k24580
37225h21092j65492P1917L14879J99478k46615m52168p5094M18251L96349j9984
37215c79571k30227r5266K9717L6496J39234K73011J27919j95074k45254J2468
37205e26547J61460R7566J20481K21669O1667k54214k17913J16999J11496k94356
37195d01692l56505J82320N60911K55674j77453j36619L3000j84522m72525k62027
37185i59438K77486N71827M67639J12497m26147q41944n53494L54477Q40858K90695
$$ plain form
37256 -100394 -342708 -945506 -1202377 -731999 -21987 315813 308432 311063 386210 390549 353573
37245 353573 374184 363524 236043 166925 318342 455531 195844 -411036 -882492 -917076
37235 -917076 -736940 -716416 -879243 -940149 -743997 -461374 -335506 -411455 -596512 -821092
37225 -821092 -986584 -914667 -599788 -400310 -646925 -1099093 -1174187 -755936 -359587 -379571
37215 -379571 -609798 -705064 -675347 -638851 -499617 -226606 -98687 -293761 -539015 -526547
37205 -526547 -365087 -267521 -147040 74629 136296 -117918 -335831 -218832 -107336 -401692
37195 -401692 -758197 -575877 -14966 240708 63255 -73364 -40364 -224886 -697411 -959438
37185 -959438 -681952 -110125 357514 470011 43864 -798080 -1351574 -997097 -156239 134456
37175A34456n01410n24598j3668J98486J00879K08356M06911K38817o6554K6512
37165B08187K75011O6655l66250k84954K06843L12638o8707k55838n8396l0k07185
37154a72026j77651J90870L65454J55284k6885m1212k07650m50310k42604L49984
37144b56746N43015O4220m00214l24097k0349J43182L02138M60556K07362m13151
37134C05916o01476Q783O14363L73028l60097o30299k15748L23453N47572M62354
37124H27849K23445L1943P7281K03651k5494n77953p42627j54587M54927J96734
37114E15169o36060r32272l27965L70620M30070J63588L02243Q32703R75930K68994
37104A963020p43251j111739n91446J56585M41518K52101l6587k54907m15211
$$ plain form
37175 134456 -366954 -891552 -905220 -706734 -605855 -397499 9412 248229 181675 208187
37165 208187 483198 549853 183603 -101351 105492 418130 349423 93585 35189 35159 -172026
37154 -172026 -349677 -158807 206647 361931 335046 293834 86184 -364126 -606730 -256746
37144 -256746 286269 350489 -49725 -373822 -394171 -250989 51149 511705 719067 305916
37134 305916 -295560 -286777 327586 700614 340517 -289782 -505530 -182077 365495 827849
37124 827849 1051294 1083237 1160518 1364169 1338675 760722 18095 -136492 318435 515169
37114 515169 -120891 -1053163 -1381128 -1010508 -580438 -416850 -114607 718096 1694026 1963020
37104 1963020 1219769 108030 -483416 -326831 114687 366788 330201 75294 -339917
37095c39917m32027k81764j79108j73684J08149P83699J136929M81304o28143
37086D75438r40966k25265M92380M91160J91355J58718K23232N2981j98899l41809
37076C78325n41078p54604m83666L27017Q31848M39072j84710r0439M58720M20269
37066H00754l55361q72344m52771L89462P83498N80760K46691P6972o7055l51825
37056G78781o18611n67979k03278J16378J48802O5216O5749j2635k98426l80675
37046i06678J53476Q23938P07365j68155p40424m40345Q7905J66994P8897K94049
37036E7022N26717L06343j49179l84289m70879n91437m42008J31294M72977M0930
37026e02509n11127k33646N35657O67493P1492k46173Q6170L34994J09908j4779
$$ plain form
37095 -339917 -771944 -1053708 -1232816 -1406500 -1298351 -514652 622277 1103581 475438
37086 475438 -465528 -690793 -198413 292747 484102 642820 866052 919033 720134 378325
37076 378325 -162753 -917357 -1401023 -1074006 -242158 196914 12204 -78235 380485 800754
37066 800754 445393 -426951 -879722 -490260 293238 873998 1120689 1197661 1130606 778781
37056 778781 160170 -407809 -611087 -494709 -345907 -280691 -214942 -227577 -526003 -906678
37046 -906678 -753202 70736 778101 609946 -130478 -570823 -482918 -315924 -237027 57022
37036 57022 583739 890082 740903 356614 -114265 -705702 -1147710 -1016416 -543439 -502509
37026 -502509 -1013636 -1247282 -711625 -44132 27360 -218813 -132643 202351 312259 297480
37016B97480K51308K62770l13408o69275j26692O19182N08464k45436n69058j98037
37006a82702J43685J02785J59850N58361P19970J84958n49605p09057l19840j1073
36996I7332j3603r374J04693l266l88865n29113j17374L28909J83385l13175m24046
36985a084497o3053J49241m5595j71191J15490M83626N59124M70529L97911J72841
36975I84426k29555l78165j03755J6019m59268r43509n99071L32798Q17403M79024
36965h3653m5650j62744L5903K36039L15220J86283j77349m70200l49486k2755
36955e38392L3066r0636J18456N74024N46901j37413o84475n14140j02264r9690
36945h94563k81013q2531L02624K09727l19896m76009J10830P65126O77256r903
$$ plain form
37016 297480 548788 811558 498150 -171125 -297817 321365 829829 584393 15335 -182702
37006 -182702 -39017 63768 223618 781979 1501949 1686907 1137302 428245 108405 97332
36996 97332 83729 74355 179048 175782 -213083 -742196 -859570 -530661 -347276 -660451 -1084497
36985 -1084497 -1147550 -998309 -1043904 -1215095 -1099605 -615979 -56855 413674 811585 984426
36975 984426 754871 376706 272951 288970 -170298 -1113807 -1712878 -1380080 -562677 -83653
36965 -83653 -129303 -292047 -256144 -20105 295115 481398 304049 -166151 -515637 -538392
36955 -538392 -505326 -595962 -477506 96518 643419 506006 -178469 -692609 -794873 -894563
36945 -894563 -1175576 -1258107 -955483 -745756 -1065652 -1541661 -1430831 -665705 11551 1648
36935A648m31427j47978L51729L81012m7205l60826k92873j44023j49603j20093
36925i59639M5586L7967k36842k40973L51294Q66202N29349j97992k20722M08916
36915C83146N22380k19831p05282j91622M55231J84278n45458n56510J96350O85390
36905B08072L98303j59521m33151l94125j55038K14451M24532J77698k82535m06815
36895d08129j57925k6544j99896l20671j75999j7939J355J45022N38971P76751
36885A54996M62328j62373m96927l01552J53014N01527N73794L61852k7592l61871
36875H57196m06055j54781J10045P5653k52206n08478l67315N2331L25321K51128
36865a7161L4327r0193j27093j11803L8040K56334K39795q5472l15415j40975
$$ plain form
36935 1648 -429779 -577757 -226028 154984 107779 -253047 -545920 -689943 -839546 -959639
36925 -959639 -914053 -876086 -1112928 -1353901 -1002607 -136405 392944 194952 -25770 383146
36915 383146 905526 685695 -19587 -211209 244022 428300 -117158 -673668 -477318 208072
36905 208072 606375 446854 13703 -380422 -535460 -321009 103523 281221 -1314 -408129
36895 -408129 -566054 -592598 -792494 -1113165 -1289164 -1307103 -1305748 -1160726 -621755 154996
36885 154996 617324 454951 -41976 -343528 -190514 311013 884807 1246659 1219067 857196
36875 857196 451141 296360 406405 482058 229852 -278626 -645941 -593610 -268289 -17161
36865 -17161 17166 -73027 -200120 -311923 -273883 -17549 222246 136774 -178641 -319616
36855c19616J27825N2263j93131j29530J58809J33764k38123l36236J26880N96775
36845b0320M87539J2619k03773j0195K04019J42877p6641j93255j20601K3063
36835B45332O8709l6600j91470k90832l39373l11965o1778L79494N76212J88367
36825B26096l69334l07547M07252Q77842M86026k70576n47528k73906K5883J48442
36815D02650K92528M18366K19212k49885n16867l85671j69053p6458J13856N04138
36805E52816O72387K45957m15512n83221r6780M71683N81968K94844p65j27787
36795A595590k07783l64405n22520m97528k34923M5006K0203l07289m57846J196
36785i30299P73189J001102K95843o76682r31520l21681L84249N07885J60007
$$ plain form
36855 -319616 -191791 -139528 -332659 -462189 -303380 -169616 -407739 -743975 -617095 -20320
36845 -20320 467219 479838 276065 265870 469889 612766 536125 342870 222269 245332
36835 245332 314041 277441 85971 -204861 -544234 -856199 -917977 -538483 37729 226096
36825 226096 -143238 -450785 -43533 834309 1320335 1049759 502231 228325 254208 402650
36815 402650 695178 1113544 1332756 1082871 566004 180333 11280 -65178 48678 552816
36805 552816 1225203 1471160 1055648 472427 375647 847330 1429298 1724142 1723377 1595590
36795 1595590 1387807 1023402 500882 3354 -231569 -186563 -166360 -473649 -931495 -930299
36785 -930299 -157110 843992 1139835 463153 -468367 -790048 -405799 102086 262093
36776B62093j25287r4285R0471J98171J83861J53418J88578K04196L4999k47973
36766H48242k83310M8883K36505k27439r05224q10646J11136P02668K33099m66395
36756e12481k53008N79823Q16718K14845k71778j10870J36161L528j08885J51493
36746F45546L34704L408m27888l84598p9862l4672j42667l05K21418P8319k39613
36735b6210j72060J83497J97028j55049j86644L05994O28687L00324k06635l11368
36725E57564k30118m18191o31953l01021M31167P99919N28921J78711K36211M18621
36715A569831K03972l27630o01164l42175J16812L23819J86045j18208m12626
36706E98676n22310k54179L09213O47315L27346l36783n77085j86620K27748J80721
$$ plain form
36776 262093 136806 42521 132992 331163 515024 668442 857020 1061216 1096215 848242
36766 848242 564932 613815 850320 622881 -282343 -1092989 -981853 -279185 -46086 -512481
36756 -512481 -765489 -185666 631052 845897 574119 463249 599410 602938 494053 645546
36746 645546 980250 983658 555770 171172 91310 56638 -86029 -86334 135084 213403 -26210
36735 -26210 -198270 -14773 182255 27206 -159438 146556 775243 1075567 868932 557564
36725 557564 327446 -90745 -722698 -1023719 -592552 207367 736288 914999 1151210 1569831
36715 1569831 1773803 1446173 845009 502834 619646 943465 1129510 1011302 598676
36706 598676 76366 -177813 131400 778715 1106061 769278 192193 5573 233321 414042
36696D14042l1086L5072J76640l5977m04344l59840Q8778L70961K81766J90805
36686G26817K54013J27097l18355o32125m49078K543L35047M45327K85891k22365
36676E54812p35601n90915J91305O56192K35579l25115j02561N37491N69094k1083
36666I69198l14720m6722Q4327k01566k51081K57712N87134J20064n51789m95476
36656A57081J68509N32824K28085k54960m01935j98896J23120L53199L17456K5336
36646A049819k22831j79325n965Q216p4620j2440J10039k1504l97790o39904n19366
36635i05671j81674J52718L85637M35685K54488j8412j71013j74289r8971R8598
36625b22904L93875M63198Q6528l27653j75661L85261N31967l5697o27165n70520
$$ plain form
36696 414042 382956 418028 594668 558691 154347 -205493 -116715 254246 536012 726817
36686 726817 980830 1107927 789572 157447 -291631 -289088 45959 491286 777177 554812
36676 554812 -180789 -771704 -580399 75793 311372 -13743 -116304 421187 990281 969198
36666 969198 654478 607756 692083 490517 239436 497148 1084282 1204346 652557 157081
36656 157081 325590 858414 1086499 831539 429604 230708 353828 707027 1024483 1049819
36646 1049819 826988 647663 641698 649914 575294 562854 672893 651389 253599 -386305 -905671
36635 -905671 -1087345 -934627 -548990 -113305 141183 122771 -48242 -222531 -321502 -222904
36625 -222904 170971 634169 720697 393044 217383 602644 1134611 1098914 471749 -98771
36615i8771j17875P6364q4383k06877j16717J6199P7368R1486M1955k8108Q8538
36604b60821L91675M22699j35154p87184p46171o7830L66742J01000l03700j99951
36594a218695J97622K64208l5292j76541N7935L05737K55347Q2709R1077K63458
36584H7565M04372M73613N05328L72903l4455m73851n45420k62579p1155j80565
36574B75756k55473j9786K14854M9955k62682j65865K49503L12253j30227l78167
36564a09879M8852O16068N43288o1624m17095j82341K01034K16971j27867m41543
36554B85864l82572M7176M66648M63864J07038j07234M8347K39565J91961J26434
36544A487091J99814N5087m86919q15879m07896J30566j04273p28860n24566N46245
$$ plain form
36615 -98771 -216646 -140282 -224665 -431542 -548259 -532060 -454692 -363206 -321251 -349359 -260821
36604 -260821 130854 553553 418399 -368785 -1114956 -1182786 -816044 -715044 -1018744 -1218695
36594 -1218695 -1021073 -756865 -792157 -968698 -910763 -605026 -349679 -266970 -175893 87565
36584 87565 491937 965550 1470878 1843781 1809326 1335475 790055 527476 456321 275756
36574 275756 20283 497 215351 265306 2624 -163241 86262 398515 268288 -109879
36564 -109879 -61027 555041 1098329 1036705 619610 437269 638303 855274 727407 285864
36554 285864 -96708 -49532 417116 880980 988018 880784 929131 1168696 1360657 1487091
36544 1487091 1686905 1741992 1255073 439194 31298 161864 57591 -671269 -1195835 -649590
36534f49590J086366L56399o16228o34008L7244M29036L64248K48574O6859l72044
36524C16856o46560k19698N22681O91139K18268j36767m7632K6790j73488k60476
36514B91113L873K18994M5025j91113l1984L68230M70528R3011m20581o54638
36504A92458n00482j46848J50432K98169L89792M75109M15968J18126k16780l08614
36494H67330j88709j08309j15405k5704J89079L01313J94872P1238J59167L84147
36484A729019M51558J98032j94502l47119j07845J97500J22697k81038n07596
36475A260706l48710j92771l25724l95019k7747M06886K88296k18289l25258J93029
36465C15399O61775N04283j489k25670q565L09039L81291J39738k17792l66267
$$ plain form
36534 -649590 436776 793175 176947 -457061 -419817 9219 373467 622041 688900 316856
36524 316856 -329704 -549402 -26721 664418 882686 745919 698287 725077 551589 291113
36514 291113 294986 513980 559005 367892 335908 704138 1174666 1267677 847096 192458
36504 192458 -308024 -454872 -304440 -6271 383521 858630 1274598 1392724 1175944 867330
36494 867330 678621 570312 454907 429203 618282 919595 1114467 1185705 1344872 1729019
36484 1729019 2180577 2378609 2184107 1836988 1729143 1926643 2049340 1768302 1260706
36475 1260706 911996 719225 393501 -1518 -29265 377621 665917 447628 122370 315399
36465 315399 977174 1481457 1479968 1254298 1245733 1554772 1936063 2075801 1858009 1491742
36455A491742j62824J02257j4766n00950q01261m78198K31902O81740N43452J44668
36445A237762M5558L20851M23027o0930o95099o86410o1143K90363n3349l98025
36435C62605q2927M47468M47678J36552K22579N86079M98084l6730k35802J52495
36425B498081N02908M04325J70428O9529q9504l58162m20078k07443m1619K278
36415B530743J42022K14914j85300p69842p08365M4219N47386L02655j10694j75540
36405A832198j64058k90728k29481q844k50661q62712p02833N77741J546093R66795
36395B413510k79864n62666R8073M52462J81414M7383K36278J26436l30875m30458
36385A951693n6214O3380k96176l93666J88799P57288N38775j74854m51857P9896
$$ plain form
36455 1491742 1328918 1431175 1416409 915459 114198 -364000 -132098 549642 1093094 1237762
36445 1237762 1283320 1604171 2027198 1966268 1271169 584759 523616 813979 760630 362605
36435 362605 279678 727146 1174824 1311376 1533955 2120034 2618118 2581388 2345586 2498081
36425 2498081 3000989 3405314 3575742 3645271 3555767 3197605 2777527 2570084 2528465 2530743
36415 2530743 2672765 2887679 2702379 1932537 1224172 1268391 1815777 2118432 2007738 1832198
36405 1832198 1668140 1377412 1147931 1139087 888426 25714 -677119 -99378 1446715 2413510
36395 2413510 2133646 1570980 1669053 2121515 2302929 2350312 2586590 2713026 2382151 1951693
36385 1951693 1895479 1958859 1662683 1269017 1457816 2215104 2753879 2579025 2127168 2207064
36375B207064Q46319R99446L30760m62545n48800m683L21475Q1244j24062J08832
36365C755050K38125j73953n02598q0537N23686L58140k96915l63390L01848P93695
36355D553151O24514K14957m503k5067J07373K50745Q91o07279o80513K64200
36345D698469J174863Q38610j73620l94462J97453M18403J18518K58403Q34417
36336G971054P65677M3270o5055O32396P65664r8257n42534K32484J041831R25619
36326A1672149P88294J469164J981017J300435L69840N48821J357086J573144
36318B1059950J473994K075956L019506L177557K802792L181690M475962N648752
36310D6916159O368689P391923R096514J1060860J3144139J5805678J9342936
$$ plain form
36375 2207064 3053383 4052829 4383589 3921044 3372244 3367561 3689036 3770280 3646218 3755050
36365 3755050 3993175 3819222 3316624 3236087 3759773 4117913 3820998 3457608 3759456 4553151
36355 4553151 5177665 5392622 5388119 5363052 5470425 5721170 5722061 5114782 4434269 4698469
36345 4698469 5873332 6711942 6538322 6143860 6341313 6759716 6878234 7136637 7971054
36336 7971054 8736731 8780001 8714946 9347342 10113006 10014749 9472215 9704699 10746530 11672149
36326 11672149 12460443 13929607 15910624 17211059 17580899 18129720 19486806 21059950
36318 21059950 22533944 24609900 27629406 30806963 33609755 36791445 41267407 46916159
36310 46916159 53284848 60676771 69773285 80834145 93978284 109783962 129126898
36303A29126898K3747882K9136133L5532210M2650747N0339214N7696256O0350014
36296D28579354N0789174K5197484r726078l9834711n4909220n5705041m9739452
36289B94651510m2913391l6690814l0845985k5671456k1484529j7981538j4795622
36282A04268175j2008052r882319q468100p506150o588757n564335m753872m409423
36274D5087167m090830l203184k070092j635777k015513k255497j775554j133695
36266B6907025r85344j160611j245955j271491j294495j049544n66816m26996
36258A8905773q18224j033665n52845L5122q1458o96139j016265q72082o68842
36249A3201375m74574k5614N02767N46751K8881m50304m23553r5550P1341k0491
$$ plain form
36303 129126898 152874780 182010913 217543123 260193870 310533084 368229340 428579354
36296 428579354 479368528 504566012 494839934 455005223 400096003 344390962 294651510
36289 294651510 251738119 215047305 184201320 158529864 137045335 119063797 104268175
36282 104268175 92260123 82377804 73909704 66403554 59814797 54250462 49496590 45087167
36274 45087167 40996337 37793153 35723061 34087284 32071771 29816274 28040720 26907025
36266 26907025 25921681 24761070 23515115 22243624 20949129 19899585 19332769 18905773
36258 18905773 18087549 17053884 16501039 16536161 16454703 15758564 14742299 13870217 13201375
36249 13201375 12726801 12701187 13203954 13750705 13779586 13329282 12905729 12810179 12881520 12861029
36239A2861029o2423K13628O41124P25184K46559l50154m73742k13790j72830
36230A3414585m43328l80572L45631J083501J042677L57018j95052k05010J17386
36221A5136836M55322O51952O05308L26159O4435R6726M22781Q06288R87506Q03064
36211B0356377L56138J16252M73880J111451J285878Q65035N03113N63627N72790
36202B6204541J72675j16114K21477O43249K65967p17091j257043r53401m61388
36193B4002872l81523n70980p25986q99757j125585j121503p64294m39040n37942
36184A7436262r03271j094635r71508p03008m07312j24136j1356j90896m17597
36175A2612543k76776J92504M35879J73216r0271K50564R48455J221557R50589
$$ plain form
36239 12861029 12798606 13012234 13653358 14378542 14625101 14274947 13801205 13587415 13414585
36230 13414585 12971257 12590685 12936316 14019817 15062494 15419512 15224460 15019450 15136836
36221 15136836 15592158 16244110 16849418 17175577 17240012 17336738 17759519 18565807 19553313 20356377
36211 20356377 20712515 20828767 21302647 22414098 23699976 24565011 25068124 25631751 26204541
36202 26204541 26377216 26261102 26482579 27125828 27391795 26674704 25417661 24464260 24002872
36193 24002872 23621349 23050369 22324383 21424626 20299041 19177538 18413244 17974204 17436262
36184 17436262 16532991 15438356 14466848 13763840 13356528 13232392 13221036 13030140 12612543
36175 12612543 12335767 12528271 12964150 13137366 13047095 13297659 14246114 15467671 16418260
36166A6418260Q40134J246252J664300J793682K256585L539780N005388N930139
36158C8694520O840539Q622353J0996683J3473216J7094771K2608837K6596128
36151A44927047K2572166Q215544j0136775k2653289k5130798k1258151j6737199
36144G9798545j3761004j1446832r021076o838016n291593m221607l350884k647946
36136B3219587k231821k130142k097451j777860j233721j004548j262695j347701
36128A0133648p58222j29712l24191r19946p40755K71526R61068P82950M12874
36119I689240K68084k10412j208415j738762j082643n2699J65364l07308n02862
36110E019587j64465J56258J67435O0116r3969l41272m35127j69065P1863j86404
$$ plain form
36166 16418260 17258394 18504646 20168946 21962628 24219213 27758993 32764381 38694520
36158 38694520 45535059 54157412 65154095 78627311 95722082 118330919 144927047
36151 144927047 167499213 175714757 165577982 142924693 117793895 96535744 79798545
36144 79798545 66037541 54590709 45569633 38731617 33440024 29218417 25867533 23219587
36136 23219587 20987766 18857624 16760173 14982313 13748592 12744044 11481349 10133648
36128 10133648 9375426 9245714 8921523 8001577 7260822 7532348 8493416 9276366 9689240
36119 9689240 9957324 9746912 8538497 6799735 5717092 5664393 5829757 5522449 5019587
36110 5019587 4855122 5011380 5178815 5238931 5144962 4803690 4368563 4199498 4271361 4084957
36100D084957o46790o27411j46842J57183R5408R2059K75381K40972j22010l47926
36090C054981k05033r3941k90340m07739n5933M54362N50649K02086j65088k98658
36080B745346k51740r3345R9446J09926j57151l88598k37971Q5832O1420k87911
36070A685254k89843L95768J130375J051603K26009m50627m45342j53879j31702
36061C017616k62885r3180L23191M52102J16373j93949j2968M57744O54882L93744
36051D852670L0246m3837J63872L58557L73986L56097M98112O90388O34528L39222
36041H253841K12853M55530O54640L65233j42497k46317M0926R8864k47249m29378
36031I016446j44122N6600l50879r73716j083109o45809j68662J27109L31876
$$ plain form
36100 4084957 3438167 2810756 2663914 2821097 2916505 3008564 3283945 3524917 3402907 3054981
36090 3054981 2849948 2756007 2465667 2057928 2001995 2456357 3007006 3209092 3044004 2745346
36080 2745346 2493606 2400261 2499707 2609633 2452482 2063884 1825913 1911745 1973165 1685254
36070 1685254 1395411 1791179 2921554 3973157 4199166 3748539 3303197 3149318 3017616
36061 3017616 2754731 2661551 2984742 3436844 3553217 3359268 3346300 3804044 4458926 4852670
36051 4852670 4882916 4839079 5002951 5361508 5735494 6091591 6589703 7280091 7914619 8253841
36041 8253841 8466694 8922224 9576864 9942097 9799600 9553283 9594209 9693073 9445824 9016446
36031 9016446 8872324 8928924 8578045 7604329 6521220 5875411 5706749 5833858 6165734
36022F165734L38182m456m14408n27161n47913q48172j085259n92170L70060P05007
36012C559444M8507o50559n09059J28509M24232K51800L0556j21953l81455o74156
36002B105866p42934n60842k41607K05334O35370O31755P7758m73646n06926k73714
35992H56414k65759l43932q0604L52976M37571K27700J80899K13257j45622o84469
35982G48431o09392J29184O12293L77390R9638L73780P30567N20952M469k03520
35972B783792j48020k00773k18790J21502N17794M14499m8377k43138n3434O4786
35962B989841j02495l50432n87659q59182r28671n32788J5799J79519P6281K47873
35952A48086N95063M24707l23774p96143m70325J00723J88326j30517l14356j44251
$$ plain form
36022 6165734 6503916 6499460 6085052 5557891 5009978 4161806 3076547 2484377 2854437 3559444
36012 3559444 3607951 2957392 2448333 2576842 3001074 3252874 3283430 3161477 2780022 2105866
36002 2105866 1362932 802090 560483 765817 1401187 2032942 2110700 1637054 1130128 856414
35992 856414 590655 246723 166119 519095 956666 1184366 1365265 1578522 1432900 748431
35982 748431 139039 268223 880516 1257906 1357544 1731324 2461891 2982843 2987312 2783792
35972 2783792 2635772 2434999 2216209 2337711 2855505 3270004 3221627 2978489 2925055 2989841
35962 2989841 2887346 2536914 1949255 1090073 161402 -371386 -355587 -176068 -99787 148086
35952 148086 743149 1167856 844082 47939 -422386 -321663 -133337 -263854 -578210 -722461
35942g22461K11910M80646L74103j27748m41526M7727R18183J003635M8265q14170
35932I78564p05837k04311k06835m83929l08259J78599L17574J70839K85736N14188
35922E36329J98854n61804r02285m96569O3383K87430L10682K78518O4821k00642
35912d21283j06614L11465N16110L19203R1406j3001k52761n36175l34807L16074
35902a10383O09693K14674j26479J66536N01875J24290n49315n51934J02820M90526
35892H72303K00936k09014k04755N3702J77085Q0638j40283m09334n62074m04661
35882e45457m5278J29619l8102k42977j38957K04509M43419M21752K85189J53217
35872F26934q9905m94810o80687j70943P81718J173421M79274m71844n14615J87660
$$ plain form
35942 -722461 -510551 -29905 344198 216450 -225076 -177349 740834 1744469 1792734 978564
35932 978564 272727 68416 -138419 -622348 -930607 -752008 -434434 -263595 22141 536329
35922 536329 735183 173379 -728906 -1225475 -1162092 -874662 -563980 -285462 -220641 -421283
35912 -421283 -527897 -216432 299678 618881 710287 697286 444525 -91650 -426457 -110383
35902 -110383 499310 713984 587505 754041 1255916 1380206 830891 278957 381777 872303
35892 872303 1073239 864225 659470 713172 890257 970895 830612 421278 -140796 -545457
35882 -545457 -590735 -461116 -499218 -742195 -881152 -676643 -233224 188528 473717 626934
35872 626934 537029 42219 -638468 -809411 -27693 1145728 1625002 1153158 638543 826203
35862H26203L72717l93706j029544n84459L39979N36963r6329o39027n38274q1116
35852a286593L33237O14946O90310M21000q4215m77313n21810k04817L32735P31873
35842E49353N89928K5525l04033j22195J9882k91974n30472j30744L83286J75327
35832C63883m28244m14892J84698L31187k30880n25364J4126O60874O37389K02445
35822G95222n8950j28028j66588m9088J69643P5070l14057l43968K01281O53837
35812H34374N80489M31009N34857M96961K45232N01149J387122J911554J917332
35803H840079K917044N249716N999821K411816l444291o449995m896332k185551
35795H442307j505946j903687j146620K92192N29961l04665o16049k85426n17090
$$ plain form
35862 826203 1198920 805214 -224330 -808789 -468810 68153 -28176 -667203 -1205477 -1286593
35852 -1286593 -953356 -338410 351900 772900 688685 211372 -310438 -515255 -182520 549353
35842 549353 1139281 1164806 860773 738578 758460 466486 -63986 -194730 188556 363883
35832 363883 -64361 -479253 -294555 36632 -194248 -719612 -705486 -44612 592777 795222
35822 795222 736272 608244 441656 392568 562211 637281 323224 -20744 180537 834374
35812 834374 1414863 1845872 2380729 2877690 3122922 3624071 5011193 6922747 8840079
35803 8840079 11757123 17006839 23006660 25418476 21974185 15524190 10627858 8442307
35795 8442307 6936361 5032674 3886054 4178246 4708207 4403542 3787493 3502067 2984977
35786B984977j232451j060470P8421O17477o3089o70481k46179L82864K46833
35777A037902j95932j63426L5817j55176l06397J50466O26904K45220n49922o08087
35767A17369J8185J92563l23768m58306K81302Q56803L56335m84080m23854L27664
35757D60213M66583l68406j065457o94578K58663P43395N39217K21816J57023
35748G18469J73432Q9893j0000o9408j73115k74496j94796k0891j13723n08943
35738c83578o82619k41806M43758O99072M29231J09574K8641M0832L8853J31681
35728F13639K55634J33300j87880k65679m109O1264l70587p23701l67730L11278
35718e44571M20820o7915l16890M649K45890o0353m12377k35776J43035J21006
$$ plain form
35786 2984977 1752526 692056 770477 1387954 1324865 654384 408205 791069 1037902
35777 1037902 841970 678544 714361 559185 252788 403254 1030158 1275378 725456 117369
35767 117369 135554 328117 4349 -453957 -172655 684148 1040483 556403 132549 460213
35757 460213 926796 558390 -507067 -1201645 -942982 -199587 339630 561446 718469
35748 718469 891901 981794 971794 902386 729271 454775 259979 239088 125365 -383578
35738 -383578 -1066197 -1308003 -864245 -165173 264058 373632 402273 443105 481958 613639
35728 613639 869273 1002573 814693 549014 544905 606169 235582 -488119 -855849 -544571
35718 -544571 -123751 -191666 -508556 -503907 -258017 -318370 -730747 -966523 -823488 -702482
35708g02482r9492J17896O72075P97830K69806k79674l66940k38427k11473j36174
35698a77055J04032J72404j26769l24087L7396N46946M25532k84664p08654l32397
35688f67316L90182P46508N60039P9634m53837q18114p34946j76165M05961M87282
35678a80772Q7277k52887j31025K41944L20219p9786n02080l99173J20428L89092
35668c86763J11174j94357j333L51879J74529m04934n29872O9872O25136M86252
35658C01583M8836L9563M13880N60184K60849j37791l17466k41434M4302M33659
35648A406165P25838R22646J314460J865728J860238P62637q12629j690920j572487
35639D781676j167634r78043p68786l56960p8112j31948j58546J16702L77073
$$ plain form
35708 -702482 -801974 -684078 -12003 785827 1055633 775959 409019 170592 -40881 -177055
35698 -177055 -73023 99381 -27388 -351475 -314079 232867 658399 373735 -334919 -667316
35688 -667316 -277134 469374 1029413 1109047 655210 -162904 -897850 -1074015 -668054 -180772
35678 -180772 -93495 -346382 -477407 -235463 84756 4970 -497110 -896283 -775855 -386763
35668 -386763 -275589 -469946 -471279 -119400 55129 -349805 -879677 -809805 -184669 301583
35658 301583 350419 389982 803862 1364046 1624895 1487104 1169638 928204 972506 1406165
35648 1406165 2132003 3054649 4369109 6234837 8095075 8857712 8045083 6354163 4781676
35639 4781676 3614042 2635999 1867213 1510253 1432141 1300193 1141647 1258349 1635422
35630A635422K78692L7281J0240R6862j489k39969l48134k32531M3350L96753
35620A676477N99945L88043n4825j69374J23169J85666l13755p70827o17572k91170
35610G55777m30164o58924k07521O11328P36026Q4181k83894R7211M16282O9807
35600A190109l31348j40624J50123j38480n30476j47158O58872O63498l08856
35591A065660r88569m56162N97578Q87555J76837o21531o23069J70534R83629
35582A192462R76520M6374r39910j003536k41096K90756N0066k55670J35870P44757
35572I96593N66118k84179o62385j34106M04235J68494l51729k74215L00058N36836
35562A265720J19197m53274o33013l28994K02347M96635J32382o68737r82073
$$ plain form
35630 1635422 1914114 1951395 1961635 2058497 2057008 1817039 1468905 1236374 1279724 1676477
35620 1676477 2276422 2664465 2609640 2440266 2563435 2749101 2435346 1664519 1046947 755777
35610 755777 325613 -333311 -540832 70496 806522 890703 606809 704020 1120302 1190109
35600 1190109 858761 718137 868260 729780 199304 52146 711018 1374516 1065660
35591 1065660 77091 -379071 218507 1106062 1282899 661368 38299 208833 1192462
35582 1192462 2168982 2215356 1275446 271910 30814 321570 371636 115966 251836 996593
35572 996593 1562711 1278532 616147 482041 886276 1054770 703041 428826 728884 1265720
35562 1265720 1384917 931643 298630 -30364 171983 668618 801000 132263 -849810
35553h49810l05245N82051O22704L4400j03985L62820M83088q5575m47790j7958
35543B74700M89336L33187l4640P0146K83415n1306n49161l97696J81294L08200
35533I07475l1717r1674J78771Q0508m02125m31600J62138M52201k0808m11749
35523C91420K0843O52656M94556k62959o20170k51676K18089K19406j48889m32123
35513B81153k98455K07955O21071M51156j83049o24761n31653k20005N914K63580
35503b7094N39227M25329j14369m09533j17644J03116k83674n98774OR18343Q30963
35492A265896k55480r50809n33802K03955M27604L62998M22113L02995k78455
35483I67015p54708m57350K89873O03645K60823j82618k89477j65280p5645j07095
$$ plain form
35553 -849810 -1155055 -573004 49700 84100 -19885 342935 826023 740448 292658 274700
35543 274700 764036 1097223 1062583 1132729 1416144 1364838 815677 417981 599275 907475
35533 907475 875758 784084 962855 1043363 641238 209638 371776 823977 803169 391420
35523 391420 412263 1064919 1559475 1296516 676346 424670 642759 862165 713276 281153
35513 281153 -17302 190653 811724 1262880 1079831 455070 -76583 -296588 -290674 -27094
35503 -27094 512133 937462 823093 413560 295916 399032 115358 -483416 -483410 434933 1265896
35492 1265896 1010416 59607 -474195 -270240 157364 520362 942475 1245470 967015
35483 967015 212307 -245043 44830 648475 909298 726680 437203 271923 196278 89183
35473H9183j86630j55946Q5240L45187K82028n4896j78523J01001L15939O4750
35463G07333l31106l47730m9164J64195K44965L42282K64848k09617o87136n52141
35453d53271O4335M15045K25065m1696m2551K3324k4194m3128q306j19525k82100
35442b87002j15583L14916M45737J35067q0357M4655K3544l87574n86289j27421
35432f20307M02571K85340j68674k02268J57807L37947K47798J50759r0697o29245
35422a28969q48123j17208Q82571Q50906j49283p11611k33380L13189J28008k46428
35412b60328j39998P9433r7010k72685N1953M43165K72129j63945j98847Q9176
35402a96957K30854K93927N16539N19592r2593p50917o02482J22325M71639K49149
$$ plain form
35473 89183 -97447 -253393 -168153 177034 459062 404166 225643 326644 642583 707333
35463 707333 376227 28497 -20667 143528 388493 730775 995623 786006 98870 -453271
35453 -453271 -388936 26109 251174 209478 166927 190251 166057 122929 114623 -4902 -287002
35442 -287002 -402585 -87669 358068 493135 412778 457433 480977 93403 -492886 -620307
35432 -620307 -217736 67604 -101070 -303338 -145531 192416 440214 590973 500276 -128969
35422 -128969 -977092 -1094300 -211729 639177 489894 -221717 -455097 -141908 -13900 -260328
35412 -260328 -400326 -320893 -417903 -690588 -638635 -195470 76659 -87286 -286133 -196957
35402 -196957 33897 327824 844363 1363955 1271362 520445 -82037 40288 511927 761076
35392G61076M1262k7148l57723p34242l76222O46906J215160P50576K397j93642
35382A728400j7003j1768j58526j93119j98380k93393k52625M6008K51052Q6505
35372I87151j47830o4371K06708L16193K61429K67172L78067M78729M76200K73201
35362C432649j48492n21019n54366m48349o20707q93004o50219N0923L70626n311
35352A2731l37382j09848P6888l66370q19166l70809O22176R70846L59318l88389
35342c50005o19972m91839k83422M8571M42337N52088K64392p0226j11360J04394
35332e15042L52560M71750L96200J93506L6969m7937k30640m59235l38364K13558
35322G3325N78447K51577k98635k60336K66154M17149r9536o08634n14381m0248
$$ plain form
35392 761076 802338 775190 417467 -316775 -692997 -46091 1169069 1919645 1922042 1728400
35382 1728400 1711397 1699629 1541103 1347984 1149604 856211 603586 649594 900646 987151
35372 987151 839321 774950 981658 1297851 1559280 1826452 2204519 2683248 3159448 3432649
35362 3432649 3284157 2763138 2208772 1760423 1139716 246712 -403507 -352584 18042 12731
35352 12731 -324651 -434499 -357611 -723981 -1543147 -1913956 -1291780 -320934 38384 -350005
35342 -350005 -969977 -1461816 -1745238 -1696667 -1254330 -702242 -437850 -508076 -619436 -515042
35332 -515042 -162482 309268 705468 898974 935943 888006 657366 198131 -140233 73325
35322 73325 651772 903349 604714 344378 610532 1027681 928145 319511 -194870 -235118
35312b35118K94180L49543K51382O0780j60240k70782k37518j71337j11253j2159
35302b42522P1765P0058Q3340J73410J25610j68858l04078R7117N95357M07061
35292I08260l63710p49304l02480L19388M05040P8094k22016m34900n75687l73584
35282a310899J93422N11435J29100m34116l50616K99508O56964L08895k66328
35273b62635m90600l30918k9301K98641N50112M92671N9763l83888l66285J10462
35263c51978N08892L63386j47810l94172p8845L65631L48744o9714k72550L9135
35253C10719M52749M57991J02146k07203k79156k20547j27168j1238N8485K3501
35243E60279j6345L6507M2740j75075m50805m17176o4527J76368M7174j44072
$$ plain form
35312 -235118 59062 408605 659987 720767 560527 289745 52227 -119110 -230363 -242522
35302 -242522 -170757 -100699 -17359 156051 281661 112803 -191275 -94158 501199 908260
35292 908260 544550 -204754 -507234 -187846 217194 295288 73272 -361628 -937315 -1310899
35282 -1310899 -1117477 -606042 -476942 -911058 -1261674 -962166 -305202 3693 -262635
35273 -262635 -753235 -1084153 -1113454 -814813 -264701 227970 287733 -96155 -462440 -351978
35263 -351978 156914 520300 372490 -21682 -100527 265104 613848 544134 271584 310719
35253 310719 763468 1221459 1323605 1116402 837246 616699 489531 478293 536778 560279
35243 560279 543934 580441 623181 448106 -2699 -419875 -484402 -308034 -260860 -404932
35233d04932J4070L97359M96769J25263l60548n72127n08334l50125j32432J55913
35223a139124L59384L22407J52981O5853O1178J6223j2662J08262K67577K39528
35213D41607Q8376O0834J12033j4794k35608j76943J40986K50260L5968k7958
35203F74761K69869M25337M2125m75247n67505l36887j56662K2888L31574M25504
35193F55757K6740l89171k56054Q9197k9376l71031j27097O01469P87799N5952
35183A044185p51111q37889l87727O9637L75656M77673K28277j60446j62732K03379
35173I8902K65868k02148n31821k47293J57986R0287j98204j74702O3957J26547
35163e50621O7425J19708J43778Q638P1475N44291P96981J46871r07314j133559
$$ plain form
35233 -404932 -390862 6497 503266 628529 267981 -304146 -812480 -1162605 -1295037 -1139124
35223 -1139124 -779740 -457333 -304352 -238499 -177321 -161098 -173760 -65498 202079 441607
35213 441607 529983 590817 702850 688056 452448 275505 416491 666751 702719 674761
35203 674761 944630 1369967 1412092 936845 369340 32453 -124209 -101321 230253 655757
35193 655757 682497 293326 37272 126469 97093 -273938 -401035 200434 988233 1044185
35183 1044185 293074 -544815 -932542 -862905 -487249 -9576 218701 58255 -104477 98902
35173 98902 364770 162622 -369199 -616492 -458506 -368219 -566423 -741125 -677168 -550621
35163 -550621 -483196 -363488 -219710 -211072 -139597 404694 1201675 1348546 441232 -692327
35153f92327k15874Q28411R75661K98085m06041n59456j99323K06992J95162k17889
35143B13401m85342j79895M10263O23299K54745k72490m83121k82699J09988L74838
35133B82987L02991K9025o9058J06717J87565p3102l40672k09951J24076J83804
35123E24382l9029j74894j40216j51401j97993p8610J08391R7293L5055K94596
35113B77574O91283N88684o0099m90098k52305J05830m2988l89817k44920K67815
35103D50959L49362k15608o81907m32778J46025K90208l0293j68422J59472M80989
35093C48007L59549N2492O230Q9890j19141n00142m97011n5732K22352L5269j70528
35082b28765k2671J46445k5213k02534M6518L79686J98523k47505j60185M67362
$$ plain form
35153 -692327 -908201 -79790 895871 1193956 787915 228459 29136 236128 431290 213401
35143 213401 -271941 -451836 -41573 581726 836471 563981 80860 -201839 -91851 282987
35133 282987 585978 615003 545945 652662 840227 767125 426453 216502 340578 524382
35123 524382 485353 310459 170243 18842 -179151 -257761 -149370 -52077 -17022 277574
35113 277574 968857 1557541 1497442 1007344 755039 860869 817881 428064 183144 450959
35103 450959 800321 584713 -97194 -529972 -383947 -93739 -124032 -292454 -132982 348007
35093 348007 707556 760048 766278 856168 737027 236885 -260126 -315858 -93506 -58237 -228765
35082 -228765 -251436 -104991 -130204 -332738 -286220 93466 291989 44484 -115701 351661
35072C51661P15545J30350n61908n25499L4725L10266N0985k67514k38809J3702
35062A3504J65018J22153K9130J0612J9076o2838j91618j43253J54433L84333
35052E00550J89334k76896m74194k20813L6109j07457l89634k75075K23679N52056
35042b42341M30396K15899K53687K58534k23916r21509r80372j44467P29306P14934
35032I0151L510m66590l16882j8896N1723J03815K85861K62645j49025m83710
35022f37398k90197J28761K03866K416K5474L06950L71025M7487k77260l07260
35012d26136k21344k53020k98033j50507J40495L30938K48878o7819l71671l59465
35002a427684J2803M08797M70905K32812Q634j7342J01832K38749K43856k019
$$ plain form
35072 351661 1067206 1197556 635648 110149 144874 455140 506125 238611 -198 13504
35062 13504 178522 300675 329805 340417 359493 296655 105037 -38216 116217 500550
35052 500550 689884 412988 -61206 -282019 -245910 -353367 -743001 -1018076 -794397 -242341
35042 -242341 188055 403954 657641 916175 692259 -229250 -1209622 -1354089 -624783 90151
35032 90151 93661 -372929 -689811 -708707 -656984 -553169 -267308 -4663 -153688 -637398
35022 -637398 -927595 -798834 -594968 -592552 -567078 -260128 110897 158384 -118876 -426136
35012 -426136 -647480 -900500 -1198533 -1349040 -1208545 -877607 -628729 -696548 -1068219 -1427684
35002 -1427684 -1414881 -1006084 -535179 -302367 -293733 -311075 -209243 29506 273362 271343
34992B71343l41837l49885J05017N11075L14612k99587o58569m98438j43100J12928
34982i76441K66504K60658n4775m83887n07534J7095N50877N20177J4019l86728
34972g80035l01018J19154M58074N01615L99016L49146K38300j49547n92548n65974
34962c23817p7748J84587j14257l79973p7491L26308J74923j90300m9015L33762
34952a93021J57630l59052k39899M53652N65107j54771n10364J05003O32087J92355
34942F48727l64084M5104Q40396Q11548J74635K4537L07045J2051q42828j097642
34932E59489m29539J04666j25528l75041L5572N48271M10674p7147k17175p9760
34922C54482j36632k69758m0602L75341L67700j14812m61406k92840J13164L55014
$$ plain form
34992 271343 -70494 -420379 -315362 195713 510325 210738 -447831 -946269 -1089369 -976441
34982 -976441 -709937 -449279 -504054 -987941 -1495475 -1478380 -927503 -407326 -393307 -780035
34972 -780035 -1081053 -961899 -503825 -2210 396806 745952 984252 834705 242157 -323817
34962 -323817 -401565 -216978 -331235 -711208 -788699 -462391 -287468 -477768 -526783 -193021
34952 -193021 -35391 -394443 -634342 -180690 384417 229646 -280718 -175715 456372 648727
34942 648727 284643 329747 1170143 1981691 2156326 2180863 2487908 2499959 1657131 559489
34932 559489 129950 234616 109088 -265953 -230381 317890 728564 651417 434242 354482
34922 354482 217850 -51908 -92510 282831 650531 535719 74313 -218527 -105363 249651
34912B49651M06761M47104M88187L47590p1496n19304n30541k0260L76784J5534
34902A190010p26941p84538M7809O90031L63770k29885j06089L76979K03757m87193
34892E37710o23397o3897J89163j99057l17549K84237O91587K10721l61979q8638
34882B58901N03598L76115k38177l39931O9579J16545l07925m01683P7355M40381
34872E54758K90205P885j37319l27679m84810k39672J99960J69597k69788l20553
34862e57416J69684M44338K25380J35780L57606K04215m08371m71638L32512P63842
34852A195932K245q30544m52936M32599L37578n59640q45523j87611M29476M51560
34842b6864K10284j38520o81027r24621l17725N45982O08360N8711n9701K52341
$$ plain form
34912 249651 656412 1103516 1591703 1939293 1867797 1348493 817952 797692 1174476 1190010
34902 1190010 463069 -321469 -273660 416371 780141 550256 444167 821146 1024903 537710
34892 537710 -85687 -149584 39579 -159478 -477027 -192790 498797 709518 347539 258901
34882 258901 762499 1138614 900437 560506 630085 746630 438705 37022 114377 554758
34872 554758 844963 852848 715529 387850 -96960 -336632 -136672 32925 -236863 -557416
34862 -557416 -387732 56606 281986 417766 775372 979587 571216 99578 432090 1195932
34852 1195932 1198177 367633 -85303 347296 684874 125234 -720289 -907900 -478424 -26864
34842 -26864 183420 44900 -636127 -1560748 -1878473 -1332491 -724131 -665420 -725121 -472780
34832d72780P1974n02370l44834N48693P59939j86198r23878m76740K46404J61030
34822a118760k38153K618N87407O19570J18123k40273k61213j72938L964K34888
34812d64767J94618j10107q8258M32930O97425J91586m61927n25922k70277k66862
34802f71561l49294j46589R3969J10362K95530Q25618R19188N2070q39807o02276
34792c12790L17300O02437J19158j53095Q8615J80405j07376k22749L0740J70403
34782G13048j7853j99628k37539l07964k78868J17093N41696M23538j6562j00539
34772F36422P9521j14747n24809l62412K44980K77837l70225n68775R8795N29153
34762g4260R94n01303N3513R04835O61021m58685r71111l70602L27115K80214
$$ plain form
34832 -472780 -400806 -903176 -1248010 -699317 60622 -125576 -1049454 -1526194 -1279790 -1118760
34822 -1118760 -1356913 -1354295 -766888 -147318 -29195 -269468 -530681 -703619 -699655 -464767
34812 -464767 -270149 -380256 -468514 -35584 661841 853427 391500 -134422 -404699 -671561
34802 -671561 -1020855 -1167444 -1073475 -963113 -667583 158035 1077223 1129293 289486 -312790
34792 -312790 4510 606947 726105 573010 661625 842030 734654 511905 542645 713048
34782 713048 695195 495567 258028 -49936 -328804 -211711 329985 753523 736961 636422
34772 636422 715943 601196 76387 -286025 -41045 236792 -133433 -702208 -603413 -74260
34762 -74260 -73266 -574569 -521056 383779 1044800 586115 -384996 -755598 -428483 -148269
34752a48269j22171j83261M5584J14203j6449l8784J23294K46357K07002R5998
34742C23504n1552l02179m95626k32744M79277Q66326K59228p68101r03239Q1725
34732g43381Q72545M58673m33887n60716l4789J40804j26881m2832M61503N48489
34722E39528O204l74582k21212r9184k42570o8407N09126O05931m1211l14070
34712B99553M52809J095161L74626q92765j010684k6679M95564J0616m07587n9545
34702C31069L90481L17685J41067K97745L47044j35256o31769m60469J36523M33309
34692A167429K95848J29664J04985Q2529N7802R3663J8257k69079m05499n9589
34682A216010L62391J74405m80355o97651j15344N47124N59030J69007M1244J85936
$$ plain form
34752 -148269 -270440 -453701 -408117 -293914 -310363 -349147 -225853 20504 227506 323504
34742 323504 271952 -30227 -525853 -758597 -279320 587006 846234 78133 -825106 -743381
34732 -743381 129164 587837 153950 -406766 -441555 -300751 -427632 -470464 -8961 539528
34722 539528 545732 171150 -50062 -149246 -391816 -460223 48903 654834 613623 299553
34712 299553 752362 1847523 2222149 1329384 318700 292021 787585 798201 390614 331069
34702 331069 721550 1039235 1180302 1478047 1825091 1689835 1058066 597597 734120 1167429
34692 1167429 1463277 1592941 1697926 1780455 1838257 1931920 1950177 1681098 1275599 1216010
34682 1216010 1578401 1752806 1272451 574800 459456 1006580 1565610 1734617 1775861 1961797
34672A961797J08626k15843k43214K21861O41932N28508J27073k7838J05918J65149
34662C373969M5298J0142J67471K64961J27139k8626R7208M66171P73742Q02996
34652F100471N64525K32651J02260M40266J135126J615823J440215R32575Q73850
34643A3437762J497550K201374K448076K520689L010614L935571M907489N905103
34635C9864228P221475Q828136J0590834J3041385J6985006K2314607K8341457
34628A47187128L5178365M2577291M6371188L8909504J6682567j2887431l5755063
34621B78263549m3592317l9857707l3169423k7834396k2934528j7731563j3739185
34614G9404430j1743169j0270769q065757n896210m844618m469432l810126k989924
$$ plain form
34672 1961797 2070423 1854580 1611366 1833227 2475159 3003667 3130740 3102902 3208820 3373969
34662 3373969 3419267 3429409 3596880 3861841 3988980 3960354 4057562 4523733 5297475 6100471
34652 6100471 6664996 6897647 6999907 7440173 8575299 10191122 11631337 12563912 13437762
34643 13437762 14935312 17136686 19584762 22105451 25116065 29051636 33959125 39864228
34635 39864228 47085703 55913839 66504673 79546058 96531064 118845671 147187128
34628 147187128 182365493 224942784 271313972 310223476 326906043 314018612 278263549
34621 278263549 234671232 194813525 161644102 133809706 110875178 93143615 79404430
34614 79404430 67661261 57390492 49324735 43428525 38583907 34114475 30304349 27314425
34606B7314425k655440k651776k329272j663349j179691j074563j098424j091566
34598A3570344j098785j111852j073227r88229q26856n35991k49891j64646j59635
34589G361232K1872K05685j2486m52042m82725j51319k93652j115663j569486
34580C511416q32796L57072P24317K36970j24945j8560n3652n00748p45833l41262
34570B211979K12375K22349j79684l07397N3989L90610K19520k62938m64497j61913
34560A934393K52771L04784r440l40593m54483l36214o804M02988N12371Q1697
34550B341470m75882m83917K4114K74071j23403n91921m65615P3124L88156L19783
34540A279980K02726K13695K08405Q9905o4865j81673k19054j36243k8449q4951
$$ plain form
34606 27314425 24658985 22007209 19677937 18014588 16834897 15760334 14661910 13570344
34598 13570344 12471559 11359707 10286480 9298251 8471395 7935404 7685513 7520867 7361232
34589 7361232 7383104 7588789 7576303 7124261 6641536 6490217 6196565 5080902 3511416
34580 3511416 2678620 3035692 3760009 3996979 3872034 3853474 3799822 3299074 2553241 2211979
34570 2211979 2424354 2646703 2467019 2159622 2213611 2604221 2823741 2560803 2096306 1934393
34560 1934393 2187164 2491948 2482508 2141915 1687432 1351218 1344414 1747402 2259773 2341470
34550 2341470 1865588 1381671 1405785 1679856 1556453 964532 498917 572041 960197 1279980
34540 1279980 1482706 1696401 1904806 1994711 1929846 1748173 1529119 1392876 1364427 1279476
34530A279476k26138j05740K67239L19638k57650q54647o71638J56309P58795
34521F65644O87179K65496j09761l65042m30649j80080J64708J44990k14628l30310
34511B97547N1465M21900L14896L6525R3626K98755Q9534m67062p02270l98392
34501C6524j21016k67262m09884l1914N73582P35567M24242J53784L2597k92055
34491H34165p02099n10520L61948R36455M96832l13679m59393j8041J76731k3756
34481G78643o9975N7605k03753p29517n87315M09182J105505O11440l79800o57684
34471C34331j87299J43059j6464k05649j19607K6833Q2939J80280K77153Q9118
34461F04694l58084n83448k84266K05897L21582l8732l99983k61459L19863P59440
$$ plain form
34530 1279476 1053338 947598 1214837 1534475 1276825 422178 -249460 -93151 665644
34521 665644 1352823 1618319 1508558 1143516 712867 532787 697495 842485 627857 297547
34511 297547 349012 770912 1085808 1122333 1215959 1514714 1604248 1137186 434916 36524
34501 36524 -84492 -351754 -761638 -793552 -219970 515597 939839 1093623 1126220 834165
34491 834165 132066 -378454 -16506 919949 1416781 1103102 643709 625668 802399 778643
34481 778643 708668 766273 562520 -166997 -754312 -345130 760375 1371815 992015 334331
34471 334331 147032 290091 273627 67978 -51629 -24796 58143 238423 515576 604694
34461 604694 246610 -336838 -621104 -415207 -93625 -132357 -532340 -793799 -473936 285504
34451B85504O13197J18131j31276K5532J71495k0027l55554m89398l67840j34094
34441b84330R2926J84543O1981q0865L4038K63991J83776j49510j51036L20553
34431D76067N83791J52036m57469m90146m9613J92892J9649k25613k83113j58521
34421b40040J15110L92353L47633l4134k30769M0907K41825j41524n98566l03964
34411d11169M71887O62788M3568m56011k17475K54799L26597J81222K53831L75250
34401A485287J13187m07873o16678k87878J96527L49532Q8121k59179l30204j11916
34391B18926O4846l9092k56866k82834r8212J09170K92055M87376N41005K83809
34381A320183p3627j38425O2824R2649k17665m94278l70122K3281K95075K77765
$$ plain form
34451 285504 898701 1016832 885556 911088 1082583 1062556 707002 217604 -150236 -284330
34441 -284330 -191404 -6861 55120 -25745 8293 272284 456060 306550 155514 476067
34431 476067 1059858 1211894 754425 264279 214666 407558 427207 201594 -81519 -240040
34421 -240040 -124930 267423 615056 580922 350153 391060 632885 491361 -107205 -411169
34411 -411169 60718 723506 767074 311063 93588 348387 674984 856206 1110037 1485287
34401 1485287 1598474 1190601 573923 286045 482572 832104 920225 661046 330842 218926
34391 218926 283772 244680 -12186 -295020 -393232 -284062 7993 495369 1036374 1320183
34381 1320183 1246556 1108131 1170955 1263604 1045939 551661 181539 204820 499895 777660
34371G77660Q7989j18473k69967l28838k46412l869K90605L97306J80599j53599
34361F13001k68941j66288j35514j85330L3888N33655P18223K10637m84103o45207
34351B24021l13429m5541J447R5614K45258J84363k3510k6777J49206R3043k55856
34340C27839m30341j43548L04612M89610L38876K3840k66539l42278j30981J33108
34330C04198J25839j14109k19125N764L68179N60362M26186L6388k92344k13603
34320I87735J82913L65590R5946j72990j8161K40158R9611k27192j86665J11542
34310A478487O6565l58145n67484l32691p9737p6249n0438J89524L73225K34820
34300H77877j04296l77503m28578k03656J43837K33120m8827k28949Q0125M70053
$$ plain form
34371 777660 865649 747176 477209 148371 -98041 -101910 188695 586001 766600 613001
34361 613001 344060 177772 42258 -143072 -109184 424471 1142694 1353331 869228 224021
34351 224021 -89408 -134949 -133502 -37888 207370 391733 368223 341446 490652 583695 327839
34340 327839 -102502 -246050 58562 548172 887048 910888 644349 302071 171090 304198
34330 304198 430037 315928 96803 102567 470746 1031108 1457294 1493682 1201338 987735
34320 987735 1170648 1536238 1632184 1459194 1441033 1681191 1780802 1553610 1366945 1478487
34310 1478487 1545052 1186907 619423 286732 206995 130746 80308 269832 643057 877877
34300 877877 773581 396078 -32500 -236156 -92319 140801 91974 -136975 -56850 413203
34290D13203L28166j62522l74758k93161l21239k96312K33017Q78723P42378q6156
34280A061339n44119k58715P347j83109k84081K3302J80162j37662l74846j72503
34270f82885l1824k63681l18390J34595M78630K62097K8943K06246J89394m73219
34260d70094r50434l54840O77106Q66889J76803l88032l94723k19069k6672L18173
34250g64893N47173K60500k42247l38308r5540k0406o7110J36638L46184M8105
34240a89904m35075l12387K78409L92276j55790n03193k10858J13316J1727p6350
34230a087829K10274L82104p348m32082j46921N98720Q72546L59657l20620n47164
34220a18663l83397k22369j69257m4263J88136L03451J72869p715j9119L7497
$$ plain form
34290 413203 741369 578847 204089 -89072 -410311 -706623 -473606 405117 1147495 1061339
34280 1061339 517220 258505 265852 82743 -201338 -178036 2126 -135536 -510382 -682885
34270 -682885 -714709 -978390 -1296780 -1162185 -683555 -421458 -392515 -186269 3125 -470094
34260 -470094 -1420528 -1775368 -1098262 -231373 -54570 -442602 -837325 -1056394 -1083066 -764893
34250 -764893 -217720 42780 -199467 -537775 -633315 -653721 -720831 -584193 -238009 -189904
34240 -189904 -624979 -937366 -658957 -266681 -422471 -925664 -1136522 -1023206 -1011479 -1087829
34230 -1087829 -877555 -495451 -502799 -934881 -1081802 -483082 389464 749121 428501 -118663
34220 -118663 -502060 -724429 -893686 -937949 -749813 -446362 -273493 -281208 -300327 -262830
34210b62830l1144j02251M8968K41721J17912j55586n4251L52086L58153k20382
34200B92396o37082l79521L0986k0803k25079J3380N14753O83781M61388J73955
34190I08154j32299m79441n21043o4094L93890L69842J61742J86686J58812k10249
34180G72000l69969J39285N72782P4149o95563n04544L08701L30273m82246o75468
34170e30600K31316R62152O13171j09223l99357n35368p77734n48615L37486Q93699
34160A36927M32715k74169l02740N926l0665j16956K45700N70312K43512j81312
34150G29250J15683O46061L56632m80936o05265J70140O61650J88468n34430o62921
34140E84332l14359p077J36314K12019J92425R7756N0586j235j74213k52959M5444
$$ plain form
34210 -262830 -293974 -396225 -347257 -105536 12376 -143210 -197461 154625 512778 292396
34200 292396 -344686 -724207 -693221 -714024 -939103 -925723 -410970 272811 734199 908154
34190 908154 775855 296414 -224629 -288723 105167 475009 636751 823437 982249 772000
34180 772000 402031 541316 1114098 1188247 492684 -11860 296841 627114 144868 -530600
34170 -530600 -299284 662868 1276039 1166816 767459 232091 -545643 -1094258 -756772 136927
34160 136927 569642 295473 -7267 -1341 -32006 -148962 96738 667050 910562 729250
34150 729250 844933 1490994 1847626 1366690 761425 931565 1593215 1781683 1247253 584332
34140 584332 269973 262896 399210 611229 803654 901410 951996 950761 776548 523589 569033
34129E69033M25756K92757k71293n19786j77385J71047Q2590q0627J07201L75868
34119I75161K67410q7789k67302k69868l66142m91534l61278n4491O7098j4337
34109f03072M7243L00882L32565m7001l98039k65565J27059K17267n4614k30466
34099e73741j27297j06255l69910m94197n9978O01542Q12948N10607K34302K17300
34089F45321J09606k73985n45799l86967q4637k8609r1662K1544J58440J2433
34079d64315j98609K1639N81920Q01692L75104k04699l81259k23441r9547o6169
34069A42316L3278J27119O645k44756l04922r3568J33352K09108K45211K83797
34059E37580J04195l64981p02143m43621K21056O08818M29331J13988J11677K46102
$$ plain form
34129 569033 994789 1287546 1016253 496467 319082 490129 572719 492092 599293 975161
34119 975161 1242571 1154782 887480 617612 251470 -240064 -601342 -655833 -588735 -603072
34109 -603072 -555829 -254947 77618 30617 -367422 -632987 -505928 -288661 -343275 -573741
34099 -573741 -701038 -807293 -1177203 -1671400 -1731378 -1129836 -316888 193719 428021 645321
34089 645321 754927 480942 -64857 -451824 -536461 -565070 -656732 -635188 -476748 -464315
34079 -464315 -662924 -641285 -59365 742327 1117431 912732 531473 308032 208485 142316
34069 142316 175594 302713 309358 64602 -240320 -333888 -200536 8572 253783 537580
34059 537580 641775 276794 -425349 -868970 -647914 -39096 390235 504223 615900 862002
34049H62002R0095k99360m55796k27507Q44j02494l36207k71934J39694M92939
34039a07724M44471J52359P8817L63570N69131K30828m55626q18392n88402k04522
34029c35490j08661j56928n801L01536N06228N63274M88831R7720o14081j104112
34019c67484q70973k09657J95770K41750L29760M99698L97791N4166r6707q452
34009A65662m4755j45169J50951O77181O04752j98774p33124l45379K38636R1420
33999D61401m72768n16740K0184L95942L07638J46328J54229J32788k0201j21997
33989D86804p0344P5657L10996N80978O41376M28699K98943M39218L99297k03054
33979C388570q77056q90191m09537j87293l17995k28233J73805L11960l193k57084
$$ plain form
34049 862002 952097 652737 196941 -30566 -29722 -132216 -468423 -740357 -600663 -107724
34039 -107724 336747 489106 567923 931493 1500624 1731452 1275826 457434 -130968 -335490
34029 -335490 -444151 -601079 -606880 -305344 200884 764158 1252989 1350709 736628 -367484
34019 -367484 -1238457 -1448114 -1252344 -1010594 -680834 -181136 216655 270821 174114 165662
34009 165662 120907 -24262 126689 803870 1408622 1209848 476724 131345 369981 461401
33999 461401 -11367 -528107 -507923 -111981 195657 341985 496214 629002 608801 486804
33989 486804 416460 492117 803113 1384091 2025467 2454166 2753109 3192327 3591624 3388570
33979 3388570 2511514 1621323 1211786 1024493 706498 478265 652070 964030 960837 703753
33969G03753j60405l1234k8077J17023L18577L0901o57754p83252L1688P77253
33959C18473N11989j90112k26425K64010K96225k01739l35892J12628K99971j52198
33949F96930m29845R4866P29298N10748k80504n71736j00826L43420K05872j42090
33939A056133j67800K5690J6444k38520m05361k85031l2120P6724n6866k39903
33929b50610j50017K70100O14455M50156n5809k96971r0560O8825j51539l33165
33919G4865k3333L81626J61373n25076p54407k03284L83507L51099M6839J07918
33909A127M06170L38835j46135m71282k98713N8847J49342p6754l15349k57165
33899f11077J34043N23257M62182p0127n29960m51463m2316J85921J87349L21281
$$ plain form
33969 703753 543348 512114 484037 601060 919637 950538 292784 -490468 -458780 318473
33959 318473 830462 640350 413925 677935 974160 772421 436529 549157 849128 696930
33949 696930 267085 361951 1091249 1601997 1321493 749757 648931 992351 1198223 1056133
33939 1056133 888333 914023 930467 691947 286586 1555 -30565 46159 -10707 -250610
33929 -250610 -400627 -130527 483928 934084 878275 581304 490744 559569 408030 74865
33919 74865 51532 433158 594531 69455 -684952 -888236 -504729 -153630 -106791 1127
33909 1127 407297 746132 599997 128715 -169998 -111151 38191 -38563 -353912 -611077
33899 -611077 -477034 46223 508405 438278 -91682 -543145 -585461 -399540 -212191 109090
33889A09090O22003O80265L25042r8702l11642m71296o89866o46407j04785N19662
33879f6636O20630K45753l1323M659P225k06565l11992r8936Q0032j12324l76573
33868b46050k53238O9693O0121j92558o2783M85393O50518J6926o81920n84742
33858g38640N8197L52833R1081j39463K9353L63957N80988N93064K52433m58221
33848I85582j002823p90334j14627J72941l7765l7809L53310M09810j55516n25835
33838g43066q5171N54175N97597K97111K52630K55971j32226m88327j73993L69834
33828G04535J98329n36335p91303l25159M8105p1791j71885J6749M9993j94136
33818a072898j20923M53892P75102L26841l17738m33303j59220M1522K05943M60871
$$ plain form
33889 109090 731093 1411358 1736400 1637698 1326056 854760 164894 -481513 -586298 -66636
33879 -66636 553994 799747 768424 773083 780308 573743 261751 162815 242847 130523 -246050
33868 -246050 -499288 -429595 -369474 -562032 -624815 -139422 511096 528022 -153898 -738640
33858 -738640 -680443 -327610 -236529 -375992 -346639 17318 598306 1191370 1443803 985582
33848 985582 -17241 -807575 -922202 -749261 -787026 -824835 -471525 -61715 -217231 -743066
33838 -743066 -828237 -274062 323535 620646 873276 1129247 997021 508694 334701 704535
33828 704535 902864 366529 -424774 -749933 -701828 -773619 -945504 -928755 -878762 -1072898
33818 -1072898 -1193821 -739929 35173 362014 44276 -389027 -548247 -506725 -300782 160089
33808A60089M51638m9375n03791l60640J3217l5253k93207p3249N01013N87831
33798C98273j294m47984j63332L86087M54879N6999k22795j21948M9005l5906
33788C51984k49765k17766J25654L67212J29174l54311m68373n7982L32783K45382
33778B03992n2199m3228K45654L82486K43348Q1740p592j70452l43322k42228
33768B98199R4373K33594J2868j57541N8118L44464K12536j79909j88476L30535
33758A058761O63832J40147q75785j285318n72887N18701Q47561J97253n85540
33749A06725p03300k48750J84262L29435L51468L58977K50040K6313j07321n6064
33739D91785K0748J531N720J32448J86349q0625n21609o55463k45696L62055O07013
$$ plain form
33808 160089 611727 562352 58561 -302079 -288862 -324115 -617322 -690571 -189558 398273
33798 398273 396979 -51005 -214337 171750 626629 683628 460833 338885 387890 351984
33788 351984 102219 -115547 10107 377319 506493 152182 -316191 -374173 -41390 203992
33778 203992 151793 108565 354219 736705 980053 1061793 1054201 883749 540427 298199
33768 298199 392572 626166 639034 481493 539611 884075 1096611 916702 728226 1058761
33758 1058761 1722593 1862740 986955 -298363 -871250 -352549 495012 692265 106725
33749 106725 -596575 -845325 -661063 -331628 19840 378817 628857 655170 547849 491785
33739 491785 512533 514064 519784 652232 838581 757956 236347 -419116 -664812 -302757 304256
33728C04256L23056j36948l26906j35763J83837L02408J29103r3733n8879J87762
33718F78193K51957l2972k64320m5897K96163J27658m17985m94825J41343O49710
33708H89025L76575j33788q6018K49611P9590m95573o55161k44142Q3723P8540
33698A42382J83980M96318M83055N234l51466k82688j66736j56796J02360M76492
33688I32135K18970n96368p64191J20701O95093p8791j052685o20620O49585Q99036
33678D02865r0860p66982m06136Q2201J10791K95938Q71765R27641L5052p81341
33668F80934o13113j7257J33278N3283K74869M49094O6758m01672k75837M6526
33658C96863k05911o72149l63429N85189R80359L86115l21151l72499j3660K59956
$$ plain form
33728 304256 627312 490364 163458 27695 211532 513940 643043 549310 490431 678193
33718 678193 930150 897178 632858 586961 883124 1010782 592797 97972 239315 889025
33708 889025 1265600 1131812 1045794 1295405 1374995 879422 224261 -19881 63842 142382
33698 142382 326362 822680 1305735 1310969 959503 676815 510079 353283 455643 932135
33688 932135 1151105 554737 -209454 -88753 606340 527549 -525136 -1145756 -496171 402865
33678 402865 312005 -454977 -861113 -778912 -668121 -372183 499582 1427223 1462275 680934
33668 680934 67821 50564 183842 237125 511994 961088 1027846 626174 350337 396863
33658 396863 190952 -481197 -844626 -259437 720922 1107037 785886 413387 399727 659683
33648F59683L92712L42654j32706q02726q65356p6953O75591N40710j00857k72497
33638C60255J80169N46066L96467L3845j72008k15536j09013K81681P87297Q25518
33628B914741J50636o11432o41562J2433N08363L08967k41749n26776m03323j22642
33618A347656J19757K25103O6908k87912m33913j13770L02925K74660r5628k15549
33608A190237P0006K85939J28213j33945k25528k54990k88023j03976K85938M15363
33598A369234O0774l32847l54871k51912l51567l91813o0397K66891Q3459l11084
33588b74133k49829J82439L30823J02747L755J03823n8339m48254m07345J73954
33578e40359M93783Q5017m08584k54035K75789M51686J68014j73342m08342n82195
$$ plain form
33648 659683 1052395 1395049 1262343 459617 -405739 -482692 192899 733609 632752 360255
33638 360255 540424 1086490 1482957 1516802 1344794 1129258 1020245 1301926 2089223 2914741
33628 2914741 3065377 2453945 1812383 1824816 2333179 2642146 2400397 1873621 1470298 1347656
33618 1347656 1467413 1692516 1759424 1471512 1037599 923829 1226754 1501414 1405786 1190237
33608 1190237 1260243 1546182 1674395 1540450 1314922 1059932 771909 667933 953871 1369234
33598 1369234 1430008 1097161 742290 490378 138811 -253002 -313399 -46508 36951 -274133
33588 -274133 -523962 -341523 -10700 92047 95802 199625 141286 -306968 -714313 -540359
33578 -540359 -46576 38441 -370143 -624178 -348389 103297 271311 97969 -310373 -892568
33568h92568n15508n8791M26798M39719O5649j77435j11183j8889o1864o4439
33558i68511P8839J89021J10659l9380n0508J01791K33330J65757m4871j37930
33548c61803l0J11174q5131m21179m88588k43513J4613K01424M41976N37932J48366
33537a44759l92947k66120N31904R31141L20134m99788n36438P68L12671K85897
33527E42463K31901j172n86337r07668l66498L85888K75187l96804l47003N63268
33517f06775J051083M69506k77192l45079j76363m18073p13013m26810K14694
33508a228022N43291M39029K24855N6495k7104Q0421K31252M2521l76007l62425
33498c75694K03419N10005P7480l94844j71104L06677K44974j34927j00726K30715
$$ plain form
33568 -892568 -1408076 -1466867 -1040069 -600350 -534701 -712136 -823319 -842208 -904072 -968511
33558 -968511 -889672 -700651 -589992 -629372 -679880 -578089 -344759 -179002 -223873 -361803
33548 -361803 -361833 -250659 -335790 -756969 -1245557 -1489070 -1474457 -1273033 -831057 -293125 -144759
33537 -144759 -537706 -803826 -271922 659219 979353 479565 -56873 -56105 256566 542463
33527 542463 774364 773192 186855 -720813 -1087311 -701423 -426236 -823040 -1170043 -606775
33517 -606775 444308 913814 636622 291543 115180 -302893 -1015906 -1442716 -1228022
33508 -1228022 -684731 -245702 -20847 35648 8544 88965 320217 362738 -13269 -375694
33498 -375694 -172275 337730 415210 20366 -150738 155939 400913 265986 165260 395975
33488C95975J64808k55096l36227P011J74547K4734L6304K59191J58106k93202
33478C36151l89525P7119L35331r0685m88423o0004P43320Q50385J54936m19711
33468A048894l44634j23073l06358n89837l84327J39437K38912k34233n13514
33459a068733k5928P06027P78179J94399k11412l7513K21829R9089j54123j24723
33449C77091P8958J22603j966j21656k14508k39065j2719L75956M38524k8469
33439G74749n32397n78114l49158k38367j56108J34081M02389L02161J6341l5713
33429b60136J47976L11991M01825L54386q8800p57697q21828L5575P92410M05196
33419E20898n55589p11052P6855P06905O43468L88278K25024j34476n43790m07223
$$ plain form
33488 395975 560783 305687 -30540 -23529 151018 175752 212056 471247 629353 336151
33478 336151 -53374 23745 359076 268391 -220032 -280036 463284 1313669 1468605 1048894
33468 1048894 704260 581187 274829 -315008 -699335 -559898 -320986 -555219 -1068733
33459 -1068733 -1094661 -388634 389545 583944 372532 335019 556848 655937 501814 377091
33449 377091 456049 578652 576686 455030 240522 1457 -11262 364694 803218 774749
33439 774749 242352 -335762 -684920 -923287 -1079395 -945314 -542925 -240764 -224423 -260136
33429 -260136 -112160 199831 601656 956042 867242 109545 -712283 -676708 115702 520898
33419 520898 -34691 -745743 -668888 38017 681485 1069763 1294787 1160311 616521 209298
33409B09298Q5607M493p18749j015684m24248J80261J34730k909L22871O43445
33399e80885M82145K79554M07111L01684m16774r34146m75870K86353K84108j87281
33389e54001q5572M97887M91778l03282q61353n37588J00100L08790J40634L5149
$$ plain form
33409 209298 294905 299398 -419351 -1435035 -1859283 -1679022 -1544292 -1547201 -1224330 -580885
33399 -580885 -98740 180814 587925 889609 472835 -461311 -937181 -650828 -366720 -554001
33389 -554001 -639573 -141686 350092 46810 -814543 -1352131 -1252031 -943241 -802607 -767458
$$ [...]
##END NTUPLES=NMR SPECTRUM
##END=
