##TITLE=31Pdec_LR-741-RM3
 , 24 sc
 8.11.2021
##JCAMPDX= 6.0         $$ Bruker NMR JCAMP-DX V2.0
##DATA TYPE= NMR SPECTRUM
##DATA CLASS= NTUPLES
##ORIGIN= UXNMR, Bruker Analytische Messtechnik GmbH
##OWNER= root
$$ XWIN-NMR		Version 3.5
$$ Mon Nov  8 13:12:02 2021 Russian Standard Time (UT+4h)  she@DPX200
##.OBSERVE FREQUENCY= 81.013821
##.OBSERVE NUCLEUS= ^31P
##.ACQUISITION MODE= SIMULTANEOUS
##.ACQUISITION SCHEME= undefined
##.AVERAGES= 24
##.DIGITISER RES= 16
##SPECTROMETER/DATA SYSTEM= spect
##.PULSE SEQUENCE= zgpg30
##.SOLVENT NAME= CDCl3
##.SHIFT REFERENCE= (INTERNAL, CDCl3, 0, 248.564)
##AUDIT TRAIL= $$ (NUMBER, WHEN, WHO, WHERE, WHAT)
$$ ##TITLE= Audit trail, XWIN-NMR		Version 3.5
$$ ##JCAMPDX= 5.01
$$ ##ORIGIN= Bruker BioSpin GmbH
$$ ##OWNER= she
$$ F:/spectra/data/she/nmr/P31/1/pdata/1/auditp.txt
$$ ##AUDIT TRAIL=  $$ (NUMBER, WHEN, WHO, WHERE, WHAT)
(   1,<2021-11-08 13:11:05.31 +0400>,<she>,<DPX200>,
      <created by zg, POWCHK disabled, PULCHK disabled
       configuration hash MD5:
       00 E9 B6 7A A2 85 ED C7 34 08 36 98 17 FE 4E 26
       data hash MD5: 32K
       A2 51 6C 55 4F E7 F2 80 EC 12 64 DA 18 AD 2B 46>)
(   2,<2021-11-08 13:11:07.78 +0400>,<she>,<DPX200>,
      <Start of raw data processing
       efp BC_mod = 2 LB = 1 FT_mod = 6 PKNL = 1 PHC0 = -8868.039 PHC1 = 165.2694 SI = 64K 
       data hash MD5: 64K
       CB 1C C3 F4 1B 28 42 AD EF 25 4C 06 F0 E1 18 1E>)
(   3,<2021-11-08 13:11:31.70 +0400>,<she>,<DPX200>,
      <pk PHC0 = -17.14766 PHC1 = 31.19999 
       data hash MD5: 64K
       12 77 D9 4B 3D 00 D7 EA 72 92 C5 84 7C DE 53 BA>)
$$ ##END=
$$ 
$$ hash MD5
$$ FA 30 49 90 DD 92 F3 FF 3F 7A 92 25 53 70 A3 25
##$RELAX= 
##$RELAX= 
##$RELAX= 
##$RELAX= 
##$RELAX= 
##$RELAX= 
##$RELAX= 
##$RELAX= 
$$ Bruker specific parameters
$$ --------------------------
##$DU= <F:/spectra>
##$EXPNO= 1
##$NAME= <P31>
##$PROCNO= 1
##$TYPE= <nmr>
##$USER= <she>
##$AMP= (0..31)
100 100 100 100 100 100 100 100 100 100 100 100 100 100 100 100 100 100 
100 100 100 100 100 100 100 100 100 100 100 100 100 100 
##$AQSEQ= 0
##$AQ_mod= 1
##$AUNM= <au_zg>
##$AUTOPOS= <>
##$BF1= 81.014009
##$BF2= 200.13
##$BF3= 200.13
##$BF4= 200.13
##$BF5= 200.13
##$BF6= 200.13
##$BF7= 200.13
##$BF8= 200.13
##$BYTORDA= 1
##$CFDGTYP= 0
##$CFRGTYP= 5
##$CHEMSTR= <none>
##$CNST= (0..31)
1 1 145 1 1 1 1 1 1 1 1 1 1 1 1 1 1 1 1 1 1 1 1 1 1 1 1 1 1 1 1 1 
##$CPDPRG= <waltz16>
##$CPDPRG1= <>
##$CPDPRG2= <waltz16>
##$CPDPRG3= <>
##$CPDPRG4= <mlev>
##$CPDPRG5= <mlev>
##$CPDPRG6= <mlev>
##$CPDPRG7= <mlev>
##$CPDPRG8= <mlev>
##$CPDPRGB= <>
##$CPDPRGT= <>
##$D= (0..31)
0 1 0 0 0 0 0 0 0 0 0 0.03 2e-05 3e-06 0 0 0 0 0 0 0 0 0 0 0 0 0 0 0 0 
0 0 
##$DATE= 1636362664
##$DBL= (0..7)
120 120 120 11 120 120 24 19 
##$DBP= (0..7)
150 150 150 150 150 150 150 150 
##$DBP07= 0
##$DBPNAM0= <>
##$DBPNAM1= <>
##$DBPNAM2= <>
##$DBPNAM3= <>
##$DBPNAM4= <>
##$DBPNAM5= <>
##$DBPNAM6= <>
##$DBPNAM7= <>
##$DBPOAL= (0..7)
0.5 0.5 0.5 0.5 0.5 0.5 0.5 0.5 
##$DBPOFFS= (0..7)
$$ [...]
##$SUBNAM2= <"">
##$SUBNAM3= <"">
##$SUBNAM4= <"">
##$SUBNAM5= <"">
##$SUBNAM6= <"">
##$SUBNAM7= <"">
##$SUBNAM8= <"">
##$SUBNAM9= <"">
##$SW= 501.771253377433
##$SWIBOX= (0..15)
0 1 3 0 0 0 0 0 0 0 0 0 0 0 0 0 
##$SW_h= 40650.406504065
##$TD= 32768
##$TD0= 1
##$TE= 0
##$TE2= 300
##$TE3= 300
##$TEG= 300
##$TL= (0..7)
0 120 53 12 22 120 120 120 
##$TP= (0..7)
150 150 150 150 150 150 150 150 
##$TP07= 0
##$TPNAME0= <>
##$TPNAME1= <>
##$TPNAME2= <>
##$TPNAME3= <>
##$TPNAME4= <>
##$TPNAME5= <>
##$TPNAME6= <>
##$TPNAME7= <>
##$TPOAL= (0..7)
0.5 0.5 0.5 0.5 0.5 0.5 0.5 0.5 
##$TPOFFS= (0..7)
0 0 0 0 0 0 0 0 
##$TUNHIN= 0
##$TUNHOUT= 0
##$TUNXOUT= 0
##$USERA1= <user>
##$USERA2= <user>
##$USERA3= <user>
##$USERA4= <user>
##$USERA5= <user>
##$V9= 5
##$VALIST= <valist>
##$VCLIST= <CCCCCCCCCCCCCCC>
##$VD= 0
##$VDLIST= <DDDDDDDDDDDDDDD>
##$VPLIST= <PPPPPPPPPPPPPPP>
##$VTLIST= <TTTTTTTTTTTTTTT>
##$WBST= 1024
##$WBSW= 4
##$XGAIN= (0..3)
0 0 0 0 
##$XL= 0
##$YL= 0
##$YMAX_a= 17292
##$YMIN_a= -18826
##$ZGOPTNS= <>
##$ZL1= 120
##$ZL2= 120
##$ZL3= 120
##$ZL4= 120
##$ABSF1= 0
##$ABSF2= 0
##$ABSG= 0
##$ABSL= 0
##$ALPHA= 0
##$AQORDER= 0
##$ASSFAC= 0
##$ASSFACI= 0
##$ASSFACX= 0
##$ASSWID= 0
##$AUNMP= <proc_1d>
##$AZFE= 0.1
##$AZFW= 0.5
##$BCFW= 0
##$BC_mod= 2
##$BYTORDP= 0
##$COROFFS= 0
##$CY= -3
##$DATMOD= 1
##$DC= 0
##$DFILT= <>
##$DTYPP= 0
##$F1P= 0
##$F2P= 0
##$FCOR= 1
##$FTSIZE= 65536
##$FT_mod= 6
##$GAMMA= 0
##$GB= 0
##$INTBC= 1
##$INTSCL= 5.30512e-09
##$ISEN= 30
##$LB= 1
##$LEV0= 0
##$LPBIN= 0
##$MAXI= 10000
##$MC2= 0
##$MEAN= 0
##$ME_mod= 0
##$MI= 50
##$NCOEF= 0
##$NC_proc= -3
##$NLEV= 6
##$NOISF1= 182.463
##$NOISF2= 159.3651
##$NSP= 0
##$NTH_PI= 0
##$NZP= 0
##$OFFSET= 248.5645
##$PC= 4
##$PHC0= -8885.187
##$PHC1= 196.4694
##$PH_mod= 1
##$PKNL= yes
##$PPARMOD= 0
##$PSCAL= 0
##$PSIGN= 0
##$REVERSE= no
##$SF= 81.014009
##$SI= 65536
##$SIGF1= 159.3651
##$SIGF2= -187.1042
##$SINO= 113.3802
##$SIOLD= 16384
##$SREGLST= <1H.CDCl3>
##$SSB= 0
##$STSI= 65536
##$STSR= 0
##$SW_p= 40650.406504065
##$SYMM= 0
##$S_DEV= 0
##$TDeff= 32768
##$TDoff= 0
##$TI= <>
##$TILT= no
##$TM1= 0
##$TM2= 0
##$TOPLEV= 0
##$USERP1= <user>
##$USERP2= <user>
##$USERP3= <user>
##$USERP4= <user>
##$USERP5= <user>
##$WDW= 1
##$XDIM= 65536
##$YMAX_p= 338307044
##$YMIN_p= -3013117
$$ End of Bruker specific parameters
$$ ---------------------------------
##NTUPLES= NMR SPECTRUM
##VAR_NAME=  FREQUENCY,     SPECTRUM/REAL,   SPECTRUM/IMAG
##SYMBOL=    X,             R,               I
##VAR_TYPE=  INDEPENDENT,   DEPENDENT,       DEPENDENT
##VAR_FORM=  AFFN,          ASDF,            ASDF
##VAR_DIM=   65536,         65536,           65536
##UNITS=     HZ,            ARBITRARY UNITS, ARBITRARY UNITS
##FACTOR=    0.620285442955139, 1,           1
##FIRST=     20137.2065510759, 0,            0
##LAST=      -20513.1999529892, 0,           0
##MIN=       -20513.1999529892, -3013117,    0
##MAX=       20137.2065510759, 338307044,    0
$$ Real data points
##PAGE= N=1
##DATA TABLE= (X++(R..R)), XYDATA
$$ [...]
40262 54070 -4703 35133 156902 212436 172434 162031 220809 229728 145334 99496 148788 125002
40250 125002 -89290 -303415 -261258 -30761 96458 39581 1587 100165 186504 117573 -10041
40239 -10041 -36206 11977 3405 -66694 -89765 -33305 26828 42918 42463 43239 27233 4707 9912
40226 9912 23773 -6265 -54849 -29882 68645 107436 7505 -119667 -122233 -22789 39214 31458
40214 31458 42791 80668 30689 -122408 -198992 -71759 114404 127972 -18757 -99651 -7030
40203 -7030 124285 141931 58145 -45321 -145820 -232108 -249284 -188240 -139763 -167530 -205893
40192 -205893 -175348 -123695 -146001 -220077 -233029 -143816 -26223 31923 531 -95555 -190032
40181 -190032 -223088 -227238 -301575 -440748 -485924 -346493 -169045 -140339 -206761 -173442 -29674
40170 -29674 39045 -37792 -111463 -70386 -285 -1161 -15784 47928 157788 232778 268585 284064
40158 284064 242193 128608 21713 -13179 -15544 -24054 23240 169498 306368 292658 150086
40147 150086 21590 -17377 4677 53719 103477 92240 -9828 -117697 -128562 -71388 -46721
40136 -46721 -55079 -16520 64198 94111 48214 -8532 -56183 -132577 -198488 -147069 6456 91711
40124 91711 11334 -121751 -155085 -95801 -51577 -67477 -116946 -177956 -221103 -185980 -68501
40113 -68501 19386 -21646 -126212 -141043 -31729 87077 122365 105088 103006 115296 96797
40102 96797 37683 -22797 -42957 -19461 6051 -20098 -104032 -180581 -175615 -93164 -15676 -16711
40090 -16711 -97490 -207338 -292667 -316190 -262162 -150468 -32417 50056 97447 132582 157351
40079 157351 150344 104961 44883 -5904 -43310 -57474 -17027 83659 180810 198348 148965
40068 148965 121116 152704 183420 163795 137160 149752 146570 55400 -63403 -69812 51040
40057 51040 151539 120417 14238 -62930 -112814 -189094 -260097 -236736 -120958 -31834 -66151
40046 -66151 -189481 -280704 -249185 -107066 39332 72855 -24188 -146893 -186934 -158123 -154034
40035 -154034 -196579 -203971 -126940 -39493 -41312 -119615 -169386 -123463 -6074 120796 200993
40024 200993 186748 72512 -61222 -104372 -42453 30251 42471 21277 4105 -34930 -100376
40013 -100376 -103486 10928 123360 67796 -117676 -221980 -159179 -75304 -101637 -161891 -131482
40002 -131482 -53941 -53897 -125331 -160829 -135679 -112998 -105945 -90530 -129893 -313487 -568975 -722147
39990 -722147 -796585 -1069210 -1706184 -2465623 -2901671 -2808449 -2360052 -1865639 -1497544 -1237367
39980 -1237367 -982435 -678887 -391401 -239847 -245187 -279275 -217606 -101808 -77216 -187288
39970 -187288 -311295 -319314 -223014 -139386 -146628 -215697 -266659 -254437 -192872 -119484 -58512 -14596
39958 -14596 16672 37456 35721 -9581 -86954 -127755 -78321 -3427 -37123 -184993 -262547 -124499
39946 -124499 107062 168212 -15296 -247441 -314884 -196792 -3374 164276 240074 192301
39936 192301 74325 1448 17541 50778 41186 23896 34450 30271 -19085 -54453 -28831 -6458
39924 -6458 -59944 -134798 -125839 -41896 14639 4088 -14868 10119 69932 130088 151501 98286
39912 98286 -7186 -68258 -24178 59570 86369 70547 94810 165805 215769 221997 218598 205880
39900 205880 154438 90114 68674 69913 23673 -58481 -87221 -37739 22246 56890 97715 136138
39888 136138 106686 15850 -37272 -25167 -55204 -190867 -319463 -299987 -163295 -59712 -61946
39877 -61946 -118549 -162733 -170987 -135586 -65507 -8693 -8111 -44219 -73799 -103617 -161101 -207802
39865 -207802 -158141 1436 165308 204499 89206 -85834 -181722 -134266 -14711 44352
39855 44352 1873 -43329 17049 165904 302451 372134 380985 314101 144480 -66794 -181574
39844 -181574 -146438 -71494 -87222 -177922 -228724 -198466 -157473 -159643 -163749 -109777 -10369 73724
39832 73724 107193 91538 38577 -25260 -53899 -23065 40189 101950 167778 244259 290017 265694
39820 265694 204104 157032 97896 -25937 -155686 -160008 -36344 56985 29988 -6588 64663
39809 64663 160114 123046 -23323 -117284 -111972 -110659 -151107 -139084 -47218 -9397 -113045 -224579
39797 -224579 -156613 61189 212730 173151 37006 -41830 -37110 -28966 -59246 -80088 -40629
39786 -40629 32865 76481 79856 88359 118640 132372 112524 97408 95472 39858 -96382 -206248
39774 -206248 -177598 -70776 -38534 -90719 -87236 24185 122014 111574 60116 50782 39043
39763 39043 -37800 -123982 -141697 -128221 -144212 -130453 -9668 130684 128487 -5053 -94158
39752 -94158 -53453 29977 86407 162723 275701 325846 250552 136853 78438 28336 -88726
39741 -88726 -207537 -205342 -100669 -27642 -31134 -22102 54314 129814 127865 69447 19519 6457
39729 6457 36780 113585 189553 176599 72179 11734 102286 241891 215005 -26560 -279155
39718 -279155 -327089 -193197 -82596 -115266 -196742 -169936 -34830 42445 -61482 -262155
39708 -262155 -356670 -262355 -106626 -58929 -128396 -178848 -111213 31821 132781 113079 -19405
39697 -19405 -180208 -256534 -195220 -57803 45696 74698 67165 48929 9010 -33498 -27050
39686 -27050 22232 43286 19284 26368 104636 183263 201614 208797 248575 238692 98646 -65318
39674 -65318 -62657 108752 247669 230097 164429 211325 361586 470908 447606 339302 270716
39663 270716 330129 478706 559762 455398 243892 125941 175603 255763 221707 111011
39653 111011 57112 94526 146793 157058 127890 56190 -67315 -187541 -205167 -100376 24685
39642 24685 63842 24719 -8759 -1020 -5295 -82511 -216091 -323318 -336051 -256844 -146113
39631 -146113 -70622 -58282 -82898 -92682 -69464 -52228 -78486 -119242 -119183 -89560 -88241 -101661
39619 -101661 -44726 81222 140828 61417 -24494 35902 164488 156852 8746 -57824 67751
39608 67751 206664 152219 -30079 -104329 7579 140505 117822 -36453 -140975 -59159
39598 -59159 160924 326800 277669 30024 -249355 -396356 -354783 -168633 58684 202120
39588 202120 189823 66097 -65945 -165238 -259147 -341381 -353763 -285384 -202924 -155328 -128382
39577 -128382 -117834 -156593 -231457 -263208 -220768 -175405 -188115 -216865 -190049 -105593 -9141
39566 -9141 59979 62018 -25155 -137606 -159036 -70293 23101 57699 96396 179803 213497 106667
39554 106667 -72050 -186554 -201806 -157354 -58155 86552 187085 168286 94232 80925 130595
39543 130595 163792 159553 137478 54643 -131013 -322163 -356843 -221189 -57672 39385 107563
39532 107563 185242 227163 192766 123881 90321 114478 164925 179294 106873 -20815 -94891
39521 -94891 -64206 -15982 -49308 -134909 -195022 -242898 -314310 -337933 -240074 -123188 -149319
39510 -149319 -271745 -285664 -146943 -28498 -29609 -47165 -1644 22695 -32550 -62058 20128
39499 20128 119708 122217 73167 56907 30744 -60291 -126204 -76341 -26219 -150793 -382956
39488 -382956 -476482 -365817 -249852 -271895 -312686 -201035 22486 185335 226768 215902
39478 215902 178072 62220 -102839 -161267 -20784 191175 260328 139477 -24017 -98169
39468 -98169 -95906 -79647 -55024 -23506 -41217 -127796 -183821 -106193 56045 164113 173197 147231
39456 147231 120402 65421 -9095 -49970 -54086 -62636 -59805 7826 110162 159683 165772 221492
39444 221492 318518 335672 253665 208119 254704 259428 137023 28696 81157 184988 128769
39433 128769 -71521 -201033 -165204 -82444 -56186 -41869 12626 53921 34413 22383 99498
39422 99498 211348 219296 87542 -57352 -74621 25323 103489 72504 2321 9122 82028
39411 82028 102491 31002 -27945 8511 61332 -1021 -163137 -265522 -199727 -30293 90740
39400 90740 86240 8856 -48529 -66345 -90803 -119455 -72873 60294 132913 22553 -141456
39389 -141456 -108978 123540 269322 142608 -93646 -191052 -158940 -175171 -278019 -347046
39379 -347046 -328919 -289896 -260600 -196451 -101212 -51115 -77111 -130328 -169591 -186319 -153659
39368 -153659 -59099 19370 -16937 -136701 -203665 -160667 -87777 -67322 -91955 -126583 -169665
39357 -169665 -223085 -268126 -291123 -289336 -264264 -251119 -302858 -377528 -321973 -82743 146008
39346 146008 144357 -22843 -108328 -57914 -51499 -156579 -199376 -72237 64774 35947 -83350
39335 -83350 -121167 -82460 -84858 -129687 -125017 -70051 -44484 -58760 -70003 -106991 -223034 -351006
39323 -351006 -363957 -275200 -227899 -275786 -317854 -274274 -188310 -113997 -35767 41124 43396 -44537
39311 -44537 -108384 -54559 42599 48970 -27152 -56318 9217 70823 41280 -31194 -46833 5863
39299 5863 58540 71548 63295 42154 -21062 -132345 -235669 -267248 -220227 -130886 -31319 53004
39287 53004 88375 58501 -10750 -87038 -169089 -250244 -281686 -237583 -187251 -213543 -271750 -238099
39275 -238099 -111438 -42311 -110519 -199914 -186969 -138021 -178330 -248304 -175571 28756 142717
39264 142717 53357 -71690 -38866 85561 98260 -19328 -87265 -20541 48611 -1555 -85067
39253 -85067 -47245 101362 221209 255082 260238 249995 159845 4185 -80989 -33445 16449
39242 16449 -66013 -203878 -218150 -96494 2900 -1604 -27589 -13088 -26628 -116541 -182872
39231 -182872 -111674 47424 150432 150991 116183 87908 38567 -42245 -110926 -131817 -111087
39220 -111087 -64852 -7337 35985 57152 91553 153699 171788 72765 -76567 -116880 -6170
39209 -6170 115623 113524 17815 -63757 -109191 -164346 -215223 -189466 -80754 21342 46206
39198 46206 16730 -16605 -51014 -96502 -116724 -70183 7589 29461 -23016 -56410 25178 196400
39186 196400 330442 328269 201087 40367 -60221 -66044 -28087 -45326 -155355 -263080 -235015
39175 -235015 -75413 58770 49132 -48007 -107574 -105577 -97723 -81718 1472 133736 200131
39164 200131 137884 22453 -39074 -37142 -34743 -61703 -88102 -83873 -66795 -89519 -179014 -278338
39152 -278338 -276062 -137045 25509 78243 42201 40351 85022 58111 -63995 -123490 -15167
39141 -15167 127248 120040 9461 -6057 113354 194882 119036 -18774 -65010 -9186 40386
39130 40386 9678 -71247 -111674 -39955 132278 313944 422142 447546 408890 301221 153022
39119 153022 66518 98293 157363 145349 134373 236010 341779 224220 -86571 -275493
39109 -275493 -176420 454 9653 -79794 -64764 44309 93822 85800 152154 282454 315595
39098 315595 203154 82352 66008 119797 164414 162854 104472 28220 39390 167006 248685
39087 248685 128443 -74624 -107173 29923 82720 -42904 -141143 -63369 52443 53704 32706
39076 32706 119524 214733 159451 29058 15748 109624 131523 30919 -71887 -117655 -169691
39065 -169691 -236043 -224864 -116426 -23249 -34027 -117692 -203988 -243323 -184320 -27077 96285
39054 96285 47894 -91550 -99465 43489 85140 -115498 -330554 -268370 1906 158458 97734
39043 97734 49923 192653 375258 350884 132270 -48709 -66874 -21359 -30089 -61597 -35379
39032 -35379 21701 23310 -26150 -39032 6292 23816 -46743 -147257 -192374 -195460 -236706 -330455
39020 -330455 -391059 -342114 -218212 -130421 -139645 -187746 -169669 -61716 57094 115616 127705
39009 127705 124874 73999 -64692 -240717 -364858 -428183 -467957 -443253 -280798 -46034 86456
38998 86456 71229 45484 83927 70147 -77658 -210611 -137763 100166 310369 414806 467883
38987 467883 479450 408296 296505 231262 193454 116776 72302 191768 400046 442122 235333
38976 235333 -2954 -64077 -305 42663 71860 167986 285550 309913 248485 205873 204512
38965 204512 175663 114424 104182 170185 227248 210669 163296 141020 111289 22440 -71650
38954 -71650 -52224 90374 208966 181462 81855 77347 177859 212651 90112 -52008 -51988
38943 -51988 32379 34005 -40306 -21821 134791 266704 249976 165885 139278 148701 102947 4739
38931 4739 -71938 -97364 -82965 -23738 65573 110779 63461 -18556 -54532 -54274 -66649 -72237
38919 -72237 -30327 10617 -32599 -131544 -173581 -140624 -143670 -245231 -349737 -332783 -209210
38908 -209210 -100120 -71178 -77852 -65664 -56220 -98245 -169736 -187952 -125361 -59779 -64796 -92724
38896 -92724 -42603 70773 113983 26865 -79015 -76442 2383 39450 28764 83198 240175
38885 240175 365995 308652 94012 -88703 -88666 55435 174507 157824 54822 -15799 -19038
38874 -19038 -20670 -71255 -141610 -186350 -202615 -188549 -106270 50959 192357 202361 77081
38863 77081 -59181 -76375 47533 220394 313349 261993 125709 35664 57678 127129 147138
38852 147138 112667 80934 50104 -41878 -184549 -251453 -151072 31270 120335 63215 -23653
38841 -23653 -27633 25719 57858 75286 125144 159013 75811 -85542 -133671 24776 231714
38830 231714 274105 151664 33940 13680 37738 52595 77922 127249 170284 190419 191153
38819 191153 153401 83309 75132 195487 323452 267998 54229 -84347 -36252 53243 46424
38808 46424 14009 52670 83523 -1462 -129982 -167403 -142975 -174556 -241638 -220056 -99840
38797 -99840 7635 53433 73906 50889 -68678 -203129 -172033 37329 191860 93278 -165131
38786 -165131 -316849 -237021 -53619 33310 -25703 -106940 -86527 9041 62431 43079 31651
38775 31651 54736 19680 -110737 -194267 -85132 142911 288075 284673 233299 202811 161494
38764 161494 107152 112700 202022 293658 307620 244684 144044 47316 9355 52311 104787
38753 104787 79615 7511 -11483 19288 -1354 -84132 -110069 -23278 67879 47310 -58883
38742 -58883 -156575 -214410 -250490 -264620 -249334 -211825 -144933 -40855 42103 16759 -90836
38731 -90836 -135015 -42750 80741 106485 55001 33501 70392 101359 76643 8513 -55004
38720 -55004 -50328 65425 246235 365593 338245 195800 19557 -131124 -191881 -97959 102796
38709 102796 225170 142095 -45867 -141383 -109857 -88135 -147906 -185294 -91016 72683 149335
38698 149335 95754 24581 37351 91639 82421 6863 -38216 -20790 -30818 -119556 -178102 -81462
38686 -81462 106568 200180 137377 27668 -39397 -90450 -150377 -171607 -136587 -109174 -120039
38675 -120039 -108276 -39004 28041 51943 81383 139466 154260 90886 33357 30035 -19407 -186883
38663 -186883 -336454 -291241 -106235 2576 -42847 -133140 -196805 -280096 -377973 -373310 -227649
38652 -227649 -95198 -138696 -308451 -401322 -303463 -96122 76407 188808 351123 643422
38642 643422 971475 1148202 1122343 1042608 1051313 1102693 1068089 944331 839008 788110 714522
38631 714522 568520 407224 317864 330046 403896 452100 402160 299007 296234 460184 640000
38620 640000 645445 502609 395691 393584 397421 350116 323685 370887 447426 519132 597191 630195
38608 630195 524130 327087 228252 292732 358843 299399 224614 291007 447576 532362 518340
38597 518340 496674 487448 433263 344161 302827 340218 415851 493464 537666 481814 311958
38586 311958 145175 115976 218863 354298 466773 529403 478245 315195 205778 294510
38576 294510 470641 511209 420884 405123 509224 538245 396426 262417 309240 452850
38566 452850 520975 504330 486639 465016 406983 385914 497704 701061 863566 911900 849637
38555 849637 713058 600878 641830 825012 970342 975315 960728 1045645 1137120 1121162 1106927
38544 1106927 1253537 1483284 1624487 1732676 1983449 2331615 2598014 2840150 3283254
38535 3283254 3906080 4486843 5077164 5996154 7305469 8823689 10798736 13841578 17657603
38526 17657603 20410420 20203312 17110704 13089512 9904291 7779710 6119261 4713070
38518 4713070 3750147 3167297 2634110 2054233 1626670 1439795 1342339 1216157 1098034 1002614
38508 1002614 853281 638894 461590 378676 338424 307938 322863 359735 296155 85956
38498 85956 -122934 -149906 -14887 83004 11103 -146465 -204353 -95788 60730 102071 -8576
38487 -8576 -164026 -238930 -202012 -111869 -36280 14047 88154 232759 414775 519788 455826
38476 455826 250990 23223 -130153 -182373 -147925 -62982 15507 51576 73379 128205 205000
38465 205000 254148 264220 250578 189578 54360 -92907 -147307 -106650 -65934 -54641 -109
38454 -109 115852 195907 185540 168915 220455 270178 221933 116081 58614 56889 46108 30529
38442 30529 74425 171406 230945 199092 120350 84024 157240 338876 525770 569579 432570
38431 432570 243635 139156 108480 68760 14810 -11971 -37866 -111099 -182776 -162066 -61475
38420 -61475 38207 134656 272280 388682 362835 228676 171785 271909 405347 457640 475028
38409 475028 525482 563871 549101 564336 683615 819637 851719 828133 879729 980445 973145
38398 973145 838251 766736 908423 1175591 1372136 1420412 1373016 1274161 1120316 936048
38388 936048 790816 723267 707393 703267 688011 630513 504655 358709 304938 383368 486005
38377 486005 484520 389886 299556 225927 102512 -44444 -85398 -4168 23603 -119743 -284240
38366 -284240 -243479 -18795 159665 180206 152573 175211 192341 151538 132764 201281 258873
38355 258873 188480 68188 81069 237942 344638 270527 120871 77926 160735 231341 198070
38344 198070 119213 92614 111159 79590 -44718 -182229 -225451 -172900 -126338 -152786 -190769
38333 -190769 -125969 56379 235686 285412 210022 125025 117334 170049 230589 296417 391657
38322 391657 501046 588895 658307 722129 737517 662280 569041 584533 691533 725897 632283
38311 632283 578356 702219 881855 923105 874025 938307 1127113 1243868 1236314 1312646 1608137
38300 1608137 1955356 2148779 2279445 2614750 3238157 3987428 4678940 5194787 5380406
38291 5380406 5088947 4404279 3661488 3140863 2829130 2551909 2236081 1933331 1666137
38282 1666137 1401952 1168591 1051585 1034977 966333 765383 576761 591043 757049 817850
38272 817850 645136 392665 258126 233307 205078 185237 261670 373682 340593 143363
38262 143363 -1701 68746 241301 292716 175575 22460 -59192 -71396 -43519 17239 97819
38251 97819 183677 281490 372064 373750 242750 87372 73756 209540 323441 287765 167407
38240 167407 102068 123396 155680 140848 90221 43830 42898 123647 278133 427085 483063
38229 483063 443312 383014 362691 383418 422781 455013 428320 291465 81601 -65616 -46230
38218 -46230 99143 245330 325612 364944 398738 424918 430403 407256 345035 257466 201202
38207 201202 205355 206409 141675 85075 162500 326417 373979 246188 142766 227361 368291
38196 368291 331613 115969 -91932 -209575 -291907 -320478 -199912 19009 140293 106938
38186 106938 83002 173593 259360 222292 154297 186432 251344 193405 28359 -76293 -34152
38175 -34152 88042 197894 253301 236552 162320 93876 65433 21457 -85790 -191595 -210802
38164 -210802 -180674 -194407 -234677 -204832 -104413 -39827 -60303 -106833 -133498 -160586 -186587
38153 -186587 -159050 -66157 34859 105146 150016 141435 24012 -160760 -259689 -181588 -10872
38142 -10872 109263 136999 116074 71576 6722 -35525 2348 101846 163532 114584 -4575
38131 -4575 -77992 -32076 94441 202411 240058 231719 207153 160759 105102 96705 147164 160600
38119 160600 40012 -172461 -335290 -360857 -260095 -80442 101197 162841 45379 -128140
38109 -128140 -167305 -56694 41448 33456 -8600 -29293 -96034 -234294 -313104 -228238 -83561
38098 -83561 -40381 -70669 -24243 106180 161853 66268 -57214 -66700 9520 34568 -49578
38087 -49578 -159760 -172000 -43642 156806 317168 370615 322109 211008 81695 -19235
38077 -19235 -71674 -116603 -203952 -294993 -292279 -190151 -100955 -83916 -56582 39809 98972 8161
38065 8161 -133627 -125907 36466 152129 110652 33049 62904 163058 203587 143065 32897
38054 32897 -75959 -142874 -120963 -20883 53649 15073 -96026 -176157 -196284 -193994 -160898
38043 -160898 -40548 150641 288123 269533 135951 23949 17045 70672 72569 -41929 -228348
38032 -228348 -369568 -373236 -248701 -100490 -39927 -83930 -137264 -96153 23449 93864 33730
38021 33730 -83338 -126402 -79738 -44291 -76400 -110321 -65281 41960 131271 151889 100790
38010 100790 -4066 -122605 -198452 -207421 -177279 -135951 -77492 -4553 45049 54246 64310
37999 64310 111998 170685 198618 200194 190184 148850 72954 16865 9391 -13238 -99111 -163453
37987 -163453 -103646 10268 16545 -73356 -71508 77065 164873 15371 -241541 -344071 -249861
37976 -249861 -135708 -100868 -69091 2742 11091 -115818 -265248 -279821 -168425 -68607 -51877
37965 -51877 -76286 -104426 -151125 -200946 -181741 -70125 43203 52560 -30875 -94445 -56491
37954 -56491 49662 114436 55320 -102868 -238398 -249783 -175385 -153594 -238340 -311228 -233079
37943 -233079 -33253 132270 178927 152224 101026 8480 -121031 -210118 -203526 -144801 -105059
37932 -105059 -96821 -104556 -132288 -166785 -162870 -127411 -146634 -255305 -348090 -310387 -177772 -70830
37920 -70830 -30632 -27642 -76921 -207208 -342094 -354881 -247732 -153683 -149077 -175871 -159854
37909 -159854 -95876 -6559 75230 82485 -6693 -69790 35052 233502 287285 116229 -101986
37898 -101986 -206920 -244202 -289356 -273256 -131053 22978 40619 -37287 -58191 17009 104770
37887 104770 147035 144573 115241 134806 325083 662384 890149 784263 436551 123294
37877 123294 -26008 -61321 -11325 126938 248669 225316 121279 116894 222474 285012 274189
37866 274189 315908 413479 398881 240095 143361 227449 323803 249759 77973 -33576 -95367
37855 -95367 -178371 -213379 -120422 -24238 -107926 -315095 -416479 -341230 -235260 -196927 -157248
37844 -157248 -55567 44820 82735 102996 158278 209758 204030 178161 210347 296744 332333
37833 332333 213741 -47394 -302774 -378251 -245063 -65572 -20221 -101658 -139194 -22382
37823 -22382 170010 281491 255078 163133 105346 123355 194832 264519 276416 208738 98395
37812 98395 19922 21418 82102 144703 181562 206786 231708 245456 238572 199001 86291 -115336
37800 -115336 -300881 -303441 -109898 80009 97432 11056 -20158 5620 -6816 -31930 24020
37789 24020 96049 18608 -185401 -307682 -281706 -268052 -347712 -380763 -284331 -208534 -274659
37778 -274659 -354952 -304978 -222974 -255660 -305506 -180102 76244 246059 261903 237083 228353
37767 228353 190811 135585 124139 127470 78291 28224 61416 95647 -16374 -218108 -308244
37756 -308244 -253662 -207456 -216574 -168865 -62770 -58648 -178170 -207906 -29120 176753 200770
37745 200770 97408 41227 49194 22091 -49541 -93823 -105160 -138080 -191158 -204634 -147122
37734 -147122 -39440 67534 104470 43345 -30429 -4476 81157 77326 -14513 -3269 180472
37723 180472 317089 192607 -86832 -253759 -240140 -186557 -173200 -152770 -118168 -130975 -169230
37712 -169230 -124275 12812 112364 104240 82084 141078 222337 211158 120254 74744 134211
37701 134211 211550 187319 55751 -79922 -138417 -137874 -129641 -107537 -35153 68878 141867
37690 141867 158958 133629 53511 -90868 -216495 -201109 -53541 78662 112200 126346 202299
37679 202299 279795 257824 142414 5270 -117905 -196452 -161708 -7720 133423 134903 48550
37668 48550 29391 126461 249303 309106 296902 245177 192792 164553 127700 17647 -137322
37657 -137322 -197958 -101983 20817 30514 -14876 29944 151620 199956 112376 -34117 -161612
37646 -161612 -234065 -195916 -28125 153788 214808 194689 226330 290433 250982 131174 126607
37635 126607 295282 451546 450449 376549 347161 324063 259880 257342 405400 578964 583496
37624 583496 425230 279139 242286 261821 266914 239259 174351 80915 1811 -42536 -93225
37613 -93225 -166860 -196258 -141208 -81118 -93047 -116598 -66046 -2707 -45142 -162852 -224266
37602 -224266 -214158 -225602 -250429 -174345 -9533 60557 -55925 -210349 -222034 -108575 -7846
37591 -7846 26309 44099 88283 157738 232097 263572 198986 69198 -6704 32659 107045 119429
37579 119429 93332 109877 170233 201025 151354 24285 -133006 -224596 -177579 -74987 -101245
37568 -101245 -271589 -360590 -235956 -104167 -206422 -398811 -334917 -22883 139035 -51586
37558 -51586 -299601 -250798 31976 237926 248103 168144 68122 -53758 -126036 -65398 42948
37547 42948 30282 -106546 -226148 -288417 -373534 -455376 -382325 -144819 37212 -5562 -174842
37536 -174842 -266543 -220774 -108852 12735 116690 157861 130173 115765 173846 224276 144113
37525 144113 -43337 -173085 -138349 -14705 40350 -24328 -96685 -40994 120199 214209 138311
37514 138311 3721 -23366 38440 43775 -11865 30054 206776 320925 221470 40857 758
37503 758 92984 125537 25129 -77300 -52442 74824 191029 212307 129957 14487 -31988
37492 -31988 11321 50003 18077 -5410 77521 203693 232281 169985 150651 193926 162053
37481 162053 4214 -123151 -75341 70389 142352 121098 125254 197732 242117 179580 63472
37470 63472 -816 15274 56907 68173 37484 -21625 -92728 -152825 -173728 -143157 -72236 25328
37458 25328 138778 229534 231148 126545 4178 -25677 29819 54655 -16187 -108442 -101724
37447 -101724 42327 254879 398199 331185 40986 -266345 -331995 -160689 -39650 -150276
37437 -150276 -303649 -213519 86123 300185 287157 190949 160625 162191 131196 119862 182212
37426 182212 247734 225900 147986 107796 133774 204080 314374 434496 458291 308699 70461
37415 70461 -79798 -75527 -12847 4784 -6684 21439 76995 69154 -44285 -193069 -282277
37404 -282277 -297481 -279289 -236762 -163857 -119258 -180287 -298574 -318584 -195050 -78897 -103095
37393 -103095 -192106 -200049 -141684 -135423 -181487 -167083 -70121 5003 2269 -16998 2621 40227
37381 40227 65272 66209 14315 -90518 -155364 -102352 -16365 -37000 -131117 -152831 -112712 -167898
37369 -167898 -322428 -377068 -251301 -125749 -154548 -248642 -277432 -281187 -316981 -276934 -61568
37358 -61568 198830 296079 222562 121214 47420 -40198 -124266 -143439 -121074 -129734 -164713
37347 -164713 -175307 -169560 -175530 -164353 -116547 -78243 -48603 67919 269699 362610 226387
37336 226387 35336 10459 85059 54709 -58750 -70129 23252 51334 -18130 -71119 -118859
37325 -118859 -268456 -429545 -383129 -177938 -116285 -268313 -349496 -210213 -98794 -238851
37315 -238851 -455717 -476920 -356562 -326425 -412246 -470527 -471118 -492259 -538031 -580468 -686334
37304 -686334 -907381 -1156495 -1379376 -1699444 -2160970 -2482087 -2359912 -1922758 -1567970 -1414057
37294 -1414057 -1245270 -974357 -789502 -773500 -725705 -511032 -300640 -281195 -351756 -309758
37284 -309758 -163328 -56365 -15171 32319 80119 73673 47740 61035 45125 -106347 -321927
37273 -321927 -398354 -276137 -120014 -86022 -133264 -126349 -27753 88988 160394 189474 198740
37262 198740 187655 149316 99163 65905 57691 51649 22842 -30080 -100477 -192011 -286221 -310287
37250 -310287 -200808 -12641 101955 64367 -31860 -49009 10545 26630 -46115 -101480 -35005
37239 -35005 95486 136106 40352 -73442 -87692 -38101 -41466 -117087 -173502 -171341 -191689 -290347
37227 -290347 -378303 -345078 -241755 -216916 -287701 -309764 -204491 -88587 -101735 -199675 -218961
37216 -218961 -90970 114781 330793 553929 746596 784861 586968 252729 -4631 -71194
37206 -71194 -24145 3161 -9177 15855 100745 161455 124027 24290 -50736 -70666 -64924 -64715
37194 -64715 -94808 -176422 -274519 -290147 -185101 -69022 -64890 -127432 -112825 1804 110156
37183 110156 172024 244921 303029 221447 14920 -99688 -4090 124571 73997 -88118 -144987
37172 -144987 -64791 6962 15401 31428 51750 -6875 -105114 -95062 19752 49073 -83452
37161 -83452 -197935 -122336 68754 203297 253518 285051 284253 198192 69539 -20723 -87878
37150 -87878 -176555 -215041 -103390 77434 124141 1691 -92364 -15628 117527 126216 38901
37139 38901 35830 170793 302922 314576 261706 245710 236856 128945 -74274 -237779 -265956
37128 -265956 -204151 -144788 -115757 -107168 -130385 -177378 -176769 -74383 73402 161289 160814 113111
37116 113111 38736 -49213 -78161 13703 145494 158380 29226 -101218 -139842 -154260 -227899
37105 -227899 -326025 -375544 -371790 -331658 -239156 -116831 -57559 -97665 -140342 -88531 28411
37094 28411 139093 240287 324397 305581 152735 8968 26349 143906 183760 114588 51198
37083 51198 30049 -23574 -103026 -89306 39148 135677 102631 39922 78761 171824 161552
37072 161552 4747 -166053 -193812 -57264 116211 179234 112900 36014 46970 97280 78966
37061 78966 -3897 -42466 11537 82506 82830 11555 -68583 -90298 -21723 91092 137136 60837
37049 60837 -55878 -97344 -53468 21731 116730 214157 219888 97828 1024 74672 191518
37038 191518 121612 -70791 -85770 138727 320703 278816 167879 136704 71207 -113288
37028 -113288 -219820 -89094 66956 -31059 -270307 -323534 -157796 -20121 1893 47082
37018 47082 135962 115551 -18129 -70151 11603 44533 -50511 -107932 -32843 16108 -84193
37007 -84193 -192342 -147414 -38267 -25326 -59657 3026 126450 147363 36565 -82753 -138996
36996 -138996 -174499 -224177 -260278 -247980 -170483 -30899 107973 153378 119310 137550 246950
36985 246950 293750 170927 35760 109174 341113 478505 429123 353655 389810 471935 466851
36974 466851 342011 154180 -12089 -65966 21278 150363 192787 145931 81790 -13488 -179587
36963 -179587 -291249 -155890 161063 342442 240887 72893 68597 152698 156007 139160 253592
36952 253592 417839 414531 248912 139562 162991 165169 58049 -37795 -20811 29261 14979
36941 14979 -24675 -27392 -25896 -46541 -22695 78520 159958 137591 74103 58172 55077 -1947
36929 -1947 -71475 -87942 -96013 -159231 -215995 -178763 -103661 -98443 -130912 -111627 -101087 -210801
36917 -210801 -334647 -244117 23647 151497 6950 -151213 -89617 30220 -58883 -263114
36907 -263114 -260905 -18008 152230 62426 -104090 -118469 -36301 -43427 -140872 -177323 -110212
36896 -110212 -48445 -59465 -95880 -124717 -180732 -244166 -202277 -28153 102663 6709 -242563
36885 -242563 -386064 -314321 -188354 -183347 -252899 -247052 -154766 -89202 -91410 -98243 -87725 -111212
36873 -111212 -167070 -175026 -110289 -45324 -18941 17762 74863 70482 -13901 -41872 97614 297287
36861 297287 343853 184577 -23280 -106014 -30515 109092 182656 118935 -25218 -110221 -77627
36850 -77627 -27765 -78134 -200574 -275726 -257015 -191346 -120267 -54638 -11340 17234 89841
36839 89841 213546 263352 130376 -84560 -170762 -90972 -11713 -36182 -69176 -6033 88225
36828 88225 84732 -19494 -112956 -115186 -39817 46013 74246 25215 -41481 -41898 33342 123531
36816 123531 196204 262155 293527 238050 143698 146973 272396 356499 265251 96072 50249
36805 50249 166001 298909 336243 309736 289906 273136 216819 127483 62375 52162 50231
36794 50231 -17754 -144105 -211622 -125603 45502 135746 87222 -1255 -48477 -99977 -202342
36783 -202342 -278484 -235364 -124735 -75775 -103442 -103136 -29187 32712 -5595 -118252 -211560
36772 -211560 -226360 -160961 -39168 99199 189044 159993 -3149 -207397 -289463 -164140
36762 -164140 61498 185252 139684 53961 55977 105145 93372 26886 -3691 17157 26758
36751 26758 23818 82789 209121 293836 261400 177745 150217 179173 177357 109864 50736 89097
36739 89097 211972 308933 298127 222244 182684 192245 164203 67869 3804 49865 106441 13710
36727 13710 -202281 -327381 -226936 -14448 94875 28834 -97060 -137505 -69575 4360
36717 4360 -17406 -116598 -181841 -157426 -108490 -100309 -87087 -5804 83592 75741 1035 -15722
36705 -15722 31707 21617 -70238 -112360 -49165 -13674 -96073 -160270 -51677 132383 168669
36694 168669 34443 -82040 -63787 29165 131225 259560 394729 442576 380805 306478
36684 306478 273318 213866 95336 14780 38473 74520 33593 4610 110091 267178 278871
36673 278871 128898 -4980 -33487 -52744 -111207 -83125 105101 285303 257246 91379
36663 91379 33315 143577 223499 123725 -46659 -99444 -25534 43210 57033 101430 231361
36652 231361 356649 339571 164475 -33525 -108483 -51768 17298 8065 -32444 -9619 49453
36641 49453 7706 -174397 -333976 -287802 -68108 115503 126881 19436 -95736 -185074
36631 -185074 -251616 -259169 -189970 -126594 -170599 -282424 -296842 -130832 96144 204593 169348
36620 169348 119751 147019 198116 182773 106702 38509 -1286 -33434 -28225 73823 231337
36609 231337 298709 219401 140036 231026 437916 528267 384306 136376 -24959 -63570 -60340
36598 -60340 -51054 -6842 62731 98178 90795 106738 178832 242361 224622 148271 87709 53973
36586 53973 -6304 -99644 -147938 -98419 -16851 -6278 -55795 -51205 46803 119749 55013 -65675
36574 -65675 -54019 109172 211160 87059 -135163 -185707 -2020 209709 265518 213350
36564 213350 191840 206492 165215 64145 -2393 -3619 -17847 -94005 -168589 -157699 -53842
36553 -53842 99456 249631 318697 238284 61538 -41698 23957 161544 229555 229654 245713
36542 245713 266895 208744 79712 -10982 -8087 50035 139828 263331 345322 277839 107381
36531 107381 20463 76008 108876 -4101 -137797 -118393 386 35385 -38220 -85226 -51878
36520 -51878 -21772 -36446 -34036 9439 29086 -331 -13609 29632 97460 185243 334443 504549
36508 504549 556473 437880 276921 211995 222976 213242 170225 149493 166101 192023 210526
36497 210526 199287 116105 -25789 -126478 -114275 -29336 71731 202053 340218 347371 145107
36486 145107 -89113 -87130 161602 398893 446680 389457 359564 321998 191819 37275 9161
36475 9161 114806 198061 150503 47411 41090 171625 326955 385222 361994 373798 453202
36464 453202 475379 337464 151453 135720 323168 513698 552896 522322 570133 665363 643568
36453 643568 439994 163780 -33890 -73461 45928 253819 419240 433746 308266 155205
36443 155205 81502 123543 247763 366540 393341 342907 340155 464181 621820 651285 517307
36432 517307 327231 195757 183273 317348 550725 724825 712438 593627 555928 621881
36422 621881 632357 521090 427927 469886 563613 578764 530862 503744 494827 461821 428675
36411 428675 425153 409246 364986 378530 486104 550751 450592 297050 281679 383466 437288
36400 437288 434400 511203 655102 685535 569442 499593 571321 621405 516964 387267 401624
36389 401624 497505 518687 480048 494273 546075 547465 539386 627496 761752 784467 682541
36378 682541 600742 601101 595410 546319 560209 714097 921860 1042500 1031807 943511 860016
36367 860016 848322 910869 973344 992071 1042785 1197496 1359086 1375877 1297787 1326239 1496595
36356 1496595 1623786 1618131 1630389 1777054 1938777 1990314 2045518 2279803 2649667 2989197
36346 2989197 3273649 3587451 3933672 4295256 4804791 5614476 6641975 7683037 8754292
36337 8754292 10088600 11807294 13860890 16314047 19413930 23314887 27983536 33369452
36329 33369452 39222249 44512483 47479652 46823705 42870535 37283662 31671603 26712808
36321 26712808 22457524 18917149 16115367 13895847 12032601 10467512 9249357 8312455
36313 8312455 7505284 6804932 6317554 6046692 5831505 5594164 5509006 5767122 6208614 6356002
36303 6356002 5885112 4970185 4078229 3496846 3180293 2993945 2905870 2884877 2795407 2543279
36293 2543279 2237955 2071844 2083679 2154584 2192903 2201199 2190745 2157650 2139835 2186704 2268372
36282 2268372 2304770 2269677 2171728 1968192 1628620 1266215 1056297 1014943 1003908 965657
36272 965657 982044 1058048 1036314 831438 600673 555191 705559 904993 1047637 1110870
36262 1110870 1089980 1013317 957635 942316 875168 706909 564212 605468 801108 983051
36252 983051 1070691 1125225 1209607 1312214 1393402 1409416 1314429 1133925 1005763 1048620 1212866
36241 1212866 1347491 1375631 1317610 1203884 1079830 1033862 1083840 1090376 934964 731394
36231 731394 680738 755510 741575 591728 501276 577598 663642 598235 456464 389290 375817
36220 375817 291173 118911 -42904 -113845 -62847 109269 316202 402447 320382 206257
36210 206257 177133 159464 54142 -39369 46243 254811 356714 284196 215818 287616 402448
36199 402448 407499 313723 229852 182341 121668 50310 30770 82022 153769 205543 251053 319425
36187 319425 416411 524147 601517 593341 491583 391802 427498 618191 834926 960959 1035158
36176 1035158 1166024 1350941 1499346 1634764 1932067 2491417 3203384 3942618 4769393
36167 4769393 5755399 6666328 7041117 6644044 5692666 4590897 3586534 2758083 2159995
36158 2159995 1808083 1595894 1385699 1171375 1041572 994608 899351 659412 340645 108404
36148 108404 77071 226837 433367 574403 625587 644896 665231 652720 595795 568825 637707
36137 637707 737497 724008 549861 332060 226942 266193 331327 286806 136725 30715
36127 30715 88059 243569 329625 292400 232110 223472 218593 178808 178066 274003 369058 324544
36115 324544 158791 11692 -51456 -80797 -109565 -106324 -62839 -15703 36187 128913 220818
36104 220818 189575 -996 -212768 -282042 -205779 -115741 -104481 -145827 -173449 -167810 -145041
36093 -145041 -109118 -58101 -18386 -21912 -40602 5545 138499 261450 266621 178965 120601
36082 120601 142990 181353 187011 206890 282575 350957 320166 203378 111570 126524 217035
36071 217035 272639 216823 111109 122089 320434 539307 541229 325599 138266 145102 241788
36060 241788 254729 185045 145046 170241 217232 259707 275123 220525 123917 101015 171314
36049 171314 175379 15666 -141789 -87373 110675 214807 176800 153902 197909 178486 46131
36038 46131 -58644 -34151 32956 39480 32840 99854 198598 207600 87761 -72932 -151909 -114818
36026 -114818 -68248 -148512 -311091 -323302 -73645 218124 269755 123223 42494 94306 109954
36015 109954 52530 102790 301634 408857 262670 27335 -80293 -81498 -74442 -6663 168579
36004 168579 295854 227624 91991 101055 205824 202779 97572 81427 183325 228467 155496
35993 155496 106544 146040 140101 18128 -60803 52418 245783 291432 150461 -4088 -17316
35982 -17316 101738 231942 257084 157284 41613 55972 209484 339340 306829 176605
35972 176605 120096 180081 239007 220626 207440 306526 491756 670277 848193 1107966 1427350
35961 1427350 1660197 1762345 1916894 2299651 2771276 2960800 2680469 2129620 1632041
35952 1632041 1289790 997928 711918 539883 558864 667307 691634 579683 420165 301010
35942 301010 221000 141848 57338 -20110 -86613 -117197 -62886 58372 121758 43753 -72065
35931 -72065 -70251 -970 -61808 -258076 -340796 -187130 -20836 -68378 -189040 -108636 112217
35920 112217 159719 -29152 -170526 -81855 69828 65847 -68282 -190322 -255277 -265086 -177225
35909 -177225 -65 155482 224619 256218 258840 151455 -43134 -150697 -111637 -98391 -225614
35898 -225614 -346384 -310530 -221304 -220149 -209264 -51125 115092 58092 -150676 -241324 -186687
35887 -186687 -216567 -393469 -490840 -357685 -132892 -1540 37148 57102 54641 19666 4242
35876 4242 27796 44804 69091 181729 346957 380749 202231 -20360 -84668 -4999 57153
35865 57153 19356 -71761 -148787 -185437 -187624 -180572 -171610 -114288 20597 141388 119845 -1136
35853 -1136 -25853 113518 239433 178625 -5693 -142076 -190162 -216409 -226132 -173194 -83196
35842 -83196 -25523 6015 61481 114172 95857 33241 25920 92473 152971 165937 171370 191928
35830 191928 205144 225983 295176 361482 312640 177213 152168 338489 596617 813572 1173425
35819 1173425 1901903 2764460 3117194 2603523 1608695 833388 541671 449477 275037 99456
35809 99456 109383 241969 283233 189167 102773 96350 85591 17757 -14051 83459 242861 304624
35797 304624 203003 22025 -110616 -137456 -89783 -35537 -22501 -55322 -106515 -137587 -116250
35786 -116250 -36163 70963 159924 217229 264573 313514 343287 331211 274754 176930 50377
35775 50377 -53311 -71539 -14277 33366 27294 27704 98507 198893 242484 223209 202987 194412
35763 194412 138218 4635 -149814 -252267 -299966 -347218 -417805 -455075 -384475 -234120 -147396
35752 -147396 -215861 -331169 -301790 -116579 28801 6101 -70365 -18404 172549 372630
35742 372630 485321 482449 358433 178489 93404 161303 219972 97797 -101415 -116713 80224
35731 80224 221628 116464 -100743 -187199 -111406 -33458 -57244 -127329 -140702 -68119 38859
35720 38859 114095 138292 137557 120292 50859 -75246 -171243 -145444 -24159 86701 139358
35709 139358 157757 136434 32770 -136839 -289144 -368451 -366017 -266475 -90046 28430 -46615
35698 -46615 -238491 -314731 -205048 -105669 -184845 -335263 -345746 -207349 -101596 -144864 -277082
35687 -277082 -373502 -356629 -217506 -23027 108000 114137 62434 44265 34449 -55008 -203384
35676 -203384 -277441 -219640 -140184 -169374 -288375 -370213 -342844 -240785 -120619 -9964 50384
35665 50384 2386 -134624 -228854 -181555 -75172 -76249 -199292 -285869 -243477 -174699 -199777
35654 -199777 -273982 -289700 -256918 -244447 -220247 -112452 16170 30836 -44984 -34258 131448
35643 131448 307558 336879 219820 44181 -114823 -168947 -33657 243483 484438 595264
35633 595264 678226 851575 1068048 1211996 1274937 1312901 1308260 1210184 1068777 997857 1016254
35622 1016254 1034842 1001677 966590 989948 1064242 1149080 1231045 1322806 1427289 1520194 1574844
35611 1574844 1618059 1739646 1984579 2231780 2265074 2007874 1616695 1292672 1078460 911023
35601 911023 788618 761965 795564 770035 642457 508556 471193 517046 561267 559134 525632
35590 525632 474968 391480 265036 128536 40591 28172 58857 86217 115458 193481 326042
35579 326042 439132 449996 358755 242956 169884 137252 99097 31616 -36526 -59267 -33303
35568 -33303 -8493 -25994 -58789 -38194 59689 174769 221187 181363 135944 186147 332688
35557 332688 452474 433605 315307 228755 207112 155057 34932 -40455 12686 84930 21310
35546 21310 -137364 -215269 -169121 -127091 -154162 -150469 -39838 91852 143069 164700 256388
35535 256388 365124 332178 139138 -20801 20938 177377 208648 41086 -127898 -99187
35525 -99187 52617 96450 -18183 -113753 -81257 -31539 -76707 -143061 -125406 -68239 -42511
35514 -42511 10564 134444 196749 91055 -20531 77216 279347 291020 95735 -11452
35504 -11452 118395 293087 313351 231017 169011 124219 75325 81956 149240 170006 112968
35493 112968 98015 184456 261250 245873 205952 183758 107554 -1816 38107 269875 439842
35482 439842 342934 135139 82565 169484 206061 189396 277504 475424 614435 624703 599550
35471 599550 587705 525978 401002 306087 298447 323565 306947 232861 135432 84543 147349
35460 147349 290736 378001 340819 276792 283585 294276 204349 70878 30214 80248 102437
35449 102437 61921 38175 76523 133615 155730 119043 28679 -46767 -10925 108305 140323
35438 140323 1958 -174117 -254627 -296842 -367139 -340400 -110979 137296 152029 10454
35428 10454 -4973 126690 155939 23744 -22361 134899 254856 116649 -132716 -212657
35418 -212657 -104178 1697 23200 42591 101678 130061 80631 10938 3458 67679 135549
35407 135549 132179 58925 4009 37826 112366 125806 76849 70233 155756 247980 244065 158222
35395 158222 94621 119804 192788 214964 149089 80762 117131 225844 267256 216965 224068
35384 224068 359991 453813 335311 126208 82804 215929 294662 206721 81771 34487
35374 34487 14393 -23614 -8976 84902 146866 107752 66677 119115 188007 157626 72332 60003
35362 60003 124321 151024 89769 9163 -25558 -29740 -32539 -4606 98766 240937 298019 187805
35350 187805 -4785 -93542 -11782 98677 76394 -50170 -128880 -98053 -17320 73890 186552
35339 186552 273442 231822 51872 -143387 -243031 -247691 -203528 -130835 -52497 -12876 -26863
35328 -26863 -59486 -71493 -43539 30435 118880 151037 106390 63483 80940 91600 22122 -53243
35316 -53243 -23726 55446 51237 80 52240 174591 147928 -85638 -297949 -290734 -137154
35305 -137154 2684 116689 246366 319977 255964 128301 68218 76549 74092 69037 131790
35294 131790 249400 335432 358475 356285 351381 345397 362853 409066 417422 327974 189444 100145
35282 100145 81300 93665 137716 229213 299681 245917 93772 2708 65997 192263 237880
35271 237880 187030 131989 123500 128752 128540 164183 248961 301353 238769 107764 41115 86906
35259 86906 159243 176402 167331 198259 260514 286368 230100 92171 -84256 -203608 -173225
35248 -173225 -18637 124740 181789 211652 256077 235182 100722 -20041 18953 161419
35238 161419 238309 213837 178576 153301 88591 34526 108382 272231 326918 180159 -27221
35227 -27221 -115908 -64574 32138 87633 64452 -8929 -34741 50523 167220 189032 130722
35216 130722 107904 126757 81710 -24379 -41740 88249 222983 229117 164762 160350 229450
35205 229450 289429 288508 238911 186300 188898 261276 320483 270674 150882 101010 173413 286969
35193 286969 371001 424065 415107 275527 39908 -132840 -138761 -34039 70490 120574 107227
35182 107227 53327 26016 59485 76970 6808 -67265 -34893 14443 -80875 -226150 -152386
35171 -152386 134109 289801 137020 -62693 -19348 157020 176088 23671 -68595 -1392
35161 -1392 93012 87151 -2194 -94628 -123548 -55862 56468 85083 -18874 -131865 -113302
35150 -113302 6538 85101 53412 -43416 -131837 -156325 -99501 -24312 -30673 -110001 -120200
35139 -120200 30750 251877 378065 340050 187280 27747 -25935 47682 115301 37872
35129 37872 -112721 -141852 -41933 -6752 -96482 -129645 -2805 127710 123601 88977 141184
35118 141184 179288 94169 11607 81365 188489 141504 21898 63126 256412 352678 229987
35107 229987 16529 -142503 -220103 -209015 -94989 49270 116194 129032 207258 362918
35097 362918 479513 497846 476575 457217 411030 344227 328099 385929 445987 438597 369256
35086 369256 281650 208418 163477 138861 116198 101886 112008 111446 46976 -36824 -25116 81196
35074 81196 140801 101739 102166 233999 362260 331026 214021 181005 221505 196985 96222
35063 96222 43197 86196 150318 177715 169121 113563 13332 -49479 2710 121332 198756
35052 198756 205092 159308 48204 -103747 -178294 -120234 -52980 -78882 -76108 102346 324354
35041 324354 321547 90075 -106641 -130050 -108237 -154292 -193298 -156807 -136958 -222689 -335559
35030 -335559 -352797 -287709 -240747 -248538 -272722 -284821 -287129 -278589 -248819 -194498 -130520 -99689
35018 -99689 -149256 -259374 -326124 -273354 -155653 -88708 -103776 -138835 -151309 -166131 -218983
35007 -218983 -310645 -413674 -484970 -486878 -426326 -351553 -296523 -268021 -286099 -363306 -437326
34996 -437326 -422188 -347630 -336978 -416946 -476126 -454112 -428225 -451192 -456709 -410070 -397785 -466877
34984 -466877 -527167 -520609 -526872 -581528 -568243 -443438 -383594 -513044 -652201 -572519 -373351
34973 -373351 -345961 -540823 -728238 -758584 -723707 -750461 -831829 -895538 -899958 -845253 -785913
34962 -785913 -805170 -889098 -893833 -743146 -569620 -529141 -566385 -515885 -355857 -200001 -100075
34951 -100075 -15853 61701 93330 59805 -47683 -233152 -411777 -439654 -326718 -275064 -386738
34940 -386738 -500975 -464196 -369390 -342356 -288486 -83888 162673 300371 424312 682287
34930 682287 933328 920455 695687 556942 612609 701825 708574 674438 627671 564221 569896
34919 569896 710232 839703 775779 617429 624368 816435 960949 929184 802023 651790
34909 651790 485959 382603 418908 490077 451474 391322 490163 670898 696553 569719 504221
34898 504221 527242 462206 310264 282535 406251 452171 329572 220238 231281 240920 199715
34887 199715 269044 513573 728760 729418 587048 454765 368146 329991 381820 475893 464333
34876 464333 319536 199116 213862 292039 328839 307873 239653 148643 138463 289316 484140
34865 484140 524442 410348 307737 269229 219053 179783 245931 345705 311828 194932 218572
34854 218572 402341 519649 463433 367427 325002 274119 208278 218414 271877 221762 82263
34843 82263 30271 107400 194157 280931 451666 595647 493884 231450 150375 318509 420819
34832 420819 281939 120967 145881 250298 281854 290439 333064 318973 216336 156049 192165
34821 192165 208877 170971 199025 304265 337984 294266 354571 536407 622214 542287 492480
34810 492480 558853 577440 494623 497230 626400 632129 399109 162857 104182 76747 -51612
34799 -51612 -132136 -41948 67289 64951 75917 183986 210726 42837 -113223 -64513 54308
34788 54308 58100 36172 132052 245045 229022 178020 246656 362906 361363 254602 173965
34777 173965 175683 247002 352964 386071 260485 112279 160855 330519 318888 94782 -38428
34766 -38428 37981 86392 -5480 -9397 178645 291047 158542 24458 108671 234046 187518
34755 187518 102921 169952 281479 285108 292057 427472 544068 477603 336060 272355 227603
34744 227603 144436 160920 345513 508640 507876 465058 476804 423976 280813 270281 472437
34733 472437 619871 530545 401028 420003 445397 329153 208380 203737 180136 71463 79596
34722 79596 282786 419999 337700 268613 391638 514501 480580 477419 634685 729256 606141
34711 606141 481289 515835 517703 380550 364790 600959 770707 639090 451382 447406 453367
34700 453367 319868 273691 449290 568014 474290 473582 734567 904200 754436 644766
34690 644766 862709 1072678 936885 728002 786937 916433 857053 816222 973451 1026854
34680 1026854 800142 711382 1036723 1312000 1111274 817156 929194 1192666 1136620 925954
34670 925954 953554 1109678 1152675 1267988 1581870 1692611 1361427 1062248 1176592 1312644
34660 1312644 1109124 966832 1238141 1488046 1360706 1338616 1787036 2137579 1939820 1777332
34650 1777332 2146985 2438894 2125942 1908092 2455934 3092669 3048152 2921734 3462555 4027694
34640 4027694 3830914 3598651 4283547 5240323 5467746 5530283 6363651 7366656 7690477
34631 7690477 8153279 9722143 11484222 12463532 13888577 17055686 20738906 23721607
34623 23721607 27844730 34994229 43445896 51613153 62812630 80878408 104337040 132736748
34615 132736748 175096563 238486336 305632664 338307044 313469125 248801359 183316980
34608 183316980 138834463 110150301 86449757 66970745 54369270 45881358 37577162
34601 37577162 30328630 26178663 23461632 19782117 16129811 14326686 13363888 11508123
34593 11508123 9518449 8831572 8677672 7652225 6323112 5870236 5751672 4937049 4018046
34584 4018046 4021431 4384282 4016904 3257315 3024919 3072158 2702480 2252813 2329223 2471768
34574 2471768 2019327 1450164 1506090 1807590 1639284 1307755 1441616 1705349 1470309 1063021
34564 1063021 1119898 1350803 1137783 759318 847343 1167993 1075673 699184 603274 721130
34554 721130 646759 549130 791127 1050670 808699 344907 297342 568465 586429 339676
34544 339676 255359 328408 239303 98811 253154 556248 596138 438222 433825 519436 402330
34533 402330 211578 278490 483644 472777 303074 256181 254775 82971 -74650 56354
34523 56354 251913 146759 -76216 3095 289711 387045 330773 439299 629489 554902
34513 554902 273999 137039 145395 46434 -74023 71701 356056 382616 173401 111378
34503 111378 254580 285086 107727 -41537 -58986 -47826 21466 244941 446832 382286
34493 382286 193858 189340 276748 140474 -120608 -100485 206155 370079 223396 58023
34483 58023 76165 143468 171160 277166 453113 477496 278410 45577 -92621 -189316 -241218
34472 -241218 -153470 17555 82920 9938 -67192 -99488 -119329 -54433 150275 302633 187021
34461 187021 -54826 -113252 -1428 21971 -51299 12814 207746 255706 104948 36396 181055
34450 181055 314867 259247 145195 131695 149666 81328 -30158 -82346 -54117 35928 161355
34439 161355 245489 237315 223595 304144 393140 330875 144552 -4856 -76613 -130400 -122879
34428 -122879 18891 168535 118267 -86188 -182996 -65006 121198 239176 296266 317979
34418 317979 301864 288941 299466 248489 111133 72674 280420 550336 591180 425677 297901
34407 297901 264516 215958 214246 408442 640824 567016 221073 44396 235612 460642
34397 460642 382819 133909 31301 107198 179084 196532 261046 397315 504824 499477 385933
34386 385933 225319 95585 39397 25659 15030 44379 158986 295377 347320 315029 265805
34375 265805 196374 81908 7164 71502 200364 234310 175516 159577 214816 249096 247940
34364 247940 274017 290528 207954 93418 99618 191719 196436 127841 183569 375766 464283
34353 464283 350920 246796 300271 332308 152325 -79776 -60364 217244 469893 511982
34343 511982 426388 363145 347966 328836 291922 270182 287735 334627 379789 391936 353213
34332 353213 267867 175026 145243 223171 360545 449602 438610 364173 266596 162084 117228
34321 117228 225058 441302 567178 489780 331647 264292 292705 341735 423961 560163
34311 560163 642899 568296 431827 408203 491595 539015 526125 562813 669226 728798 685816
34300 685816 631847 662977 769754 885472 946415 909409 798739 709961 681288 613290 415033
34289 415033 158089 -38219 -195033 -389975 -549796 -515678 -300984 -111537 -92663 -191005
34279 -191005 -279866 -303301 -280586 -260130 -277527 -303462 -265832 -174101 -147628 -248792 -380729
34268 -380729 -441190 -473449 -556756 -662344 -748114 -876079 -1078410 -1218521 -1166714 -1025670
34258 -1025670 -994494 -1076745 -1105208 -1001059 -834733 -676548 -548655 -482425 -480391 -471183 -422566
34247 -422566 -417336 -496532 -545333 -482607 -429846 -509938 -606725 -531627 -319667 -151234 -85646
34236 -85646 -83167 -176090 -381539 -542592 -500350 -347928 -289497 -334570 -353139 -327053 -310010
34225 -310010 -254473 -132053 -100501 -274608 -462270 -433638 -318765 -390853 -575786 -573689 -390139
34214 -390139 -321410 -433660 -483169 -380239 -318704 -378429 -387012 -267817 -171342 -169038 -150751
34203 -150751 -106777 -173255 -313829 -303102 -125635 -45537 -166905 -270607 -215080 -151171 -186893
34192 -186893 -181672 -57506 3637 -123573 -275060 -277430 -200925 -149101 -55845 115281 214307
34181 214307 143776 33739 1965 -37027 -151668 -212154 -115430 18920 54615 40333 48964
34170 48964 30331 -18681 34174 203348 273644 126900 -39935 -13012 137566 247230 330335
34159 330335 457305 560972 574323 573430 590114 487276 227252 50974 150935 352311 362734
34148 362734 174562 -12846 -104131 -104446 27718 268146 408506 303585 118341 97506
34138 97506 215863 288281 290789 320821 360806 342187 340497 448270 550343 488829 363564
34127 363564 392786 543838 589632 493165 442995 503679 514378 387708 264457 283028 380516
34116 380516 414377 349980 253474 193605 205733 290989 418615 553474 666360 707952 642974
34105 642974 535714 498344 514070 447349 292430 240507 385990 539394 493203 323230
34095 323230 239465 265332 272428 238506 255005 330242 377091 365565 332242 281390 218834 224001
34083 224001 340087 454100 437046 343985 324901 396217 450700 435424 371658 260529 121684
34072 121684 63439 156428 295251 343895 356030 474629 661347 719942 582990 401765
34062 401765 328022 340124 314966 182905 -878 -89120 20580 238679 347211 265476
34052 265476 151639 168589 272066 327639 304481 232334 101932 -48210 -75700 75193
34042 75193 243263 267745 211766 202203 188165 68528 -60872 -27079 129427 213938 174421
34031 174421 125630 123603 124378 128998 169170 182286 92337 -21127 -23693 45850 42913 -28091
34019 -28091 -34021 34990 43265 -57202 -158686 -177303 -143178 -104642 -74408 -58293 -27677 83355
34007 83355 243667 290752 175095 105115 249282 429785 370821 144708 67587 206689
33997 206689 313347 249133 165004 200756 285611 324711 350459 397449 420919 416424 454285
33986 454285 547521 648234 797297 1097285 1514235 1886905 2140617 2293326 2254390 1872852
33976 1872852 1243499 721889 531193 542562 529372 450052 382044 350661 341604 359181 381383
33965 381383 354860 283628 224638 183835 134962 126042 210871 291489 221569 71533 78851 297605
33953 297605 505083 516259 398593 305240 273868 270722 284724 308846 344642 442865 610640
33942 610640 706381 607580 451837 486193 689622 797074 703546 565740 472684 322086
33932 322086 100840 -18722 19914 46218 -18732 -18349 116449 192129 87772 -10084 73922
33921 73922 201842 178407 79391 60660 42181 -122428 -310895 -273294 -29891 142288 87369
33910 87369 -78503 -166750 -97271 82511 224155 182657 3185 -93297 -11243 82667 55057
33899 55057 45870 205258 365316 251813 -76094 -281727 -210494 -38107 37337 18053 -10424
33888 -10424 -25346 -40344 -63442 -114684 -193743 -235773 -186847 -95798 -47286 -50557 -75545 -125420
33876 -125420 -178717 -150314 -24968 63405 12074 -85640 -88579 -17967 25820 45082 76436
33865 76436 53267 -70446 -159998 -76219 73747 86033 -17068 -58355 -35524 -102183 -240810
33854 -240810 -244980 -61019 121611 182565 221018 309222 336556 222702 83697 44777 49869
33843 49869 -2902 -72243 -65383 -16499 -30193 -106956 -146696 -98018 -14931 24701 2201 -38160
33831 -38160 -48509 -40471 -66737 -124849 -141644 -102963 -111840 -222913 -308989 -228290 -46825 68395
33819 68395 107343 174533 247003 207665 97408 78788 133687 65100 -148701 -280443 -226756
33808 -226756 -173427 -248997 -289788 -144173 40108 71948 42882 119476 189073 37705 -227083
33797 -227083 -277409 -66699 93207 -108 -178781 -202704 -83573 12306 12347 -36047 -70537
33786 -70537 -48538 32146 83202 -9825 -221758 -384145 -390099 -295370 -178497 -39084 95811
33775 95811 113945 -11899 -112705 -30057 141549 173753 26635 -102527 -54489 105808
33765 105808 212932 200382 119292 33674 -33989 -82033 -103828 -81231 7513 159410 321868
33754 321868 418105 411337 339437 285716 314116 414323 500988 489030 381973 259664 171667
33743 171667 92888 9035 -23074 35200 109007 92765 178 -61737 -55950 -52649 -96064 -134938
33731 -134938 -116079 -59748 -2143 62455 143225 225952 316315 430849 512334 456530 282968
33720 282968 170096 225775 321378 279447 145689 115238 230859 334276 327059 301385 348357
33709 348357 391568 321345 185998 115998 114616 62570 -72270 -155472 -67393 116286 204493
33698 204493 127266 18199 42304 198103 339810 363400 298096 212619 114665 -11553 -132217
33687 -132217 -196829 -208934 -198930 -154230 -48576 74551 126319 87478 34085 36124 88373
33676 88373 157451 239102 335835 415975 433003 378435 300876 267920 293412 299356 192134 4988
33664 4988 -89718 22610 224141 274362 93432 -145471 -227021 -127822 -2747 13578 -60343
33653 -60343 -109238 -69405 11297 64167 102541 176480 257121 270254 248692 315539 463285
33642 463285 499436 323601 124022 139826 330069 462101 450564 398975 353926 259875 166146
33631 166146 235022 475500 675771 692617 635263 668467 792658 921618 1035586 1150434
33621 1150434 1256714 1383405 1602303 1882479 2066583 2077517 2014067 1957533 1847111 1660239
33611 1660239 1535410 1549270 1533783 1323152 1057844 1009903 1185722 1342704 1360742 1352296
33601 1352296 1395243 1393768 1275066 1139092 1116998 1205191 1317490 1398190 1409074 1290304 1020195
33590 1020195 678152 394497 248450 220833 215570 130382 -53180 -246921 -346944 -332809
33580 -332809 -260522 -201983 -221348 -346598 -509834 -580097 -519156 -433605 -401975 -347384 -193167
33569 -193167 -45354 -55295 -163288 -172944 -66039 -39966 -191814 -351899 -320895 -133705 13741
33558 13741 1245 -142950 -320476 -417635 -345571 -127104 81878 132646 32069 -95726
33548 -95726 -164229 -182129 -181182 -161852 -122572 -85429 -60250 -18056 56375 101710 29913 -141572
33536 -141572 -267041 -237667 -127294 -94978 -168023 -223596 -184787 -114672 -80594 -47168 23053
33525 23053 66185 11352 -92611 -139199 -104740 -52676 -46478 -117531 -255916 -375169 -364451
33514 -364451 -237082 -133970 -115534 -74544 52231 133085 44640 -109707 -163568 -154289 -219826
33503 -219826 -320247 -292421 -131267 7911 53845 50611 -11369 -155209 -244271 -123317 72558
33492 72558 47627 -186195 -290644 -127975 32135 -18665 -82810 85046 347593 399042
33482 399042 220436 36622 -43482 -68233 -32499 93528 187640 96502 -94934 -163181 -100321
33471 -100321 -116824 -275441 -378149 -289580 -147870 -136450 -216063 -217450 -87919 78981 192810
33460 192810 246261 283137 350403 453303 525693 485043 336791 174801 66779 2438 -33240
33449 -33240 -18610 36420 57454 -4478 -103381 -165614 -178418 -169367 -152480 -148405 -204353 -319496
33437 -319496 -385622 -291602 -86990 39611 -26295 -191298 -271109 -200005 -76513 -22877 -53525
33426 -53525 -90814 -71274 -9839 29134 3938 -68867 -149952 -232877 -330563 -399838 -340560 -131208
33414 -131208 78532 112824 3496 -39039 77208 185830 102847 -107373 -236393 -220599
33404 -220599 -168704 -143891 -96835 -27882 -44817 -192869 -352524 -384927 -293730 -182669 -130322
33393 -130322 -157554 -237459 -282473 -201093 -27510 79018 24266 -104480 -172928 -169008 -156825
33382 -156825 -138027 -69544 19436 40174 -24361 -84983 -63163 9230 30805 -47581 -156028
33371 -156028 -173289 -74336 20677 -4399 -93292 -85969 51073 170658 141761 -8388 -183296
33360 -183296 -330654 -411733 -378579 -264282 -191395 -204260 -198313 -109460 -51654 -133847 -251654
33349 -251654 -232714 -113760 -82718 -181198 -260604 -238342 -205834 -234065 -243006 -152909 -36735
33338 -36735 -13606 -69226 -87241 -23301 40914 18175 -68832 -119439 -84531 -28272 -33209 -70762
33326 -70762 -38620 64458 97008 -37716 -248479 -375162 -369549 -270470 -97652 96715 161854
33315 161854 25261 -102907 78388 533878 863505 786744 478373 295983 317876 324883
33305 324883 166402 -44701 -120533 -45031 34327 -1958 -127788 -231547 -242310 -171779 -59896
33294 -59896 63861 153786 147632 43595 -68082 -109935 -112242 -135496 -147367 -75934 45446
33283 45446 104636 79548 63564 107211 150364 145344 137998 177870 246616 337174 524405 893333
33271 893333 1447400 2110488 2739022 3113348 3047020 2592954 2055657 1709944 1566073 1468620
33261 1468620 1324952 1135371 892903 601861 356459 260439 276354 275707 234504 249167 338988
33250 338988 370151 245106 63158 -3370 67549 144994 134767 71431 15229 -48136 -153135
33239 -153135 -256972 -267964 -161464 -14722 77374 80754 15769 -77860 -153113 -175239 -149756
33228 -149756 -96835 4070 180529 364832 418587 314905 207619 235629 337472 364199
33218 364199 299906 231849 159689 11555 -159368 -181907 -17717 153247 169390 79438 21720
33207 21720 29831 48179 45172 17469 -48124 -137018 -186959 -162723 -92823 -446 115239 198273
33195 198273 156858 24334 -28609 74075 197608 214880 206587 299369 416248 366207 123580
33184 123580 -145904 -303201 -334003 -260832 -108421 45783 111901 84696 15272 -82313 -202697
33173 -202697 -281226 -273415 -253523 -304147 -357260 -293416 -158338 -115008 -200071 -294358 -326338
33162 -326338 -336029 -338868 -301809 -262798 -294235 -336410 -263688 -136768 -160974 -335118 -390289
33151 -390289 -196560 9106 -20434 -164555 -146207 26285 98854 -8612 -88681 21343
33141 21343 208352 263014 143501 -32056 -161305 -225374 -220464 -122733 39406 126498 -9301
33130 -9301 -324506 -561624 -518612 -297380 -166087 -204488 -245135 -171774 -81222 -79274 -105372
33119 -105372 -80763 -65061 -113355 -123023 -5955 104239 28111 -153477 -194009 -50576 66757
33108 66757 29747 -36118 20942 150306 191607 88196 -69737 -148775 -81055 69023 138859
33097 138859 39509 -121087 -179254 -148075 -171185 -259481 -255516 -102027 39411 36996 -470
33086 -470 101250 308913 439649 425254 362734 325516 271773 161098 45111 -8081 -6951
33075 -6951 -5725 -26207 -53231 -78392 -104081 -112546 -71154 17466 96123 111122 81115 77808
33063 77808 136593 219022 271727 284571 275219 259705 262046 303552 348094 313221 185269 67174
33051 67174 45671 63713 8067 -119073 -213521 -228603 -219884 -238506 -273405 -297390 -285921 -202590
33039 -202590 -60739 18046 -73320 -245256 -285368 -143531 -11025 -58252 -212280 -276415
33029 -276415 -180165 -22143 73793 64995 -7842 -64194 -57355 -37954 -105001 -271993 -434386
33018 -434386 -491631 -442250 -338655 -220088 -122860 -89595 -127494 -200801 -275347 -319382 -280959
33007 -280959 -158170 -76557 -168019 -361401 -434293 -305538 -130786 -62791 -76604 -100120 -145806
32996 -145806 -206941 -184070 -48867 55524 16010 -76325 -93020 -72481 -95352 -93845 14285
32985 14285 113502 33938 -173089 -325138 -403083 -512815 -604317 -505966 -247148 -76123 -98768
32974 -98768 -142801 -67096 14947 -63217 -274203 -468747 -555307 -514143 -369513 -236271 -258601
32963 -258601 -414706 -514538 -470185 -416790 -470375 -533374 -477832 -372241 -357466 -409325 -400359
32952 -400359 -317052 -241474 -170292 -19241 217653 457318 658660 839072 979358 1030945
32942 1030945 1004094 947930 871286 782362 755456 829944 889038 793921 616329 569896 703423
32931 703423 831248 803088 681955 597308 574544 592162 672228 809923 918740 950942 985623
32920 985623 1095171 1205778 1201543 1097203 988408 889260 752382 612175 562159 592839
32910 592839 589567 514047 463953 510527 583853 573842 460153 293201 129120 35586 76561
32899 76561 222560 347466 381749 395179 454918 491502 416711 299298 279368 348700 373430
32888 373430 324280 313100 370495 363672 222345 96697 156817 328512 372778 189429 -79007
32877 -79007 -231628 -198733 -52864 82884 128150 107548 124841 235812 365126 393984 300015
32866 300015 153844 11748 -112924 -193671 -191175 -112735 -8051 90640 167941 185966 122855
32855 122855 39288 20691 51263 32313 -63434 -146483 -144064 -89750 -39136 20595 116362 208221
32843 208221 234195 201382 170785 170962 178777 176015 177751 196372 207190 170561 87797 20306
32831 20306 30560 104051 165825 186576 217511 283315 309741 236827 145838 155105 216970 165768
32819 165768 -9929 -98042 50369 289426 361615 240039 138574 192023 274895 202075
32809 202075 8090 -88487 22475 202239 264193 223555 235606 327957 354055 250082 170157
32798 170157 245807 347392 269998 76617 30622 194611 330003 256795 96082 35206
32788 35206 37582 -39924 -167576 -181486 -48965 87657 129355 131717 174405 240017 265188
32777 265188 228159 146224 48062 -17860 1150 97158 176899 135721 -39268 -242587 -331657
32766 -331657 -250930 -79400 58065 112912 114356 78259 -4103 -85318 -74482 25997 92652
32755 92652 56084 12490 70098 165686 153623 26573 -82107 -94699 -61697 -39507 -19321
32744 -19321 107 -17542 -61215 -52214 40201 139268 165567 131870 84287 20805 -66076 -126624
32732 -126624 -114360 -71438 -73689 -112906 -112477 -50329 12460 29441 18713 556 -36972 -78565
32720 -78565 -62260 31202 133628 190249 238615 311274 330381 216708 59925 31951 129778
32709 129778 160993 27914 -126244 -134850 -32379 49324 87862 133249 158344 106573 30061
32698 30061 20465 41788 -6925 -90804 -75180 41964 112597 76225 38797 65927 65295 -47844
32686 -47844 -209310 -313382 -341278 -307741 -201061 -59745 6868 -32539 -63950 1394 91501
32675 91501 103775 67405 63019 69402 17472 -64282 -83288 -29106 16460 -4190 -72881 -137203
32663 -137203 -151688 -113951 -91932 -150909 -227061 -174525 16349 173489 189748 173760 240522
32652 240522 295602 197698 27703 -9398 100839 171371 113565 58854 141096 308465 413944
32641 413944 388189 266930 123385 22403 -8048 4492 9806 -8497 -28307 -24884 9534
32630 9534 55595 62203 -4307 -97197 -140104 -145451 -185828 -236730 -187451 -55816 -28587 -190369
32618 -190369 -368284 -377878 -280603 -241386 -262543 -241705 -182500 -145847 -78948 92373 258873
32607 258873 232498 30435 -141933 -175418 -142048 -114635 -84817 -55149 -45975 -20227 48568
32596 48568 71229 -29644 -140042 -91593 72829 175678 190816 219282 232470 117588 -38796
32585 -38796 -17025 156477 200712 17881 -157117 -142157 -54178 -40384 -34945 53690 146846
32574 146846 154889 130601 114261 27382 -134180 -210738 -134647 -60600 -80901 -46372 133514
32563 133514 253860 127080 -77929 -89831 48136 116248 124358 242163 414269 399850
32553 399850 184962 28714 56384 94427 -10000 -151871 -160752 -42980 80553 142466
32543 142466 138865 72935 -32043 -127724 -188528 -210853 -166850 -36384 121955 218024 242386
32532 242386 248936 242717 180094 71597 -8719 -17407 25193 78050 92856 28353 -74861 -95859
32520 -95859 -730 68342 -11076 -139716 -142847 -44749 -9449 -55796 -49777 24115 15669 -118015
32508 -118015 -209439 -142323 -28509 -7047 -30909 2950 47291 4496 -51880 49994 296562
32497 296562 450839 350392 122046 14007 82133 147734 59901 -103928 -157979 -61486
32487 -61486 47928 58166 8683 -14296 -1808 18451 54134 99730 93214 11143 -57972 -28537
32475 -28537 54533 98650 106347 120916 95163 -41657 -221973 -292255 -216448 -96712 -7095
32464 -7095 56970 80651 39176 8230 97076 243171 243296 46844 -142258 -139036 -10625 63033
32452 63033 36099 -15586 -57537 -111991 -157673 -130872 -15142 142160 284052 363224 341749
32441 341749 227118 82938 -35329 -120055 -158480 -104633 35552 146188 114255 -17549
32431 -17549 -88639 -18974 91685 91423 -34934 -152805 -156029 -104857 -128927 -219062 -221698 -76691
32419 -76691 55606 5642 -157655 -233090 -183920 -155697 -213100 -250769 -205525 -173742 -231870
32408 -231870 -294617 -261329 -178926 -142719 -141510 -125172 -134519 -226637 -335054 -339038 -233056 -113932
32396 -113932 -43140 -32018 -108247 -263148 -374010 -327269 -200569 -172523 -257347 -290866 -196734
32385 -196734 -91480 -67835 -44508 66020 184718 197360 154181 186691 289933 341451 304438
32374 304438 258689 232035 152943 5211 -105115 -100842 -46055 -36049 -62466 -66164 -49277
32363 -49277 -46996 -46910 -27027 -25345 -78814 -139102 -151576 -171424 -272544 -373725 -317755 -131449
32351 -131449 -29290 -100986 -171326 -81399 46917 -7156 -221144 -363668 -332188 -264275 -292355
32340 -292355 -357274 -335871 -231229 -141956 -110096 -87951 -32252 34434 62650 44971 27911
32329 27911 50590 86606 84817 68359 122821 247876 302501 181792 -16768 -116152 -104045
32318 -104045 -117589 -201813 -245034 -187886 -137752 -192268 -278692 -280182 -222999 -206279 -210074 -122342
32306 -122342 56929 179089 144319 24138 -64338 -111624 -163041 -180515 -74646 125775
32296 125775 244887 158381 -42064 -156986 -119607 -45709 -50745 -111043 -138393 -110288 -66320
32285 -66320 -32961 -19185 -46533 -115631 -170882 -162095 -117189 -94090 -90079 -66282 -30057 -9927
32273 -9927 26541 129667 247589 258856 150802 66611 124320 262669 323993 239752 80461
32262 80461 -45315 -94881 -109322 -155304 -242629 -299374 -248571 -97380 84131 252304 401021
32251 401021 499506 502502 439700 415954 480413 554427 539539 454742 408983 452709 507138 454828
32239 454828 279753 94528 17653 40771 54619 2015 -57511 -55737 -9531 47011 142675
32228 142675 289261 385073 320215 152913 59460 107526 189401 194667 146718 134954 186265
32217 186265 235749 187224 12859 -170348 -179444 7433 179539 159868 54834 74952 187899
32206 187899 179817 32096 -31553 84686 196898 155015 59751 31260 -5571 -126633 -203826
32195 -203826 -109529 32364 26063 -85467 -115936 -48176 -20542 -64098 -80048 -43621 -16272
32184 -16272 22753 145751 285325 284562 151198 58422 64908 38049 -91722 -198620 -168992
32173 -168992 -71550 -19790 -5274 27146 56403 46168 38553 88921 174983 242583 269954 231431
32161 231431 94107 -79253 -133225 -27301 56587 -57826 -277584 -351670 -207656 -20431
32151 -20431 59443 89132 184407 310410 326397 180680 -40733 -241449 -396359 -493511 -486309
32140 -486309 -365898 -227362 -180523 -208642 -195854 -98815 -1483 30306 50381 117316 162135
32129 162135 80360 -88651 -194231 -177097 -127815 -131223 -157269 -138101 -63983 37459 141001
32118 141001 202912 173141 73362 -2899 -12500 -18730 -77880 -143294 -148796 -120838 -122687 -135963
32106 -135963 -93382 -3879 49941 34521 1271 -4049 11209 39726 93358 144150 125847 40249
32094 40249 -4860 72809 206964 261408 203862 124972 92719 73137 22409 -18393 14873
32083 14873 92066 111423 42886 -19291 17041 108309 125623 26723 -86003 -103298 -51562
32072 -51562 -39583 -88115 -96703 -5305 90852 61785 -67553 -147020 -114522 -70740 -104630 -149501
32060 -149501 -96859 19822 67342 9986 -47031 -16159 69903 139638 179074 202208 192692
32049 192692 129686 31660 -67395 -153472 -216168 -237671 -231025 -248642 -312760 -370386 -357516 -280694
32037 -280694 -195711 -128896 -60720 24459 105627 140420 103453 23379 -22079 13732 69228
32026 69228 33891 -98148 -202170 -191212 -141865 -182886 -307555 -383766 -333756 -221966 -156373
32015 -156373 -166872 -201480 -198597 -141910 -72642 -64139 -163738 -341081 -496394 -529391 -415499
32004 -415499 -231193 -95808 -61568 -66135 -25444 41218 37656 -57506 -142653 -127206 -44082
31993 -44082 16549 22950 -2868 -46326 -89354 -85608 -20819 37172 25022 -5845 51290 196178
31981 196178 299024 255002 101758 -37474 -84970 -60630 -28809 -16638 8210 74436 142329
31970 142329 146773 103690 108080 198019 282874 252475 108222 -59592 -176058 -215690 -182975
31959 -182975 -115950 -72960 -72572 -85297 -106802 -165761 -226342 -188671 -56228 9126 -93797
31948 -93797 -231750 -216505 -75567 11256 -16836 -67715 -98402 -163784 -259694 -297085 -268100
31937 -268100 -280109 -377897 -477200 -529974 -615572 -793300 -987727 -1113686 -1226399 -1453955
31927 -1453955 -1824329 -2210784 -2412687 -2288245 -1885279 -1446288 -1189110 -1075795 -906920
31918 -906920 -639791 -455662 -477383 -595040 -652091 -641400 -609157 -520592 -363680 -254649
31908 -254649 -274837 -303309 -186229 3690 60147 -53788 -180654 -220795 -220218 -202642 -105696
31897 -105696 65582 184403 173917 106014 62600 21718 -41166 -60488 3935 55767 -7585
31886 -7585 -118164 -124558 -22192 41260 -8671 -78651 -77986 -59755 -108776 -179433 -160626 -62721
31874 -62721 -18613 -90515 -182908 -190299 -144855 -147262 -207903 -241573 -200011 -131825 -103194 -115839
31862 -115839 -121904 -87489 -30327 -9962 -69457 -168015 -201287 -124710 -20845 9761 -12846
31851 -12846 5023 74408 114231 92116 63223 49279 -3726 -97465 -124582 -24456 94740
31840 94740 96580 19258 21516 153643 297363 335023 273029 173739 62875 -40776 -77100
31829 -77100 -6309 107438 144880 67914 -42855 -96814 -91430 -74637 -52793 7814 99511
31818 99511 152093 109865 -6674 -125724 -174720 -108606 50756 191015 200422 112839 77791
31807 77791 142061 168838 58938 -63473 -29043 100899 123917 23081 -5370 129728 272854
31796 272854 268609 171836 109010 78858 16806 -51479 -50010 23934 117121 196265 225118 147439
31784 147439 -15590 -132364 -124045 -82143 -119993 -190504 -175584 -85316 -28157 -30616 -26287 4198
31772 4198 13043 -13107 -47646 -96834 -166745 -194598 -139343 -98723 -182207 -294921 -229054 19477
31760 19477 208994 171389 5823 -107747 -126490 -94714 -32839 11685 -62891 -254525 -375508
31749 -375508 -272418 -54874 37023 -58853 -192494 -240238 -225244 -198711 -146360 -57704 17341
31738 17341 34768 7719 -47016 -143591 -264052 -326667 -279673 -185412 -145636 -161502 -131564
31727 -131564 3923 169360 237574 183950 114070 127777 193151 198125 112145 28925 22761
31716 22761 32959 -35475 -139497 -132579 22656 181617 201949 111700 28823 -3453 -3857 56623
31704 56623 213380 373876 372218 194059 21695 -4175 47063 47483 21791 82864 224335
31693 224335 318659 303893 249959 233908 249861 252604 205939 88265 -63388 -125954 -14989
31682 -14989 162465 201631 65677 -71469 -85055 -60385 -117916 -207820 -194318 -58999 94902
31671 94902 186208 206425 173477 122729 106314 131441 143000 119068 109598 119676 59597 -89416
31659 -89416 -168913 -44654 170383 256439 186321 108097 78802 20800 -68694 -85445 -32776
31648 -32776 -57543 -193555 -258069 -116179 104197 185333 89957 -55508 -142434 -133590 -34844
31637 -34844 72837 64841 -52431 -97399 32776 174084 123067 -43631 -80942 47117 130413
31626 130413 56960 -35295 -13230 51282 44924 8543 31555 76701 59587 13223 20176 43248
31614 43248 -16365 -124616 -142910 -53503 4613 -36716 -63645 25978 147973 165244 105467
31603 105467 111711 222299 337026 395431 455413 559919 637146 599486 466999 323535 206294
31592 206294 112706 71846 114834 184275 168110 51616 -38070 11194 145419 213664 164047
31581 164047 98298 123360 219366 296826 328112 346030 337382 240986 79833 -3632 75054
31570 75054 193367 158065 -31992 -173775 -124142 34476 136158 137614 107057 86001 61181
31559 61181 32985 15769 -12464 -75247 -123603 -85103 11016 49811 -4737 -48332 13754 126746
31547 126746 159637 70830 -64004 -155478 -164329 -86717 43740 139312 123251 32541 -17469
31536 -17469 -969 -27813 -158149 -261183 -181585 3890 57522 -82376 -206356 -143589 -3189
31525 -3189 20429 -52657 -59906 20246 64808 52868 96631 202860 214807 67755 -78931
31514 -78931 -71611 21160 38444 -42356 -119284 -118404 -35120 88737 151198 64099 -81459 -67399
31502 -67399 130196 245588 105202 -78125 -22470 165456 150767 -91632 -234559 -105542
31492 -105542 83673 98415 -7563 -71545 -80635 -95073 -92486 -45623 -17627 -40668 -21029
31481 -21029 107518 250823 296784 278376 273570 256515 179488 96665 68765 43740 -26239
31470 -26239 -49595 62458 205327 207715 85010 -8134 -22347 -25001 -11648 84177 199314
31459 199314 173801 11442 -91110 -40111 15267 -66107 -190715 -186031 -62710 26430 20659
31448 20659 2668 37454 77082 41532 -76990 -209445 -273373 -236037 -135982 -40420 22349
31437 22349 70347 114326 138435 137335 120636 69806 -46113 -186382 -239834 -160271 -43919
31426 -43919 -11190 -58174 -97558 -109257 -154626 -241104 -268117 -152453 49926 199620 221961
31415 221961 154214 67382 -324 -27900 10052 107882 202180 228198 192185 143130 82882
31404 82882 -31513 -184110 -273826 -240353 -157328 -131755 -153075 -127038 -38583 17630 -15971
31393 -15971 -70114 -46517 55263 151314 169579 98205 -18153 -92479 -47140 102185 240105
31382 240105 266137 191290 91912 8872 -57436 -86651 -45586 44171 105876 94340 46978
31371 46978 30234 58775 85624 63751 5348 -29520 -12464 1603 -56717 -152032 -159737 -35275
31359 -35275 98430 98310 -15972 -111267 -132710 -135552 -138263 -74995 69064 189350 192450 104932
31347 104932 -13097 -168297 -356407 -469715 -409839 -250325 -159790 -181201 -210243 -184044
31337 -184044 -152412 -141446 -93872 -6945 7340 -99020 -183031 -95178 86409 163205 121371
31326 121371 149160 318044 422115 252385 -76914 -232241 -69990 195826 270504 115636
31316 115636 -66525 -114998 -64392 -25020 -21894 -12520 4137 -13877 -58094 -54722 32996 137604
31304 137604 156532 66685 -53808 -109772 -83010 -42698 -58487 -109203 -111316 -47964 -10074
31293 -10074 -61501 -127088 -105240 -45572 -88110 -236204 -335016 -306260 -255885 -279361 -303869
31282 -303869 -235462 -141110 -138217 -188657 -165956 -78508 -56121 -126216 -168709 -116554 -52652 -59519
31270 -59519 -100598 -116810 -136569 -210844 -311407 -367962 -358560 -304920 -218729 -105732 4709
31259 4709 76861 101170 91962 74789 81629 126339 180744 207499 210705 216478 222383 218506 231037
31246 231037 270434 263994 142395 -17332 -56063 45990 137170 116027 52971 34697 26038
31235 26038 -17733 -23987 80155 206022 200122 62164 -59499 -70690 -18934 13316 3366
31224 3366 -26797 -37987 15601 130557 211936 161396 11514 -96788 -78472 16573 95235
31213 95235 125551 127417 113467 76645 16266 -46198 -79254 -76200 -75478 -115300 -162639 -140492
31201 -140492 -49304 8449 -22248 -46948 43489 190133 231160 128889 11916 -21715 -29289
31190 -29289 -105407 -228981 -295974 -254564 -146620 -41188 22378 33916 -3370 -70935 -124620
31179 -124620 -108282 -11818 77537 32009 -164964 -358911 -374442 -208713 -24196 31249 -57174
31168 -57174 -202038 -284539 -212683 -3218 188237 208837 94964 25918 74149 115396 38117
31157 38117 -77133 -87101 -5674 34071 -7084 -34724 6909 46436 5894 -83260 -136719 -127233
31145 -127233 -89424 -61522 -65641 -106811 -151819 -146042 -88211 -44255 -43528 -19711 72245 137544
31133 137544 56341 -105305 -143311 -3560 124757 83093 -25155 -8172 114558 160533
31123 160533 77035 -11447 -45100 -108286 -211276 -200259 -12941 145367 62207 -154007 -210160
31112 -210160 -43690 109243 74766 -27475 6749 174074 294059 248502 85767 -69510
31102 -69510 -124856 -61735 60187 145417 150871 119896 105162 99100 84117 100227 181599 253723
31090 253723 199815 45241 -29900 79438 246874 277250 164525 69593 68472 67522 -2556
31079 -2556 -55988 -3412 85627 100682 86477 161090 278060 249421 25685 -210590 -288143
31068 -288143 -245174 -209823 -208307 -190928 -150481 -107067 -46483 31178 72072 69855 122681 273862
31056 273862 378715 280551 61913 -53246 -23617 -24758 -137766 -204456 -85699 99733
31046 99733 138477 26078 -48828 15053 115445 125711 66419 34945 41690 8762 -82507
31035 -82507 -127249 -19846 200675 376233 384156 226135 -13054 -230842 -337495 -303592
31025 -303592 -204238 -150916 -152688 -113827 3770 105020 100668 33580 -5318 -5166 2420 24859
31013 24859 53558 11514 -120892 -201983 -97466 101301 189036 140083 112544 170359 194599
31002 194599 102387 -30306 -125221 -212256 -302163 -303917 -174884 -26986 28808 39489 101429
30991 101429 189748 216747 188621 181749 207646 208287 156225 74068 -14675 -82779 -87660 -31585
30979 -31585 12088 209 -8441 40948 83769 24689 -103988 -178043 -150399 -89348 -65481 -84976
30967 -84976 -117218 -114206 -34564 73267 62665 -129074 -337464 -348004 -192709 -109749 -197351
30956 -197351 -282084 -192429 -2256 104583 87528 36715 -7865 -82987 -184982 -250491 -247901
30945 -247901 -197444 -113662 -10593 58890 62764 69122 161594 291953 342017 328642 389422
30934 389422 527075 546269 348488 130084 127794 284470 356681 275726 187714 170458 143683
30923 143683 78507 63525 99054 51142 -87199 -110894 71236 234146 165996 25362 110830
30912 110830 389510 547412 469651 375982 444061 565839 573691 491415 431201 398097 330578
30901 330578 235851 176840 185659 246516 297294 229836 -6186 -278420 -378415 -286412 -192053
30890 -192053 -214664 -268483 -268915 -284129 -364731 -396849 -284982 -144162 -131987 -191973 -149622
30879 -149622 5906 120601 117344 67901 40768 32756 48470 105256 151139 107077 8871
30868 8871 -6687 115234 267169 305708 193857 13221 -107948 -89851 18936 77750 19147
30857 19147 -68416 -80980 -48437 -52895 -75094 -46286 7694 14922 2391 39129 71419 -11040
30845 -11040 -157977 -195216 -96143 -28155 -82925 -146709 -115156 -61674 -87137 -155567 -199014
30834 -199014 -246673 -313383 -288581 -103128 92894 108105 2513 -1946 118772 143841 -32659
30823 -32659 -205166 -141133 91976 245672 243355 230357 296116 333003 226194 40039 -81569
30812 -81569 -104944 -87379 -36549 78509 199882 202492 70368 -58195 -65905 10111 64549
30801 64549 59915 20907 -31607 -74049 -65504 -3723 50915 59858 64141 108879 166695 186255
30789 186255 157526 85443 -23760 -102101 -48508 107743 183369 82223 -52034 -53012 10602
30778 10602 -35731 -170237 -199672 -46872 174754 350498 441851 393171 168302 -99478
30768 -99478 -189264 -67372 86010 148457 169285 184770 135718 41555 45456 176818 257839
30757 257839 174606 69014 112843 239251 263222 156871 45528 12290 45386 110298 157571
30746 157571 129190 52348 39502 110553 132432 32755 -69776 -75093 -84365 -202124 -303977
30735 -303977 -216858 -19402 70128 26636 2214 36665 32204 -13480 -429 52026 25312
30724 25312 -46629 -5087 118599 92310 -127583 -268069 -142613 57151 57511 -103069 -186124
30713 -186124 -117187 -15742 50248 121157 189696 181312 102942 62932 111743 171058 157540
30702 157540 101573 100505 184574 259394 200287 20363 -95690 -1223 196474 253007 123844
30691 123844 24759 99640 202243 133294 -49666 -128690 -40346 78755 107980 42798 -84035
30680 -84035 -221695 -259567 -122474 86140 170585 80932 -54990 -131854 -162645 -167117 -112342
30669 -112342 -7036 66267 62431 23187 -11220 -40268 -35575 46456 152565 155357 35933
30658 35933 -71814 -74354 -42305 -74762 -145407 -161088 -88193 45480 191620 269757 212151
30647 212151 80830 36941 129092 224441 219343 184234 203613 217948 159768 109960 148797
30636 148797 169235 39965 -132519 -128665 43729 162316 131840 84980 119797 159882 136492
30625 136492 108207 115134 92119 23550 22801 146201 267923 259701 177784 152110 192267 224149
30613 224149 232240 245846 254640 246803 264221 317072 314895 193912 48293 17341 95172 168075
30601 168075 189932 195407 179265 101075 502 -18458 69909 186761 274810 360813 478841
30590 478841 607579 700336 726940 690874 645892 661081 714788 675873 467713 194031 3908
30579 3908 -110249 -256999 -439681 -560349 -606213 -658728 -703027 -607696 -353651 -122596 -65359
30568 -65359 -111344 -114646 -83113 -133422 -278539 -386994 -348359 -198467 -72025 -66929 -149423
30557 -149423 -185663 -98781 12672 -17146 -188279 -308602 -243512 -92295 -37439 -98086 -135778
30546 -135778 -61909 63938 135229 116626 47283 -25199 -95366 -191195 -305435 -351494 -247121
30535 -247121 -48825 78719 62792 7279 22403 62149 22319 -76030 -122635 -98383 -94122
30524 -94122 -152407 -199343 -152246 -15046 142636 229689 164494 -43569 -235522 -230827 -49839
30513 -49839 87119 34912 -91723 -84994 74824 206364 167984 14516 -96753 -82624 14201
30502 14201 102065 127065 96221 46320 3272 -30191 -58804 -83829 -109697 -142612 -174183 -185816
30490 -185816 -181187 -191311 -227184 -250652 -222966 -164827 -129180 -122502 -96664 -21890 74758 152009
30478 152009 189997 168213 62198 -99508 -219264 -224304 -153465 -104932 -122468 -181155 -253194
30467 -253194 -317826 -325653 -238003 -105520 -26192 -10379 31205 140326 236236 230781 146207
30456 146207 70311 57269 114230 212574 262105 156467 -84320 -289956 -335257 -284967 -257198
30445 -257198 -229555 -108274 72646 174754 158740 120931 121154 107220 34930 -55737 -121760
30434 -121760 -173962 -211775 -187625 -84415 32497 80648 43762 -20051 -27018 51216 122164
30423 122164 49211 -146768 -253759 -141798 31873 48317 -37850 -5185 152897 218059
30413 218059 120726 45229 99343 144757 61269 -64384 -137282 -207184 -284573 -243928 -79653
30402 -79653 -20832 -187143 -358198 -318806 -206218 -231851 -274840 -107154 137877 128435 -110503
30391 -110503 -217666 -69153 67974 12393 -82708 -70131 -46853 -92004 -77049 68267 163754
30380 163754 62462 -94897 -120353 -75579 -106790 -157888 -91303 37704 74433 41253 84373
30369 84373 203574 257843 207605 146943 112649 53577 -14742 -9110 56505 75330 37099 49413
30357 49413 137588 184178 124116 52521 58565 77743 10931 -100721 -131204 -49732 56137
30346 56137 117299 152384 189615 191324 102388 -50599 -157224 -138869 -42616 11534 -32816
30335 -32816 -123463 -187441 -210208 -211630 -198314 -173190 -152515 -146733 -161019 -218675 -314694 -340302
30323 -340302 -170702 118912 258256 115423 -89088 -60291 162419 273715 148689 -5207
30313 -5207 11902 113849 110994 13513 -15986 61751 100204 -15731 -205037 -283140 -166271
30302 -166271 51049 210032 257855 278386 340881 370357 243554 -10730 -212458 -245016
30292 -245016 -164913 -69237 25214 107348 100613 -21456 -137361 -122556 -30522 2600 -16854
30281 -16854 33001 155405 201942 112382 30785 98246 246906 305361 233080 140642 115277
30270 115277 128488 114346 61224 5460 -22935 -26613 -24549 -16086 28377 119884 208097 233331
30258 233331 216434 227825 255368 194640 21044 -117136 -66728 126116 275660 283383 208307
30247 208307 140378 114228 141140 212502 257152 203806 110944 121904 247727 313544 197480
30236 197480 14661 -46856 9344 26060 -47205 -86634 -2583 121262 158425 110883 67805
30225 67805 53528 8414 -95248 -197606 -228544 -190768 -139889 -111956 -101125 -95281 -98584 -109409
30213 -109409 -101611 -52836 15950 54880 43391 13271 5751 25637 49783 59919 47223 2446
30201 2446 -68499 -124465 -116018 -42068 40796 77596 68647 50519 38477 14945 -24377 -44857
30189 -44857 -16550 35449 57263 36500 9908 -133 -12778 -39119 -53642 -43622 -41388 -69542
30177 -69542 -100602 -120459 -181073 -316300 -444942 -452926 -359450 -304965 -365873 -467325 -493223
30166 -493223 -401537 -220285 -18468 103439 91074 28339 51115 143779 142064 -18666 -195790
30155 -195790 -252634 -234875 -225794 -171195 -9712 135879 95841 -78726 -184044 -170996 -182468
30144 -182468 -281704 -351806 -313568 -250556 -234309 -195953 -84014 -5816 -71832 -202175 -236934
30133 -236934 -174046 -146605 -191679 -190959 -62465 109267 190033 166379 132214 140620 138147 59457
30121 59457 -57195 -96018 -6519 124359 174559 130528 82628 96931 149238 182208 167038
30110 167038 99252 -7227 -99673 -110737 -32880 63989 107806 89460 50371 44819 113178
30099 113178 239008 328595 295974 180409 109595 125271 126400 28470 -102649 -148927 -112792
30088 -112792 -101967 -166833 -236426 -219171 -106271 34047 119449 102576 -834 -113827 -152450
30077 -152450 -98565 -15316 15510 -26959 -81785 -67823 24533 111090 103036 11447 -67747 -73627
30065 -73627 -47986 -69515 -153551 -242004 -273361 -238594 -176537 -133209 -126233 -137918 -132758 -77982
30053 -77982 36288 169803 234802 175551 55740 9501 79207 163809 165664 113925 80955
30042 80955 56777 527 -51662 -47801 -38409 -101373 -182217 -155804 -34529 39998 20374 5503
30030 5503 37918 18174 -107341 -220824 -189484 -36331 127355 236936 268201 207163 112060
30019 112060 104037 206613 284586 221947 65626 -80194 -188519 -252903 -222730 -102883 3915
30008 3915 68393 209262 452407 567215 352121 -24422 -206852 -119217 -6873 -30744
29998 -30744 -72397 12191 169330 272038 303139 313700 312671 281395 219857 128567 10720
29987 10720 -93654 -152604 -208412 -297081 -330808 -206203 -16643 23349 -107799 -188332 -81151
29976 -81151 68464 61524 -86514 -223475 -272213 -241340 -142853 -29669 -13498 -112225 -169237
29965 -169237 -58653 115073 166525 97661 52072 61823 26666 -73500 -131188 -97669 -54799
29954 -54799 -60820 -67301 -39732 -29049 -61277 -77116 -52347 -59609 -119346 -104847 72609 264604
29942 264604 231389 -34243 -277320 -294883 -153580 -49614 -63842 -133092 -185405 -205927 -198973
29931 -198973 -167760 -130603 -105350 -83545 -57744 -51214 -71672 -64665 16230 108142 91931 -44434
29919 -44434 -173881 -182970 -86491 31198 110587 119398 43738 -68786 -126879 -112720 -110959 -159337
29907 -159337 -155986 -14641 156560 163951 -4316 -147393 -107075 47781 132240 70843 -36726
29896 -36726 -48804 50344 126888 60306 -85952 -130103 -22753 78112 45934 -25757 4059
29885 4059 74107 23108 -122240 -168704 -59333 43802 9468 -111127 -228378 -335089 -417293
29874 -417293 -407356 -308809 -226914 -201069 -152409 -69858 -77834 -216867 -332413 -316128 -285355
29863 -285355 -354329 -393441 -234533 14787 115137 71618 95961 224480 255148 100048
29853 100048 -60032 -59209 34791 91289 108630 104509 -7720 -258282 -460283 -403198 -150467
29842 -150467 27361 -4225 -120288 -159716 -123830 -100745 -105835 -87695 -40402 -19304 -44719
29831 -44719 -57661 -5466 67962 73214 8740 -25615 21106 53412 -46577 -234790 -334583 -247843
29819 -247843 -54938 106427 178980 174117 104523 -10338 -114708 -148004 -96322 -110 63954
29808 63954 18813 -132177 -256588 -208789 -21982 104629 57676 -44446 -29854 92014
29798 92014 177094 160340 99347 42608 -15761 -58040 -43352 556 -3636 -51304 -49295 31572
29786 31572 105147 110357 91958 83863 26456 -109536 -214795 -174611 -45072 27936 23779 48860
29774 48860 136604 181874 105551 -23433 -80695 -28585 75188 152010 151205 77306 -712 -11980
29762 -11980 27172 38059 2147 -14212 19765 39280 -6888 -64329 -56642 263 38899 42737
29750 42737 32036 -5897 -84659 -148874 -130190 -62786 -57436 -156805 -285980 -347984 -306603 -183476
29738 -183476 -44214 18740 -32414 -114127 -112053 -38582 -15125 -92680 -187878 -217044 -189133
29727 -189133 -128512 -14474 141065 255145 288470 308499 356864 351892 231735 99404 76946
29716 76946 85185 -46450 -274355 -351593 -184097 21674 62869 16764 63671 168720 142981
29705 142981 -34522 -166407 -126524 -17526 24516 26564 73096 122755 74361 -40896 -80496
29694 -80496 -1521 74881 39720 -66263 -142301 -171880 -205301 -251205 -266285 -233268 -178496
29683 -178496 -115171 -33357 42841 48959 -36854 -146610 -198049 -189752 -177276 -175892 -149506 -101110
29671 -101110 -101275 -178326 -233989 -149772 37516 154394 102879 -25908 -86383 -47828 27709
29660 27709 97884 141421 109003 -11093 -108514 -56664 98197 173550 89650 -48272 -130264
29649 -130264 -169584 -196500 -160143 -32892 90024 103198 30582 -42939 -106488 -186240 -239313
29638 -239313 -200235 -91992 9699 79540 115791 71397 -69430 -198272 -201601 -136698 -146882
29627 -146882 -228552 -239819 -133052 -8851 80741 203409 359272 390500 190337 -110147
29617 -110147 -280221 -246887 -122009 -29730 555 -610 -3056 3360 15609 38842 89461 150012
29605 150012 148278 40308 -109199 -204090 -246384 -290510 -299099 -188733 -24996 -3261 -171748
29594 -171748 -322838 -258593 -48800 83946 45700 -74410 -162260 -175407 -118459 -23256 53773
29583 53773 77800 70842 69664 78295 85429 86453 70994 39493 35072 85822 118884 37784 -104628
29570 -104628 -141751 -37208 50372 10936 -53756 -4273 130519 233177 271235 279154 272091
29559 272091 288479 408022 605041 696127 573370 383860 324097 358916 323211 216869
29549 216869 190844 278045 339634 284169 175435 106354 96407 122569 147920 131591 93259
29538 93259 112142 171659 112104 -119467 -296607 -199819 25368 55779 -124927 -227300 -136399
29527 -136399 -66565 -161175 -249505 -155627 8582 54012 18169 44225 98501 30864 -157105
29516 -157105 -300820 -306166 -246115 -228826 -275563 -328259 -306895 -167720 49316 245721 352019
29505 352019 355112 252817 66331 -102750 -141464 -77122 -47144 -90233 -98167 -18916 38309
29494 38309 -21724 -130470 -170842 -130303 -57996 14679 30780 -84352 -275253 -348408 -223356
29483 -223356 -61423 -23922 -44555 5504 65436 -6326 -169494 -254478 -217839 -154289 -104310
29472 -104310 -41522 -10672 -76842 -157141 -104529 42472 93783 3916 -69500 -38538 -11828
29461 -11828 -80235 -162116 -156401 -95744 -53059 -32602 -42327 -135434 -279434 -317944 -179606 -6383
29449 -6383 47272 26886 53204 98986 62532 -18013 -17812 45975 35019 -60587 -86103 24065
29437 24065 132439 112026 20737 -34062 -68113 -129178 -144720 -25357 139253 165604 49733
29426 49733 -19585 40023 63573 -101593 -332399 -382397 -225879 -76293 -71871 -117670 -90841
29415 -90841 -42791 -81371 -162740 -156335 -71443 -55027 -149199 -203395 -97509 67822 110633
29404 110633 18379 -67557 -79994 -97822 -178138 -252707 -255273 -247194 -321890 -447054 -498659 -418544
29392 -418544 -255428 -82488 38407 46514 -51625 -122798 -39214 126835 175159 63027 -37487
29381 -37487 -16386 19206 -26883 -36367 117767 293451 237291 -36015 -249650 -245428 -146785
29370 -146785 -114470 -142267 -157020 -138115 -52984 159353 433700 553407 405762 149403
29360 149403 3852 -25188 -77729 -188419 -261817 -252239 -218159 -206141 -200504 -188333 -174005
29349 -174005 -127378 -7394 154404 266107 275371 199521 68782 -91400 -226895 -274745
29339 -274745 -229667 -147603 -85367 -72709 -121116 -205128 -249425 -194961 -80101 -11266 -50194
29328 -50194 -158594 -244063 -235629 -134565 -17325 34344 22186 10654 6450 -65929 -225746
29317 -225746 -357032 -347692 -245426 -184724 -204050 -228284 -198019 -121319 -19481 87613 155796
29306 155796 157477 133864 134233 130330 71146 -9743 -35028 -4945 20985 38590 86862 138707
29294 138707 120741 38993 -26793 -50487 -65905 -55353 30124 131531 115892 -14089 -93532
29283 -93532 -35086 47611 28110 -59929 -128174 -180220 -241273 -257296 -192244 -130386 -147234 -163013
29271 -163013 -74673 34521 -7634 -181330 -268677 -151442 36855 108909 55095 9374 64681
29260 64681 187294 269584 228077 83419 -42550 -51790 6239 -8383 -146891 -320705 -432889
29249 -432889 -475324 -479053 -466392 -491632 -629829 -865639 -1091955 -1297404 -1644459 -2224641
29239 -2224641 -2808333 -3013117 -2722844 -2193913 -1728113 -1389165 -1091540 -813514 -604554
29230 -604554 -474234 -395348 -369491 -392396 -397694 -330699 -242604 -217572 -238442 -221920 -155848
29219 -155848 -93125 -35897 46896 97539 13059 -164900 -251527 -167469 -51939 -48890 -103712
29208 -103712 -77701 35921 134767 178349 208564 231574 193241 70371 -88420 -206636 -222384
29197 -222384 -127514 -9902 6572 -76539 -109107 -5938 113266 107432 37660 53748 136944
29186 136944 145320 71951 47856 92076 78521 -13428 -39977 37060 43028 -114087 -238087
29175 -238087 -119027 131631 229027 106130 -56099 -137100 -188882 -233457 -169528 35634
29165 35634 223516 229665 97835 5329 34444 114356 157505 159189 152470 129671 46203 -109215
29153 -109215 -266594 -314575 -210680 -47848 28546 -13185 -52028 17877 121795 88327 -101416
29142 -101416 -248727 -185365 -12204 23420 -134220 -272080 -210306 -45692 15642 -31746
29132 -31746 -15211 116428 202440 126497 1796 -4528 82812 109650 33148 -42190 -47494 -32100
29120 -32100 -46798 -63035 -52490 -52653 -95184 -141471 -149964 -143511 -140641 -81718 78819 242180
29108 242180 245713 84448 -57683 -42732 48595 50172 -58953 -159500 -191389 -229708 -339148
29097 -339148 -445604 -415382 -225807 -5763 90667 29940 -80349 -109488 -36259 52677 90796
29086 90796 103012 120358 96481 -8745 -114339 -102109 2281 56425 13628 -27023 -10359
29075 -10359 -13610 -78153 -104787 -29921 26697 -56784 -173788 -123177 72047 168071 32234
29064 32234 -189779 -280352 -194273 -40953 76420 136166 171425 218978 266238 240706 93862
29053 93862 -111374 -254265 -290549 -271239 -240554 -193865 -135793 -97852 -86634 -83559 -96916
29042 -96916 -138658 -155485 -79874 39323 60761 -63109 -219370 -296632 -319762 -360150 -392257
29031 -392257 -327289 -151819 44341 170690 214412 213949 191299 135247 54162 19173 102290
29020 102290 259518 344532 287743 194545 189992 231716 188606 62808 -3423 56349 135745
29009 135745 104575 -39078 -191805 -244798 -153645 14141 104817 35205 -89594 -109068 -30065
28998 -30065 8147 -29156 -29443 56185 123940 94639 38214 50835 124589 204827 269607 288329
28986 288329 201204 6453 -206061 -344734 -368878 -261003 -62167 78907 47138 -50261
28976 -50261 -19316 92786 40342 -203362 -345313 -212242 -21510 -22902 -112295 -53338 106326
28965 106326 133809 9397 -68566 -23872 25822 25130 55150 123254 101800 -56260 -208300
28954 -208300 -202671 -56270 97227 149715 81911 -41882 -123506 -119088 -63986 13790 133894
28943 133894 268358 309582 223594 133455 140469 166308 100789 -1036 -23040 8811 -1894
28932 -1894 -32398 -2330 52587 56348 66483 167745 262073 193803 35380 2717 110348
28921 110348 168155 123496 134696 255438 308723 171830 -33850 -147828 -180445 -210742 -238528
28910 -238528 -248019 -282475 -353908 -388188 -337040 -246836 -170262 -116863 -114602 -189541 -263044 -216433
28898 -216433 -81235 -5578 -9839 39302 172057 234099 132087 -30104 -140704 -218171 -274828
28887 -274828 -240216 -131998 -114485 -253900 -381822 -337529 -192890 -102222 -76461 -44841 -4171
$$ [...]
##END NTUPLES=NMR SPECTRUM
##END=
