##TITLE=31Pdec_LR-741-RM2
 , 24 sc
 8.11.2021
##JCAMPDX= 6.0         $$ Bruker NMR JCAMP-DX V2.0
##DATA TYPE= NMR SPECTRUM
##DATA CLASS= NTUPLES
##ORIGIN= UXNMR, Bruker Analytische Messtechnik GmbH
##OWNER= root
$$ XWIN-NMR		Version 3.5
$$ Mon Nov  8 11:36:26 2021 Russian Standard Time (UT+4h)  she@DPX200
##.OBSERVE FREQUENCY= 81.013821
##.OBSERVE NUCLEUS= ^31P
##.ACQUISITION MODE= SIMULTANEOUS
##.ACQUISITION SCHEME= undefined
##.AVERAGES= 24
##.DIGITISER RES= 16
##SPECTROMETER/DATA SYSTEM= spect
##.PULSE SEQUENCE= zgpg30
##.SOLVENT NAME= CDCl3
##.SHIFT REFERENCE= (INTERNAL, CDCl3, 0, 248.564)
##AUDIT TRAIL= $$ (NUMBER, WHEN, WHO, WHERE, WHAT)
$$ ##TITLE= Audit trail, XWIN-NMR		Version 3.5
$$ ##JCAMPDX= 5.01
$$ ##ORIGIN= Bruker BioSpin GmbH
$$ ##OWNER= she
$$ F:/spectra/data/she/nmr/P31/1/pdata/1/auditp.txt
$$ ##AUDIT TRAIL=  $$ (NUMBER, WHEN, WHO, WHERE, WHAT)
(   1,<2021-11-08 11:35:15.68 +0400>,<she>,<DPX200>,
      <created by zg, POWCHK disabled, PULCHK disabled
       configuration hash MD5:
       00 E9 B6 7A A2 85 ED C7 34 08 36 98 17 FE 4E 26
       data hash MD5: 32K
       A4 BC A4 6F F9 4A A6 5D C8 05 1D F6 8F E3 36 31>)
(   2,<2021-11-08 11:35:18.20 +0400>,<she>,<DPX200>,
      <Start of raw data processing
       efp BC_mod = 2 LB = 1 FT_mod = 6 PKNL = 1 PHC0 = -8852.549 PHC1 = 129.4694 SI = 64K 
       data hash MD5: 64K
       10 10 90 85 77 CF F0 04 4E 54 CA 82 8E 26 95 F4>)
(   3,<2021-11-08 11:35:38.21 +0400>,<she>,<DPX200>,
      <pk PHC0 = 7.340926 PHC1 = -19.2 
       data hash MD5: 64K
       72 F1 92 5B A6 E5 73 54 18 B7 43 AD E4 EE 87 BC>)
(   4,<2021-11-08 11:35:51.96 +0400>,<she>,<DPX200>,
      <abs ABSG = 5 
       data hash MD5: 64K
       8E 5D 56 FC AD 9B 2B 13 D2 76 40 27 32 30 6F 87>)
$$ ##END=
$$ 
$$ hash MD5
$$ 4A EC 7E FD 83 22 43 70 85 EE E1 68 37 48 F1 9A
##$RELAX= 
##$RELAX= 
##$RELAX= 
##$RELAX= 
##$RELAX= 
##$RELAX= 
##$RELAX= 
##$RELAX= 
$$ Bruker specific parameters
$$ --------------------------
##$DU= <F:/spectra>
##$EXPNO= 1
##$NAME= <P31>
##$PROCNO= 1
##$TYPE= <nmr>
##$USER= <she>
##$AMP= (0..31)
100 100 100 100 100 100 100 100 100 100 100 100 100 100 100 100 100 100 
100 100 100 100 100 100 100 100 100 100 100 100 100 100 
##$AQSEQ= 0
##$AQ_mod= 1
##$AUNM= <au_zg>
##$AUTOPOS= <>
##$BF1= 81.014009
##$BF2= 200.13
##$BF3= 200.13
##$BF4= 200.13
##$BF5= 200.13
##$BF6= 200.13
##$BF7= 200.13
##$BF8= 200.13
##$BYTORDA= 1
##$CFDGTYP= 0
##$CFRGTYP= 5
##$CHEMSTR= <none>
##$CNST= (0..31)
1 1 145 1 1 1 1 1 1 1 1 1 1 1 1 1 1 1 1 1 1 1 1 1 1 1 1 1 1 1 1 1 
##$CPDPRG= <waltz16>
##$CPDPRG1= <>
##$CPDPRG2= <waltz16>
##$CPDPRG3= <>
##$CPDPRG4= <mlev>
##$CPDPRG5= <mlev>
##$CPDPRG6= <mlev>
##$CPDPRG7= <mlev>
##$CPDPRG8= <mlev>
##$CPDPRGB= <>
##$CPDPRGT= <>
##$D= (0..31)
0 1 0 0 0 0 0 0 0 0 0 0.03 2e-05 3e-06 0 0 0 0 0 0 0 0 0 0 0 0 0 0 0 0 
0 0 
##$DATE= 1636356915
##$DBL= (0..7)
120 120 120 11 120 120 24 19 
##$DBP= (0..7)
150 150 150 150 150 150 150 150 
##$DBP07= 0
##$DBPNAM0= <>
##$DBPNAM1= <>
##$DBPNAM2= <>
$$ [...]
##$SUBNAM3= <"">
##$SUBNAM4= <"">
##$SUBNAM5= <"">
##$SUBNAM6= <"">
##$SUBNAM7= <"">
##$SUBNAM8= <"">
##$SUBNAM9= <"">
##$SW= 501.771253377433
##$SWIBOX= (0..15)
0 1 3 0 0 0 0 0 0 0 0 0 0 0 0 0 
##$SW_h= 40650.406504065
##$TD= 32768
##$TD0= 1
##$TE= 0
##$TE2= 300
##$TE3= 300
##$TEG= 300
##$TL= (0..7)
0 120 53 12 22 120 120 120 
##$TP= (0..7)
150 150 150 150 150 150 150 150 
##$TP07= 0
##$TPNAME0= <>
##$TPNAME1= <>
##$TPNAME2= <>
##$TPNAME3= <>
##$TPNAME4= <>
##$TPNAME5= <>
##$TPNAME6= <>
##$TPNAME7= <>
##$TPOAL= (0..7)
0.5 0.5 0.5 0.5 0.5 0.5 0.5 0.5 
##$TPOFFS= (0..7)
0 0 0 0 0 0 0 0 
##$TUNHIN= 0
##$TUNHOUT= 0
##$TUNXOUT= 0
##$USERA1= <user>
##$USERA2= <user>
##$USERA3= <user>
##$USERA4= <user>
##$USERA5= <user>
##$V9= 5
##$VALIST= <valist>
##$VCLIST= <CCCCCCCCCCCCCCC>
##$VD= 0
##$VDLIST= <DDDDDDDDDDDDDDD>
##$VPLIST= <PPPPPPPPPPPPPPP>
##$VTLIST= <TTTTTTTTTTTTTTT>
##$WBST= 1024
##$WBSW= 4
##$XGAIN= (0..3)
0 0 0 0 
##$XL= 0
##$YL= 0
##$YMAX_a= 15488
##$YMIN_a= -18426
##$ZGOPTNS= <>
##$ZL1= 120
##$ZL2= 120
##$ZL3= 120
##$ZL4= 120
##$ABSF1= 248.5645
##$ABSF2= -253.2056
##$ABSG= 5
##$ABSL= 3
##$ALPHA= 0
##$AQORDER= 0
##$ASSFAC= 0
##$ASSFACI= 0
##$ASSFACX= 0
##$ASSWID= 0
##$AUNMP= <proc_1d>
##$AZFE= 0.1
##$AZFW= 0.5
##$BCFW= 0
##$BC_mod= 2
##$BYTORDP= 0
##$COROFFS= 0
##$CY= -3
##$DATMOD= 1
##$DC= 0
##$DFILT= <>
##$DTYPP= 0
##$F1P= 0
##$F2P= 0
##$FCOR= 1
##$FTSIZE= 65536
##$FT_mod= 6
##$GAMMA= 0
##$GB= 0
##$INTBC= 1
##$INTSCL= 5.30512e-09
##$ISEN= 30
##$LB= 1
##$LEV0= 0
##$LPBIN= 0
##$MAXI= 10000
##$MC2= 0
##$MEAN= 0
##$ME_mod= 0
##$MI= 50
##$NCOEF= 0
##$NC_proc= -6
##$NLEV= 6
##$NOISF1= 182.463
##$NOISF2= 159.3651
##$NSP= 0
##$NTH_PI= 0
##$NZP= 0
##$OFFSET= 248.5645
##$PC= 4
##$PHC0= -8845.208
##$PHC1= 110.2694
##$PH_mod= 1
##$PKNL= yes
##$PPARMOD= 0
##$PSCAL= 0
##$PSIGN= 0
##$REVERSE= no
##$SF= 81.014009
##$SI= 65536
##$SIGF1= 159.3651
##$SIGF2= -187.1042
##$SINO= 113.3802
##$SIOLD= 16384
##$SREGLST= <1H.CDCl3>
##$SSB= 0
##$STSI= 65536
##$STSR= 0
##$SW_p= 40650.406504065
##$SYMM= 0
##$S_DEV= 0
##$TDeff= 32768
##$TDoff= 0
##$TI= <>
##$TILT= no
##$TM1= 0
##$TM2= 0
##$TOPLEV= 0
##$USERP1= <user>
##$USERP2= <user>
##$USERP3= <user>
##$USERP4= <user>
##$USERP5= <user>
##$WDW= 1
##$XDIM= 65536
##$YMAX_p= 528080697
##$YMIN_p= -31908971
$$ End of Bruker specific parameters
$$ ---------------------------------
##NTUPLES= NMR SPECTRUM
##VAR_NAME=  FREQUENCY,     SPECTRUM/REAL,   SPECTRUM/IMAG
##SYMBOL=    X,             R,               I
##VAR_TYPE=  INDEPENDENT,   DEPENDENT,       DEPENDENT
##VAR_FORM=  AFFN,          ASDF,            ASDF
##VAR_DIM=   65536,         65536,           65536
##UNITS=     HZ,            ARBITRARY UNITS, ARBITRARY UNITS
##FACTOR=    0.620285442955139, 1,           1
##FIRST=     20137.2065510759, 0,            0
##LAST=      -20513.1999529892, 0,           0
##MIN=       -20513.1999529892, -31908971,   0
##MAX=       20137.2065510759, 528080697,    0
$$ Real data points
##PAGE= N=1
##DATA TABLE= (X++(R..R)), XYDATA
$$ [...]
37364a31604r8628J13261K56568K48619J13247j76247n51282o64493k52861L25702
37354h17718M31120J08176P9668N25161O21208j58120r84592p54774K30700O38727
37344h0444j225p38103o67242j13083N3212l04016n39487k42233K27745L28748
37334b076128J18361J10307M50371O72508M11614q6189m46669o77616p76825m02370
37324b702636M07834P68282J10822o93588n05909K23966J47506p16395j019785
37315c979903l80109Q1527k49778o41527n91652n43276n35303P1308R30529P11223
37305e126961m80390p72730L76174J016344j210r30685j69745R02592M60488m47380
37295e173503J29553J408343J236342j21351o56156j96441j70044m13305M98889
$$ plain form
37364 -131604 -230232 -116971 139597 388216 501463 325216 -226066 -890559 -1143420 -817718
37354 -817718 -386598 -278422 -198754 326407 947615 789495 -195097 -949871 -719171 -80444
37344 -80444 -81669 -819772 -1487014 -1600097 -1546885 -1850901 -2390388 -2632621 -2404876 -2076128
37334 -2076128 -1957767 -1847460 -1397089 -724581 -312967 -399156 -845825 -1523441 -2300266 -2702636
37324 -2702636 -2294802 -1526520 -1415698 -2109286 -2615195 -2391229 -2243723 -2960118 -3979903
37315 -3979903 -4360012 -4278485 -4528263 -5169790 -5761442 -6304718 -6840021 -6768713 -5838184 -5126961
37305 -5126961 -5607351 -6380081 -6003907 -4987563 -4988773 -5919458 -6089203 -5186611 -4726123 -5173503
37295 -5173503 -5043950 -3635607 -2399265 -2520616 -3176772 -3373213 -3543257 -3956562 -3457673
37286c457673J961906J690527l97513j730259j029181J22286K90000R7023L48014
37277b104870O69737P85535R64634P25407o11719j817845r09205J227233J474263
37268D03170n39699j540872O2796J565358O58343p41080j07806J247537O90068
37259A697815j038821j207643K81462J105304M83036k35626m23583p17636r89547
37250a045239m33113M44812L44823m04627k73427O71012P45715l96659j091720
37241a438423m03253N09725M35653j74281k55294L93980J214919J466394N61444
37232B310864j123141j938289p82160J000708J124111m00443j376880q04926m6749
37223b036905j79896l43399L32382J056665R08853M81869N96540O51506k22177
$$ plain form
37286 -3457673 -1495767 194760 -202753 -1933012 -2962193 -2839907 -2549907 -2452884 -2104870
37277 -2104870 -1435133 -649598 315036 1040443 428724 -1389121 -2298326 -1071093 403170
37268 403170 -136529 -1677401 -1614605 -49247 609096 -131984 -239790 1007747 1697815
37259 1697815 658994 -548649 -267187 838117 1321153 1085527 661944 -55692 -1045239
37250 -1045239 -1478352 -1033540 -688717 -1093344 -1366771 -695759 49956 -346703 -1438423
37241 -1438423 -1841676 -1331951 -896298 -1070579 -1325873 -931893 283026 1749420 2310864
37232 2310864 1187723 -750566 -1532726 -532018 592093 191650 -1185230 -1990156 -2036905
37223 -2036905 -2216801 -2560200 -2227818 -1171153 -262300 219569 816109 1467615 1245438
37214A245438j320496j268891j82119N63684M01230M8759M0659Q4792K7349K86557
37204g3038Q93689J012995O0308j251915j672285r69926r5757J86751J78693M88856
37194a241629R75954J026098N54283J2311m50043r97469j290989o82436M92185
37185a601735R07906J17467o40023l02064M07128L22839k02984j30723K59066
37176h63123q6767q60720o62289O31117J535948J214257L95989k18946p52677
37167C32789r40323l2151J335086J119814j043284k533951j181111J454983K218890
37158G30742P22103o45545m89487J58062K03787L5375J03300j26655q49613j069694
37148a227625k01430O66823L47848n29372n40508K35643M44831k45101o03134
$$ plain form
37214 1245438 -75058 -1343949 -1526068 -962384 -561154 -512395 -471736 -386944 -359595 -73038
37204 -73038 820651 1833646 1893954 642039 -1030246 -2000172 -2095929 -1909178 -1730485 -1241629
37194 -1241629 -265675 760423 1314706 1327017 876974 -120495 -1411484 -2093920 -1601735
37185 -1601735 -693829 -576362 -1216385 -1518449 -1111321 -788482 -991466 -1122189 -863123
37176 -863123 -949890 -1810610 -2472899 -1841782 -305834 908423 1304412 1085466 332789
37167 332789 -607534 -639685 695401 1815215 771931 -1762020 -2943131 -1488148 730742
37158 730742 1452845 807300 317813 475875 679662 715037 818337 691682 -157931 -1227625
37148 -1227625 -1429055 -762232 -414384 -943756 -1484264 -1248621 -803790 -1048891 -1652025
37139a652025J59032J165533J264985O30387J79567J00074j54885p61442j239541
37130c08315j161309n43377L40907J017595R04257j6552p97864n19200M48908
37121f34950R50597O85238L68684K80074j18708q16119q55614j0572M28940l94164
37111a16594j292054p59224N60360Q07664j90659p88360k02944N26118N83500
37102h72193N88989J030010J068155l694j315516j612025r81329k54511M71911
37093a880203J410125J865747R88292n41129j077088k88346N15398M86316K19623
37084A698735K02315k12150j336446j909992p24487J212751J669019J90441j286378
37075d96192j070898K40025R15272L51939n90511r45119n17633L30252J065063
$$ plain form
37139 -1652025 -1492993 -327460 937525 1567912 1747479 1847553 1692668 931226 -308315
37130 -308315 -1469624 -2013001 -1672094 -654499 249758 233206 -564658 -1083858 -634950
37121 -634950 315647 1000885 1369569 1649643 1530935 714816 -140798 -151370 277570 -116594
37111 -116594 -1408648 -2167872 -1607512 -799848 -990507 -1778867 -1981811 -1455693 -872193
37102 -872193 -283204 746806 1814961 1811267 495751 -1116274 -2097603 -2352114 -1880203
37093 -1880203 -470078 1395669 2383961 1842832 765744 477398 992796 1479112 1698735
37084 1698735 1901050 1688900 352454 -1557538 -2282025 -1069274 599745 790186 -496192
37075 -496192 -1567090 -1327065 -411793 -59854 -650365 -1595484 -2113117 -1782865 -717802
37066g17802J179507N38785l88924r48255r46412o91296m99430l96550j91883
37057c062260L22072J064255J471421J007779M5058l53247J04622M17879j13430
37048I04149n83735J36439J347010J332034O263q87469m24699K84611R5935m75291
37038A735247m65791q4776j0951r1307P3733P2410n59375j180839r11760j52106
37028a575515L4958l24506k98676K37119M36070N4683j05095L97628Q93338O85309
37018D35313N3156k62102m316M79619O66660K85229l48143n30109r7759J77383
37008H54931k87431q20475m44825M91468P87906L01302N4820L82665M15068j86310
36998A549119m27762K82698Q51255R4904j240750j376551j9194J271290J231999
$$ plain form
37066 -717802 461705 1000490 611566 -336689 -1283101 -1974397 -2473827 -2870377 -3062260
37057 -3062260 -2740188 -1675933 -204512 803267 848325 495078 599700 1017579 904149
37048 904149 320414 456853 1803863 3135897 3142160 2254691 1829992 2114603 2210538 1735247
37038 1735247 1269456 1184680 1173729 1082422 1156155 1228565 669190 -511649 -1423409 -1575515
37028 -1575515 -1540557 -1865063 -2163739 -1926620 -1490550 -1435867 -1540962 -1143334 -249996 435313
37018 435313 488469 226367 222051 701670 1368330 1653559 1305416 775307 677548 854931
37008 854931 567500 -252975 -697800 -206332 581574 882876 937696 1320361 1735429 1549119
36998 1549119 1121357 1404055 2255310 2350214 1109464 -267087 -286281 985009 2217008
36989B217008L35639k31399j89852j61355m64124o28953j97671N07821P85704
36980A972818M86309Q6490r7481k30503m01515l48387j2101K12637J37270Q2977
36970A888514J09836k95484j108480j186240J56257J641198J424311l03870j479180
36961H46862r19312L67733Q25355J40380r33692j555216j229407q8588R46424
36952a599461R71543K18756l05291k49699j21143j35711N7113M42777N37449L35516
36942A51849K70959J97738l36757p87240j30875J107120J130542l09517j259891
36933C3928n78301L33335N2342n00328N2866R15750N11265o43984p66419J73329
36923d16217N76717O7044r6062M54452M92600m44672j034862m11567K89244j69171
$$ plain form
36989 2217008 2552647 2321248 2131396 1970041 1505917 876964 679293 1187114 1972818
36980 1972818 2459127 2545617 2448136 2217633 1816118 1467731 1455630 1668267 1805537 1888514
36970 1888514 1998350 1702866 594386 -591854 -435597 1205601 2629912 2326042 846862
36961 846862 -72450 295283 1120638 1261018 327326 -1227890 -2457297 -2545885 -1599461
36952 -1599461 -627918 -409162 -714453 -964152 -1085295 -1221006 -1163893 -721116 -183667 151849
36942 151849 422808 620546 283789 -503451 -634326 472794 1603336 1293819 33928
36933 33928 -544373 -211038 -158696 -659024 -606158 309592 820857 176873 -589546 -416217
36923 -416217 160500 227544 131482 585934 1078534 633862 -401000 -812567 -523323 -692494
36913f92494j010027o81430O00369J068434k8707j361886j292079J45157J482344
36904a770319J580742O47286l43859p24520m66487J24742N96929M43888l92747
36895c04345j107035p46880M77987J236789P23966l50764q10433m34696J73079
36886a142332N65377O60110M13616o4087l78267l52999l03821l75482j70278M08568
36876g39595O39960J06674l58273J10763Q36325N18802o37752j161158n84864
36867a269118K1333j200M1329O11170Q50885P0167p94679m73011N81011Q03106
36857D40993o0990n52410K29249J185267Q13171n56381j191181l94352O09410
36848E22776N35798j81188k73050L15659M04590m65416j213959q07364K15762
$$ plain form
36913 -692494 -1702521 -2383951 -1783582 -715148 -743855 -2105741 -3397820 -3252663 -1770319
36904 -1770319 -189577 457709 113850 -610670 -1077157 -952415 -355486 88402 -304345
36895 -304345 -1411380 -2158260 -1680273 -443484 280482 -70282 -880715 -1315411 -1142332
36886 -1142332 -576955 83155 496771 432684 54417 -298582 -602403 -977885 -1148163 -739595
36876 -739595 -99635 7039 -351234 -240471 595854 1114656 476904 -684254 -1269118
36867 -1269118 -1247785 -1248985 -1207656 -596486 254399 324566 -470113 -943124 -362113 440993
36857 440993 380003 -172407 56842 1242109 2055280 1498899 307718 -86634 522776
36848 522776 1058574 877386 604336 919995 1324585 859169 -354790 -1162154 -946392
36839i46392N21558k15061j000895q28953K32872J193047J094859m4439j122988
36830a116392j049415J518Q63756R18712O53240N30504K43997m02059p74080l48807
36820d79026L26864M46467J32140j7230M427r9871r4442L34094P07783L82565
36810A643771k90030m70006j96529j47084k84081L8296P06829Q47485K95689j19649
36800B024691Q963Q4006l26914p58827p27865m72000l50722k37825M5707L05771
36790d05015L52764K79041J14163k56270o60375p11135m29490j80575M3447N08095
36780a345350Q73078M38535n11805p13680K10510R40982L22338q43510r24481
36771a553383J76297R66446N40568l09241m34724Q9217L20827r0738n36692m83649
$$ plain form
36839 -946392 -424834 -639895 -1640790 -2469743 -2236871 -1043824 51035 6596 -1116392
36830 -1116392 -2165807 -2164289 -1300533 -381821 271419 801923 1045920 643861 -130219 -479026
36820 -479026 -152162 294305 426445 409215 413642 313771 219329 553423 1261206 1643771
36810 1643771 1353741 883735 687206 540122 256041 294337 1001166 1848651 2144340 2024691
36800 2024691 2033654 2117660 1790746 1031919 304054 -167946 -518668 -756493 -710786 -405015
36790 -405015 -52251 226790 340953 84683 -575692 -1286827 -1716317 -1896892 -1853445 -1345350
36780 -1345350 -472272 -33737 -545542 -1259222 -1048712 -107730 214608 -628902 -1553383
36771 -1553383 -1377086 -410640 129928 -179313 -614037 -524820 -203993 -294731 -831423 -1315072
36761a315072j67573O2818M72276J301224J799075R61129p36463j528917p33168
36752A15329K40214J0119p79889p35887o883K10670j54080o1711O47108R29484
36742D14474L42438k98663l54440j73461j42035p9274Q4519O3881q6371q64J73857
36731e5939L2224p1835M59383J019057M59575p34292q17325L24860P49588l29287
36721A036009j096270j73557R67113M22665j004027j209523j35238N22780K17071
36712d52977k9038K19683K67774p2045o5476M87258Q23839N08711k2036l53894
36702A311799m75837k38468M91067J101870P42357l75727j161127j122640o70547
36693c97253p2316O75852R74834O1101j392875j549418J03116J763364J637275
$$ plain form
36761 -1315072 -1482645 -1419827 -947551 353673 2152748 3113877 2377414 848497 115329
36752 115329 355543 365662 -414227 -1150114 -1156997 -946327 -1100407 -1162118 -515010 414474
36742 414474 756912 458249 103809 -69652 -211687 -290961 -206442 -142561 -228932 -229796 -55939
36731 -55939 -23715 -95550 363833 1382890 1842465 1108173 290848 615708 1365296 1036009
36721 1036009 -60261 -233818 733295 1155960 151933 -1057590 -1192828 -670048 -452977
36712 -452977 -482015 -262332 5442 -66603 -132079 355179 1179018 1687729 1665693 1311799
36702 1311799 835962 597494 1088561 2190431 2932788 2557061 1395934 273294 -397253
36693 -397253 -469569 206283 1181117 1242218 -150657 -1700075 -1596959 166405 1803680
36684A803680K38021n85165j64529N00935M00346l33088r12603q68823l89691
36675c10917j5695n6908k19084M2297P24372J144974P98387J5115n26562o60033
36665I35946p02259p54667n54901r2744J30454j80789m51422J28591J303890J762931
36655A525030Q15785n30199q42162j76073K01658k02685n45839k09749K61309
36646B97075K78289J78342L49498L35520k75307q56562o58316p5858O7854n4304
36636d13769K41417O86478M30519l27881m83146J44677M85929K8135l43537J25486
36626E74308P84875O04808k96333r49317q77374m31211n8174J61197L22741M36518
36616B72038L88310O2984m30665p22934n81797k46715q1954n8016M8432J63181
$$ plain form
36684 1803680 2041701 1456536 1292007 1792942 2193288 1860200 947597 78774 -310917
36675 -310917 -326612 -383520 -602604 -560307 164065 1309039 2107426 2122541 1595979 935946
36665 935946 233687 -520980 -1075881 -1168625 -1038171 -1218960 -1670382 -1541791 -237901 1525030
36655 1525030 2340815 1810616 968454 792381 994039 791354 245515 35766 297075
36646 297075 575364 753706 1103204 1438724 1163417 306855 -351461 -427319 -359465 -413769
36636 -413769 -172352 514126 944645 616764 133618 278295 764224 792359 448822 574308
36626 574308 1359183 1963991 1667658 718341 -159033 -590244 -648418 -487221 -164480 272038
36616 272038 660348 723332 292667 -430267 -1012064 -1258779 -1340733 -1398749 -1350317 -1187136
36606a187136J47355K88535Q43619J231932N91918p54065j345257m75875P81685
36597A22711R98422J72195n68509n64443j89632k0760j07338j18423J85987P01015
36587F11225J001928O92215q0360n75737j97605P39779J213460N51243q07402
36578C148746j704339j419420l60467M59174N13394J23892j88163l09874l69314
36569a06371l63926k44490q7580P6343L22339M98546K43498l44945n38924M0331
36559e05179P24898O82503R5595k40880j51785q9434j42806L7066L60918K69824
36549A040720k72727n72174k41254K38295K83542l4864l00509l31921j68163J37575
36539b21480M41002M91774J94470k51796n01738k72533L86316Q64668M27275p72445
$$ plain form
36606 -1187136 -1039781 -751246 92373 1324305 1916223 1162158 -183099 -658974 122711
36597 122711 1121133 1293328 724819 160376 -29256 -50016 -157354 -275777 -89790 611225
36587 611225 1613153 2305368 2225008 1649271 1451666 2191445 3404905 3956148 3148746
36578 3148746 1444407 24987 -335480 123694 637088 760980 572817 262943 -106371
36569 -106371 -470297 -714787 -802367 -726024 -403685 94861 338359 -6586 -545510 -505179
36559 -505179 219719 902222 997817 756937 605152 515718 372912 409978 770896 1040720
36549 1040720 767993 195819 -45435 192860 476402 441538 141029 -190892 -359055 -221480
36539 -221480 219522 711296 905766 653970 152232 -120301 266015 1130683 1557958 785513
36529G85513j566882j153257j11346N49227P52643R18427P80099j35117j172437
36520c53130j060440K11659J251472J164159M99403J09607J12018K39824L00365
36511B474937Q3104l80753n05186p247K06304p08710j699063r88157R18082J495856
36501H89167j3170j259694l06099J490910J660734J33715j168099j170177l79869
36492a22582M75313J011847R02486K74185r5098O2809q1577r06550j264969k68956
36482a3092R08714O50544n36476q72931j22354L48295R348k06711K94225R85549
36472A445111J305047J130010K84977j017778j532210m10673R89599O30332j007560
36463A816855j426071O091J078486L48931o78371k71718P55640P48069L0618N959
$$ plain form
36529 785513 -781369 -1934626 -2045972 -1496745 -744102 174325 954424 819307 -353130
36520 -353130 -1413570 -1201911 49561 1213720 1713123 1822730 1934748 2174572 2474937
36511 2474937 2558041 2177288 1672102 1664855 1871159 1162449 -536614 -1524771 -606689 889167
36501 889167 875997 -383697 -689796 801114 2461848 2595563 1427464 257287 -122582
36492 -122582 352731 1364578 2267064 2541249 2446151 2508960 2427383 1520833 255864 -13092
36482 -13092 895622 1546166 1009690 136759 14405 362700 372048 165337 459562 1445111
36472 1445111 2750158 3880168 4165145 3147367 1615157 1204484 2194083 2824415 1816855
36463 1816855 390784 396875 1475361 1824292 1145921 874203 1629843 2377912 2408530 2414489
36453B414489N44017L79754m57080o23822K19080Q40964M45752k14310k24613
36444C324231J22884J6231n55811q71168n31093R9202M38336L35989J10884J14498
36434B604183L96017P64458R74668P55472n9247j125993j582728r33817J92704
36425A985717P22652N03263L70102Q13674J259168R06945k28925j355520j617203
36416C359873p50771N44420R93265Q6883j106730j207574l89586L6193k36586
36407A329387j68606O12535J016385L84079k81355k94N36993K64012l91080l73984
36397B928072J01336J29823r433O81865J804828J709874j101j660498j711206
36388C973560m77482P36237J231109J029177L43627l89652n89191j77515L05590
$$ plain form
36453 2414489 2958506 3338260 2881180 2257358 2476438 3317402 3763154 3548844 3324231
36444 3324231 3447115 3463346 2907535 2036367 1505274 1604476 2042812 2378801 2489685 2604183
36434 2604183 3000200 3764658 4739326 5494798 5435551 4309558 2726830 1793013 1985717
36425 1985717 2708369 3211632 3581734 4395408 5654576 6561521 6332596 4977076 3359873
36416 3359873 2609102 3153522 4146787 4233670 3126940 1919366 1529780 1565973 1329387
36407 1329387 1160781 1773316 2789701 3173780 2892425 2892131 3429124 3693136 3302056 2928072
36397 2928072 3029408 3159231 3149798 3831663 5636491 7346365 7345264 5684766 3973560
36388 3973560 3496078 4232315 5463424 6492601 6836228 6446576 5857385 5679870 5985460
36379E985460M92674N06262L56606j49880o56672l82278N65189J019422N29744
36370H266527K26033R77229J729042J051737l82405n77988P26680J576844P50079
36361A4343778m59774l03298Q68456J382146Q07154L30001P76538J541362J710145
36352B0996508J284289Q86209R09894J363779K063803K622303K658442K358639
36344C5143866K463717L385740M691667N745404O431219O908364P204753P621083
36336G9595813R020632J1887948J5360346J8053447J9752386K1444215K3700947
36329A98815734K5910413K7107195K6473161K2810602J4925927L523957q156119
36322C11410870j6769740k1609174k4122447k5273495k4646997k2075654j8777779
$$ plain form
36379 5985460 6478134 6984396 7341002 7191122 6534450 6152172 6717361 7736783 8266527
36370 8266527 8492560 9469789 11198831 12250568 11868163 11290175 12016855 13593699 14343778
36361 14343778 13884004 13580706 14449162 15831308 16638462 16968463 17745001 19286363 20996508
36352 20996508 22280797 23167006 24076900 25440679 27504482 30126785 32785227 35143866
36344 35143866 37607583 40993323 45684990 51430394 57861613 64769977 71974730 79595813
36336 79595813 88616445 100504393 115864739 133918186 153670572 175114787 198815734
36329 198815734 224726147 251833342 278306503 301117105 316043032 319566989 311410870
36322 311410870 294641130 273031956 248909509 223636014 198989017 176913363 158135584
36315A58135584j6249662j4759288j3523870j1923791j0010541q117679o526382
36308G7024371n455875m931954m566984l814979k675024j903957k145008k920761
36300D8609829l044952k232499j634828k176603k987014k575193j259326r42878
36292C1756536k199913l153045k145752j91664N64345j74865j013849j331843
36284B2109950j740879k235382j791292k47356R88479Q11728k07016r73297j252314
36275A5462621j184393n54221M88500R02973O3804j044005j020585J9353P65764
36266A3899811O23071K17446J28926J61769l495k66718m33127m78387l39142N0097
36256A3560251M09921K91131k79205p26479n99894J4272P64931J345870J478761
$$ plain form
36315 158135584 141885922 127126634 113602764 101678973 91668432 83550753 77024371
36308 77024371 71568496 66636542 62069558 58254579 55579555 53675598 51530590 48609829
36300 48609829 45564877 43332378 41697550 39520947 36533933 33958740 32699414 31756536
36292 31756536 29556623 26403578 24257826 24066162 24630507 24455642 23441793 22109950
36284 22109950 20369071 18133689 16342397 16095041 17083520 17895248 17688232 16714935 15462621
36275 15462621 14278228 13724007 14212507 15115480 15179284 14135279 13114694 13134047 13899811
36266 13899811 14522882 14740328 14869254 15031023 15027528 14760810 14327683 13849296 13510154 13560251
36256 13560251 13970172 14261303 13982098 13255619 12655725 12669997 13434928 14780798 16259559
36247A6259559R63081o0068j033980j296401n57499P31483J530338J152030J45267
36238A7833810l02040k326l0361r21274j577816r12222K34276J74887j020345
36229A3476589j535405m80998Q96445J085815J46623r11104j515422j585485j067560
36220H509498k14642K86987J62385j056K76108N22398Q2731p91001j282722j029980
36210F520706k38206P37070J348724R75441j92236r02099k96969Q12112R94111
36201I758654J31368o55945p34307n41948n15774m65216j70376K26136O07852
36192G640444J002266J221866J003375N18678J68461L445p313N23449J688484
36183A3763155K445288J828711Q55593J556465L858959N297682M617678L802092
$$ plain form
36247 16259559 17222640 17162572 16128592 14832191 14274692 15006175 16536513 17688543 17833810
36238 17833810 17531770 17529444 17499083 16577809 14999993 14087771 14322047 14496934 13476589
36229 13476589 11941184 11460186 12356631 13442446 13589069 12677965 11162543 9577058 8509498
36220 8509498 8294856 8581843 8744228 8743172 9019280 9541678 9624409 8833408 7550686 6520706
36210 6520706 6282500 7019570 8368294 9343735 9151499 8249400 7952431 8764543 9758654
36201 9758654 9890022 9234077 8499770 7957822 7442048 6976832 6806456 7032592 7640444
36192 7640444 8642710 9864576 10867951 11386629 11555090 11558535 11551222 12074671 13763155
36183 13763155 16208443 18037154 18892747 20449212 24308171 29605853 34223531 38025623
36175C8025623N093974P585417Q774030Q500043Q914200J0632489J1243636Q424481
36167A07193893K928423k525364o238369q383022r639501j0159295r784861q553795
36159E4838109o853684n315303m432775m106519l777369l181131k673561k586055
36151B1911712k609763k213237j473322j041696j254106j599827j269027j56128
36143A0294606Q41060O73146o59951j920097j844233m78916R15600J241454N65080
36134I627749k56238n91205m81448l02874k77054l40718l46800k64644j34872
36125F631896O9263L26340L28425k79462j221626j535790o50502O81493J077006
36116E427043J60936r87806j165101l84916L53879L31846j96346m88793k37270
$$ plain form
36175 38025623 43119597 50705014 59479044 67979087 76893287 87525776 98769412 107193893
36167 107193893 110122316 107596952 101358583 92975561 83336060 73176765 63391904 54838109
36159 54838109 47984425 42669122 38236347 34129828 30352459 27171328 24497767 21911712
36151 21911712 19301949 17088712 15615390 14573694 13319588 11719761 10450734 10294606
36143 10294606 11135666 11808812 11148861 9228764 7384531 6905615 7821215 9062669 9627749
36134 9627749 9371511 8780306 8298858 7995984 7718930 7378212 7031412 6766768 6631896
36125 6631896 6701159 7027499 7355924 7076462 5854836 4319046 3668544 4350037 5427043
36116 5427043 5587979 4600173 3435072 3050156 3404035 3735881 3539535 3050742 2813472
36107B813472J27842N4906l50109m42267J6756M37178K26027l21230m27765Q7957
36097B222767O64737Q00841M90133l5410m55610l55774L12007Q13490L63721p04288
36087D116614j238966q35400k87521k31873j98924M72261J447166J761867J014727
36078F019951k62520j155893j060545j92514M67982K37516k60078J02323J131342
36069E027564J416244N36062k03678O7524L34555m21954j234931o98273M99835
36060E322948N83863l37251m93886M34366P17154m10784j274777l92795J120316
36051E269154J219929j35765j211262j001767j46112L95604M21571K15025k197
36042E024180j79660l79718o25235p15409m78206k30391m13066o72654j44382
$$ plain form
36107 2813472 2941314 2996220 2646111 2203844 2220600 2657778 2883805 2562575 2134810 2222767
36097 2222767 2887504 3688345 4178478 4143068 3687458 3331684 3643691 4457181 4820902 4116614
36087 4116614 2877648 2042248 1754727 1522854 1323930 1796191 3243357 5005224 6019951
36078 6019951 5757431 4601538 3540993 3348479 3816461 4053977 3793899 3896222 5027564
36069 5027564 6443808 6979870 6776192 6843716 7178271 6756317 5521386 4823113 5322948
36060 5322948 5906811 5569560 5075674 5510040 6227194 5816410 4541633 4148838 5269154
36051 5269154 6489083 6353318 5142056 4140289 3994177 4389781 4811352 5026377 5024180
36042 5024180 4844520 4464802 3839567 3124158 2645952 2415561 2002495 1329841 1185459
36033A185459J016209J371647J60519j369734j534998m47069L92822K68591j24273
36024I19173l7022M07171O81615M42739l53512j250728j342126k51572J085748
36015C01486J397411O74552k4365j75947j86602k51966J0506N55700O25560q5718
36005B840617q61941j007602o72031k25755L47857R32600R78178L59090j82149
35996B508864j24739k1120n02154j074233q31647Q5246P13024O73556M24018K60483
35986B111298J3563k57092j39808M04074Q92013J026415R20581N62376k24576
35977E308844j126998j383258p70171O7379N31999O79570O52003K94505j86328
35968D067545L174J039074J706552Q39775q52094j532115p20921J50071q5220
$$ plain form
36033 1185459 2201668 3573315 3733834 2364100 829102 382033 774855 1043446 919173
36024 919173 882151 1289322 1970937 2413676 2060164 809436 -532690 -784262 301486
36015 301486 1698897 2373449 2349084 2173137 1986535 1734569 1745075 2300775 2926335 2840617
36005 2840617 1978676 971074 299043 73288 421145 1353745 2331923 2691013 2508864
35996 2508864 2384125 2363005 1860851 786618 -45029 40217 753241 1426797 1850815 2111298
35986 2111298 2124861 1867769 1727961 2132035 3024048 4050463 4971044 5533420 5308844
35977 5308844 4181846 2798588 2028417 2095796 2627795 3307365 3959368 4253873 4067545
35968 4067545 4070719 5109793 6816345 7656120 6804026 5271911 4550990 4701061 4615841
35959D615841p64059o70245N3716K75624l15151q31956n87305L6602L25321J48118
35949B286506j85696m64964n98004m69158j45593L3561j04353k72393j75411r352
35939a04857j44990n06485o62480m16469N7166N31177P95730N91610j7479l45008
35929b22085J89892J036267R79243j55237j057815o57248M34100Q77521M34891
35920A859529m3618j10949j72890m56136n32359j85833O4292j94503n14438k60386
35910e47291L70720O15285K20717k97628m15796j63812Q5405M5521k84257n84210
35900i55346m12357K82336Q91341P21740j47447r13278r99115o00894j73961K08329
35890b098652O60003R47429O58930p9360n08884j25119N80863O28897k23475j116131
$$ plain form
35959 4615841 3851782 3181537 3235253 3510877 3195726 2363770 1776465 1813067 2138388 2286506
35949 2286506 2100810 1635846 1037842 568684 423091 456652 352299 79906 -95505 -104857
35939 -104857 -249847 -756332 -1418812 -1835281 -1778115 -1246938 -451208 140402 122923 -222085
35929 -222085 -32193 1004074 1983317 1828080 770265 113017 547117 1424638 1859529
35920 1859529 1815911 1704962 1532072 1075936 543577 357744 422036 227533 -286905 -547291
35910 -547291 -176571 438714 659431 361803 -53993 -217805 -132400 -86879 -371136 -955346
35900 -955346 -1367703 -1085367 -194026 527714 380267 -533011 -1532126 -2133020 -2306981 -2098652
35890 -2098652 -1438649 -491220 167710 88350 -420534 -545653 35210 664107 440632 -675499
35880f75499j108845k75788N17304O99584M13834k0395m35983n14960J18272J099155
35870a83321J296136K55100q71136p27757K83013N58257l08736r83952n18406
35861a200802L03255M32570J94112L89535O69973J49051q42251j020957r2907
35852a018421Q26856Q65455L58789n9535l01121m12165k51364J9179m5561l00162
35842c18050m9371O28859O38055l92889j151223m10149J062139J533718O86268
35833B227357k87223o14538o30672n73335l6927J018562J792984J714909J225277
35824E836394J024149J192789J526365K093797K834377L041746J985040m2002
35816A9492655j841110k551638k412985k165477j997381j459215m45459K16143
$$ plain form
35880 -675499 -1784344 -2060132 -1542828 -843244 -429410 -449805 -885788 -1400748 -1282476 -183321
35870 -183321 1112815 1367915 496779 -230978 52035 610292 301556 -682396 -1200802
35861 -1200802 -897547 -464977 -270865 118670 788643 937694 95443 -925514 -1018421
35852 -1018421 -191565 673890 1032679 973144 672023 259858 8494 27673 -17888 -318050
35842 -318050 -367421 261438 899493 506604 -644619 -1054768 7371 1541089 2227357
35833 2227357 1940134 1325596 694924 121589 84662 1103224 2896208 4611117 5836394
35824 5836394 6860543 8053332 9579697 11673494 14507871 17549617 19534657 19492655
35816 19492655 17651545 15099907 12686922 10521445 8524064 7064849 6619390 6835533
35808F835533l00334j454784j721608n95975O07850N57352k83969n78603k22018
35799B843444k50522r07165j225199p15927j56243k23075m52307j75446M06985
35790h55455P36362P42909N84223K01102l16108n53698m55951m98709p27562m51625
35780a594512N11581J168873P18347j97064m67761n2380L43194M30762K56378
35771A117418l39596j151015j202050p8539J000899P39276k32718l64803L46326
35762a64802N91568J09457o4493L24325L50172j45233r4618P74071J244512O50055
35752C575014r2857l20121p57988j719552j857296k54227J575045J536002n7840
35743A626180j045760m24652P57883J180788N55206o14705j418171r69688M92282
$$ plain form
35808 6835533 6535199 5080415 3358807 2762832 3370682 3928034 3644065 3065462 2843444
35799 2843444 2592922 1685757 460558 -255369 -411612 -634687 -1086994 -1262440 -855455
35790 -855455 -119093 623816 1208039 1409141 1093033 539335 83384 -415325 -1142887 -1594512
35780 -1594512 -1082931 85942 804289 607225 139464 87084 430278 861040 1117418
35771 1117418 777822 -373193 -1575243 -1653782 -652883 86393 -146325 -511128 -164802
35762 -164802 426766 536223 471730 796055 1146227 1000994 906376 1680447 2924959 3575014
35752 3575014 3482157 3162036 2404048 684496 -1172800 -1427027 148018 1684020 1626180
35743 1626180 580420 155768 913651 2094439 2649645 2034940 616769 -352919 139363
35734A39363J343816M82501j032115j437307p31273k04862j04831L85650J103252
35725e5806Q99363j46825n20343K27983O88574M6053n36858m3737O15751L26661
35715A500816k24819Q0434O05834L4836j118570j078320L58941J424979R45804
35706B529935l23059j233931j600730j487822n76517Q65271J491162M90052r70425
35697h16064j064692K30916J118979M74202o82270o99559M20669J090271L35467
35688D07919r01537j055119m481Q56174N23596l88549o36347J4141O79952O10410
35678A06159k0695n18140m25525J46493O60270O18060P3210m35051n94632o49505
35668a039356p42484m18690N92459J479667J140577j98369j100390q21733j56630
$$ plain form
35734 139363 1483179 1965680 933565 -503742 -1235015 -1439877 -1544708 -1159058 -55806
35725 -55806 843557 696732 176389 404372 1092946 1138999 602141 558404 1174155 1500816
35715 1500816 1275997 1356431 1962265 1997101 878531 -199789 159152 1584131 2529935
35706 2529935 2206876 972945 -627785 -2115607 -2692124 -1826853 -335691 154361 -816064
35697 -816064 -1880756 -1649840 -530861 -56659 -738929 -1438488 -1017819 72452 407919
35688 407919 -493618 -1548737 -1553218 -697044 -173448 -561997 -1198344 -1184203 -504251 106159
35678 106159 85464 -432676 -858201 -711708 -51438 566622 639832 204781 -389851 -1039356
35668 -1039356 -1781840 -2200530 -1608071 -128404 1012173 813804 -286586 -1108319 -1264949
35659a264949j5921j24124J71120N94157M46840k0892J59157J120885J824840
35650B891113J500025O40021J90824L57490O78598Q26645P79556M49433k78025
35641H035680j137407j561203j272589n18945L29407J072680J458272J096762
35633G502657P908r93583j012992j97709L80273J30738l12684j29612M32615N00297
35623F307908m4107m45449k97524j4903J07236M22642J050729J255647M63860
35614H806039o37542q99283l19899M0374l35194q11875p37697l38509j21830o7902
35604D576682R1029K53232J25493k58592o27393q70148r78415q00033k66879K61060
35594A506036L12018n3023l06602k24143j87492m98941p22637j67782J002373
$$ plain form
35659 -1264949 -1280870 -1404994 -1233874 -639717 -192877 -213769 -54612 1066273 2891113
35650 2891113 4391138 5031159 5221983 5579473 6258071 7084716 7864272 8313705 8035680
35641 8035680 6898273 5337070 4064481 3545536 3874943 4947623 6405895 7502657
35633 7502657 7510565 6516982 5503990 5306281 5686554 5817292 5504608 5374996 5807611 6307908
35623 6307908 6263801 5818352 5520828 5505925 5613161 6035803 7086532 8342179 8806039
35614 8806039 8168497 7269214 6949315 6989689 6654495 5842620 5104923 4766414 4644584 4576682
35604 4576682 4667711 4920943 5046436 4787844 4160451 3290303 2311888 1511855 1244976 1506036
35594 1506036 1818054 1765031 1458429 1234286 1046794 547853 -174784 -342566 659807
35585F59807J659698J047241j17875m72130J53741N02085k40396j193418j127899
35576H70854l65860k02628p53575p58178K93824J228618J019041L44737L34973
35567B011806P01009M04873l84692m66638L48237P62691p6426j284665j501618
35558E14577o93128K3021l9235l92493j90805O20765J182294P85545p8280j89398
35548A542863O83718J196926K36858j268439j459774j90266Q14740N30721j49834
35539A937513k71155l10694q26292j030053j67093P62257L85777o63487o44387
35530h27614M47440J004449O72753P84125J533303J195353p41336j997105q38108
35521A233260R35620O19373j204061j750150m60159N51073K77623Q9694P43990
$$ plain form
35585 659807 2319505 3366746 3248871 2776741 2930482 3432567 3192171 1998753 870854
35576 870854 504994 302366 -451209 -1209387 -915563 313055 1332096 1676833 2011806
35567 2011806 2712815 3117688 2732996 2266358 2614595 3377286 3300860 2016195 514577
35558 514577 -178551 -155530 -194765 -587258 -778063 -157298 1024996 1810541 1732261 1542863
35548 1542863 2226581 3423507 3660365 2391926 932152 741886 1556626 2087347 1937513
35539 1937513 1666358 1355664 529372 -500681 -667774 94483 480260 -183227 -827614
35530 -827614 -380174 624275 1297028 2081153 3614456 4809809 4068473 2071368 1233260
35521 1233260 2168880 2788253 1584192 -165958 -626117 -75044 202579 292273 1036263
35512A036263R59186N4618n16035K34856Q96542J15606r39738o24657L23250K74893
35502A814784l04635Q4692R59983O61097m66541n80168K66212K46889o73997n09896
35492A498420Q93540J101077o67849j793884n14276J100370P18605m22274p0785
35483A842944R37910M11204j033297j053108J68800L16242q46585j141542N9943
35474c37489Q62052L38885r1631M04510O69545J16256n6748N02225J35240j675364
35464H67481k495641m68962K336507K601712M35329j134453n94101N28873M46640
35455B523385n89574j158427n68700N47657R95705L05606o13400n76520J18624
35446I84356P7326q70376j223559k70150O86133N44526J35524L99238N57042j79441
$$ plain form
35512 1036263 1995449 2050067 1534032 1768888 2665430 2781036 1841298 1216641 1539891 1814784
35502 1814784 1510149 1594841 2554824 3215921 2749380 2169212 2435424 2682313 2008316 1498420
35492 1498420 2391960 3493037 2825188 1031304 517028 1617398 2336003 1913729 1842944
35483 1842944 2780854 3192058 2158761 1105653 1274453 1590695 744110 -397432 -337489
35474 -337489 524563 863448 771817 1176327 1845872 1962128 1905380 2407605 2542845 867481
35464 867481 -1628160 -2097122 239385 2841097 3276426 2141973 1547872 2076745 2523385
35455 2523385 1933811 775384 206684 754341 1750046 2055652 1442252 865732 984356
35446 984356 1061682 191306 -1032253 -1302403 -616270 -71744 63780 463018 1020060 840619
35436H40619o92410J48206J070269K94583j254086j292051K3566M86032l40038
35427g15310o55444J46910N77708R4727J47237J214768J532308J75095j002943
35418A515056k69144J154858J138539l1084m72923J77582N59008j0394p27850
35409C033648q27591n41402m26921n96041o65781r0035J156473K043337J401727
35400D487414l04569j183070m56618M03994m2300j059053j121051l61988m9541
35391C13218l29598j90157O20761J212033J070153O34049K79392j04015m23483
35382C082353l54236j43814m36851j083497j060302P1963J371232J586950N96739
35373C630537n04292n52828M45781J135626K25470j712496k543066j186085Q63418
$$ plain form
35436 840619 148209 296415 1366684 1661267 407181 -884870 -861304 -375272 -715310
35427 -715310 -1370754 -1223844 -646136 -551409 -404172 810596 2342904 2517999 1515056
35418 1515056 1245912 2400770 3539309 3508225 3035302 3212884 3771892 3761498 3033648
35409 3033648 2206057 1664655 1237734 641693 -24088 -114123 1042350 3085687 4487414
35400 4487414 4182845 2999775 2543157 2947151 2904851 1845798 724747 362759 313218
35391 313218 -16380 -206537 414224 1626257 2696410 3330459 3609851 3505836 3082353
35382 3082353 2728117 2584303 2147452 1063955 3653 75616 1446848 3033798 3630537
35373 3630537 3126245 2573417 3019198 4154824 4380294 2667798 124732 -1061353 -197935
35364a97935J476576N59910l77205o18340o71801o90560j96384N60625O16725
35355D61611j7700k05499L69451O31829P3006k85436K42722O54898n7226j109262
35345G58394j153675l29752L10175N92465R37966R68597Q7113r41905p74630K20795
35335F75543K74238r22968j507942l34792J098784Q39494o31020j197228j39042
35326a844933J157323J370944P90293M14697N05366N54560J78993m24009p54022
35317A949212n38176m0322J79494j05066n48978p34878o15050k72240L10370Q75309
35307D59675Q25885J45282j57584N87179J338124N43314j428408k441003j408692
35298a536228M03219J371359J412752J106106L23669r87383j738508r52658N63790
$$ plain form
35364 -197935 1278641 1838551 1461346 843006 171205 -519355 -715739 -155114 461611
35355 461611 443911 238412 607863 1239692 1312698 1027262 1269984 1924882 1867656 758394
35345 758394 -395281 -725033 -414858 177607 1115573 2084170 2171283 1229378 454748 675543
35335 675543 949781 26813 -1481129 -1815921 -717137 122357 -508663 -1705891 -1844933
35326 -1844933 -687610 683334 1473627 1888324 2393690 2948250 3127243 2703234 1949212
35317 1949212 1411036 1370714 1550208 1445142 896164 161286 -453764 -726004 -415634 459675
35307 459675 1285560 1430842 1273258 1860437 3198561 3741875 2313467 -127536 -1536228
35298 -1536228 -1133009 238350 1651102 2757208 3080877 2093494 354986 -597672 -33882
35289c3882J261874J030919Q29809O58071k48818j364378j087232N94497J603712
35280C244572P32747o34638q18922k76141l22256p23841l25507O69112Q77162
35271B422288P687o64714k83400M45382M96058p6898m97136l86370n3853J3782
35261A422826l12528o26001l61756M40999R63707N75277k51472n13910k3110M39468
35251A753500L04024p8474j01384K26453M10800K16467m8514O892K82003K36563
35241C208330l93010j094760j105230l80405L53696N41817L25121N9000j27804
35232A386755j25732J80542M73429K05406m30447m82330L40554J026322O86622
35223C261121j40562m17891j37045K4790k1166R5298K42653L8200k63499j73296
$$ plain form
35289 -33882 1227992 2258911 3088720 3746791 3497973 2133595 1046363 1640860 3244572
35280 3244572 3977319 3342681 2523759 2247618 1925362 1201521 876014 1545126 2422288
35271 2422288 2429975 1765261 1481861 1927243 2423301 2346403 1849267 1462897 1409044 1422826
35261 1422826 1110298 484297 122541 563540 1527247 2102524 1851052 1337142 1314032 1753500
35251 1753500 2057524 1979050 1877666 2104119 2514919 2731386 2682872 2689764 2971767 3208330
35241 3208330 2815320 1720560 615330 234925 588621 1130438 1455559 1514559 1386755
35232 1386755 1261023 1441565 1914994 2120400 1689953 1207623 1548177 2574499 3261121
35223 3261121 3120559 2702668 2565623 2590413 2569247 2664545 2907198 2945398 2681899 2508603
35213B508603N0613j19253l53618Q419O00473N10823o0049q0257L83077J06036
35203C554867j115219j800942r35845N66008J309239J156718O87379N318q68089
35194B559434j225239m33965R23946J581811J059582m514p58501q69325n49687
35185B283542k28567q9130J14638N19078O41129K1975q45645j127001r90036j159555
35175h59572j250885j64186J592918J859669l7028j858400j464403K68021J094094
35166h19772O53387K21520K01283n9996m52612j38566O99014R20877K85061l34133
35156A176063n63500p76085p32245K54163J555164J456662k72519j688806j323444
35147i14547n3912N48656L69513J84378J19185j02485k24088N6007K88451N324
$$ plain form
35213 2508603 2559216 2439963 2086345 2094764 2695237 3206060 3146011 3065754 3448831 3554867
35203 3554867 2439648 638706 -297139 268869 1578108 2734826 3422205 3427523 2559434
35194 2559434 1334195 900230 1824176 3405987 4465569 4461055 3702554 2833229 2283542
35185 2283542 2054975 1965845 2080483 2599561 3240690 3262665 2417020 1290019 299983 -859572
35175 -859572 -2110457 -2274643 -681725 1177944 1140916 -717484 -2181887 -1913866 -819772
35166 -819772 -166385 55135 256418 196422 -256190 -394756 304258 1225135 1510196 1176063
35156 1176063 612563 -163522 -895767 -641604 913560 2370222 2097703 408897 -914547
35147 -914547 -968459 -419803 -50290 134088 253273 150788 -73300 -17293 271158 276482
35137B76482l28774j11874J99427k03332r71795r65899M260Q71897Q23676K20561
35127a85371j86929k40011k54935l86069m29745j20108N01098J017190J048239
35118G63359P08418L99684K14333k6677k29479j80983j89805o50288r33943J68
35108a25213J565685J728105N1452j184853l38818Q63719Q4527j611732j387536
35099c54664N30592J065996n48996j433771K7045J403677M16065j111265l98772
35090d04093J448428J263998q02871j498998J76543J458834L99489j184537q35875
35081B0918Q52920J540069N90563n84749p92668j72809M95775N43096j95010j046492
35071A251613j020247j12152N72606M09153N6021J35649J91899k25699m98709
$$ plain form
35137 276482 -52292 -164166 35261 -168071 -1139866 -2105765 -2101505 -1229608 -405932 -185371
35127 -185371 -372300 -612311 -867246 -1253315 -1683060 -1803168 -1302070 -284880 763359
35118 763359 1471777 1871461 2085794 2059117 1829638 1648655 1458850 808562 -125381 -125213
35108 -125213 1440472 3168577 3220029 2035176 1696358 2560077 2644604 1032872 -354664
35099 -354664 175928 1241924 692928 -740843 -713798 689879 1105944 -5321 -404093
35090 -404093 1044335 2308333 1505462 6464 183007 1641841 2041330 856793 20918
35081 20918 873838 2413907 3004470 2419721 1627053 1454244 1950019 2493115 2298105 1251613
35071 1251613 231366 119214 691820 1100973 1156994 1292643 1484542 1258843 760134
35062G60134k9065N06967K01994n04596n62369n2229J24367j32107j71953r860
35052A31283l01104r49955j043806l15471M36204N48420J69203l26756o57175
35043b309157l85754O18423J472449J114698j11687q32255o12947k73775j62871
35034a482876L18385J077153R12541m12955j243026l86475Q90000P18089m94737
35025a03901p59693M20070J420202R68704k53459q71260n47789O8087L54435J57543
35015H52939l11546o38846n48574k58079k15049m38775n03136k35947J6778J757
35005b278478n823K80847N15245Q9565q57012j293437m98652Q43897J284297L94232
34995a525319o54103o26094K14358P07406N23696L60749N46513N21454k1626m55166
$$ plain form
35062 760134 731069 1238036 1440030 935434 373065 320836 445203 313096 141143 131283
35052 131283 -169821 -1119776 -2163582 -2479053 -2042849 -1494429 -1325226 -1651982 -2309157
35043 -2309157 -2694911 -2076488 -604039 510659 398972 -433283 -1046230 -1320005 -1482876
35034 -1482876 -1164491 -87338 825203 412248 -830778 -1217253 -327253 390836 -103901
35025 -103901 -863594 -443524 976678 1945382 1691923 820663 272874 340961 695396 852939
35015 852939 541393 -97453 -646027 -904106 -1119155 -1557930 -2061066 -2297013 -2280235 -2278478
35005 -2278478 -2284301 -2003454 -1488209 -1398644 -2255656 -3549093 -4047745 -3203848 -1919551 -1525319
34995 -1525319 -2179422 -2805516 -2591158 -1883752 -1360056 -999307 -452794 68660 47034 -408132
34985d08132k15098K70977K96957m7354j95742j00370k25788p40303j247255j238651
34975c850759n27335N69727J295950J076788K83067j12505J33027K06449l82287
34966a307878q93827n12003L05016N24685P8248k84162l20990m21683n54563j73305
34956c560462P19316J352256J272532Q81646O27232L68591r8070m80109m11817
34947F71115n8318J33149Q1717J13429M13055P13554O42897K72531R1914L16307
34937C391350M87355J32740m10022m58385j55452k85784q08018o78539L73178
34928A588423J053228L85727o30157m71539N60080Q87728J28075n13193k39109
34919B749263L79128O17906N19293K93492j02297m39056k28272L87687N96692
$$ plain form
34985 -408132 -623230 -352253 -55296 -102650 -298392 -398762 -624550 -1364853 -2612108 -3850759
34975 -3850759 -4378094 -3808367 -2512417 -1435629 -1152562 -1265067 -1132040 -925591 -1307878
34966 -1307878 -2201705 -2713708 -2408692 -1884007 -1805759 -2089921 -2410911 -2832594 -3387157 -3560462
34956 -3560462 -2841146 -1488890 -216358 665288 1292520 1661111 1563041 1082932 671115
34947 671115 612797 745946 827663 941092 1354147 2067701 2710598 2983129 3075043 3391350
34937 3391350 3878705 4011445 3601423 3143038 2987586 2701802 1893784 1215245 1588423
34928 1588423 2641651 3027378 2397221 1925682 2485762 3373490 3501565 2988372 2749263
34919 2749263 3128391 3746297 4265590 4559082 4456785 4017729 3789457 4177144 4773836
34910D773836P5384n70100p39589m79936p7725K13180K8348o36927q94554Q504
34900A700421J221813J213010J67900j97680N12251O78396m37050j180270k55405
34891C423386Q99709L78721j027591j166263l3838M67188j94573o13012j84996
34882A948731l2118o64866q79685R0127J113261R81035K40062q657O6974k68802
34872B586062p37597n63270N7507L29151K62690M37921O94172L75168k71069k84874
34862B885861L39312N00430k03989p87064n02471J2915l3030k58734L3592N03653
34852B490475L84183j47139l61154k99843m75770n77144J14894J101604J025568
34843C255674q3166n34234M02273J172131L10179j220964j502468m57438M58331
$$ plain form
34910 4773836 4849220 4279120 3539531 3059595 2981870 3195050 3223398 2586471 1691917 1700421
34900 1700421 2922234 4135244 4303144 4105464 4617715 5296111 4859061 3678791 3423386
34891 3423386 4323095 4701816 3674225 2507962 2474124 2941312 2746739 2133727 1948731
34882 1948731 1916613 1251747 372062 462189 1575450 2556485 2796547 2787890 2854864 2586062
34872 2586062 1848465 1285195 1342702 1671853 1934543 2372464 3066636 3441804 3170735 2885861
34862 2885861 3225173 3725603 3521614 2734550 2232079 2244994 2211964 1953230 1986822 2490475
34852 2490475 2874658 2727519 2366365 2066522 1590752 1013608 1128502 2230106 3255674
34843 3255674 3172508 2638274 3040547 4212678 4522857 3301893 1799425 1341987 1800318
34834A800318O78939Q53421J062275N78040m49722p91766p9336N36760K47185
34825D436114k50662j45291J90803J33139q5646j04839k32268n43881k45515Q95588
34815D047542J499279M31044j092253j003325M78948J152735K17666p04558m20398
34806D606680j8228p42212j670321j177967L02516Q61391Q6995l81619M78557
34797B345792J480162J082014l35064j138235p35782n1431R5202R557L07968Q80679
34787C940862J106751O76924j45820q11246q20734j06092P21250Q51627K44742
34778E658264k59498o2152M15040M57741Q9754j83573k65473m16584n75171m42329
34768D416019q3693K33414O03541J114624J148093O8477j413260j718014n12457
$$ plain form
34834 1800318 2479257 3332678 4394953 4972993 4523271 3731505 3652169 4188929 4436114
34825 4436114 4185452 4040161 4230964 4364103 4278457 4173618 3941350 3397469 3151954 4047542
34815 4047542 5546821 5977865 4885612 3882287 4361235 5513970 5731636 5027078 4606680
34806 4606680 4588452 3846240 2175919 997952 1300468 2161859 2248854 1867235 2345792
34797 2345792 3825954 4907968 4572904 3434669 2698887 2647456 2742658 2752215 3060183 3940862
34787 3940862 5047613 5724537 5578717 4767471 3946737 3840645 4561895 5413522 5658264
34778 5658264 5398766 5336614 5751654 6209395 6299149 6115576 5850103 5433519 4858348 4416019
34768 4416019 4332326 4565740 5169281 6283905 7431998 7500475 6087215 4369201 3856744
34759C856744P40488P92278J46562j4097N12762J125324J439133J292741M40227
34750A0332162q49928j495246q70940J27550K95128j18349m5086M01922O9307
34741G846520j061617j408061r2209J538618J632428K63305q79795q05624j92313
34732F841252o3353l70722k87641N31434J452814J578685O79466o54581j585804
34723H121550j587363o21327Q36811J875734J673596L16582j055208j257649k33158
34714H069568R61565J301535P63470J61893J57668N33204N39926n9592o08586
34705A1820651m61011R1889L43926L43361P06363J310634J214823K05519n90759
34696A4985396k66638N57176P70143L90481K19557M38328N62161M50059L89613
$$ plain form
34759 3856744 4597232 5389510 5536072 5521975 6034737 7160061 8599194 9891935 10332162
34750 10332162 9482234 7986988 7116048 7243598 7538726 7420377 7375291 7777213 7846520
34741 7846520 6784903 5376842 5284633 6823251 8455679 8718984 7839189 7033565 6841252
34732 6841252 6777899 6407177 6119536 6650970 8103784 9682469 10361935 9707354 8121550
34723 8121550 6534187 5912860 6749671 8625405 10299001 10615583 9560375 8302726 8069568
34714 8069568 9031133 10332668 11096138 11258031 11415699 11948903 12488829 12429237 11820651
34705 11820651 11359640 11451529 11795455 12138816 12845179 14155813 15370636 15576155 14985396
34696 14985396 14718758 15275934 16046077 16436558 16656115 17094443 17656604 18106663 18496276
34687A8496276L91432K72438K39201N58571Q92276Q19957P24427J163995J648976
34678B5207549J230442J82887k04676L95960R31376Q24801Q86465J738411K545490
34669C3738705K253906J264553Q81627J531568K345845K338344J478268O73718
34661D6506534Q55562J896528K602636K273067J909927K865255M514521M797772
34653F8221802L338619K296159L255899M908489N210316M523314M788646O382423
34645A02925667P779557Q125517Q276214R035939R938985J0339056J0550470J1293165
34637A78264570J2774801J4740934J6799377J8457355J9488009K0415798K1961779
34630C02902623K3923107K5350450K5860475K5857612K5393727K3947743K1609765
$$ plain form
34687 18496276 18887708 19160146 19399347 19957918 20850194 21670151 22394578 23558573 25207549
34678 25207549 26437991 26620878 26416202 26812162 27743538 28568339 29454804 31193215 33738705
34669 33738705 35992611 37257164 38138791 39670359 42016204 44354548 45832816 46506534
34661 46506534 47362096 49258624 51861260 54134327 56044254 58909509 63424030 68221802
34653 68221802 71560421 73856580 77112479 82020968 87231284 91754598 96543244 102925667
34645 102925667 110705224 118830741 127106955 136142894 146081879 156420935 166971405 178264570
34637 178264570 191039371 205780305 222579682 241037037 260525046 280940844 302902623
34630 302902623 326825730 352176180 378036655 403894267 429287994 453235737 474845502
34623D74845502J9193579J6564545J2172091N304980k238847q071733j2105072
34616E05665045j6056564k0464829k3845330k5004143k4715994k4451686k4493561
34609C46632938k4130963k3039823k1595649k0120857j8568974j6929977j5439705
34602B06806990j4300055j3452378j2665585j1729938j0622308r549730q704206
34595A25782790p959490p073714o246690o050990o532355o776216n866273m099083
34587G5177979k737422k566133l128228l454595l144898k553896k209504k287045
34579E3096258k538502k589455k335685k047703k003954k093041j948046j426515
34571C6113357p74869l63744m25174r36777j549044j783838j574838j388702j456422
$$ plain form
34623 474845502 494039081 510603626 522775717 528080697 525841850 517770117 505665045
34616 505665045 489608481 469143652 445298322 420294179 395578185 371126499 346632938
34609 346632938 322501975 299462152 277866503 257745646 239176672 222246695 206806990
34602 206806990 192506935 179054557 166388972 154659034 144036726 134486996 125782790
34595 125782790 117823300 110749586 104502896 98451906 91919551 85143335 79277062 75177979
34587 75177979 72440557 69874424 66746196 63291601 60146703 57592807 55383303 53096258
34579 53096258 50557756 47968301 45632616 43584913 41580959 39487918 37539872 36113357
34571 36113357 35338488 34974744 34549570 33612793 32063749 30279911 28705073 27316371 25859949
34562B5859949j247007l57475L93318k19790j894320k814218j967156l74641N51948
34553A7930608P64918Q27964N17397n09067j422747j156517k37486j10061p90575
34544A5814434q81757n4621K85768o04230j451757j018410p2831m136n60711m79235
34534A0972514L25423P44924L35781k33273n20173p97980j097589r37943k94264
34525H497420J37432j9695l03368k06407K08750O65075R07641M85755p94266k009617
34515G568720j793953l05842O03812r4820j047506n37535Q91694J304224L11694
34506F900488n37271k86784J63053j96314q85100r21881l52310J72323N50185
34497D606389R15807P79656l06379j511221j430684j22262P38826J20988r55053
$$ plain form
34562 25859949 24612942 24255467 24648785 24428995 22534675 19720457 17753301 17378660 17930608
34553 17930608 18695526 19523490 20040887 19531820 18109073 16952556 16715070 16605009 15814434
34544 15814434 14932677 14878056 15163824 14559594 13107837 12089427 12016596 12012460 11451749 10972514
34534 10972514 11297937 12042861 12378642 12145369 11625196 10827216 9729627 8791684 8497420
34525 8497420 8634852 8615157 8311789 8105382 8314132 8979207 9886848 10372603 9578337 7568720
34515 7568720 5774767 5468925 6072737 5977917 4930411 4392876 5284570 6588794 6900488
34506 6900488 6363217 6076433 6239486 6043172 5158072 4236191 3883881 4056204 4606389
34497 4606389 5522196 6301852 5995473 4484252 3053568 2931306 3670132 3791120 2836067
34488B836067q90023L91523J589401J761633J084885J78143m81547n23660J23322
34479F069744Q13840O11608n33995j504569j282115j79366N84618L23597n02657
34470D400705j013332q32030k31645K97097M25363J32697k93789m58354k17402
34461B209310J71201L56682K77880R4843j33940m11670n09567j64710L33549L02955
34451B526533k79255m81891K39071R69809N33838n97716q07120K39888J008471
34442C351628L93585o76278p81550r4382K08232j34354l70989j32720K45161N28879
34432B537212O63098L28131n03580q97505r0893R68860O83074o76901j164644
34423A846852j19201Q19728L25512o26936m55965O45457J276315Q72210J2581
$$ plain form
34488 2836067 1946044 2337567 3926968 5688601 6773486 6951629 6470082 5946422 6069744
34479 6069744 6883584 7495192 6961197 5456628 4174513 3995147 4579765 4903362 4400705
34470 4400705 3387373 2555343 2323698 2620795 3046158 3178855 2885066 2426712 2209310
34461 2209310 2380511 2737193 3015073 3109916 2975976 2564306 2054739 1890029 2223578 2526533
34451 2526533 2247278 1765387 2004458 2974267 3508105 2910389 2103269 2343157 3351628
34442 3351628 3745213 3068935 2287385 2193003 2401235 2266881 1895892 1763172 2008333 2537212
34432 2537212 3200310 3528441 3024861 2127356 2036463 3005323 3688397 3011496 1846852
34423 1846852 1727651 2547379 2872891 2245955 1789990 2435447 3711762 4583972 4596553
34414D596553o51795p88186l06037K86760J53608n26785m59659O63858J213446
34405D181763N8701j309547q87811O43296J025051O4395l43875L06423L46179
34396D084575q52905j501963m05605R21794P45415j57517j43983M13596Q6336
34387C189743p61077m83433Q09110J086123l91231j721673j063396Q43318J913499
34378C420983J417424L07243m83211q59080q70153k93085P53921J423327R12500
34369E729869m89654j515034j234444j03750N52748R1049p41630q19461m2713
34360A426980O67475O24619J20381j67299m4518J97636L33224L62724K51914q5079
34350C688057m90796n95808l07687J0333P7589J34036M73482P83569N22170j34845
$$ plain form
34414 4596553 3944758 3156572 2850535 3137295 3290903 2764118 2304459 2968317 4181763
34405 4181763 4240464 2930917 2043106 2686402 3711453 3775848 3431973 3738396 4084575
34396 4084575 3231670 1729707 1324102 2245896 2991311 2833794 2689811 3103407 3189743
34387 3189743 2428666 1945233 2754343 3840466 3449235 1727562 664166 1507484 3420983
34378 3420983 4838407 5145650 4662439 3803359 2933206 2640121 3394042 4817369 5729869
34369 5729869 5240215 3725181 2490737 2386987 2939735 3030784 2289154 1469693 1426980
34360 1426980 2094455 2719074 2839455 2672156 2627638 2825274 3158498 3521222 3773136 3688057
34350 3688057 3197261 2601453 2293766 2304099 2381688 2515724 2989206 3772775 4294945 4160100
34340D160100m37477k57906l03881p84530q12701J27673J015819P11979j61420
34331C257656j82786M82812M08251m59541n04533P03764J299007M365j639366
34322C369629j531817j15476O51566L98544L15849O42647M40390k44792k25363
34313C701177N23022N14828o50673j334706m63911P10573P01147K6578j43176
34304C584859j78207r50465j621347o53365J348962J989749M88642j186601j205013
34295A617214k36046K9110n87377r49772n52138M2516L85774N87937N72797n7735
34285H52280j080775j420357m93956P10647P06360m64470j132274k41280J086783
34276a477042J007411m57764j379229n76568P86906R09506j75304q38117k17788
$$ plain form
34340 4160100 3722623 3464717 3160836 2376306 1563605 1691278 2707097 3419076 3257656
34331 3257656 3074870 3557682 3965933 3506392 3001859 3705623 5004630 5008995 3369629
34322 3369629 1837812 1722336 2373902 2772446 3088295 3730942 4171332 3926540 3701177
34313 3701177 4224199 4739027 4088354 2753648 2289737 3000310 3701457 3728035 3584859
34304 3584859 3406652 2456187 834840 181475 1530437 3520186 4008828 2822227 1617214
34295 1617214 1381168 1410278 822901 -126871 -679009 -636493 -250719 337218 910015 852280
34285 852280 -228495 -1648852 -2142808 -1432161 -725801 -1190271 -2322545 -2563825 -1477042
34276 -1477042 -469631 -927395 -2306624 -2883192 -2096286 -1186780 -1362084 -2200201 -2417989
34267b417989P25034O59026m29145j395097j337709m47213L93070O05322M51295
34258c193406N14470P53547N15760l20613q34352k98031N61865M58291n09853
34249b352322q91030k4896R32087O93157l07209o18898J32833Q39098N86186j18125
34239a129119k29524K38852K52041n75270j121574k49121J294888J600916L23832
34230D05921o44047N4793J101406N02394j237800j826959o62573M88708M42336
34221a375821J14551M09564N69511j91143j018874p92337P9024N95326P86558
34212h23641J000183O79830n56540j582364j211816j49116K73313M25566J365287
34203e79298K247799J283477r66403j910440p78658M25681L38895k6879J55258
$$ plain form
34267 -2417989 -1692955 -1033929 -1463074 -2858171 -4195880 -4643093 -4250023 -3644701 -3193406
34258 -3193406 -2678936 -1925389 -1409629 -1730242 -2564594 -2862625 -2300760 -1842469 -2352322
34249 -2352322 -3243352 -3268248 -2336161 -1643004 -1950213 -2569111 -2436278 -1597180 -1010994 -1129119
34239 -1129119 -1358643 -1119791 -867750 -1443020 -2564594 -2813715 -1518827 82089 405921
34230 405921 -238126 -183333 918073 1420467 182667 -1644292 -2306865 -1818157 -1375821
34221 -1375821 -1261270 -851706 -282195 -473338 -1492212 -2284549 -2205525 -1610199 -823641
34212 -823641 176542 856372 299832 -1282532 -2494348 -2643464 -2370151 -1944585 -579298
34203 -579298 1668501 2951978 1985575 75135 -703523 -277842 61053 34174 189432
34194A89432r8388j211843j509297N0057J649823J268223j62452n30094K1189
34185c33350k9950m53044J53171J318727J158355k63700q24125J52637R42548
34176A821269N29601Q4380M37651N29953l39141r28823l03144K87018l94238j154674
34166E69852k91975J336163J489847N6036r29690m76157L16633M33091J61655
34157B665455j29513n98696q85710j97390R79446R42584o31342j756791q88984
34148e00941Q20667J342691O29768R1289J23167n1457n33541n37352j1039J27299
34138A500551l88671o82602k05409N03212Q68726R52033P33027l8125q22790m76271
34128A943681Q42903J304280m8796j655446j622541m12916K30399R4777K93347
$$ plain form
34194 189432 91044 -1120799 -2630096 -2580039 -930216 338007 175555 -354539 -333350
34185 -333350 -363300 -816344 -663173 655554 1813909 1550209 726084 878721 1821269
34176 1821269 2350870 2435250 2872901 3402854 3063713 2134890 1831746 2118764 1724526 569852
34166 569852 277877 1614040 3103887 3159923 2230233 1754076 2070709 2503800 2665455
34157 2665455 2535942 1937246 1051536 854146 1833592 2776176 2144834 388043 -500941
34148 -500941 319726 1662417 2292185 2383474 2506641 2455184 1921643 1384291 1373252 1500551
34138 1500551 1111880 429278 223869 727081 1595807 2547840 3280867 3242742 2419952 1943681
34128 1943681 2786584 4090864 4042068 2386622 764081 351165 581564 676341 969688
34119I69688Q12699M73237o31756q38313L80528J341961P09379n19480p34832
34110A963111q2858J99075j95961o17701p26652n70274m299Q25994J047927K85420
34100B123782l14705L75400J465915J185339l12087j064080k93539N30607J17899
34091C814531q31887j106641q68666r15404j074274o14294L24142Q89930Q21812
34082D39249O01361M87170K95312P0258J28521L54836J94493m45803q89781n88620
34072F46996R6451L54175o1633n83189n32809J21526P45981P20600J20564l22449
34062A306213j5421P52414J016049K36746q86404j047859L3134R94843M10094
34053B799809j204553j831872o15520R21565J003726L3154k55993N22201J041906
$$ plain form
34119 969688 1782387 2255624 1623868 785555 1166083 2508044 3217423 2697943 1963111
34110 1963111 1880253 2079328 1883367 1265666 539014 -31260 -35559 790435 1838362 2123782
34100 2123782 1809077 2184477 3650392 4835731 4523644 3459564 3166025 3696632 3814531
34091 3814531 2982644 1876003 1007337 91933 -982341 -1596635 -1272493 -382563 439249
34082 439249 1040610 1527780 1823092 1893350 2021871 2376707 2571200 2125397 1235616 646996
34072 646996 743447 1097622 1035989 452800 -80009 41517 787498 1508098 1628662 1306213
34062 1306213 1290792 2043206 3059255 3296001 2409597 1361738 1394872 2389715 2799809
34053 2799809 1595256 -236616 -852136 69429 1073155 1106309 850316 1372517 2414423
34044B414423M73862m37367p95385p02733m91566m5626M61720L17289m75283q10129
34034i0795k19361J80542m19480r08559m5907J188123R54650l75985o83280N24338
34024A04286J399738P61884k88024m90551k64759l65100l56782K60001P45005
34015A505698L50272k28486o8765K73687j65616q03234l81400P19180R04489n4111
34005B051714o93611k50567L59440L41632J68483K97800K26476l28704n71296
33996A601367P0660Q20577P70635L55812N17873J091279J174308O39842J55131
33987G197484k4609k39682n40209n57307k47667j600j9766k09243n78768j087263
33977C691370j252058o25192M03071R30434O33366k012l80401k11899M51257R82634
$$ plain form
34044 2414423 2888285 2450918 1655533 952800 461234 415608 877328 1194617 719334 -90795
34034 -90795 -310156 -129614 -549094 -1457653 -1503560 -315437 639213 263228 -420052 104286
34024 104286 1504024 2265908 1977884 1487333 1222574 857474 500692 760693 1505698
34015 1505698 1855970 1627484 1558719 1832406 1666790 863556 482156 1201336 2105825 2051714
34005 2051714 1358103 1107536 1466976 1808608 1977091 2274891 2501367 2172663 1601367
33996 1601367 1672027 2492604 3263239 3619051 4136924 5228203 6402511 7042353 7197484
33987 7197484 7172875 6933193 6392984 5835677 5588010 5586410 5566644 5357401 4778633 3691370
33977 3691370 2439312 1814120 2217191 3147625 3780991 3778979 3398578 3186679 3637936 4620570
33967D620570M68076r54409j637032m89050J037521O48830j329461k155695o45650
33958d36300J133743J072244p256j02702P35494Q80493l87n78188j66446L92061
33948B922756L42110M9181j158n1690l59677n23444j50998L71656L51134k89894
33938B659976r79236j199727r16653l87573J91980P31503J018043P44441k211
33929A860543n76248n65902m44939o99857o68557M96073J822109J275816r65520
33920A533518k028661l91459J553092R71031j050278j321867L38553J069429j52881
33911E20477j019288l7928J023612M15138n89294j05417J014593P14320p71609
33902A164604j459853q55664k63887k32804O7898Q72416J211832O37160n9471
$$ plain form
33967 4620570 5088646 4134237 2497205 2008155 3045676 3694506 2365045 209350 -436300
33958 -436300 697443 1769687 1762431 1659729 2395223 3275716 3275329 2697141 2530695 2922756
33948 2922756 3264866 3314047 3312889 3261199 2901522 2378078 2227080 2598736 2949870 2659976
33938 2659976 1680740 481013 -435640 -823213 -631233 100270 1118313 1862754 1860543
33929 1860543 1284295 718393 273454 -426403 -1094960 -598887 1223222 2499038 1533518
33920 1533518 -495143 -886602 666490 1637521 587243 -734624 -396071 673358 520477
33911 520477 -498811 -536739 486873 902011 312717 207300 1221893 1936213 1164604
33902 1164604 -295249 -1150913 -1414800 -1647604 -1579706 -707290 504542 1141702 1082231
33893A082231k56599k74261l49861j19394M18652N71870J08850k60447q5303Q1469
33883I17207k65891o26047k84592N28873R43516N38480l31340r75242q44666K6176
33873c73526Q39756P72414N3643l04132j5513Q6024m54848q09021k13202O35502
33863B17097O09095j7960l3594O65357Q49721n6724j015081q92051M7679P98593
33853A172132R46013O22892j35396j091675j411844o20151L67805K86349n56227
33844d20102o59060K72258P69565J0166o90090O6634J384320J331691j22246j205311
33834G37825j114872q06475q29270l47738Q94677J437709K75326j175951r07552
33825a836321P31892J602685Q24162m03809q70146o31355j12194N37518Q35460
$$ plain form
33893 1082231 825632 551371 201510 82116 500768 1072638 1181488 921041 835738 917207
33883 917207 651316 25269 -259323 269550 1213066 1751546 1420206 444964 -399702 -373526
33873 -373526 466230 1238644 1292287 988155 972642 1058666 603818 -205203 -418405 217097
33863 217097 826192 808232 774638 1439995 2289716 2232992 1217911 325860 373539 1172132
33853 1172132 2118145 2741037 2605641 1513966 102122 -518029 -150224 136125 -420102
33844 -420102 -1079162 -806904 -37339 -27173 -717263 -650629 733691 2065382 1943136 737825
33834 737825 -377047 -1183522 -2012792 -2360530 -1465853 -28144 247182 -928769 -1836321
33825 -1836321 -1104429 498256 1322418 918609 48463 -582892 -695086 -157568 677892
33816F77892J33395j068262j266946r9695Q80868M24755n72531n52235L53135
33807a089624P98702M04482r829m7375j38611l56310j93698K95142L91286M1267
33797I5432O9879O50253Q17885J49163l23225J96998Q01119L35084n91369n59997
33787A641222K81209M74543l11072q15505l59413J52839m2932k92190J88304Q87358
33777A804363Q38447P0799o50550q85864o14602M5176N75370L13446l95845k98512
33767H02228P51125J111089j60136j455830r23135N28579O48090n01017p85521
33758A5472L39170J052390L90575l11498l7910J96202n21470j185819o70374L25790
33748d07472O30343M52731M16021J30099p05069j095730l31771M74339J96500
$$ plain form
33816 677892 811287 -256975 -1523921 -1623616 -742748 -317993 -890524 -1442759 -1089624
33807 -1089624 -290922 113560 103731 56356 -82255 -438565 -632263 -337121 54165 95432
33797 95432 165311 815564 1633449 1782612 1459387 1656385 2457504 2792588 2201219 1641222
33787 1641222 1922431 2396974 2085902 1270397 910984 1063823 1020891 728701 917005 1804363
33777 1804363 2642810 2713609 2063059 1177195 562593 607769 1183139 1496585 1100740 802228
33767 802228 1553353 2664442 2504306 1048476 125341 653920 1302010 800993 15472
33758 15472 354642 1407032 1797607 1486109 1448199 1644401 1122931 -62888 -733262 -407472
33748 -407472 222871 675602 1091623 1221722 516653 -579077 -910848 -436509 -240009
33739b40009k11413N49697J493653Q60158o46287q37444K19051L34704r14620
33730F07490j410660j90695R13509M48224l96750k03663K12598l68158j068985
33721a457090l95743R86141J160748J08p71873l39564K51205P5271l26921j10713
33711i28431N13757P62236M47385M9795q5676j43557m05048o72216m04388M45545
33701d20598J049434O32627l79868p91955j99712N91823P92501M68266j0434m77153
33691A254931o33738j42850N30788L58957o22151r81749K6606J101562O86351
33682A578707p24715j338913n58706N71284J073423R28602L98594l44780q48126
33673G35370o39210L910L37112K28863K05812M70341O58619N45378K33948k62411
$$ plain form
33739 -240009 -451422 98275 1591928 2452086 1805799 968355 1187406 1522110 607490
33730 607490 -803170 -993865 -80356 367868 -28882 -232545 -19947 -388105 -1457090
33721 -1457090 -1852833 -866692 294056 294164 -477709 -817273 -566068 -490797 -817718 -928431
33711 -928431 -414674 347562 794947 844742 759066 615509 210461 -461755 -866143 -420598
33701 -420598 628836 1261463 881595 89640 -110072 481751 1274252 1742518 1732084 1254931
33691 1254931 621193 478343 1009131 1368088 745937 -235812 -209206 892356 1578707
33682 1578707 853992 -484921 -1043627 -472343 601080 1529682 1928276 1583496 735370
33673 735370 96160 100070 437182 666045 871857 1342198 2000817 2546195 2780143 2517732
33663B517732q28263q01557K89889J593303J626503K68894r85070j029183l87505
33654B264743p3117j89648k40752n1257K29482M83820N32974K08607j79874o7104
33644B917874M29578N49884J40187p1505J47845Q911p39840r09202L25483J689667
33634D488882J370166k64433j107901k88097Q85217J065970M58156j59998o30431
33625E817531r39690o60880K72483J022979Q85346K61514q5241j34838k59681
33616F179523l88788l35735m15828q51510j053072m74950K47877J61743l29269
33607B739991k17J042265J250181L0822j183978r88735P7313N87659K28841l03791
33597C480351o34602p87802n06222L11331Q48170K43373r50000j343603o90428
$$ plain form
33663 2517732 1689469 887912 1177801 2771104 4397607 4666501 3681431 2652248 2264743
33654 2264743 2191626 2001978 1761226 1709969 1939451 2423271 2956245 3164852 2984978 2917874
33644 2917874 3347452 3897336 4037523 3966018 4113863 4122774 3382934 2473732 2799215 4488882
33634 4488882 5859048 5594615 4486714 4198617 5083834 6149804 6607960 6447962 5817531
33625 5817531 4877841 4216961 4489444 5512423 6397769 6659283 6574042 6439204 6179523
33616 6179523 5790735 5455000 5039172 4187662 3134590 2659640 2907517 3069260 2739991
33607 2739991 2739774 3782039 5032220 5063042 3879064 2890329 2967642 3555301 3784142 3480351
33597 3480351 2845749 2057947 1551725 1863056 2711226 2954599 2004599 660996 -29432
33588b9432j05227k32043m28192j26356J54777j88677p20980o13981J41408Q53953
33578a294750J086146R29129O12879L14951J60036P8379j52225n38482q05136
33569C90927q02955o37898l43412J02104L78433O8903n35786n66563K08083R60802
33559g77362R31696L26170k32028m34951j59089N49150R51237R9921j534226k042145
33549b321627o04075J072008J068283k2026k83606M29360N59935l40535r79306
33540a421589o71024l06597m20665j60915R11603J636517J043153j6342l19966
33531B74175k23951o95640j305194q69273L72424R22061L09954l19906j34483
33522a669833K49259L5874m59188m64501O8834N78397O69717L21914k26305m53043
$$ plain form
33588 -29432 -134659 -366702 -794894 -921250 -766473 -955150 -1676130 -2290111 -2148703 -1294750
33578 -1294750 -208604 720525 1333404 1648355 1808391 1886770 1734545 1196063 390927
33569 390927 -412028 -1049926 -1393338 -1291234 -912801 -843898 -1379684 -1946247 -1738164 -777362
33559 -777362 154334 480504 248476 -186475 -345564 203586 1154823 1254744 -279482 -2321627
33549 -2321627 -2925702 -1853694 -785411 -807437 -1091043 -661683 -101748 -442283 -1421589
33540 -1421589 -2092613 -2399210 -2819875 -2980790 -2069187 -432670 610483 594141 274175
33531 274175 50224 -645416 -1950610 -2819883 -2447459 -1525398 -1215444 -1535350 -1669833
33522 -1669833 -1420574 -1384700 -1843888 -2308389 -2239555 -1661158 -991441 -669527 -895832 -1348875
33512a348875O1239Q88763R96265J39808o45906m88840J05680K26783K7150J71055
33502A33122L87136p0473p90166o03408K88536L06054q38345j233736L18796K060906
33492d1578J657649k69051j049491R5607J199868P31303m24425p80559l51138
33483G68185l2863j41378m34946o35831l02365Q01582J719952R90975j007761
33474A725550j900289n30626J171180R57605m97587r52672r5404M68599J23685
33465D70041j09287K40947L36723k48735p92441p84071n40152j75476N60841J163524
33455A21914O68728n34697q18348J88838Q44341K9078j118542j060806j02795
33446a782289M47852K91946M6297n0332j37380m3435L36807M80576j2095n82990
$$ plain form
33512 -1348875 -1287636 -398873 597392 737200 91294 -397546 -291866 -65083 -37933 133122
33502 133122 520258 449785 -340381 -943789 -655253 -349199 -1187544 -2421280 -2102484 -41578
33492 -41578 1616071 1347020 297529 393136 1593004 2324307 1899882 1119323 768185
33483 768185 735322 593944 158998 -476833 -779198 22384 1742336 2733311 1725550
33474 1725550 -174739 -705365 465815 1423420 925833 -26839 -122243 346356 470041
33465 470041 360754 601701 938424 689689 -102752 -886823 -1426975 -1602451 -1041610 121914
33455 121914 790642 255945 -562403 -373565 470776 499854 -618688 -1679494 -1782289
33446 -1782289 -1334437 -1042491 -996194 -1046526 -1183906 -1227341 -890534 -409958 -422053 -1005043
33436a005043m76178J42264N90797O70271N09602J8164o76702q30964m0188Q80633
33426b17344Q67242M0394o68972q81357q61756o52033o9005O56863J074225J163593
33416D51850J123883Q00659J6574q33750j195579j075448p91704m13278J5047
33407a901746K29911K90416O68542J191850Q39370n32106j328922l50923J183802
33398B90194J302801J87556l77958P0557L04743k25182o84934o88165q73209j223349
33388a916946o96184P51712J484175N18009q62853r26788J48659Q32658L70507
33379b97051o26848j178518p54730M40118J438606J231713l6922j067081q99789
33370a750502J00055R39985J036142M02488m72756q06544l22597J33120l08433
$$ plain form
33436 -1005043 -1481221 -1338957 -748160 -77889 431713 449877 -226825 -1057789 -1097977 -217344
33426 -217344 649898 690292 21320 -860037 -1721793 -2373826 -2442831 -1785968 -711743 451850
33416 451850 1575733 2376392 2392966 1559216 363637 -711811 -1503515 -1916793 -1901746
33407 -1901746 -1671835 -1381419 -712877 478973 1318343 786237 -542685 -893608 290194
33398 290194 1592995 1780551 1402593 1473150 1777893 1552711 867777 179612 -693597 -1916946
33388 -1916946 -2613130 -1861418 -377243 140766 -722087 -1648875 -1500216 -667558 -297051
33379 -297051 -923899 -2102417 -2857147 -2417029 -978423 253290 216368 -850713 -1750502
33370 -1750502 -1650447 -710462 325680 728168 255412 -551132 -873729 -740609 -1049042
33361a049042r62856m22364J015803J408411J06312j088541o03504O24536P83717
33352a87528j32770o90280k52508M48904N31830k00591j243464j619435p39610
33343d085452N51573P19022k63152p13802J63576J030756O99873K7942J81787
33334a687877N63697J51726m32130q1175O76387O76316K73199M70357P79857J24622
33324A514979q65739p61260N2792O4407n27600k31410P58313P51615k43971l83837
33314A28289O08765Q22968l16313q03970M91213J812794J446685K69034k70838
33305D188627n07839j106293j263791l34994M87322J00347m66968P3522Q71785
33296B041718N36380k72832j35222M60786J61498n30090j20994R86472J059485
$$ plain form
33361 -1049042 -2011898 -2434262 -1418459 -10048 96264 -992277 -1595781 -971245 -187528
33352 -187528 -320298 -1010578 -1263086 -814182 -282352 -482943 -1726407 -3345842 -4085452
33343 -4085452 -3533879 -2814857 -3078009 -3791811 -3628235 -2597479 -1897606 -1869664 -1687877
33334 -1687877 -1124180 -972454 -1404584 -1485759 -809372 -133056 140143 610500 1390357 1514979
33324 1514979 649240 -112020 -59228 5179 -522421 -753831 4482 756097 512126 128289
33314 128289 737054 1560022 1243709 439739 930952 2743746 4190431 4459465 4188627
33305 4188627 3680788 2574495 1310704 975710 1463032 1563379 1096411 1169933 2041718
33296 2041718 2578098 2305266 2170044 2630830 2792328 2262238 2141244 3127716 4187201
33287D187201Q2644k77391M11441Q70119N33622J70443M7164k98749m58293L40679
33277E608880J128391K07494j544634j332561R67164K030626J84464j835936j216951
33268D196937O40553P86656n44375r48246j33502M7322q15643j129705k96429
33259A803568L88116J38072k82812l50653n78928j005987p50305K79474Q86519
33250E27064M63899j38568k36696k71181m90310k81748L58450L33305n42390p08543
33240i86718O14028J695460Q56124o68947n99591O97589R02343l72840j083712
33231A053736k89937M42985o1815o64263j28893O84452M30501l98128m49420K23680
33221H42898N06151R6182m39339q73092j207038r65569O175O56977J38158n32846
$$ plain form
33287 4187201 4269845 3992454 4403895 5274014 5807636 5978079 6025243 5726494 5268201 5608880
33277 5608880 6737271 6944765 5400131 4067570 5034734 7065360 7249824 5413888 4196937
33268 4196937 4837490 5624146 5079771 4131525 3998023 4045345 3229702 2099997 1803568
33259 1803568 2191684 2329756 2046944 1696291 1117363 111376 -638929 -359455 527064
33250 527064 990963 852395 615699 344518 -145792 -427540 -69090 264215 -278175 -986718
33240 -986718 -372690 1322770 2178894 1509947 910356 1607945 2510288 2137448 1053736
33231 1053736 763799 1206784 1144969 480706 351813 1036265 1466766 1068638 619218 842898
33221 842898 1349049 1445231 1005892 132800 -1074238 -2039807 -2033632 -1376655 -1238497 -1771343
33211a771343O9099J225714J038890l44188q13463K21532Q83469N7031q14349
33202b47608l61603M12917P0721p87945p94846j66056Q4337J24111N64252P39124
33192c62596j76063j082353k68417J570921J958851L26251j149551q05993M19977
33183D31027Q48580K66168n42161j031408q59052J52350J275656J237893k9385
33174A749668j118097j161597q15222n97896J56223J593065K109747M70588j857025
33165E29454k289115n84117R66398P19433m59479q03259P3401J068365J130794
33156C51875L69715k53717j31301K81044K06091k53507l75855j76759l89810q83994
33146a256218n06049Q34829J428194K69201j090997p83130M91945P78493J32705
$$ plain form
33211 -1771343 -1702244 -476530 562360 218172 -595291 -373759 509710 566741 -247608
33202 -247608 -609211 -196294 -125573 -913518 -1708364 -1874420 -1790083 -1665972 -1101720 -362596
33192 -362596 -538659 -1621012 -1889429 -318508 1640343 1966594 817043 11050 431027
33183 431027 1279607 1545775 1003614 -27794 -886846 -734496 541160 1779053 1749668
33174 1749668 631571 -530026 -1345248 -1943144 -1786921 -193856 1915891 2386479 529454
33165 529454 -1759661 -2343778 -1377380 -657947 -1117426 -1920685 -1847284 -778919 351875
33156 351875 721590 467873 336572 617616 823707 570200 194345 17586 -372224 -1256218
33146 -1256218 -1762267 -927438 500756 769957 -321040 -1104170 -612225 166268 298973
33137B98973J82390Q75227L89893j411762k135879m88230J544856J624433L11708
33128A191609l51031n2943o228m50376m46434J59246M22602J9349k53391Q1920
33118C14323N17096O10272N76454N07794N5087o98426j000859n81730k05154m98835
33108d03978r70849q57131l17961k3831j9494J64041N42320O63310M63134L46998
33098d13441M00633K93013P6587K58275P70772P26143k12321r70127m75181N81455
33088A035808N48598p60187j701485j144169L3306M65256K60787L83174Q23149
33079e5763P53382K05422J36794O72549O74845l71320j260801p77563L98456O44001
33069A020002k56218r31576m88139L85296O05557R1014m59429n80343l73061j51150
$$ plain form
33137 298973 481363 1356590 1746483 334721 -1801158 -2289388 -744532 879901 1191609
33128 1191609 840578 787635 781407 331031 -115403 43843 466445 485794 232403 314323
33118 314323 831419 1441691 2018145 2525939 2581026 1882600 881741 300011 94857 -403978
33108 -403978 -1374827 -2231958 -2549919 -2573750 -2593244 -2429203 -1886883 -1223573 -760439 -413441
33098 -413441 -12808 280205 356792 615067 1385839 2111982 1899661 929534 454353 1035808
33088 1035808 1584406 824219 -877266 -2021435 -1988129 -1522873 -1262086 -878912 -55763
33079 -55763 697619 903041 1039835 1712384 2387229 2015909 755108 -22455 376001 1020002
33069 1020002 763784 -167792 -655931 -270635 334922 425936 -33493 -613836 -986897 -1138047
33059a138047q2118l0645L00221Q40531R06266K108j190804j368242l15826P06045
33049a370511O40894q7381n03027m70380l57795l1684P19498J217614O11036n92554
33039b24290r83614l08734K22025n4503l15242R6780M51276M4480l40554K93753
33029a118623J272299J156468P2277m77528l5854J91649n32471j212477p36784
33020a421044L49006O64423l7684o54711k68965P66392J282529N48355q85728
33011C42573j589322p59228P53462J379152O96427k96153p23653p32395o50311
33002a579448k89087L66383O61790J96466m30071m90272j24174K04843N39776
32993i43794R10015P19831k98342j118661o23285O16382J025217K70495m87054
$$ plain form
33059 -1138047 -1220165 -1250810 -950589 -110058 796208 798316 -392488 -1760730 -2076556 -1370511
33049 -1370511 -729617 -816998 -1320025 -1790405 -2148200 -2179884 -1460386 -242772 368264 -224290
33039 -224290 -1207904 -1516638 -1294613 -1349116 -1664358 -1567578 -1116302 -1071822 -1412376 -1118623
33029 -1118623 153676 1310144 1382421 904893 869039 1060688 528217 -684260 -1421044
33020 -1421044 -1072038 -407615 -445299 -1100010 -1368975 -602583 679946 1228301 342573
33011 342573 -1246749 -2005977 -1252515 126637 823064 526911 -196742 -929137 -1579448
33002 -1579448 -1868535 -1502152 -840362 -643896 -1073967 -1564239 -1688413 -1483570 -943794
32993 -943794 -33779 686052 387710 -730951 -1354236 -737854 287363 557858 70804
32984G0804n22011l42555l89330l10200L4729R8133k22144j19544O87125J091032
32974G6039J68523j155613j162522L10280J627811J415369N3257r73981o83713
32965c24550N44187J413292J032780q5610o09812q3677M84894R1772p96086r13982
32955G53208K5769J001194J025698J84562o83090q48872k38766N13259O25416
32946B358378P8056k74728J35082P12495N75038p2360k74584J44992L46447j53733
32936C575083p61800p31997j01496N85045Q96699O65992J04826j28207L38330
32927D442475P59763J01491j206111j547201n32541K63109k46561r18410l56710
32918G59304O78304N95074k42278j69588P77306Q24190m35066j155934j71064
$$ plain form
32984 70804 -451207 -793762 -1183092 -1493292 -1458563 -1360430 -1582574 -1702118 -1014993 76039
32974 76039 244562 -911051 -2073573 -1763293 -135482 1279887 1333144 359163 -324550
32965 -324550 219637 1632929 2665709 2580099 1970287 1886610 2371504 2463276 1667190 753208
32955 753208 778977 1780171 2805869 2990431 2307341 1458469 1219703 1732962 2358378
32946 2358378 2436434 2161706 2296788 3009283 3584321 3511961 3237377 3382369 3728816 3575083
32936 3575083 2813283 2081286 1979790 2564835 3461534 4127526 4232352 4104145 4442475
32927 4442475 5202238 5303729 4097618 2550417 2017876 2280985 2034424 1116014 759304
32918 759304 1437608 2032682 1790404 1620816 2398122 3222312 2787246 1631312 1460248
32909A460248J166857J111200j16279j215835j650590j409219k72419J303020
32901C76983J749570L81573j151323j010872J16465K59290o12681p29899L67127
32892b53767J075647M13960m90411l02026O46820J181697Q58264J9907q12316
32883B337775j085651n56788J62654J94585l10436l96889R9459L18402r8734m91363
32873A73014m38715k48708P1212Q85943J618422J000648p48280j675375q62176
32864b24015K34821K24553j79043J13412M81824n7370q12015n88343J93374M25348
32854a87454L89117R61712J570863J011396k69731p66589m04685m12565r71057
32845I21007j038551m32681p5584j19122J99571O96738K60800r29202j207593
$$ plain form
32909 1460248 2627105 3738305 3622026 2406191 755601 -653618 -926037 376983
32901 376983 2126553 2508126 1356803 345931 462396 721686 109005 -620894 -253767
32892 -253767 821880 1235840 745429 443403 1090223 2271920 3130184 3150091 2337775
32883 2337775 1252124 695336 857990 1052575 742139 345250 444709 763111 664377 173014
32873 173014 -265701 -514409 -443197 442746 2061168 3061816 2313536 638161 -224015
32864 -224015 10806 235359 56316 169728 651552 594182 -217833 -806176 -612802 -187454
32854 -187454 201663 1163375 2734238 3745634 3475903 2709314 2304629 1892064 921007
32845 921007 -117544 -550225 -625809 -744931 -545360 151378 412178 -517024 -1724617
32836a724617m7802R53751N18966m77149n17312M77142J401265J333015J26669
32827B043928j429789j844546m41572J282236J226668l10232r28637K80759J412897
32818A291712P62197p24995j139754k30324Q51817J218526O44799n99207j510399
32809E64372j100643R528J57896o54902n08712J101873J881714K45222j845118
32800a48770j671741K24016J211086N79108j37059j23796o1281j80560J25759
32791a83238O48898L36395q00208j438154q95552J00040P66979J042031Q95693
32782D72884K27285m19722l08551K31224K29923k46227k13956L97099N57488L1996
32772I59443q9758P09608J341466P20757o78904j618354j588677r07031j01057
$$ plain form
32836 -1724617 -1772419 -818668 -299702 -776851 -1294163 -817021 584244 1917259 2043928
32827 2043928 614139 -1230407 -1671979 -389743 836925 526693 -401944 -121185 1291712
32818 1291712 2053909 1328914 189160 -41164 810653 2029179 2673978 2074771 564372
32809 564372 -536271 -526743 -368847 -1023749 -1532461 -430588 1451126 1696348 -148770
32800 -148770 -1820511 -1596495 -385409 193699 56640 -67156 -128437 -308997 -183238
32791 -183238 465660 802055 1847 -1436307 -2331859 -2231819 -1464840 -422809 472884
32782 472884 700169 280447 -28104 203120 433043 186816 -27140 369959 927447 959443
32772 959443 869685 1579293 2920759 3641516 2962612 1344258 -244419 -1151450 -1252507
32763a252507K57418j59752q12253o63071L55695R97593L90628o27667n95863
32754b109779O09490J661869J484826M36687l21858k74003k5949k81679p01606
32745D77998l84033N44552P67155k77366j222428n54565J094302J700746N75525
32736B721886r76912j645356j432550q42881o6995N78632N23471j24761l78274
32727a643740K77422J023809Q37266o1848n56931j44934N04716N05884j11220
32718F30424m75780q8425M02826J48007m18015o8955J044014J107234o29953k231122
32708e79745j617099L83054J358117Q61763M54923O55441L32685p10054j042650
32699I6435j85189L71986k77618r00947l24099O35076P95323N35952O12705N43828
$$ plain form
32763 -1252507 -995089 -1154841 -1967094 -2630165 -2274470 -1276877 -886249 -1513916 -2109779
32754 -2109779 -1500289 161580 1646406 2083093 1761235 1487232 1461283 1179604 477998
32745 477998 93965 638517 1405672 1128306 -94122 -648687 445615 2146361 2721886
32736 2721886 1744974 99618 -1332932 -2175813 -2242808 -1664176 -1140705 -1265466 -1643740
32727 -1643740 -1366318 -342509 494757 432909 -124022 -268956 235760 741644 630424
32718 630424 154644 66219 469045 617052 199037 130082 1174096 2281330 1651377 -579745
32708 -579745 -2196844 -1813790 -455673 406090 861013 1516454 1849139 1139085 96435
32699 96435 -88754 283232 5614 -895333 -1219432 -584356 210967 746919 1359624 1903452
32689A903452k12432q19709n24784k91803j061855j562486j54054J974079K082939
32680A333347J05790j123403k18869Q35173J47030j066751o71327Q65320J283143
32671A489453M5397j063390p73181N9275J29204m37868o85157l63438K8463J80103
32661a391139R8644l02652q70576p73272N44486K041451J934655J46605j338036
32652I0166j123237j44774J29563n3589L02501P93879L13462o54536n02115P96300
32642e2380J479197P97108K7251Q3453P4351p49222j395509q46265O8279L5381
32632d78356o04876o46360p7832K11738J47690L33959O40232M35363k9771P4470
32622F257N82878M68320l91968r02036m41834K84590M59573K16095L0523j30023
$$ plain form
32689 1903452 1691020 871311 346527 54724 -1007131 -2569617 -2723671 -749592 1333347
32680 1333347 1439137 315734 96865 932038 1079068 12317 -659010 206310 1489453
32671 1489453 1534850 471460 -301721 -242446 -113242 -551110 -1236267 -1599705 -1571242 -1391139
32661 -1391139 -1292495 -1595147 -2465723 -3238995 -2694509 -653058 1281597 1428202 90166
32652 90166 -1033071 -1177845 -1048282 -1101871 -799370 -5491 307971 -346565 -848680 -52380
32642 -52380 1426817 2223925 2251176 2334629 2408980 1659758 264249 -582016 -513737 -478356
32632 -478356 -1083232 -1729592 -1807424 -1595686 -1447996 -1114037 -473805 -38442 -68213 6257
32622 6257 589135 1057455 665487 -236549 -678383 -393793 65780 281875 312398 182375
32612A82375m75377p35800m25038M07609J065548R03565N6604o36430n60932k0610
32602b38486L24865M57787P33130Q00435n1164j293209j315908J40112J131103
32593F88665K18812j250351j119757L18788R31565Q3408o68971k73431L32482
32584g38790J3503p47089o89629L90871J397719J223447n337r25459m51152O30310
32574I8394M57399j070426j655240K0833J818576J106720j011252j245484O56136
32565h24344J534051K6236j267457j87411J488033J108345o66986j325966m96853
32556f12352J77135J18434J80872M61296J32295o77524q95339l88419k7885O7268
32546a464219N30910J016301M08208r97808j462480m47296N30833L59755j28331
$$ plain form
32612 182375 -293002 -1028802 -1453840 -1046231 19317 922882 979486 343056 -217876 -238486
32602 -238486 86379 544166 1277296 2077731 2026567 733358 -582550 -442438 688665
32593 688665 907477 -342874 -1462631 -1143843 -212278 -128870 -797841 -1071272 -738790
32584 -738790 -725287 -1472376 -2162005 -1771134 -373415 850032 844695 -80764 -531916 98394
32574 98394 555793 -514633 -2169873 -2149040 -330464 776256 -234996 -1480480 -824344
32565 -824344 709707 735943 -531514 -718925 769108 1877453 1210467 -115499 -612352
32556 -612352 -435217 -316783 -135911 325385 457680 -219844 -1115183 -1503602 -1531487 -1464219
32546 -1464219 -933309 82992 491200 -506608 -1969088 -2416384 -1885551 -1525796 -1654127
32537a654127J9354K25917k00882m86601K49882J171097R12839j51888n15608
32528d30017M9263L55452p1937l89348j48250p4403n93053q63759r9983J056254
32518a209781J359822O07493l22115p15289o17292l86018k58216l13943m53596
32509b308935m30387j56408J38935K56143L16101M67375N71206M87188M02527
32500b56255M98432N44889K91624M7414K82205P28383N57196l69061j038818n39856
32490G46153N89397Q58859k82697j567734j341931K99368J434649O73720r91540
32481D18244j457252l12026P65721N60415o5501J28068O65438L12958o60355q53226
32471d97516q9232L43871k8519j01821O87718J122294J78337j060809r09985L13494
$$ plain form
32537 -1654127 -1634773 -1408856 -1609738 -2096339 -1846457 -675360 237479 85591 -430017
32528 -430017 -380754 -25302 -97239 -486587 -634837 -709240 -1302293 -2166052 -2266035 -1209781
32518 -1209781 150041 757534 435419 -279870 -897162 -1283180 -1541396 -1855339 -2308935
32509 -2308935 -2739322 -2895730 -2756795 -2500652 -2184551 -1717176 -1145970 -658782 -256255
32500 -256255 242177 787066 1078690 1126104 1408309 2136692 2693888 2324827 1286009 746153
32490 746153 1335550 2194409 1911712 343978 -997953 -698585 736064 1409784 418244
32481 418244 -1039008 -1351034 -585313 -24898 -90399 37669 703107 1016065 355710 -497516
32471 -497516 -586748 -242877 -271396 -373217 314501 1436795 1615132 554323 -355662 -42168
32461d2168P59100j75651j020161l90472J179726K056859J439972k8059j179110
32452B600036j394659q92169k84151k191j03329m16533o50517m91465N0752M59262
32442a124964K89050j36305j28922L19270N63131L72480J61092O6260k21022m81997
32432c21927O210R77430R80763m51091j643140j014463N17336Q62639j97418r62673
32422a246334m99767L20031N59071M39248M16421K95597j38588n18873m79399
32413h52593k02566Q881J65497L25501L85636L22413K17942M802l69105n99148
32403e92740l72893O0042K34343K13041L75987P03197R33172J096706J120507
32394C771362L82073j276397k538304j973699j78908Q94666O11730L7222k86781
$$ plain form
32461 -42168 716932 541281 -478880 -869352 310374 2367233 3807205 3779146 2600036
32452 2600036 1205377 313208 29057 26866 -76463 -492996 -1143513 -1634978 -1584226 -1124964
32442 -1124964 -835914 -972219 -1101141 -781871 -218740 153740 314832 381092 160070 -321927
32432 -321927 -315717 661713 1642476 1191385 -451755 -1466218 -948882 -86243 -283661 -1246334
32422 -1246334 -1746101 -1426070 -866999 -427751 -11330 284267 145679 -373194 -852593
32413 -852593 -1055159 -1046278 -880781 -555280 -169644 152769 370711 375513 6408 -592740
32403 -592740 -965633 -905591 -671248 -458207 -82220 620977 1554149 2650855 3771362
32394 3771362 4153435 2877038 338734 -1634965 -1813873 -919207 -307477 -270255 -557036
32385e57036r47908j677291r70406J251555K581663J289320r76958j410551J49583
32376a268029J483838J288799L06495m64931q56650q16581j92802N38852N81614
32367F00605M6323k15391o1047j42066m42623j27061P52493Q25482n01267j741509
32357a006061j290893J81507P00975j03942o15360J51336J070611P85665j39853
32348b66015j87427O57515R19269O9248n95839j00169N52770J0038j119889j124523
32338a185022Q7751Q21089K52548m19650j03811M13534p1667j051683j054189
32329b311100L7100Q43866N92994O6376J59575N43313L79171k81528n65271n6767
32319e92271O11440O00008p4032o19624m88930N0870M35482N04099M00076J25796
$$ plain form
32385 -557036 -1504944 -3182235 -4152641 -2901086 -319423 969897 -7061 -1417612 -1268029
32376 -1268029 215809 1504608 1811103 1346172 489522 -327059 -519861 18991 600605
32367 600605 646928 431537 370490 228424 -214199 -341260 411233 1236715 735448 -1006061
32357 -1006061 -2296954 -2115447 -1414472 -1518414 -2133774 -1982438 -911827 -126162 -266015
32348 -266015 -453442 204073 1123342 1192590 596751 496582 1049352 1059390 -60499 -1185022
32338 -1185022 -1097271 -276182 -23634 -443284 -547095 -133561 -205228 -1256911 -2311100
32329 -2311100 -2274000 -1430134 -837140 -770764 -611189 -67876 311295 29767 -535504 -592271
32319 -592271 19169 619177 545145 -74479 -563409 -512539 -77057 427042 827118 952914
32309I52914l04806m76877L0718Q48501J013747J36447j073131j578162r65798
32300a416447L48518J403970J269837l1569j209365j033201M7499N02274m2477
32291a60961l47689L33779J035791P31777j7156j81796k5702l75831q68067n00487
32281c76342M19794N24644l95532r84232m63097K63391K56612k959K83967P24203
32271B50449M62533k54532m65622r7511M0988k08018p2567O32482R08154J34172
32261A330528p68869o72034K8101J74309j77845K883O70492N62599n08677r27274
32251b85787K28051J463157J036087l60721q15049k22740o9147o11925n29702
32242a67776M62568Q70966q45p22407j07560P44828K27921j155465j538350l91028
$$ plain form
32309 952914 648108 171231 201949 1050450 2064197 2200644 1127513 -450649 -1416447
32300 -1416447 -1067929 336041 1605878 1574309 364944 -668257 -620758 -118484 -160961
32291 -160961 -508650 -174871 860920 1592697 1575541 1393745 1368043 992212 124145 -376342
32281 -376342 43452 568096 172564 -811668 -1274765 -1011374 -754762 -757721 -473754 250449
32271 250449 712982 458450 -7172 -104683 -63695 -271713 -344280 288202 1196356 1330528
32261 1330528 561659 -110375 -82274 92035 -85810 -82927 587565 1150164 641487 -285787
32251 -285787 -57736 1405421 2441508 2080787 1265738 1042998 973851 361926 -167776
32242 -167776 294792 1165758 1164913 442506 334946 1079774 1307695 152230 -1386120 -1777148
32232a777148R42089J122687J55932r81867j272211m20300P49381J001748J98648
32223b81041m81833k42501K68223K32051M0735M14838R46956P26542r5169n66362
32213I62439m61424m18796o85318p38236j95607O52235J234937J110506J79630
32204A640366j004594j451149p80948K70583Q27254Q38899O35073K35320k65403
32195I45401l80242m9448j4526n73267q12570l0768R58853J051367N12676K05029
32185A812505M5759l66219m73510K60152Q74836K37791q09337o27503L95726M22740
32175A772940o67407j090906k91236J78096n17205j078221m36840M71430M61617
32166a197732l1883m0792L44022N70281O35133N55063r734p55320o05632N42915
$$ plain form
32232 -1777148 -835059 287628 443560 -538307 -1810518 -2230818 -1481437 -479689 -281041
32223 -281041 -762874 -1005375 -737152 -505101 -464366 -49528 897428 1623970 1528801 962439
32213 962439 501015 82219 -603099 -1341335 -1536942 -884707 350230 1460736 1640366
32204 1640366 635772 -815377 -1596325 -1325742 -498488 340411 975484 1210804 945401
32195 945401 565159 515711 501185 -72082 -884652 -915420 43433 1094800 1607476 1812505
32185 1812505 1858264 1492045 1018535 1278687 2153523 2391314 1581977 954474 1350200 1772940
32175 1772940 1105533 14627 -276609 -98513 -615718 -1693939 -2130779 -1659349 -1197732
32166 -1197732 -1229615 -1270407 -926385 -356104 279029 834092 824358 69038 -536594 6321
32156F321J252932O68241j57005j26740J27296l09743p73442k61021N38082K88328
32146A253249o38394p24887J69962O72073J90130l38786j95206J11830j4603l07108
32136A78260l20818j54156j3007K08981M79660L76937k54270q47404p65498j30332
32126a241647L87852M58635L93761N23186O02918J77685n50002p20903M0008R44427
32116A015920J005052K92800m25486r12494j384056j470342n04375J024983J590526
32107B32528O72095m21333l81989M35332Q81257O29904J00584m87947j080117
32098E80314j312461r08911k37986J24455J04499J5563J06665M60838Q63759P26645
32088E23380j22684o48138K26329J607047J384132n76900j841848r25587N02127
$$ plain form
32156 6321 1259253 1927494 1770489 1643749 1771045 1461302 687860 426839 964921 1253249
32146 1253249 614855 -110032 59930 732003 922133 583347 388141 499971 485368 178260
32136 178260 -142558 -296714 -309721 -100740 378920 755857 501587 -345817 -1111315 -1241647
32126 -1241647 -853795 -395160 -1399 521787 1124705 1302390 752388 31485 71493 1015920
32116 1015920 2020972 2313772 1888286 975792 -408264 -1878606 -2382981 -1357998 232528
32107 232528 904623 483290 101301 536633 1417890 2047794 2148378 1660431 580314
32098 580314 -732147 -1641058 -1879044 -1754589 -1650090 -1634527 -1527862 -1067024 -203265 523380
32088 523380 400696 -247442 -21113 1585934 2970066 2393166 551318 -374269 127858
32079A27858L68102o46631o77440N8587j8776p71138n55175P75420J513017Q76527
32069A050351n418k24323k46790m60659l63832J59822L17710j74577n24911k96087
32059g68714o9030j24006J34492P66857P47842k79279j015707l69316P86561R15228
32049G24928L6417n92048m36541j19761j58321l10171j78094K33613O05288N89334
32039C94644J36908k99382k37716P0415m9544m99014l99867L68487O80571p6420
32029H9082p82323k03360R72325J080104K0320o38410r8284N68265K12586o69808
32019E50497q08660k5731O63948N58768R5265L8187L53356K87868m83585j188625
32009D1288q27021L65830R29750J5294j308891j288314K31927J637229J704382
$$ plain form
32079 127858 495960 -150671 -828111 -769524 -788300 -1559438 -2114613 -1339193 173824 1050351
32069 1050351 1044933 820610 573820 113161 -250671 -90849 226861 52284 -472627 -768714
32059 -768714 -837744 -961750 -827258 -60401 687441 408162 -607545 -976861 -190300 724928
32049 724928 761345 169297 -267244 -387005 -545326 -855497 -1033591 -799978 -194690 394644
32039 394644 531552 232170 -5546 64869 15325 -483689 -883556 -515069 165502 89082
32029 89082 -693241 -896601 75724 1155828 1176148 537738 439454 1007719 1220305 550497
32019 550497 -258163 -283894 380054 938822 1034087 1072274 1425630 1713498 1229913 41288
32009 41288 -785733 -419903 509847 525141 -783750 -2072064 -1840137 -202908 1501474
32000A501474R53020M25956R5445o07244j325979j094998j9084N78269r41q57035
31990c51117q77570k12519K95488L71520J94695k71434q65504p55101M65882J668955
31980c36705J487769L86711o3773K30569j29238j301655j564491k15704R25408
31971e81109L14269p63850k95920J096945J095030o81366k161434j868069n68840
31962d414344L37915M90998K44771l7273K2938N56024R85877O87021K7204k08241
31952a307110j87342o17024j202090r86315j48937J59897j34898Q8181R14252
31943c421386R35928k85802j159269n21959M70055K31309q11422j126426m24662
31934f113634L50382O63413O79744M38028r2951n31426n95584o21779p76589m53386
$$ plain form
32000 1501474 2454494 2880450 2975895 2368651 1042672 -52326 -71410 506859 505918 -351117
31990 -351117 -1228687 -1441206 -1145718 -774198 -579503 -850937 -1716441 -2471542 -2005660 -336705
31980 -336705 1151064 1537775 1474002 1704571 1575333 273678 -1290813 -1506517 -581109
31971 -581109 -266840 -1030690 -1326610 -229665 865365 183999 -1977435 -3845504 -4414344
31962 -4414344 -4076429 -3585431 -3340660 -3377933 -3354995 -2798971 -1813094 -1126073 -1098869 -1307110
31952 -1307110 -1494452 -2111476 -3313566 -4299881 -4448818 -4288921 -4423819 -4335638 -3421386
31943 -3421386 -2485458 -2771260 -3930529 -4452488 -3982433 -3751124 -4562546 -5688972 -6113634
31934 -6113634 -5763252 -5099839 -4420095 -3982067 -4075018 -4606444 -5202028 -5823807 -6600396 -7053782
31924g053782O35329J553730J415708Q08262P35520Q68401K59330p52886r02254
31915b432642N349Q96914J083060P63188Q5428q51948j201182j66816J328122
31906d90527J427569O0026q19991k07833M79958j96621j437311j613311o86752
31897c484793K40024Q52574J500895J750475P86131q45272j498754o97324K48597
31888a147447L40581K88393R81625J676887R91558q20544j954833j442039k55978
31879a341797L16435L34452N07774P00922K57369n51059o42957J66815O86924
31870D34878N9906r42806j060682l29643J64948l0856k76320n5456K32259M3228
31860a760544l67612l02713L30984Q19430N37020k54026p01485l65379L26018
$$ plain form
31924 -7053782 -6418453 -4864723 -3449015 -2640753 -1905233 -1036832 -777502 -1530388 -2432642
31915 -2432642 -2427293 -1530379 -447319 315869 401297 -450651 -1651833 -1818649 -490527
31906 -490527 937042 997068 177077 -30756 449202 252581 -1184730 -2798041 -3484793
31897 -3484793 -3244769 -2392195 -891300 859175 1645306 800034 -698720 -1396044 -1147447
31888 -1147447 -806866 -518473 463152 2140039 3131597 2311053 356220 -1085819 -1341797
31879 -1341797 -1025362 -690910 -183136 517786 775155 224096 -418861 -252046 434878
31870 434878 494784 -448022 -1508704 -1838347 -1673399 -1704255 -1980575 -2036031 -1803772 -1760544
31860 -1760544 -2128156 -2430869 -2099885 -1280455 -743435 -997461 -1698946 -2064325 -1738307
31851a738307O89526N85012L61388K45065J79695J38385J30638k5436m26624o64545
31841e25203l23921J56360l0588o21096l80755R51877J910002J231151l90009
31832A977818j398365j400831j010898m14860N44385J282818R42955j17684o29885
$$ plain form
31851 -1738307 -1048781 -463769 -102381 142684 322379 460764 591402 565966 139342 -525203
31841 -525203 -849124 -692764 -723352 -1344448 -1725203 -773326 1136676 2367827 1977818
31832 1977818 579453 -821378 -1832276 -2247136 -1702751 -419933 523022 405338 -224547
$$ [...]
##END NTUPLES=NMR SPECTRUM
##END=
