##TITLE=31Pdec_LR-741-RM1
 , 24 sc
 30.10.2021
##JCAMPDX= 6.0         $$ Bruker NMR JCAMP-DX V2.0
##DATA TYPE= NMR SPECTRUM
##DATA CLASS= NTUPLES
##ORIGIN= UXNMR, Bruker Analytische Messtechnik GmbH
##OWNER= root
$$ XWIN-NMR		Version 3.5
$$ Sat Oct 30 13:50:07 2021 Russian Standard Time (UT+4h)  she@DPX200
##.OBSERVE FREQUENCY= 81.013821
##.OBSERVE NUCLEUS= ^31P
##.ACQUISITION MODE= SIMULTANEOUS
##.ACQUISITION SCHEME= undefined
##.AVERAGES= 24
##.DIGITISER RES= 16
##SPECTROMETER/DATA SYSTEM= spect
##.PULSE SEQUENCE= zgpg30
##.SOLVENT NAME= D2O
##.SHIFT REFERENCE= (INTERNAL, D2O, 0, 248.564)
##AUDIT TRAIL= $$ (NUMBER, WHEN, WHO, WHERE, WHAT)
$$ ##TITLE= Audit trail, XWIN-NMR		Version 3.5
$$ ##JCAMPDX= 5.01
$$ ##ORIGIN= Bruker BioSpin GmbH
$$ ##OWNER= she
$$ F:/spectra/data/she/nmr/P31/1/pdata/1/auditp.txt
$$ ##AUDIT TRAIL=  $$ (NUMBER, WHEN, WHO, WHERE, WHAT)
(   1,<2021-10-30 13:47:39.34 +0400>,<she>,<DPX200>,
      <created by zg, POWCHK disabled, PULCHK disabled
       configuration hash MD5:
       00 E9 B6 7A A2 85 ED C7 34 08 36 98 17 FE 4E 26
       data hash MD5: 32K
       30 90 CD DD D6 14 3B 41 08 38 7C 1F F0 6C 37 F9>)
(   2,<2021-10-30 13:47:41.92 +0400>,<she>,<DPX200>,
      <Start of raw data processing
       efp BC_mod = 2 LB = 1 FT_mod = 6 PKNL = 1 PHC0 = -8878.063 PHC1 = 147.8694 SI = 64K 
       data hash MD5: 64K
       FA 49 A7 49 10 A4 D4 25 FB 4A 8B 76 01 AC 7B 4E>)
(   3,<2021-10-30 13:47:58.84 +0400>,<she>,<DPX200>,
      <pk PHC0 = 15.00917 PHC1 = 0 
       data hash MD5: 64K
       DC 76 65 DE D9 DD 96 8B 47 C4 4D 49 12 F2 7A 77>)
(   4,<2021-10-30 13:48:12.09 +0400>,<she>,<DPX200>,
      <pk PHC0 = -0.4000012 PHC1 = 0 
       data hash MD5: 64K
       B8 E8 8D D9 74 56 E3 E8 0E 19 4A 81 B0 F9 F0 12>)
$$ ##END=
$$ 
$$ hash MD5
$$ B8 38 A4 21 C2 DF 0D B3 11 2A 1F 93 8F 70 31 92
##$RELAX= 
##$RELAX= 
##$RELAX= 
##$RELAX= 
##$RELAX= 
##$RELAX= 
##$RELAX= 
##$RELAX= 
$$ Bruker specific parameters
$$ --------------------------
##$DU= <F:/spectra>
##$EXPNO= 1
##$NAME= <P31>
##$PROCNO= 1
##$TYPE= <nmr>
##$USER= <she>
##$AMP= (0..31)
100 100 100 100 100 100 100 100 100 100 100 100 100 100 100 100 100 100 
100 100 100 100 100 100 100 100 100 100 100 100 100 100 
##$AQSEQ= 0
##$AQ_mod= 1
##$AUNM= <au_zg>
##$AUTOPOS= <>
##$BF1= 81.014009
##$BF2= 200.13
##$BF3= 200.13
##$BF4= 200.13
##$BF5= 200.13
##$BF6= 200.13
##$BF7= 200.13
##$BF8= 200.13
##$BYTORDA= 1
##$CFDGTYP= 0
##$CFRGTYP= 5
##$CHEMSTR= <none>
##$CNST= (0..31)
1 1 145 1 1 1 1 1 1 1 1 1 1 1 1 1 1 1 1 1 1 1 1 1 1 1 1 1 1 1 1 1 
##$CPDPRG= <waltz16>
##$CPDPRG1= <>
##$CPDPRG2= <waltz16>
##$CPDPRG3= <>
##$CPDPRG4= <mlev>
##$CPDPRG5= <mlev>
##$CPDPRG6= <mlev>
##$CPDPRG7= <mlev>
##$CPDPRG8= <mlev>
##$CPDPRGB= <>
##$CPDPRGT= <>
##$D= (0..31)
0 1 0 0 0 0 0 0 0 0 0 0.03 2e-05 3e-06 0 0 0 0 0 0 0 0 0 0 0 0 0 0 0 0 
0 0 
##$DATE= 1635587258
##$DBL= (0..7)
120 120 120 11 120 120 24 19 
##$DBP= (0..7)
150 150 150 150 150 150 150 150 
##$DBP07= 0
##$DBPNAM0= <>
##$DBPNAM1= <>
$$ [...]
##$SUBNAM2= <"">
##$SUBNAM3= <"">
##$SUBNAM4= <"">
##$SUBNAM5= <"">
##$SUBNAM6= <"">
##$SUBNAM7= <"">
##$SUBNAM8= <"">
##$SUBNAM9= <"">
##$SW= 501.771253377433
##$SWIBOX= (0..15)
0 1 3 0 0 0 0 0 0 0 0 0 0 0 0 0 
##$SW_h= 40650.406504065
##$TD= 32768
##$TD0= 1
##$TE= 0
##$TE2= 300
##$TE3= 300
##$TEG= 300
##$TL= (0..7)
0 120 53 12 22 120 120 120 
##$TP= (0..7)
150 150 150 150 150 150 150 150 
##$TP07= 0
##$TPNAME0= <>
##$TPNAME1= <>
##$TPNAME2= <>
##$TPNAME3= <>
##$TPNAME4= <>
##$TPNAME5= <>
##$TPNAME6= <>
##$TPNAME7= <>
##$TPOAL= (0..7)
0.5 0.5 0.5 0.5 0.5 0.5 0.5 0.5 
##$TPOFFS= (0..7)
0 0 0 0 0 0 0 0 
##$TUNHIN= 0
##$TUNHOUT= 0
##$TUNXOUT= 0
##$USERA1= <user>
##$USERA2= <user>
##$USERA3= <user>
##$USERA4= <user>
##$USERA5= <user>
##$V9= 5
##$VALIST= <valist>
##$VCLIST= <CCCCCCCCCCCCCCC>
##$VD= 0
##$VDLIST= <DDDDDDDDDDDDDDD>
##$VPLIST= <PPPPPPPPPPPPPPP>
##$VTLIST= <TTTTTTTTTTTTTTT>
##$WBST= 1024
##$WBSW= 4
##$XGAIN= (0..3)
0 0 0 0 
##$XL= 0
##$YL= 0
##$YMAX_a= 16021
##$YMIN_a= -18025
##$ZGOPTNS= <>
##$ZL1= 120
##$ZL2= 120
##$ZL3= 120
##$ZL4= 120
##$ABSF1= 0
##$ABSF2= 0
##$ABSG= 0
##$ABSL= 0
##$ALPHA= 0
##$AQORDER= 0
##$ASSFAC= 0
##$ASSFACI= 0
##$ASSFACX= 0
##$ASSWID= 0
##$AUNMP= <proc_1d>
##$AZFE= 0.1
##$AZFW= 0.5
##$BCFW= 0
##$BC_mod= 2
##$BYTORDP= 0
##$COROFFS= 0
##$CY= -3
##$DATMOD= 1
##$DC= 0
##$DFILT= <>
##$DTYPP= 0
##$F1P= 0
##$F2P= 0
##$FCOR= 1
##$FTSIZE= 65536
##$FT_mod= 6
##$GAMMA= 0
##$GB= 0
##$INTBC= 1
##$INTSCL= 5.30512e-09
##$ISEN= 30
##$LB= 1
##$LEV0= 0
##$LPBIN= 0
##$MAXI= 10000
##$MC2= 0
##$MEAN= 0
##$ME_mod= 0
##$MI= 50
##$NCOEF= 0
##$NC_proc= -4
##$NLEV= 6
##$NOISF1= 182.463
##$NOISF2= 159.3651
##$NSP= 0
##$NTH_PI= 0
##$NZP= 0
##$OFFSET= 248.5645
##$PC= 4
##$PHC0= -8863.455
##$PHC1= 147.8694
##$PH_mod= 1
##$PKNL= yes
##$PPARMOD= 0
##$PSCAL= 0
##$PSIGN= 0
##$REVERSE= no
##$SF= 81.014009
##$SI= 65536
##$SIGF1= 159.3651
##$SIGF2= -187.1042
##$SINO= 113.3802
##$SIOLD= 16384
##$SREGLST= <1H.CDCl3>
##$SSB= 0
##$STSI= 65536
##$STSR= 0
##$SW_p= 40650.406504065
##$SYMM= 0
##$S_DEV= 0
##$TDeff= 32768
##$TDoff= 0
##$TI= <>
##$TILT= no
##$TM1= 0
##$TM2= 0
##$TOPLEV= 0
##$USERP1= <user>
##$USERP2= <user>
##$USERP3= <user>
##$USERP4= <user>
##$USERP5= <user>
##$WDW= 1
##$XDIM= 65536
##$YMAX_p= 396902934
##$YMIN_p= -31324422
$$ End of Bruker specific parameters
$$ ---------------------------------
##NTUPLES= NMR SPECTRUM
##VAR_NAME=  FREQUENCY,     SPECTRUM/REAL,   SPECTRUM/IMAG
##SYMBOL=    X,             R,               I
##VAR_TYPE=  INDEPENDENT,   DEPENDENT,       DEPENDENT
##VAR_FORM=  AFFN,          ASDF,            ASDF
##VAR_DIM=   65536,         65536,           65536
##UNITS=     HZ,            ARBITRARY UNITS, ARBITRARY UNITS
##FACTOR=    0.620285442955139, 1,           1
##FIRST=     20137.2065510759, 0,            0
##LAST=      -20513.1999529892, 0,           0
##MIN=       -20513.1999529892, -31324422,   0
##MAX=       20137.2065510759, 396902934,    0
$$ Real data points
##PAGE= N=1
##DATA TABLE= (X++(R..R)), XYDATA
$$ [...]
37592D66691n0846j14326j68819j47896k3302N8239k6344j25853k0606J87819
37582C4757K01685J1814r5400l0676n010o3664M2105L37730M20115O3759l44046
37571E73169l34911k4735J40870N9419k8718l0120n0300o1133O1624K12233J55044
37560F72442n8243j32783o741O3828n4053j69810j05783L7545P3098j4274j02965
37549B02261q8951M7954K17731K58987J19763m2917p3096l6607o0848p2681N9238
37538E30834K16550J66996l3371r7980J6932L3956j63941k97105j13562J95804
37528D55113K41494l2823k89239k46199j2221J02673J0675p0235J4798R0508n8177
37517B06367k69912k06341P5005J61860k8822q6637J68070L05983L075l39309
$$ y = [466691, 415845, 301519, 132700, -15196, -38498, 19741, -6603, -132456, -153062, 34757, 236442, 248256, 152856, 122180, 117170, 53506, 95611, 433341, 853456, 917215, 573169, 238258, 213523, 354393, 413812, 385094, 354974, 304674, 243541, 305165, 517398, 672442, 614199, 481416, 474675, 538503, 484450, 314640, 208857, 246402, 319500, 305226, 202261, 113310, 161264, 378995, 637982, 757745, 714828, 641732, 605125, 544277, 471596, 530834, 747384, 914380, 881009, 783029, 799961, 833917, 669976, 372871, 259309, 455113, 696607, 663784, 374545, 128346, 116125, 218798, 229473, 159238, 174036, 264544, 206367, -63545, -269886, -194881, -33021, -61843, -148480, 19590, 325573, 328648, -10661]
37507a0661k03490J90524K45286o2654k40288j28481l3270p1459l2670R3142O1524
37496a92497j01536r6871O8284P0638r9095r4589J13272J51582l8099n5584J96394
37485g8101K80223J5883j66539n908J14326j10873l29049j72573P5745J4344j59871
37474e22393n6268J88383J97368M0811M3885J68598J51754L9063M4354Q1408l8576
37463C38387j44309K0778K42524J17050k48941l84497k06359o1304p3087j6339
37453d16097J52063J85093L3890n2971l568l3464j85362k06040j5047J19529L5741
37442c86233o3886J1601J34755J22145L0076M47L5055Q5719J67860K36371J39881
37431E13791j40392l61045k90901j5122J77033J47258K8666P899Q9570J32869
$$ y = [-10661, -214151, -23627, 221659, 159005, -81283, -209764, -243034, -314493, -347163, -254021, -192497, -294033, -390904, -322620, -251982, -351077, -445666, -332394, -180812, -218911, -274495, -78101, 202122, 218005, 51466, 45558, 159884, 49011, -280038, -452611, -376866, -362522, -522393, -578661, -390278, -192910, -152099, -108214, 60384, 212138, 251201, 295555, 376963, 338387, 194078, 214856, 457380, 574430, 325489, -59008, -265367, -326671, -399758, -416097, -264034, -78941, -45051, -98022, -101590, -135054, -320416, -526456, -541503, -421974, -386233, -450119, -438518, -303763, -181618, -151542, -151095, -116040, -30321, 137539, 373910, 513791, 373399, 12354, -278547, -293669, -116636, 30622, 59288, 67187, 156757, 289626]
37421B89626Q3450N1454R1593M5635j99008m00272k31228J56339K39144j04026
37411B2707l61545j57975J79036J76188m0365k7426K13745K86887Q9730n1565
37401C29417O1310K21431J61171j13030l77842m03777j39715J84425K59221J00152
37391B82763J5918O6585n2579l66319l67894J68893O27976L90624j92167l69497
37381B04303j68491j71871l72547k08443L09790M85770J02603k03412j5606K32258
37371A94354P6614k34291k61375n6298J12135K19113K71233R0329k98683m83100
37361c69969k41738Q3349J45474J15728K65301M20633K75293n9419k37717j82323
37351B14612n5540M5094O3172r1884l15870k85943N3689K92906J46370r0854l0979
$$ y = [289626, 373076, 424530, 516123, 561758, 362750, -37522, -268750, -112411, 126733, 22707, -338838, -496813, -317777, -141589, -181954, -209380, 4365, 291252, 380982, 329417, 390727, 612158, 773329, 660299, 282457, -121320, -261035, -76610, 182611, 282763, 298681, 365266, 312687, -53632, -421526, -252633, 375343, 765967, 573800, 204303, 35812, -136059, -508606, -717049, -407259, 78511, 181114, -22298, -37904, 194354, 270968, 36677, -224698, -280996, -168861, 50252, 321485, 411814, 113131, -369969, -611707, -528358, -382884, -267156, -1855, 418778, 694071, 634652, 396935, 214612, 159072, 204166, 267338, 175454, -140416, -426359, -372670, -79764, 66606, -24248, -55227]
37340e5227J92435K08374K0299j08555j47787k22954k34897k6092J98849R0079
37330h5476k57127l63794m3262L48988M06321J30167j73863k53276r6287J14386
37320b73223K00366J71469J54411J51422M8838j10760j21750L0795R0103o6204
37310B75467k25325k02236j02982m6121N2592J99162J69231r0703k45099o5482
37300b81496J75063J46160j4708p832Q9207J9038j59287k13610j73809j83515
37290f04789j13917J98486M86179L34661j39813l83403j68653J63000K38241N4000
37280F3992j79275k69662j11201K00685L54576J80344p1423p8574P1198P8506
37270B39166m7811o8033J2075k2657j48722j23042O9527J85435J30717L5044n2843
$$ y = [-55227, 137208, 345582, 365881, 257326, 109539, -113415, -348312, -374404, -175555, -85476, -342603, -706397, -749659, -400671, 5650, 135817, -38046, -291322, -387609, -273223, -72857, 98612, 253023, 404445, 453283, 342523, 220773, 251568, 341671, 275467, 50142, -152094, -255076, -301197, -248605, -49443, 119788, 29085, -216014, -281496, -106433, 39727, 25019, 17187, 106394, 125432, -33855, -247465, -421274, -604789, -718706, -520220, -34041, 300620, 160807, -222596, -391249, -228249, 9992, 63992, -115283, -384945, -496146, -295461, 59115, 239459, 168036, 89462, 160660, 239166, 191355, 123322, 135397, 112740, -35982, -159024, -89497, 95938, 226655, 261699, 208856]
37259B08856j80829k47914j14071Q8773J15574N788l9107m3658j10580o9036K08805
37248a77399L32894r7091o34951m46014L52904P01904J66685m07222k44505K06080
37238b46715J33139l06680l61080L6519K46705K9795j53001j070J67562L8979
37228d15847j59681p6275J60020J17712k88052o43560n68225j95876J0532j46388
37218b205640l70342l01546m499J59381M9644j07180q0926R1876K49793L14287
37208b205152K87974K09362J60493J82700J82483P3827k9389K9801J55546J24588
37198h27767k6840m9622Q8433J58872R1162P3826J63663J64554J1659q8786m5522
37187b86368m3236j50864j40936R0568K80786K16084N9196J5459N814o6048o7567
$$ y = [208856, 28027, -219887, -333958, -245185, -129611, -123823, -162930, -206588, -317168, -386204, -177399, 155495, 58404, -576547, -1022561, -669657, 32247, 198932, -208290, -452795, -246715, -113576, -420256, -781336, -744817, -498112, -468317, -621318, -622388, -454826, -415847, -575528, -651803, -491783, -374071, -662123, -1305683, -1873908, -2069784, -2059252, -2205640, -2575982, -2877528, -2882027, -2722646, -2673002, -2780182, -2861108, -2769232, -2519439, -2205152, -1917178, -1707816, -1547323, -1364623, -1182140, -1108313, -1137702, -1107901, -952355, -827767, -854607, -904229, -815796, -656924, -565762, -491936, -328273, -163719, -152060, -240846, -286368, -329604, -480468, -621404, -530836, -250050, -33966, 25230, 40689, 46503, -19545, -87112]
37176h7112M2834N319k74089l91749k1823M62036M42348m9654m05469l07222l5333
37165f19914P5349L9594J7657N6205J18293J41373N5073p7421l6078K10228L05109
37154B85468j6543m13713l35006J60085M59389K75834l4421j15188o4926o1505
37144A39474q851J49531J63727j11972l48696j87752J62627K11896n5604j77846
37134f3466K7622J80443j6731k57074q9671L46915M73884J04416k89715k65198
37124A51425n834L0845j81111k54876k9287K00382J58041l2380j00009k2343K4388
37113f0759m2480j43422j67561n6441J50829K89676K20288N5795N1071J98402
37103D95398J87505j02064l55212k84865o8619k8453j09997m6667J23764J22186
$$ y = [-87112, -44278, -38959, -313048, -704797, -726620, -264584, 177764, 128110, -277359, -584581, -619914, -544565, -504971, -487314, -431109, -312816, -171443, -116370, -193791, -229869, -19641, 285468, 268925, -144788, -479794, -319709, 139680, 415514, 381093, 265905, 200979, 139474, 130623, 280154, 443881, 331909, -16787, -204539, -41912, 169984, 114380, -63466, -35844, 144599, 127868, -129206, -218877, 128038, 601922, 706338, 416623, 151425, 145591, 176436, -4675, -259551, -288838, -88456, 69585, 37205, -62804, -85147, -60759, -103239, -246661, -414222, -470663, -319834, -30158, 190130, 245925, 296996, 495398, 682903, 580839, 225627, -59238, -127857, -156310, -266307, -312974, -189210, -67024]
37093f7024o1188j31218K0476J62555J31595N6321O3929N6726o9111k09766k11726
37082b58431q1787P4261J84115K01478J10183M149J9364J24547J28476l9505k08056
37071B58794k04923q7253l8654j28003k43027k10269L2645L27259M03207J95058
37061C04834l5840n1328J0461j13260l05245j91072K20473M46575K30704p3087
37051D43215p7941M2843p3896k96802j88038K27560M10880J13560k30561j54980
37041B15840J55692J81878j35549l29731j23428J80072J83960j5136j8728K30759
37031E25629L43889O2156l55197m85120k77809k8784N7772L9928K4613K0450K4752
37020d7721O1560Q1967j3592j95409k85948j83798J3371J62031K22673J97531
$$ y = [-67024, -128212, -259430, -238954, -76399, 55196, 111517, 175446, 232172, 163061, -46705, -258431, -340218, -265957, -81842, 119636, 229819, 233968, 253332, 377879, 506355, 466850, 258794, 53871, -33382, -72036, -200039, -443066, -653335, -620690, -293431, 109776, 304834, 268994, 217666, 228127, 114867, -190378, -381450, -160977, 285598, 516302, 443215, 365274, 408117, 334221, 37419, -150619, 76941, 487821, 601381, 370820, 215840, 371532, 553410, 417861, 88130, -35298, 144774, 328734, 313598, 294870, 525629, 869518, 931674, 576477, 91357, -186452, -215236, -157464, -117536, -92923, -72473, -47721, 13839, 95806, 82214, -113195, -399143, -582941, -569570, -407539, -184866, 12665]
37010A2665O1134j42069k44216j32159Q0140J77471J09872K2695K8670O3881J7295
36999E5379p8114q4434J8740P0435l1196j25321Q72K37925K42004l6208j95184
36988G4898M7889L86708L36839o0605l31968k80680j69846j77607j27912Q4826
36978b17458K17279P6932j24379j06929M1655P0863j768R511P9726L1570j12219
36967c5217j53194n7078J7044J3139L9300J28143J78259J51083J10361N8828n3656
36956C97012j60821j38802l4136m323l4181K9700J48894R7362j35831k55678j02314
36945a93118J03115J21745L8164K9644M0891m9470j31448k6594J74889K26038
36935C33856R9923q909j4005j4971o0211o5677J0659R8308J28652P6280p0316
$$ y = [12665, 73799, -68270, -312486, -444645, -364505, -187034, -77162, -54467, -25797, 38084, 55379, -22735, -107169, -88429, -17994, -49190, -174511, -173639, 64286, 306290, 270082, 74898, 122787, 509495, 846334, 785729, 453761, 173081, 3235, -174372, -302284, -217458, -179, 76753, -47626, -154555, -112900, -42037, -43805, -34294, 45432, 77002, -35217, -188411, -245489, -228445, -215306, -176006, -47863, 130396, 281479, 391840, 450668, 397012, 236191, 97389, 63253, 58930, 24749, 54449, 203343, 300705, 164874, -90804, -193118, -90003, 31742, 69906, 99550, 140441, 90971, -40477, -67071, 107818, 333856, 433779, 424870, 410865, 395894, 335683, 270006, 280665, 378973, 507625, 583905, 513589]
36924E13589k20390j55463J77910M33911K31114k68765m83946j74478K49287L05861
36914F08630K6795k20103k34631q9023Q3058J77957J21909m0864j49698j32109
36904A51921q7453q2696l9665P0270J22806O4120K7475Q5729J19342Q1270J14959
36893F28078K18808J24181k18968l88400j00424K56809J77289j61280k20680j2750
36883C02663k1272l02875l78769q4841J56871Q6252j2616Q1284J32816k6899j29832
36872a97218J9360J52602L9880p4726M9059J66255K504k00357r9576J23617R0539
36861G1939j00683q6178R2871J01206n5632p0742P8106J23385L8542M8252J29236
36850C70302K4827k20677k56397j9702J52360R8916M2765R4264K8285k40430l93540
$$ y = [513589, 293199, 137736, 315646, 749557, 980671, 711906, 227960, 53482, 302769, 608630, 635425, 415322, 180691, 91668, 174726, 352683, 474592, 433728, 284030, 151921, 64468, -18228, -57893, 12377, 135183, 199303, 226778, 312507, 431849, 513119, 628078, 846886, 971067, 752099, 363699, 263275, 520084, 697373, 536093, 315413, 302663, 281391, -21484, -400253, -485094, -328223, -241971, -254587, -173303, -40487, -67386, -197218, -177858, -25256, 14624, -60102, -11043, 155212, 157716, -42641, -142217, -18600, 71939, -28744, -114922, -22051, 79155, 23523, -47219, 30887, 154272, 192814, 241066, 370302, 395129, 174452, -81945, -101647, 50713, 149629, 192394, 286658, 314943, 74513, -319027]
36839c19027j90436J27192J91796J5144j20519q0909M0357J21960J10934J2872
36829i0636r4944j17363n7397Q653N6855R2780O2088m6107r0345J5852R6813j7179
36817a80930j44943k8316J67461P3208k20607k37347J04091L20378J24924j58080
36807a80161j69459l1968j536j6381P4963J74806J52191J10987J43584R3351j39025
36796B11352l17473k10865J8415O7518o8851j89519k13621j53175L2326K87050
36786e36843L65529J51223j19490j84430r4358o086R8415K29400K12389J135j09703
36775G181P5068K67546J29521j66558k26395n9851K8168j4106j3563P8j18673
36764i1584k16809j1393L66654M71407J91863j28625k39254k35057k32621j86767
$$ y = [-319027, -509463, -382271, -190475, -175331, -295850, -376759, -336402, -214442, -103508, -90636, -185580, -302943, -360340, -351687, -294832, -202052, -139964, -186071, -276416, -260564, -163751, -180930, -325873, -354189, -186728, -113520, -334127, -571474, -467383, -147005, -22081, -180161, -349620, -381588, -383124, -399505, -324542, -149736, 2455, 113442, 257026, 350377, 211352, -106121, -316986, -298571, -231053, -299904, -489423, -703044, -856219, -823893, -536843, -171314, -20091, -139581, -324011, -418369, -424455, -326040, -96640, 115749, 116884, 7181, 82249, 349795, 479316, 312758, 86363, 26512, 54680, 40574, 27011, 27089, -91584, -308393, -319786, 46868, 518275, 710138, 581513, 342259, 107202, -125419, -312186]
36754c12186q4854J4177J48285L36044L50923J1130l66794k93873J11386K19977
36744A34215j32178l50767j1145M59074M18706o0886l65790k12222Q7022J57088
36734A23117Q874r3399j749J66708J98540N7747p4276p7058p6298j97173k84720
36723b49687j38088R2383R3343q2443q2052J39152K23514K9055j18877R99J17275
36712B4574m7959k71499j90159R1419J70665j5778j26484L9989K79073L24952
36702B78793K08831J44168J87508J66707l9467k57135j98357J02420K45060L896
36692H42424l08690k88373n0635n200j58399j49588M2773K1554k76715l58403
36682f89252J1784L35298J43377k37707k09997J65217L46736J95174O3262R8545
$$ y = [-312186, -397040, -382863, -234578, 101466, 452389, 463519, 96725, -197148, -85762, 134215, 2037, -348730, -359875, 99199, 517905, 457019, 91229, -120993, -33971, 123117, 131991, 38592, 36843, 203551, 402091, 459838, 385562, 308504, 232206, 35033, -249687, -387775, -295392, -202049, -284492, -366544, -227392, -3878, 25177, -93700, -92701, 24574, -23385, -294884, -485043, -393624, -222959, -238737, -365221, -325232, -46159, 278793, 487624, 631792, 819300, 986007, 946540, 689405, 491048, 593468, 838528, 842424, 533734, 245361, 194726, 189526, 31127, -118461, -75688, -54134, -330849, -689252, -677468, -342170, -198793, -436500, -646497, -481280, -134544, 60630, 123892, 222437]
36672B22437N7377j39107k01545J4315K18589J30229j05021j71902m1033O4910
36662D9249L1311l6635k5585K8709L5027K365J1780M7241k2453k11516k91814
36651c82321q1380K26363K77596O8616p2915l5606o7673k56222k89425R678L03202
36640c00087K44773L9273P7175K66449K06465j27159l55524k90083j08904L7683
36630c09939J75156K47986J23119r4800j21689O1844J66621O5149l8903q089M121
36619B70576j22815k23902j09568J32071K63499J86728k803j32383p8752R6883
36609B79534J55257k7243k41041k31992j02400j18220k09678p4236K35859K97517
36599c6643j3608k92156k17003K3595J36832J51322J73823J02505r9392j82070
$$ y = [222437, 279814, 140707, -60838, -46523, 172066, 302295, 197274, 25372, -15661, 49249, 80560, 43925, 18340, 47049, 82076, 84441, 96221, 143462, 121009, -90507, -382321, -463701, -237338, 40258, 108874, 35959, 353, -67320, -323542, -612967, -603289, -300087, -55314, -16041, 61134, 327583, 534048, 406889, 51365, -238718, -347622, -309939, -134783, 113203, 236322, 141522, 19833, 81677, 248298, 313447, 274544, 266455, 270576, 147761, -76141, -185709, -53638, 209861, 396589, 393786, 261403, 182651, 279534, 434791, 407548, 166507, -65485, -167885, -286105, -495783, -570019, -334160, -36643, -50251, -342407, -559410, -535815, -398983, -247661, -73838, 28667, -70725, -252795]
36589b52795n338J51772M1683r7128L9090K26739O4035k77672k42018K16229N07210
36578C71807K74312j34450k59568j53591j31556k27163k27362o8429R4694J40695
36568c20611R9436N8212P9525J59729J84067J0920l08479m96558l49363J0002
36558h73120K84695L30834K19422O1289p3686j08067Q36J53833J82837O7214l8008
36547B08079k9703J0306j8981o1739k1213L7796k3186j53752j37915P4489K50651
36536A34832J98206L5613k6142k6759j44506l21841k92801o905K52775K70873
36526G3345J66991J16870N1152j38484k83447j34561K04736L50803J60877r0540
36516D77742j26132j2077L5053j6654n2995n4465r4490j48968r9312N5187J37430
$$ y = [-252795, -258133, -106361, -64678, -161806, -122716, 104023, 168058, -109614, -351632, -135403, 371807, 646119, 511669, 252101, 98510, -33046, -260209, -487571, -556000, -461306, -320611, -221175, -162963, -83438, 76291, 260358, 271278, -37201, -533759, -883122, -873120, -588425, -257591, -38169, 23120, -50566, -158633, -157797, -3964, 178873, 246087, 208079, 178376, 188682, 169701, 107962, 86749, 124545, 101359, -52393, -190308, -115819, 134832, 333038, 368651, 342509, 315750, 171244, -150597, -443398, -450303, -197528, 73345, 240336, 357206, 408358, 269874, -13573, -148134, 56602, 407405, 568282, 477742, 351610, 339533, 374586, 357932, 304937, 250472, 155982, 7014, -92298, -37111, 100319]
36505A00319J2873k12077k84429p8310K56921M19673K37566j48964m01352l19227
36495d17007m1586J37065J13780M3528P5636J70076K26653K46026K46321J49232
36485I49724p8134k56900j88250K0874O1330j27384k62000j53519J6952J8421
36475A114o6443k7584R6070R9378k8665j02834o0765k7497o3142p8791k3556M9877
36463b32838J19961J97710J94320J1982k20171k47057o4090O4698K7903K3663
36453a23919J77655K89289J54212q8709j61425l6661R1779J06624L9473n6556
36443C91762j34962j38713q4623o3398o0850N4005K46329K49752k3658k45159
36433A90485j15296J58246J65491q2284k23643j46963q8396j37130q9376J06494
$$ y = [100319, 113192, -98885, -383314, -461624, -204703, 214970, 452536, 303572, -97780, -417007, -458593, -321528, -207748, -164220, -88584, 81492, 308145, 554171, 800492, 949724, 871590, 614690, 426440, 447314, 508644, 381260, 119260, -34259, -17307, 1114, -65329, -92913, 3157, 102535, 73870, -28964, -89729, -117226, -180368, -259159, -282715, -232838, -112877, 84833, 279153, 291135, 70964, -176093, -240183, -175485, -147582, -123919, 53736, 343025, 497237, 408528, 247103, 210442, 302221, 408845, 448318, 391762, 256800, 118087, 33464, -29934, -90784, -36779, 209550, 459302, 435644, 190485, 75189, 233435, 398926, 316642, 92999, -53964, -142360, -279490, -368866, -262372]
36423b62372J79083P55j31728N1844L32546K98133n7413l29204k39212O2807K38284
36412A43523J29384j33086k87456j91877L4677J42205M0597j05122r7718O7182
36402b57691K44889L08466K11787o970k08814k42737j28763m4636n3630O182K29289
36391E7372L94188K26552j69195l89826k48801J7509J18007O8139N4718J02906
36381B31569P1028p8320j85338j06858R2024K21250J79069K6442j11815j58008
36371A81043j08907j9639K2817l3469j27689j22496K4081J58807R4226j31430
36361f2656k60957j36065Q5723J34625p135q8134M9049K30782J76287j21617l65362
36350c65460k95872K5059K93782K72219J3838j79738o2487K42314L18491k0286
$$ y = [-262372, -83289, -82534, -214262, -162418, 170128, 468261, 410848, 81644, -157568, -94761, 143523, 272907, 139821, -147635, -339512, -304835, -162630, -122033, -227155, -324873, -257691, -12802, 295664, 507451, 500481, 291667, 48930, -79833, -124469, -178099, -171917, 57372, 451560, 678112, 508917, 119091, -129710, -112201, 5806, 73945, 128663, 231569, 302597, 224277, 38939, -67919, 24105, 245355, 424424, 450866, 339051, 181043, 72136, 52497, 75314, 41845, -85844, -208340, -184259, -25452, 68774, -62656, -323613, -459678, -373955, -239330, -246465, -334599, -285550, -54768, 121519, -98, -365460, -661332, -636273, -342491, -70272, -56434, -236172, -298659, -56345, 262146, 241860]
36340B41860l81731k27187L59429O81454L43713k00407l02288o374J46631R3q4378
36329E70815N3522R8814j27090k90702q7173K29857K26708o0336k20931o4835
36319C28649K00791L06059J85365k8047j13051L9105K43698K20201L0707J2946
36309A426423J72657Q8536l32634n24633j21242L46199K15441k57201l56848j05244
36299E51454j16235m12148l64557J20483L45140J2592k48841K3333L55054K12352
36289D78627r0891k8535K00690J06020j87035k10878k596N0722l7316L8585K02825
36278E20218J26940r6094p8993J34091J27044j33027k44424q8505L0148R865R1931
36267C99194K78552K30931r3646k86641j59185j1524k9541J8992K30900K80188
$$ y = [241860, -139871, -367058, -7629, 673825, 1017538, 817131, 514843, 508469, 655100, 655193, 570815, 624337, 723151, 596061, 305359, 218186, 448043, 674751, 614415, 393484, 328649, 529440, 835499, 1020864, 992817, 879766, 918871, 1162569, 1382770, 1413477, 1426423, 1599080, 1687616, 1354982, 830349, 709107, 1055306, 1270747, 1013546, 656698, 551454, 435219, 23071, -341486, -221003, 124137, 136729, -112112, -88779, 266275, 478627, 387736, 359201, 559891, 665911, 478876, 267998, 265402, 316124, 278808, 317393, 520218, 647158, 551064, 472071, 606162, 733206, 600179, 355755, 267250, 297398, 307263, 399194, 677746, 908677, 815031, 528390, 369205, 357681, 328140, 347132, 578032, 858220]
36257H58220J4051j95762p8716O1118o3791j44929J64711N15867L33427k20424
36247A243772m23325o0195L05353J93505j78875l16040r4367K07131K99103J45928
36237A321990m9993o8318O7670J18224l55n0414J30720K87559J20068j72287j42223
36226A562641J84719L15206N6838j96470j09802J02438J00902l0059j5310Q5303
36216B056406q061k70609l54175r8972K51093M04295L38528J78903j7755k19378
36206B260275l16380k24248k0416J35998J73101J11811k6030j97255k71693j36604
36196A488559J12294K10634K1206k89261m37399l36227j56867j10182k27657l52820
36186g7720l17688j29164K7839R084r4579p6190P7987J45053q083k08565k08788
$$ y = [858220, 872271, 676509, 597793, 658911, 595120, 450191, 614902, 1130769, 1464196, 1243772, 820447, 760252, 1065605, 1259110, 1080235, 764195, 669828, 876959, 1176062, 1321990, 1271997, 1203679, 1271349, 1389573, 1389218, 1338804, 1469524, 1757083, 1877151, 1704864, 1562641, 1747360, 2062566, 2119404, 1922934, 1813132, 1915570, 2016472, 1986413, 1971103, 2056406, 2048345, 1777736, 1423561, 1324589, 1575682, 1979977, 2318505, 2497408, 2479653, 2260275, 1943895, 1719647, 1699231, 1835229, 2008330, 2120141, 2094111, 1896856, 1625163, 1488559, 1600853, 1811487, 1832693, 1543432, 1106033, 769806, 612939, 502757, 275100, -77720, -395408, -524572, -496733, -487649, -582228, -658418, -580431, -435378, -443461, -652026, -860814]
36175h60814p649K05389L12797L03536J57328q3325k06482n8663J55082Q8370
36165E569k13067l11470p800L34822K87177o6887k86672j60362J04874K14448
36155i9368J12377k5202j7096J09975J32152q3242l44743l55717j35314K3409
36145f82769K1589N8060J86632J58163r5286k11994M2071L17957K04913q2921
36135h3585n2561K30290K36442j47442m29419k87102R447J22386J11291J37599
36125a52654J25196J025p4221r870r980j89057k63078J1036L39511K64664j21628
36114g9056k89091m3464K47794K49195P3668l0630o7710j49592k06894j05359
36104d01139P0482R7105n0653j44252k3693J74102J99743K2444j38048j00518
$$ y = [-860814, -868463, -663074, -350277, -46741, 110587, 27262, -179220, -237883, -82801, 5569, -207498, -518968, -526768, -191946, 95231, 28344, -258328, -418690, -313816, -99368, 13009, -12193, -29289, 80686, 212838, 129596, -215147, -570864, -706178, -682769, -661180, -603120, -416488, -258325, -353611, -565605, -523534, -205577, -664, -83585, -136146, 94144, 330586, 183144, -246275, -533377, -523930, -401544, -290253, -152654, -27458, -26433, -100654, -110524, -120504, -309561, -572639, -561603, -222092, 42572, -79056, -368147, -411611, -163817, 85378, 159046, 128416, 60706, -88886, -295780, -401139, -330657, -233552, -284205, -428457, -452150, -278048, -78305, -55861, -193909, -294427]
36094b94427O5035J62099J20670L4277o474j613K5659O4686P0515l117r7724r6287
36082D3299r044K2791l9960n5827N3717J49177R9377O518K0884O5348k2786j70236
36070A63258j63671k9830j3420j38342j16004J69015L84442K12932j29426j66090
36060A72864J44908L42159J23691k42190l23612j04650P5128L4436o2460l3860
36050A26414M1855m788j30643j19217R7292L04951K62468J975k26526k78499k50290
36039a75008k55238k15863k6641J74465J35133r6330j47501J53465M61543L55106
36029C63131o8316l25739j96318P5873K07135J73414L9743j69976l15465j79153
36019c95671J57850K80437M909l02449k39851O6694K40318K44452K89321L27708
$$ y = [-294427, -229392, -67293, 53377, 87654, 81180, 79567, 105226, 169912, 240427, 237310, 139586, 43299, 34255, 57046, 17086, -38741, 14976, 164153, 263530, 270048, 290932, 356280, 333494, 163258, -413, -30243, -43663, -182005, -298009, -128994, 255448, 468380, 338954, 172864, 317772, 659931, 783622, 541432, 217820, 113170, 188298, 222734, 160274, 126414, 168269, 163481, 32838, -86379, 10913, 315864, 578332, 580307, 353781, 75282, -175008, -430246, -646109, -672750, -498285, -363152, -459482, -606983, -453518, 8025, 363131, 294815, -30924, -227242, -151369, 55766, 229180, 268923, 98947, -216518, -395671, -237821, 42616, 47525, -254924, -494775, -428081, -187763, 56689, 346010, 673718]
36009F73718J16834k74911m74285l37637r0870Q1768K01751K31855P1277j23833
35999G5667n3830J89634J64374j92454l69168o7345K97399K42002o0121j44697
35989H1461p749J2225j20070j22825P3510K37065K34188J39729m643j89300k53055
35978H0536o4504J56463O9354k53561l96560k08834L3027J10821J33117K20502
35968a19639K69884J80308L9328n5526j36367k17670k16885j11206J0308R5923
35958b61542J43591P5296j50541l17821j60774J84606K90573O6342j02961K9812
35948b03419K14954J63256l897k9358N8014Q4458M8023J9050n5145j83196j84211
35937g1471K5525K15999J83381P6726Q7331O2857j90329m34774k89395J26641
$$ y = [673718, 790552, 515641, 41356, -296281, -387151, -305383, -103632, 128223, 199500, 75667, 21837, 211471, 375845, 183391, -185777, -253122, 44277, 286279, 226158, 81461, 73712, 85937, -34133, -156958, -83448, 153617, 387805, 527534, 522891, 333591, 80536, 16032, 172495, 241849, -11712, -408272, -617106, -584079, -473258, -340141, -119639, 150245, 330553, 369881, 314355, 177988, -39682, -256567, -367773, -357465, -261542, -117951, -42655, -193196, -511017, -671791, -487185, -196612, -130270, -233231, -203419, 11535, 174791, 170894, 141536, 199550, 284008, 332031, 351081, 295936, 112740, -71471, -45946, 170053, 353434, 430160, 517491, 580348, 390019, -44755, -334150, -207509]
35927b07509L09073J02414j34041j37374q2114j75531k81330j56672J70125M37053
35917a55906M24360J16900k60032l51430k0746L97806M28450N8277k51837k00227
35907A85615K1769J24534J11712R0024l213k12208l33976j80356Q5390J68627
35897E7918Q3908P0489J48322J04646o8283p8556J92062M15566K47785j50239
35887A023618k87999J7405M28372N41188L40892R9892p852j3205L9908J73343
35877B355562L40978M04266L20391K06090J22871m0911l29066n16850l84255j03510
35867B375566p2993l54713n56102l69137J4940J89263M2303k10707l70812l99569
35857B88039k89681m2612K00677K26406L7737q8601L6747K26080J58923j53428
$$ y = [-207509, 101564, 203978, 69937, -67437, -149551, -325082, -606412, -763084, -592959, -155906, 268454, 385354, 125322, -226108, -246854, 150952, 579402, 637679, 385842, 185615, 207384, 331918, 443630, 533654, 530441, 318233, -15743, -196099, -110709, 57918, 141826, 212315, 360637, 465283, 397000, 318444, 510506, 926072, 1173857, 1023618, 735619, 753024, 1181396, 1722584, 2063476, 2163368, 2155516, 2142311, 2182219, 2355562, 2696540, 3100806, 3421197, 3627287, 3750158, 3709247, 3380181, 2863331, 2479076, 2375566, 2302573, 1947860, 1391758, 1022621, 1037561, 1226824, 1269127, 1058420, 687608, 288039, -1642, -44254, 156423, 382829, 420566, 331965, 368712, 594792, 753715, 600287]
35847F00287l59819k44322L269R3991K4804k4120k4435p0268r3545O9449L05885
35836B81176K63479j15286m20004l36477q0834M888k969J42218K94541J04963
35826A35695l08379m12835n0867L12767K90208O7720k7432m0623j38928j81217
35816c53891M6795L62389L65744J9728l02249l33782j74887j4147J18510K27247
35806c8543K09330N945k12479j81161J18295L58728K20307j71478l31307m1543
35796f3906K99579K02690j99358l50085j19563M5188q5152j33788J80794M66359
35786B42758K51073k22856l58185j11764M7295l9231n1520J40266K22288n94k58882
35775a39352k40897j4859J59340J76757J00485L2677M8230Q8008l9434l27075
$$ y = [600287, 240468, -3854, -585, 93406, 118210, 94090, 69655, -613, -94158, -24709, 281176, 544655, 429369, 9365, -327112, -407946, -403058, -406027, -263809, 30732, 135695, -172684, -585519, -636386, -323619, -33411, 34309, 6877, -33746, -172674, -353891, -307096, 55293, 421037, 440765, 138516, -195266, -370153, -384300, -265790, -38543, 170787, 176732, -35747, -216908, -98613, 260115, 480422, 308944, -22363, -63906, 235673, 438363, 239005, -111080, -230643, -185455, -270607, -404395, -223601, 242758, 493831, 270975, -87210, -198974, -151679, -190910, -242430, -102164, 120124, 119530, -139352, -380249, -395108, -235768, -59011, 41474, 74151, 122381, 210389, 170955, -156120]
35765a56120l87837K5579M72912L27972k43591m53114q3497K16185L9564j49652
35755c91599Q1938L37635J09653k88142k45801J03673J61519r0062j29431J39898
35745b10719K62983Q2149l5397P1372R0963j06666j90966j1283O6105j95906m23096
35734f00461k00090K66968M78837L41951J30570k4817j96586l33752k61324P567
35724c91137K27253K01146l9030k88457l07309k3193L06341L07088j4103k05851
35714b27252J6363L41599L09224l4204k60940j97309n6790m057K6105M9734o1609
35703i9136k86843l64524j51955J47473K71874K34351K05535K12172J46970L999
35693C19916q2068l4967N5934O7191N151j7257N2277J19455O8617n2953o9760
$$ y = [-156120, -543957, -518378, -45466, 282506, 38915, -414199, -497696, -281511, -241947, -391599, -309661, 27974, 137627, -150515, -396316, -292643, -131124, -221186, -350617, -210719, 52264, 134413, 99016, 170388, 261351, 154685, -36281, -47564, 18541, -177365, -600461, -800551, -533583, -54746, 287205, 417775, 392958, 196372, -137380, -398704, -391137, -163884, 37262, -1768, -290225, -597534, -620727, -314386, -7298, -21401, -227252, -210889, 130710, 439934, 405730, 144790, -52519, -109309, -113366, -87261, -37527, -99136, -385979, -750503, -902458, -754985, -483111, -248760, -43225, 168947, 315917, 319916, 237848, 202881, 258815, 326006, 331157, 313900, 366177, 485632, 554249, 501296, 431536]
35682D31536O9846J84299R7829j01645j90576j39840j26310k12350k30247p4125
35672b91583Q9346O8392l6244J5406J93092K00721o2959k98437k17624L0460R0662
35661b18768m7555m4330K22561M13524K21916j49829k74392r0446R4729R6420
35651B23830J4348o8670j95828k92427j67526J11628J84356o7171k58870n0287
35641e66617L18156L67950P0177j79602j65026n1650j3929j1895J6314K9510J6524
35630a70088K5600K4734n2677j18489k8091J28686J11202o9378j32966J5574J28853
35619a37040L0015j22401j40320q6637o1422J0811J52374J58198p3864k71162
35609e41448j56719J02288J57174K7910N867J12409Q8454q1135p6759K05876M03549
$$ y = [431536, 501382, 685681, 783510, 681865, 491289, 351449, 225139, 12789, -217458, -291583, -202237, -133845, -170089, -154683, 38409, 239130, 176171, -122266, -339890, -309430, -218768, -266323, -310653, -88092, 325432, 547348, 397519, 123127, 32681, 127410, 223830, 238178, 169508, -26320, -318747, -486273, -374645, -190289, -257460, -516330, -566617, -248461, 119489, 189666, 10064, -154962, -206612, -220541, -232436, -216122, -186612, -170088, -144488, -119754, -172431, -290920, -319011, -190325, -79123, -148501, -281467, -265893, -137040, -107025, -229426, -369746, -456383, -517805, -506994, -354620, -196422, -270286, -541448, -698167, -595879, -438705, -410795, -404928, -292519, -204065, -285200, -361959, -156083, 247466]
35598B47466J95215k22001m09956k51596k132R5130K5074r8362j58705q9123O1289
35587f07701J31497K8499j24763j29380K7659J68245J72322J07241P8251O8727
35577g9403R675p2033q9008m9447n1687j00791o6549R0055J80018M2093j52123
35566c39200q6529K11940L51278J35787j24768o5835J96176K53028j0142l09957
35556B11778l70818j61380K15227N77648O54628L41350k9549j3405L13071M16203
35546B154753R4364k12010r9909K07956K71093J02080L6824J52890K28586J62146
35536C098773N2107o5749k05951k18256M6456L75583L75790M8025j78133n7314
35526C271331J71362K11334J07032M7076M5266J2570n9669j56682l03497m41007
$$ y = [247466, 442681, 220680, -189276, -440872, -443004, -347874, -322800, -421162, -579867, -668990, -607701, -476204, -447705, -572468, -701848, -674189, -505944, -333622, -226381, -148130, -79403, -69728, -141761, -230769, -280216, -331903, -432694, -499243, -409188, -229170, -187077, -339200, -425729, -213789, 137489, 273276, 148508, 82673, 278849, 531877, 521735, 211778, -159040, -320420, -105193, 472455, 1127083, 1468433, 1438884, 1425479, 1738550, 2154753, 2249117, 2037107, 1937198, 2145154, 2416247, 2518327, 2555151, 2708041, 2936627, 3098773, 3150880, 3085131, 2879180, 2660924, 2707380, 3082963, 3458753, 3506778, 3328645, 3271331, 3442693, 3654027, 3761059, 3808135, 3853401, 3865971, 3806302, 3649620, 3346123, 2905116]
35516B905116m26491k73512j81464k09171j64968K7986J32089j8656j90382r3373
35506A507174J44290J63788r0231l24499l11904r5824J49755K42208O6625k55279
35496A196103l96391k40160q3956j63055k19681N3902L75339K32820k25996l17669
35486B11256J09211M01688J21126k98687k87937Q041J10683K5906J03017L27247
35476H31551L38129O4813j66258j56010m4975J6576L8832K040j59394l29394k78433
35465A57477k7983J28525L6754j37494j96876j35546j0782J62969L07596K89641
35455E74281J25472r366l8786o3056j29448j38674m5616N1377Q6648R5520O5184
35444E73536n7118j69024r2141R5299J07849p3065j20495Q5438K03745m971k19594
$$ y = [2905116, 2478625, 2205113, 2023649, 1814478, 1649510, 1677496, 1809585, 1790929, 1600547, 1507174, 1651464, 1815252, 1725021, 1400522, 1088618, 992794, 1142549, 1384757, 1451382, 1196103, 799712, 559552, 475596, 312541, 92860, 146762, 522101, 754921, 528925, 211256, 320467, 722155, 843281, 544594, 256657, 264698, 375381, 401287, 504304, 831551, 1169680, 1234493, 1068235, 912225, 867250, 883826, 922658, 924698, 765304, 435910, 157477, 129494, 258019, 294773, 157279, -39597, -175143, -185925, -22956, 284640, 574281, 699753, 690387, 651601, 588545, 459097, 320423, 274807, 326184, 412832, 508352, 573536, 516418, 347394, 255253, 350552, 458401, 385336, 264841, 350279, 554024, 549053, 329459]
35433C29459m3062L21570L37748n3096l45951j94656J74900L47015K03153p1121
35423A005959k37147j74374L6377J61936P9404m7445j8766O4900k7270k17026
35413F26548j87302Q4145K21993J1171k65626k50089j0233J27085O5760l459N2556
35402D72549J50112J63798Q6247j0042o6106p0004m2776N862R7301K10916K29745
35391A227602P6942j15626j38278n079P3395L9767N6956J46480O5384k63400m86375
35380F77768k84460J09940K16542p198j74764j08062m2384j38868k04451p4162
35370c0099O6957r65j39111o4280J84805K89507J15490j21841j82094q5145L363
35359C6587K6080N9182J42224J91155J07988p2285k04843k10526j59433j31977
$$ y = [329459, 286397, 607967, 945715, 892619, 546668, 352012, 526912, 873927, 1077080, 1005959, 768812, 594438, 630815, 792751, 872155, 824710, 805944, 870844, 843574, 626548, 439246, 523391, 745384, 756555, 490929, 240840, 230607, 357692, 423452, 419993, 472549, 622661, 786459, 872706, 862664, 796558, 726554, 683778, 689640, 786941, 997857, 1227602, 1304544, 1188918, 1050640, 1045561, 1118956, 1158723, 1215679, 1362159, 1427543, 1164143, 677768, 393308, 503248, 719790, 712592, 537828, 429766, 387382, 248514, 44063, -30099, 36858, 35893, -103218, -167498, 17307, 306814, 422304, 300463, 118369, 33224, 36587, 62667, 121849, 264073, 455228, 563216, 490931, 286088, 75562, -83871, -215848]
35349b15848p5418R0868K78029K91515R8633j15843j87807j23563P966J52366
35339B00898J96339L6968j81153j39998J82573L69182J28392k31207k24676Q8763
35329D26081K21468J2123j94361j56365o1116q6379o2326J64632L66155K52295
35319H82207p0377k70158k50200j51621n0704N3036P3689l6498j03064L1891J89907
35308B98108J02531j15282j20476P5387J13302q5978j64825N3480K36215Q9293
35298D81755j51540j24767N8957L3250j93632k58597l3608K07885K48995J99921
35288D68619K01502J54319p1624l47742m13970k17492L6077J46927J14369N4550
35278A25535K5712L145j5290J9493R6749R9614l3001j62121j05786Q8143J92556
$$ y = [-215848, -291266, -200398, 77631, 369146, 467779, 351936, 164129, 40566, 48532, 200898, 397237, 434205, 253052, 113054, 295627, 664809, 793201, 561994, 337318, 426081, 647549, 659672, 465311, 308946, 247830, 161451, 99125, 263757, 629912, 882207, 811830, 541672, 291472, 139851, 89147, 142183, 215872, 179374, 76310, 108201, 298108, 400639, 285357, 164881, 240268, 353570, 267592, 102767, 156247, 392462, 481755, 330215, 205448, 264405, 297655, 104023, -154574, -188182, 19703, 268698, 468619, 670121, 824440, 752816, 405074, -8896, -226388, -190311, -43384, 70985, 125535, 151247, 154392, 139102, 158595, 255344, 354958, 321957, 159836, 54050, 142193, 334749]
35267C34749J26276L6609K2155k935p7448o4326Q5783J61153k238k18034k10500
35256A91244l9121J9536p9878j21633r480J13504J30977P9517k542j03048j09181
35245F9895P3180K54190J26853k26551l27598L8462M61499M46473P7748j53024
35235H41127m1011J30972O7605j46385k30725j19384k8471j28868k71331j54468
35225h0939K35524N17563L78003P298j47780N960J33415J3581j65188j63997m9508
35214F83932L739L0702J54452L05339L02696J30219o3486j70023j75116r4285
35204A108169K803L86r7193j25669k3330K2857j27918k98617k54476q4569l3874
35193H8569o6888N7941L15959L84622J44068j21525j49602m6592m0416j14976
$$ y = [334749, 461025, 497634, 519789, 516854, 439406, 375080, 460863, 622016, 619778, 401744, 191244, 152123, 171659, 91781, -29852, -39332, 74172, 205149, 284666, 282124, 179076, 69895, 143075, 397265, 524118, 297567, -30031, 8431, 469930, 916403, 994151, 841127, 800116, 931088, 998693, 852308, 621583, 502199, 473728, 344860, 73529, -80939, 154585, 672148, 1050151, 1057449, 909669, 915629, 1049044, 1062625, 897437, 733440, 683932, 687671, 718373, 872825, 1178164, 1480860, 1611079, 1547593, 1377570, 1202454, 1108169, 1110972, 1111358, 1014165, 888496, 865166, 888023, 760105, 461488, 207012, 122443, 88569, 21681, 79622, 395581, 780203, 924271, 802746, 653144, 606552, 566136, 451160]
35183D51160j04066j103M5418j5715p0737k0376R2132J45936P4705o4004j25721
35172D07629j9060J66038K23147O5785j50039k00313o1429O7768K1084j25275
35162C95335j60007k7562R1822M2322p1719m0400J23337J95758Q6008l8498l4658
35151E61738J3837o786l4457J5335N7421o669p5470l565J34082J52211M9278k2453
35139H34502j0511K4959P8552J57695J48654l1237k14398j82732l0455l1571j79639
35128E63819j91348J5286J88224J55157M6671P132j1702m9621k1985O3507N3695
35117H18835n3182m5581J21384J92253L7122j08246n3243K0786o9902j28889O8282
35106G99619L00536K09437r6477k02301n2953J4443j10070j41730M6508J53736
$$ y = [451160, 347094, 345991, 391409, 375694, 304957, 284581, 376713, 522649, 597354, 533350, 407629, 388569, 554607, 777754, 843539, 693500, 493187, 431758, 499526, 520610, 395335, 235328, 207766, 299588, 341910, 270191, 229791, 353128, 548886, 634894, 596396, 561738, 575575, 568789, 534332, 549667, 607088, 600419, 524949, 521384, 655466, 807677, 856955, 834502, 823991, 848950, 927502, 1085197, 1233851, 1202614, 988216, 805484, 775029, 743458, 563819, 372471, 387757, 575981, 731138, 777809, 784941, 773239, 723618, 701633, 765140, 818835, 765653, 720072, 841456, 1033709, 1070831, 962585, 909342, 930128, 860226, 731337, 799619, 1100155, 1309592, 1213115, 1010814, 957861, 972304, 862234, 720504, 767012, 920748]
35096I20748m7000k92169k11697J01684K34830O1747j12254l9803J08323K8144
35086G52553k33140l21540j06531Q6534n7557l29148k46147K24423N51019L51074
35076F71540j00360k87145j19498R3009J49642J18687Q0953J9931m8591q0074
35066D98094j18131k00199j99594j068K15278J50040j51670l04950j18119J48257
35056h2062J70862j1559j18029k2332J24975J12622q4998k64888k02687O3740
35046c14356K34747J25529p1388o7656R2178J32093O520m2811R4352K23537J74419
35035E87164M1771j6780q449j4619m9803j03229j59700j27323O6287K70462K40824
35024G26605K6208n0139J09037K00081P390k36454k20959l2978L1508n2386n8803
$$ y = [920748, 873748, 581579, 369882, 471566, 706396, 768143, 655889, 616086, 724409, 752553, 519413, 197873, 91342, 177876, 120319, -208829, -454976, -230553, 320466, 671540, 571180, 284035, 164537, 257546, 407188, 525875, 606828, 626759, 578168, 498094, 379963, 179764, -19830, -20898, 194380, 344420, 192750, -112200, -230319, -82062, 88800, 77241, -40788, -63120, 61855, 174477, 89479, -175409, -378096, -314356, -79609, 45920, -25468, -93124, -946, 131147, 137667, 94856, 189208, 412745, 587164, 628935, 612155, 603706, 589087, 539284, 436055, 276355, 149032, 215319, 485781, 726605, 752813, 702674, 811711, 1011792, 1019182, 782728, 561769, 528791, 560299, 507913, 449110]
35013D49110Q8539K22706K05526P2152p3424j40158o9152Q5750J52967M1012j34144
35002I00884k18621j99634j17385K9223J56221Q7355j35849j70460J34518L88396
34992H54648J63110l20944m49358r0017K46610J75050p9019j27854R757M7228
34982D29211r3851k14519j51948K9439J42701Q9320k6174o763J61181K30628K9493
34971F18718k31649k15042M7973J96200N6894j77370l06221l25043k16889Q5801
34961d66628M00902L45507q9511l71320j31214K77354K95745k9455k03118p9425
34951e1163R019j04530j59057J9634J75554M2913j95894j74618J03959K76970
34941e7213J33789j32152k25748j20371j5293j7613k0647P4149J50585L3762k01248
$$ y = [449110, 537649, 760355, 965881, 1038033, 964609, 824451, 755299, 841049, 994016, 1035028, 900884, 682263, 482629, 365244, 394467, 550688, 638043, 502194, 331734, 466252, 854648, 1017758, 696814, 247456, 157439, 404049, 579099, 500080, 372226, 381983, 429211, 335360, 120841, -31107, -1668, 141033, 230353, 204179, 197416, 358597, 589225, 618718, 387069, 172027, 220000, 416200, 473094, 295724, -10497, -335540, -552429, -466628, -65726, 279781, 190270, -181050, -312264, -34910, 260835, 231380, 28262, -51163, -42144, -146674, -305731, -286097, -110543, -67630, -263524, -438142, -334183, -57213, 76576, -55576, -281324, -401695, -416988, -434601, -455248, -381099, -230514, -196752, -398000]
34930c98000k75651j06016N1251j5002j37396m2536J88085K26710K0219j18824
34920f07160L523J83870J65302J9112j4248R2369J43736K8642j39674j80706m4343
34909c49577J37068J56714m5730k55201k00069O0529J54171r2633l71618l21286
34899a127632m6240Q1357O367O470J50714J55233j03930l12216j84596Q2518J25851
34888a166104l0663p9250L7381O2835j17254k94636k74914j13198O9670K49188
34878a656945L72917L22644J34772K8866P1225N4801j03015j22194J89683M93456
34868b13790L28729j65714l94898j53485J33732J07808m2432q538J22938J02692
34858a82958j9710k4491P0745Q5676M6758J34875L12372L33005J37372n0475o3910
$$ y = [-398000, -673651, -779667, -728416, -743418, -880814, -923350, -735265, -508555, -488336, -607160, -603637, -419767, -254465, -235353, -249601, -157232, -13496, 15146, -124528, -305234, -349577, -212509, -55795, -101525, -356726, -556795, -496266, -342095, -434728, -806346, -1127632, -1173872, -1092515, -1086148, -1079678, -928964, -773731, -877661, -1189877, -1374473, -1291955, -1166104, -1196767, -1276017, -1238636, -1175801, -1293055, -1587691, -1862605, -1975803, -1906133, -1656945, -1284028, -961384, -826612, -797746, -726521, -671720, -774735, -896929, -707246, -213790, 114939, -50775, -445673, -599158, -465426, -357618, -400050, -408588, -285650, -182958, -202668, -227159, -156414, -70738, -23980, 110895, 423267, 756272, 893644, 843169, 779259]
34847G79259K1562R5603J64688K19962J70209Q913j19962j10499p825J18828K52177
34836A592915L21518K06163o4098k70098k59315j07864L7635J25235J38763N0364
34826A771218p5878r7410q98O5063L4365K700q874j16471k82202k50217L7472
34815A078868K50060J41026o6902p1499J0716q1226k21675j12247J29484J13659
34805A170264j46894k29753K494K09532J64416M8577K0761l1201j27709n8199
34795A022288J67169J94362o5309j77840R7672L05467m582m67729m04623J21702
34785G88577M05057J59557j56684j33007N7244Q7189k0080o3018j8458L742l4607
34774A075512r0348r0111N3248K99288L75896P7175l41405l91683k9150K49304
$$ y = [779259, 800821, 896424, 1061112, 1281074, 1451283, 1460196, 1340234, 1229735, 1221910, 1340738, 1592915, 1914433, 2120596, 2056498, 1786400, 1527085, 1419221, 1456856, 1582091, 1720854, 1771218, 1695340, 1597930, 1597032, 1662095, 1696460, 1699160, 1690286, 1573815, 1291613, 1041396, 1078868, 1328928, 1469954, 1403052, 1331553, 1342269, 1261043, 1039368, 927121, 1056605, 1170264, 1023370, 793617, 796111, 1005643, 1170059, 1218636, 1239397, 1208196, 1080487, 1022288, 1189457, 1383819, 1318510, 1140670, 1238342, 1543809, 1539227, 1071498, 666875, 788577, 1193634, 1353191, 1196507, 1063500, 1120744, 1207933, 1187853, 1124835, 1106377, 1110119, 1075512, 985164, 895053, 948301, 1247589, 1623485, 1700660, 1359255, 967572, 938422, 1187726]
34764A187726J02461k10651k77380j04705K4600L2058O7031J68611J85402J9221
34754A194374k25336l38798j84978J61433M17173L41096K6501j90668j51960l1467
34744A017370k1208p7166q3343o1167p3576r0718q1155p6833m5481J06264K94425
34733H07412K60804k9778k40601j13431J61486K54934J58034P0180L0507l9379
34723A320168q5118k2095L2078p5540k36659k34780r3380J008O389j8605j12849
34712D80617k52368j74798K37641N66028L35778k07917l58856K4460L42899K00463
34702A193947q3200j19812l2795n8183p1049P6612J61768j0329j54384N6769L70312
34691A329656K97392r5876k85571j07012N9597m3577j91973j25000N1918J11739
$$ y = [1187726, 1290187, 1079536, 802156, 697451, 722051, 754109, 821140, 989751, 1175153, 1194374, 969038, 630240, 445262, 606695, 1023868, 1364964, 1391465, 1200797, 1048837, 1017370, 996162, 918996, 835653, 774486, 700910, 610192, 529037, 452204, 406723, 512987, 807412, 1068216, 1038438, 797837, 684406, 845892, 1100826, 1258860, 1329040, 1359547, 1320168, 1235050, 1212955, 1245033, 1169493, 932834, 698054, 604674, 605682, 612071, 593466, 480617, 228249, 53451, 291092, 857120, 1192898, 984981, 626125, 650585, 993484, 1193947, 1110747, 990935, 958140, 899957, 828908, 905520, 1067288, 1056959, 902575, 959344, 1329656, 1627048, 1531172, 1245601, 1138589, 1198186, 1154609, 962636, 837636, 889554, 1001293]
34681A001293N5168Q305j8815p9847j35561j03860J4628J50010K31129K03735
34671A326185P0132p6006j51177j96580k64825k47645k0185K67526L04974P4106
34661A086505q2457M4093K29743J89463J2061k4371R3716J34500K2613n8732J7010
34650A664144J32259J21835r26r1682n5463O8761J46923P0727j05918j91606r7164
34639A661890K2693k067o8652N1346L10682L91722J65181j10006j62907n6910
34629B202972L778O201N1144J04128O8898J932J2350L6315l8612j08872o108J45989
34617B480115P1908j53634j32241K22740M63070K36892j80877k85102l1640J96680
34607B887911J67031Q357q8900q4529k187J25460K04647J62270Q9398J42841L09099
$$ y = [1001293, 1056461, 1064766, 1045951, 966104, 830543, 726683, 741311, 891321, 1122450, 1326185, 1396317, 1320311, 1169134, 972554, 707729, 460084, 439899, 707425, 1012399, 1086505, 1004048, 1048141, 1277884, 1467347, 1479408, 1455037, 1548753, 1683253, 1705866, 1647134, 1664144, 1796403, 1918238, 1917312, 1825630, 1770167, 1838928, 1985851, 2056578, 1950660, 1759054, 1661890, 1684583, 1682516, 1613864, 1665210, 1975892, 2367614, 2532795, 2422789, 2259882, 2202972, 2206750, 2212951, 2264095, 2368223, 2437121, 2439053, 2451403, 2487718, 2449106, 2340234, 2334126, 2480115, 2552023, 2398389, 2266148, 2488888, 2951958, 3188850, 3007973, 2722871, 2691231, 2887911, 3054942, 3063299, 2974399, 2889870, 2887683, 3013143, 3217790, 3380060, 3469458, 3612299, 3921398]
34596C921398M14791L57013J88500R541q9309l6207J16130J64154J0316j29060
34586D927267J4131L44707M91204K98091M987p9248J16217M44277O74728O20009
34576G856370L21933Q6653J31809K67708J91681J3620J14275M89567O81600M86256
34566A0641472K95405M91372Q69259R92585Q54467Q06288R76412J135729J118491
34557A8181480J065219J179468J449181J709408J878617K039611K298568K627489
34549C2429041K920595L206914L668403M359071N079813N725481O585818P994653
34541G1969789R787599J1490217J3035487J4910894J7542309K0889398K4696452
34534A84322145K8732609L2630062L5742644L7119435L5251454K8169316J4935269
$$ y = [3921398, 4336189, 4693202, 4881702, 4891243, 4801934, 4765727, 4881857, 5046011, 5056327, 4927267, 4941398, 5286105, 5777309, 6075400, 6080387, 6001139, 6117356, 6561633, 7236361, 7856370, 8178303, 8264956, 8396765, 8664473, 8856154, 8869774, 8984049, 9473616, 10155216, 10641472, 10936877, 11428249, 12297508, 13290093, 14144560, 14950848, 15927260, 17062989, 18181480, 19246699, 20426167, 21875348, 23584756, 25463373, 27502984, 29801552, 32429041, 35349636, 38556550, 42224953, 46584024, 51663837, 57389318, 63975136, 71969789, 81757388, 93247605, 106283092, 121193986, 138736295, 159625693, 184322145, 213054754, 245684816, 281427460, 318546895, 353798349, 381967665, 396902934]
34527C96902934k404556j9100882l0778460l6185123l6818962l4671919l1060882
34520B05882150k6968178k3200691j9970693j7011716j4282345j2085804j0489732
34513H1872991r169488p909020o803629n910648n123505m433516l919165l468710
34505C5135310k912415k400510k211029k217657k035764j678210j522140j592117
34497A8565468j471126j053131p86738r31616j112195r29362n69248m49532o00476
34488A0662044p34580o83448m92386k81660k06756l53533n45112m89766k08771
34479F666032l2293r8031j93705j81063j89525k73707k89266k44002l31670m65463
34469D367307k82180J71654L09515j12467n24919l89076j0318K3163k12160k15657
$$ y = [396902934, 394498378, 375397496, 344619036, 308433913, 271614951, 236943032, 205882150, 178913972, 155713281, 135742588, 118730872, 104448527, 92362723, 81872991, 72703503, 64794483, 57990854, 52080206, 46956701, 42523185, 38604020, 35135310, 32222895, 29822385, 27611356, 25393699, 23357935, 21679725, 20157585, 18565468, 17094342, 16041211, 15254473, 14322857, 13210662, 12281300, 11712052, 11262520, 10662044, 9927464, 9244016, 8751630, 8469970, 8263214, 7909681, 7364569, 6874803, 6666032, 6633739, 6535708, 6342003, 6160940, 5971415, 5697708, 5408442, 5164440, 4832770, 4367307, 4085127, 4256781, 4566296, 4453829, 3928910, 3539834, 3529516, 3552679, 3340519, 3124862]
34459C124862M2112J27337q5882k62800k09040j04398r2060o3734O3502J78086
34449B717985J56339K895j91907k84080j64546L3087P08k77334l85448p7905K71525
34438A801319J96687j46896k53738n4529Q0933R037m9679p830l7392j59375j66529
34427A212008k5592N7726M1639J05669K26193J24138k18183l92983j41551K27207
34417A216271K44593j09010m32005m04690q7691K11241K60517J15281Q155K1016
34407A043678J994j02395p0300K03966L86433J48781k45669k76155J3644Q1536
34397A185513k04858l30880n9L31538J51330l11300m40632j28226J57889R8674
34387E08989j00816j02826J06850K80483K56397J06185j8256p6701j30775j86145
$$ y = [3124862, 3166974, 3294311, 3208429, 2945629, 2736589, 2632191, 2540131, 2476397, 2539899, 2717985, 2874324, 2877219, 2685312, 2401232, 2236686, 2269773, 2270481, 1993147, 1607699, 1529794, 1801319, 1998006, 1851110, 1597372, 1542843, 1623776, 1632813, 1583134, 1575304, 1537912, 1378537, 1212008, 1186416, 1244142, 1285781, 1391450, 1617643, 1741781, 1523598, 1130615, 989064, 1216271, 1460864, 1351854, 919849, 515159, 427468, 638709, 899226, 1014507, 1022662, 1043678, 1045672, 943277, 872977, 1076943, 1463376, 1612157, 1366488, 1090333, 1103977, 1185513, 980655, 649775, 649716, 981254, 1132584, 821284, 380652, 252426, 410315, 508989, 408173, 305347, 412197, 692680, 949077, 1055262, 1037006, 960305, 829530, 643385]
34377F43385j50092J5403J96880K58799J88926N8543n2412m6696J00352J83674
34367A396762m7157m38634n01147j25450J63744l306k27199o008L83342L38060
34357I33007k7628r1295J71204J74055j59558k02010K28967M35482k1625n52366
34347H88233m65566l778J75538J6190r7368r2600j33448j09533J53333M05134
34337G36135K96208n01n9398Q4775O7829j11045j22297N6502J21123K5055K3938
34326A118324J33671Q4956j43395k61257j90037j43104j27223R1853M11863L60534
34316A336185j29150m52281j80241K82485L05338o1252k60986r0716J12755Q4018
34306I46155j9720L4595J79622J82426j2939k28220k76790j49745J4697R0758
$$ y = [643385, 493293, 508696, 705576, 964375, 1153301, 1211844, 1159432, 1112736, 1213088, 1396762, 1349605, 910971, 409824, 284374, 448118, 444812, 217613, 211605, 594947, 933007, 905379, 814084, 985288, 1159343, 999785, 797775, 1026742, 1462224, 1440599, 888233, 422667, 418889, 594427, 610617, 513249, 420649, 287201, 177668, 331001, 736135, 1032343, 1031842, 972444, 1057219, 1125048, 1014003, 891706, 948208, 1069331, 1094386, 1118324, 1251995, 1336951, 1193556, 932299, 742262, 599158, 471935, 563788, 975651, 1336185, 1207035, 754754, 574513, 856998, 1162336, 1101084, 840098, 749382, 862137, 946155, 926435, 961030, 1140652, 1323078, 1310139, 1081919, 805129, 655384, 670081, 760839]
34296G60839O9034K0696K509J5093J7614l9200j49360k03016q2840J47493K53747
34285H12609J10663j26802k26720j49068N53J59911K90620K81732Q1340j37111
34275A097727j50161J179O6809n6815k12226k19946o3460J58459L07468K58074
34265A187108L7975j23570o7406L7498o2609k63482k11389J28244L51382J89261
34255A203012j02236j32399P7851J93817P1023j03308j32574m8719R063q05j3738
34244A020987J9072P3489J06269J13894J05473M8839p9601j86243j15297J18184
34234A225066K58604R9425k19805l41865r8609L12803N41063L96190M775k82234
34224A895413k17657M2937J06749j07689k10808P4530M16893L10206j55628l94014
$$ y = [760839, 829873, 850569, 853078, 868171, 885785, 846585, 697225, 494209, 411369, 558862, 812609, 923272, 796470, 569750, 420682, 421235, 581146, 871766, 1153498, 1234838, 1097727, 947566, 948745, 1015554, 958739, 746513, 526567, 463107, 621566, 929034, 1187108, 1225083, 1101513, 1034107, 1071605, 1008996, 745514, 534125, 662369, 1013751, 1203012, 1100776, 968377, 1046228, 1240045, 1311068, 1207760, 1075186, 1026467, 1035530, 1034725, 1020987, 1040059, 1113548, 1219817, 1333711, 1439184, 1488023, 1408422, 1222179, 1106882, 1225066, 1483670, 1583095, 1363290, 1021425, 922816, 1235619, 1776682, 2172872, 2177647, 1895413, 1677756, 1720693, 1827442, 1719753, 1508945, 1583475, 2000368, 2310574, 2154946, 1760932]
34214A760932j59311J67285K09886P8609K7990J5833j10571k58913k40756j17252
34204A373732j03830k12806k45815j17377K1853J0144j09668j42614L1647K91325
34194G96591L58707J24473j56636j42961J33510K86105R7436j98049k67105j12858
34184I19213O475m8353j76596k12870r9141O4098Q5145j05448k95257k13767O1700
34173a4801J70837J6401o6440J37332L36149K08358k0644R0077M55027N45761
34163A858057J95241j66969j85629m0742l1585q4347J8310J93348K02955Q6659
34153B045298Q7294K09850K04671J0822j12337K561J69731J58145K5110n0975
34143B750170o6852q9957m1054J23902J64703j30991m64591l20250K13082M28898
$$ y = [1760932, 1601621, 1768906, 1978792, 2057401, 2085391, 2101224, 1990653, 1731740, 1490984, 1373732, 1269902, 1057096, 811281, 693904, 715757, 725901, 616233, 473619, 505266, 796591, 1155298, 1279771, 1123135, 980174, 1113684, 1399789, 1497225, 1299176, 1032071, 919213, 925688, 877335, 700739, 487869, 388728, 452826, 537971, 432523, 137266, -76501, -14801, 156036, 172437, 105997, 243329, 579478, 787836, 767192, 857269, 1312296, 1858057, 2053298, 1886329, 1700700, 1659958, 1628373, 1544026, 1562336, 1755684, 1958639, 2045298, 2132592, 2342442, 2547113, 2557935, 2445598, 2448159, 2617890, 2776035, 2801145, 2750170, 2683318, 2593361, 2552307, 2676209, 2840912, 2709921, 2245330, 1925080, 2138162, 2567060]
34133B567060J4788m40279l24614P3960P6956k83637l62433K1847L25842J81198
34123A850688j03409j57072q6848r9759q5830N4202R1558j12464k39989j4636
34113A096441K54001J25584k23191k63409K7802J64351l1105j95242r0723M5871
34103I10380N717l2717Q8081J53510l1178k26591j23414J06750M3126l10404m95104
34092H8156k50482J59732L61120L07269J64177J2791j22303j26116O8110K72991
34082I35445K27936k9463k04323j69305r6301j03601o1355R4760J47522l6404
34072G04911j73695L4492L44492K70020j29067k75423M0364L32660J88698j29313
34062A208139j86357o1691r2950k33201j61675J19787K78577J90731P5277Q7434
$$ y = [2567060, 2581848, 2141569, 1816955, 1890915, 1967871, 1684234, 1321801, 1343648, 1669490, 1850688, 1747279, 1590207, 1503359, 1403600, 1317770, 1371972, 1463530, 1351066, 1111077, 1096441, 1350442, 1476026, 1252835, 989426, 1017228, 1181579, 1150474, 955232, 864509, 910380, 916097, 883380, 971461, 1124971, 1093793, 867202, 743788, 850538, 893664, 583260, 88156, -162326, -2594, 358526, 665795, 829972, 842763, 720460, 594344, 662454, 935445, 1163381, 1133918, 929595, 760290, 663989, 560388, 499033, 593793, 741315, 704911, 531216, 565708, 910200, 1180220, 1051153, 775730, 816094, 1148754, 1337452, 1208139, 1021782, 960091, 867141, 633940, 472265, 592052, 870629, 1061360, 1136637, 1224071]
34052A224071J31080J01578K1432p6390j48337o7101J82787L19932J03027k29548
34042A562531k44598J6952J08600q1903j76357N18J05170j04783l15342j66050
34032G04738J66982K83985J64973P0936P0878N2836K7090M5709k2432k56965l72685
34021I36045o6922M07686M77629N8103l23336k91793p4476j4331l8357R8115L16606
34010A484969L06034j1946l81739n31014l94790p3803K46296L58249J88214q7232
34000A103238j90554l1769K19149L34049K28415j3875k26586k73739j56149j7747
33990I74432P217n3220o3606K9815J38922J57859P0428p1593j99546k44336j83004
33979E63368r3610q3586j33333j00901O9700K39810K49062J11987m2285j36604
$$ y = [1224071, 1355151, 1456729, 1478161, 1401771, 1253434, 1186333, 1369120, 1689052, 1792079, 1562531, 1317933, 1334885, 1443485, 1361582, 1185225, 1185743, 1290913, 1186130, 870788, 704738, 871720, 1155705, 1320678, 1391614, 1462492, 1515328, 1542418, 1588127, 1565695, 1308730, 936045, 869123, 1276809, 1754438, 1812541, 1489205, 1197412, 1122936, 1108605, 1070248, 1168363, 1484969, 1791003, 1779057, 1397318, 866304, 471514, 397711, 644007, 1002256, 1190470, 1103238, 912684, 880915, 1100064, 1434113, 1662528, 1648653, 1422067, 1148328, 992179, 974432, 981649, 928429, 864823, 894638, 1033560, 1191419, 1261847, 1190254, 990708, 746372, 563368, 469758, 386172, 252839, 151938, 221638, 461448, 710510, 822497, 780212, 643608]
33969F43608j45131k8021J72068K47703N5063k04700j82111J06526K32571n2192
33959H45384m29386m37762r7135J66941J28246o170K0966J62121K00454P7960
33949F31619m4669p193J47121K01292J5511k60604l27932j34328K2660q4564k59843
33938a00930j74012J18438K57520J25972j9896l588L7556o819J2642J80291K53903
33927F81077K9097k48018j87556J35265K50764k5797l36294l06477m2542Q6093
33917C5612l0143j62365j10558O2846J84868J98543J60984J09800L5890l9761
33907D45716o2956l7024l4610q3249j16761r1078o1673o8142l7020Q0352J61674
33896I5229P1830r4265j27703l5159k0521j25419j48087L599J36317Q2700m2064
$$ y = [643608, 498477, 470456, 642524, 890227, 945290, 740590, 558479, 665005, 897576, 845384, 415998, -21764, -118899, 48042, 176288, 170118, 191084, 353205, 553659, 631619, 586950, 579757, 726878, 928170, 943681, 683077, 355145, 220817, 243477, 158913, -100930, -274942, -156504, 101016, 226988, 207092, 203504, 241060, 234241, 246883, 427174, 681077, 710174, 462156, 274600, 409865, 660629, 634832, 298538, -7939, -50481, 35612, 5469, -156896, -267454, -204608, -19740, 178803, 339787, 449587, 485477, 445716, 382760, 345736, 311126, 227877, 111116, 20038, -41635, -109777, -146797, -66445, 95229, 167059, 72794, -54909, -90068, -110589, -236008, -384095, -380496, -244179, -161479, -203543]
33885b03543o3711k4454m1729p0395j5376P1453J12701J67817K60000K22243j8034
33874C96972j83789j5938K53153K00445j02536j75880Q9461K47534L0498k26495
33864E13425j60549M2664J9177j42906q1447K05794L41175J40582j55239k50476
33854D72200j19453P3457J59489M9826j77372k78588j16639J03308Q3065j25691
33844A23602j95990l2637J13805R6443Q6587J88203J84539o4757k63631q2132
33834A54032K68286K86836n6349k63229p5977J42747J2578k60452k36826M3108
33824A4754J32755j08508l11936j87068O5841J23751K7112K7520J41736J65404
33814I1361M4981o0871p4771p9788p9692M4019K53051K94640O7494j82713k14688
$$ y = [-203543, -267254, -291708, -333437, -403832, -419208, -347755, -235054, -67237, 192763, 415006, 396972, 213183, 197245, 450398, 650843, 548307, 372427, 461888, 709422, 739920, 513425, 352876, 395540, 414717, 271811, 190364, 396158, 737333, 877915, 722676, 472200, 352747, 426204, 585693, 635519, 458147, 179559, 62920, 166228, 249293, 123602, -72388, -105025, 8780, 105223, 191810, 380013, 564552, 499795, 236164, 154032, 422318, 709154, 652805, 389576, 313599, 456346, 468924, 208472, -28354, 14754, 147509, 39001, -272935, -460003, -394162, -270411, -243299, -215779, -74043, 91361, 136342, 75471, 700, -79088, -158780, -114761, 138290, 432930, 500424, 317711, 103023]
33803A03023j31549j43705j79266l4677J99345K17435q36j20527L5311K21636
33793A66190J78381K0376q717M6953k3209j81100j63246Q5287K77526J70433j09014
33782D59860k41058j05629J12058J64023J2491j45549j16925M1398Q5250p3781
33772A92138k07349p9225J82004K23707m1278l15808l39223k00367j08865n5696
33762g49962R4711K92147L17269J04469j36453j70343K733J79095J71708k4336
33752H1038k30675k43440m1879J71902J97152O8089k1444J005J1034q2178j66954
33741b56350q5395J25478K67996K32522J02105l42o3707j30406j67110j01465
33731g6674K6502O5407m3310j48861p3382J31957K25656P6300j73977k75988j25931
$$ y = [103023, -28526, -172231, -351497, -386174, -186829, 30606, 29770, -90757, -55446, 166190, 344571, 364947, 356230, 403183, 379974, 198874, 35628, 120915, 398441, 568874, 459860, 218802, 113173, 225231, 389254, 401745, 256196, 139271, 180669, 265919, 192138, -15211, -94436, 87568, 311275, 269997, -45811, -385034, -585401, -694266, -749962, -655251, -363104, -45835, 58634, -77819, -248162, -245429, -66334, 105374, 81038, -149637, -393077, -434956, -263054, -65902, 2187, -19257, -18252, -7218, -89396, -256350, -341745, -216267, 51729, 284251, 386356, 386014, 322307, 191901, 24791, -76674, -50172, 15235, -28075, -176936, -250318, -118361, 107295, 183595, 9618, -266370, -392301]
33720c92301J73379M18005M34586K00747j06087k56804k18669j67991k10784k29571
33710c55490j08960L9959N6900J2403P9404J98826J50713m6722j14150L4721J21346
33699F8950m5788k23411j00345J91599K63819O5460o7118L7656J35600j1839k55434
33688E9149k97893j18352O6013J39157J62737J79036J53125R6569N9182n423j80003
33677C13297l66228l26487j9360K85961L45287K36835J81187J98564J36288l7657
33667I47687j77634j91662j47727j14926n2412P7447J97365J96736O9394q1714
33657G22554j51044j29017j11270j78848k47901j31198J76048L95609L00712L8295
33647F83940q9063o5044j07628k29493j95361L9530K00896J29017J7696N6242
$$ y = [-392301, -218922, 199083, 633669, 834416, 728329, 471525, 252856, 84865, -125919, -355490, -464450, -424491, -367591, -355188, -275784, -76958, 73755, 27033, -87117, -52396, 68950, 23162, -200249, -300594, -108995, 154824, 220284, 153166, 190822, 326422, 314583, 59149, -238744, -357096, -291083, -151926, 10811, 189847, 342972, 439541, 498723, 493300, 313297, -52931, -379418, -398778, -112817, 232470, 469305, 650492, 849056, 985344, 947687, 770053, 578391, 430664, 315738, 263326, 340773, 538138, 734874, 804268, 722554, 571510, 442493, 331223, 152375, -95526, -226724, -50676, 344933, 645645, 683940, 594877, 529833, 422205, 192712, -2649, 36881, 237777, 366794, 384490, 440732]
33637D40732J39953J31604J06942J12276r770k75676l60259q5674J89919Q5103
33627D75150j78716j50830Q4842R5796j03343r3026J45926J54346j72392l37853
33617h0100n9879K66248K26543j6579j32606j45319j63752l7054K84138M31006
33607E72646J41380k20047j66478J49148J99305q3317k66722j13110J72708L36017
33597G21530K95090L5673l22081m33491j07314L13257L52250P1766j02533r3760
33587G30387j70699l09785j82441J74660K97839N0298j41539o087J69348J03762
33577G15743k8474j4483P061r6717j39596j988Q0053m0428r7670R2311K30695
33566G06507N3685j56478o2191J12693N489j91952q0275J87421J62215q7772j22286
$$ y = [440732, 580685, 712289, 819231, 931507, 921737, 646061, 285802, 200128, 390047, 475150, 296434, 145604, 230446, 326242, 222899, 129873, 275799, 430145, 257753, -80100, -139979, 126269, 352812, 336233, 203627, 58308, -105444, -142498, 141640, 572646, 714026, 493979, 327501, 476649, 675954, 592637, 325915, 212805, 385513, 721530, 1016620, 1052293, 730212, 296721, 189407, 502664, 854914, 926680, 824147, 730387, 559688, 249903, 67462, 242122, 539961, 590259, 448720, 442633, 611981, 715743, 687269, 672786, 679847, 583130, 443534, 441546, 521599, 481171, 383501, 475812, 706507, 760192, 603714, 541523, 654216, 659705, 467753, 387478, 574899, 737114, 649342, 527056]
33555E27056M8649K4650j59516m5532L55963M65587J00401k04271r2173J03958
33545A124772P2692N3496K42652L21180Q3009n2409K61715O04700M41616L3925
33535C187348j3900K31292K36998k0631r7732K7111o7773l71525l62638N4416
33525B802966L01323O1989k28138j49607P4277J02914O2987J57777J80785p7669
33515C289604l28180k06095R9492J40391j05048l14313l73961l81897l00869j00265
33505A418859n6265l75285o68962m00289K23140M44922P3329k69704j61371L2344
33495B60718j09679l40660k19739J29457K53683Q9100n1285m4294m9113j13702
33485a95514j06874l0611m0268j33399j33397j5340N1215L9695J45640M11809
$$ y = [527056, 575705, 600355, 440839, 395307, 751270, 1216857, 1317258, 1112987, 1020814, 1124772, 1197464, 1250960, 1493612, 1814792, 1897801, 1845392, 2107107, 2711807, 3153423, 3187348, 3173448, 3404740, 3641738, 3621107, 3523375, 3550486, 3482713, 3111188, 2748550, 2802966, 3104289, 3166278, 2938140, 2788533, 2862810, 2965724, 3028711, 3186488, 3367273, 3289604, 2961424, 2755329, 2854821, 2995212, 2890164, 2575851, 2201890, 1819993, 1519124, 1418859, 1362594, 987309, 318347, -81942, 141198, 586120, 659449, 389745, 228374, 260718, 151039, -189621, -409360, -279903, -26220, 62880, 11595, -32699, -81812, -195514, -302388, -332999, -373267, -506666, -640063, -655403, -604188, -564493, -418853, -7044]
33475g044N45752L02764j35589l79943l22677j97024j91478k23201j43646J0928
33465g41158J03657J27459J81365K41246J42013j46030l85608l47309j03602R9181
33455h28786J66343J76192J58268P1723l0271m7541l7369j29997k36550j23145
33445h61133J77371L36150K11155M3811K8642K1986j04031j53819L7141K29132
33435c3595J32837q6167o7655J40700J78436k3772j79569j54558j02236p9897
33425b75476L6067J90384J34462j16636k21804n0434J19611J06850J03949K18395
33415B45368J76518j65175m04959j48245L09478L63919j320k29626m8027K18649
33405C16580K54570J83092K08380K31629R0990r6100j11000J7433Q3370P908j25219
$$ y = [-7044, 538708, 841472, 705883, 325940, 3263, -193761, -385239, -608440, -752086, -741158, -637501, -510042, -328677, -87431, 54582, -91448, -477056, -824365, -927967, -828786, -662443, -486251, -327983, -256260, -286531, -334072, -371441, -501438, -737988, -861133, -683762, -347612, -136457, -92646, -64004, -42018, -146049, -299868, -262727, -33595, 99242, 13075, -54580, 86120, 264556, 240784, 61215, -93343, -195579, -275476, -239409, -49025, 85437, -31199, -253003, -303437, -183826, -76976, 26973, 245368, 421886, 256711, -148248, -296493, 12985, 376904, 375584, 145958, 97931, 316580, 571150, 754242, 962622, 1194251, 1285241, 1189141, 1078141, 1095574, 1178944, 1186852, 1061633]
33394A061633k37370k81231j98812l4592M007j97043m13939l26304K8277K84225
33384c11149K47984J14487J07497J53720P5770q2277j29817j9417J30645K30098
33374E17541K60702J96062N3991l6222n177p484j88294l58367k06429J70545L03627
33363G00495J4524l05740k65085k706J05042P613p1958o7729j00030j68513j43663
33352b97750l2375K5995Q584J0000L1369J1252J5312J29081K13402O9056j82499
33341A427k13874L418J55195Q9768J042J3623k9705j90547k07282R3577M35754
33330A52396M30711Q9864k48534l48408k15075L9761K56960K84116J54169P4835
33320F70795R9261J8762k32552l35605n0118L06645K37507k01515m60093k61544
$$ y = [1061633, 824263, 543032, 344220, 309628, 313635, 116592, -297347, -623651, -595374, -311149, -63165, 51322, 158819, 312539, 388309, 306032, 176215, 156798, 287443, 517541, 778243, 974305, 1028296, 992074, 986897, 979413, 791119, 432752, 226323, 396868, 700495, 715019, 409279, 144194, 141488, 246530, 254143, 182185, 114456, 14426, -154087, -297750, -330125, -304130, -295546, -285546, -254177, -242925, -227613, -98532, 114870, 183926, 1427, -212447, -209029, -53834, 35934, 36976, 50599, 20894, -169653, -376935, -283358, 152396, 583107, 672971, 424437, 76029, -139046, -99285, 157675, 441791, 595960, 670795, 770056, 788818, 556266, 220661, 170543, 477188, 714695, 513180, 53087, -208457]
33310b08457Q3019J85843N2020r2160j51815j60039j08488L1403J96356K62133
33300H9815J66201k7701j54595p2917J60722K96775J78544m5699j34024r4801
33290C62320j25045k51275k68131o6863J82495K54286J27738l9984r4555p428
33280G3558R1001J8362k10113l04242n0430L19747L65373L8364k38133j62147
33270e8660P1630J34857L1137k4069J9961N7739P7325J27781J14350r3111l61534
33259I7406l82379j15235J06794L4531j48320j17893J03032J98866N1029r1946
33249b64115k520J89232K03038R169j70768j92407j20124m9587P156L7957J1712
33238c41257j6457M7891J48034J27252J9650M4084K02627J72982j87535n02519
$$ y = [-208457, -125438, 60405, 112425, 20265, -131550, -291589, -400077, -368674, -172318, 89815, 256016, 228315, 73720, 803, 161525, 458300, 636844, 591145, 457121, 362320, 237275, -14000, -282131, -348994, -166499, 87787, 215525, 175541, 80986, 73558, 164559, 182921, -27192, -331434, -381864, -62117, 303256, 341620, 103487, -58660, 12970, 147827, 178964, 154895, 174856, 232595, 309920, 437701, 552051, 458940, 97406, -284973, -400208, -293414, -258883, -407203, -525096, -422064, -223198, -172169, -264115, -266635, -77403, 125635, 134804, -35964, -228371, -348495, -398082, -390926, -352969, -341257, -357714, -309823, -161789, -34537, -14887, 29197, 231824, 404806, 217271, -285248]
33228b85248l59472O3877K40943O1217o9647R4669K88229J97493o6696j88660
33218b3295j09904k5721m1263n4172M0836J82200K17781J02693k5840j8523N7125
33207C01917r927k22030k90722o0203J98671J74121J262J2311J50568Q9793j19891
33196B25870n8742L29317N53475L43876J02596K55337N70188N38210J39020j94836
33186B804311j85009Q8091M17817N69058L20314k35622n93033m06065j5912j0234
33176B753716l81579n74753l23486K6783Q1325j33334l64669m53745l44956o8335
33166B16967J81501J89735N403j42128j93952k39360j88122J29451N04116M56612
33156I20223m6085m32226l10972M902N5140r0781j01862K50l3918j51374p9385
$$ y = [-285248, -644720, -580843, -339900, -278683, -348330, -253661, 34568, 232061, 165365, -23295, -133199, -158920, -200183, -254355, -213519, -31319, 186462, 289155, 263315, 244792, 301917, 291990, 69960, -220762, -280965, -82294, 91827, 93089, 105400, 255968, 345761, 225870, 167128, 496445, 1049920, 1393796, 1496392, 1751729, 2321917, 2860127, 2999147, 2804311, 2619302, 2707393, 3125210, 3694268, 4014582, 3778960, 3185927, 2779862, 2763950, 2753716, 2372137, 1797384, 1473898, 1500681, 1582006, 1448672, 1084003, 630258, 285302, 216967, 398468, 588203, 593606, 451478, 257526, 18166, -169956, -40505, 463611, 920223, 874138, 441912, 130940, 135842, 190982, 100201, -1661, -1411, -35329, -186703, -266088]
33145b66088J49843K09175O727j89043j92577j18137q5912l1408Q7702J69007
33135b60711J68853J90388K44717J52392j52974m12091l37413j7910J72660M3412
33125b08677j97942k26393M725K21807J75120m0327r5880J27977L42929K16041
33115C19380j65228l82581k23076P8554J86631P0325m8723k1712R9231J97869
33105A10670K23666J79610O8420j02414k72162l18684j59441J08843K42700J10405
33095A91613j27890k01475n5500J21294J62204P0905p8128k13677k27963n1873
33085d10490J75844J99880p887j73454r4789Q5950J23568J9473m7762j6372K8582
33074a17457L9507L8379J7633l0010k8235R0727K53853L29702K78203J11154j71341
$$ y = [-266088, -116245, 92930, 99657, -89386, -281963, -400100, -486012, -517420, -429718, -260711, -91858, 98530, 343247, 495639, 342665, -69426, -406839, -424749, -252089, -208677, -406619, -633012, -628287, -406480, -231360, -271687, -367567, -239590, 103339, 319380, 154152, -228429, -451505, -372951, -186320, -115995, -164718, -186430, -87199, 110670, 334336, 513946, 582366, 479952, 207790, -110894, -270335, -161492, 81208, 191613, 63723, -137752, -193252, -71958, 90246, 161151, 83023, -130654, -358617, -410490, -234646, -34766, -42653, -216107, -310896, -224946, -101378, -81905, -129667, -146039, -117457, -77950, -39571, -21938, -51948, -80183, 10544, 264397, 594099, 872302, 983456, 812115]
33063H12115m49943m51409r0159K78452K46748p6226k16566k5678J59104Q9399
33053B75837o0152p9063o3263j29836j10251J52908M24308L40921m6634l12919
33043C91856k14345M2224J07841j03276l49263l25309r222K59434J75758o8068
33033i2370P368M16727N49433K5128o51609p18927j90324K45542K16672P563o9223
33022b54020p1429q2168J8751K29643K94393J18633m7210m4593m9692j58384j37175
33011a83251J15588K60331M6635k03774q8595K02262K08727l7824j29451j2348
33001A78300j4922j88428k10124m224J02361j7485o1624J24359K39238P4144q2328
32990A39267O1924K82648K17231l2773j09502J156K0104j00112j34967k9734J6324
$$ y = [812115, 362172, -89237, -179396, 99056, 345804, 269578, 53012, 27334, 186438, 275837, 215685, 136622, 73359, -56477, -166728, -13820, 410488, 751409, 704775, 391856, 177511, 219735, 327576, 224300, -124963, -450272, -459494, -200060, -24302, -92370, -85002, 331725, 881158, 906286, 254677, -464250, -654574, -409032, -192360, -184797, -254020, -325449, -407617, -388866, -159223, 135170, 253803, 206593, 162000, 112308, -46076, -183251, -67663, 192668, 239303, 35529, -53066, 149196, 357923, 320099, 190648, 178300, 163378, -25050, -235174, -239398, -137037, -154522, -216146, -91787, 147451, 221595, 139267, 201191, 483839, 701070, 668297, 558795, 559951, 580055, 479943, 344976, 315242, 331566]
32979C31566p2562j33678q1389l3710m8717m701J55785K82748K26360K5153j80790
32968D66065k76843j88351N3035K29994J26133j61654l00028j61350K9459O1260
32958a22280R335K5398R0257J34086J90011K46120J46120j48289l77497l12738
32948a19477j13832q9067k21581k35845n6691J18864J78174J94514J61856k9336
32938b12421k80134k90063j7370J85394R2581l5022J17270L75267L20763n8129
32928A98136l39554k69013m0621Q0841J04479J39344J30597j3501j74312j32701
32918c16305J06788K83643K00404n1052k29122k15325p8263O8271J62216J56753
32908H8008J5475j83615k40297o0519J60201J47339o7893j72042k4930J32487
$$ y = [331566, 259004, 125326, 43937, 10227, -38490, -43191, 112594, 395342, 621702, 646855, 466065, 189222, 871, 53906, 283900, 410033, 248379, -51649, -212999, -183540, -122280, -112945, -87547, 2710, 136796, 326807, 572927, 719047, 570758, 193261, -119477, -233309, -322376, -543957, -779802, -836493, -717629, -539455, -344941, -183085, -212421, -492555, -782618, -799988, -614594, -522013, -557035, -439765, -64498, 256265, 198136, -141418, -410431, -451052, -370211, -265732, -126388, 4209, -9292, -183604, -316305, -209517, 74126, 274530, 223478, -5644, -220969, -299232, -230961, -68745, 88008, 103483, -80132, -320429, -380948, -220747, -73408, -141301, -313343, -338273, -205786]
32898b05786N6644j26086j42205m472N2082k5337o6951j5178P829j2671N3301
32887d28830J62232P8668j85483k58094L1878K97844J34338k39412k92776J3600
32877f86035K17871J20662M8091K20876L36457P6479l17170l57400j1931K95344
32867e6756L07763K01886K10166K93486K94426J85240L3444j14583j94653j08186
32857A052233J24777L01568K56161O3761q9765j53309j80910j41593L4700K36080
32847A503703K21108l2683k26571j24364J07389J28451q7299k12452k7959K76607
32837A525930L63714J75189l9960o8580L5720Q0700j1552j49208k24366k34525
32827A453062k23975j73412m0833R7282P1256j43488l20450k45437j3567J09608
$$ y = [-205786, -149142, -275228, -417433, -421905, -369823, -395160, -462111, -477289, -469460, -482131, -428830, -266598, -187930, -373413, -631507, -599629, -301785, -167447, -406859, -699635, -686035, -468164, -347502, -299411, -78535, 257922, 334401, 17231, -340169, -352100, -56756, 251007, 452893, 663059, 956545, 1250971, 1436211, 1469655, 1355072, 1160419, 1052233, 1177010, 1478578, 1734739, 1798500, 1708735, 1555426, 1374516, 1232923, 1267623, 1503703, 1724811, 1692128, 1465557, 1341193, 1448582, 1577033, 1489734, 1277282, 1249323, 1525930, 1889644, 2064833, 2024873, 1956293, 1992013, 2072713, 2061161, 1911953, 1687587, 1453062, 1229087, 1055675, 1014842, 1112124, 1183380, 1039892, 719442, 474005, 460438, 570046]
32817E70046Q2042J05821K24197J84291j33266m01587k49524J73071L64835J57060
32807A076986j16490j65195j00753j14776j27586m235J24783O5172o8175o711
32797E63020K03852K21501o8478l41936k72433L2898J99061O5672j55851j75792
32787B71514L1807K09868J24767j36912k55165r3892R7787L1003j98373k49443
32777a67039l5190J87172K30589J97002K06878J88153P3673l1127m4436o5259
32767G40416j65189k21455j34575j2310M8593J40196K84419K50543p0498l47257
32757E12883k35202O9904J28704m7256q6304N1715L3260j81762k13833N4496K25676
32746C12281N1758j54825p6187J08124J26077Q9847J53531R2795k73947n69544
$$ y = [570046, 652088, 757909, 982106, 1166397, 1033131, 631544, 382020, 555091, 919926, 1076986, 960496, 795301, 694548, 579772, 452186, 447951, 572734, 637906, 569731, 563020, 766872, 988373, 919895, 577959, 305526, 338424, 537485, 603157, 447306, 271514, 303321, 513189, 637956, 501044, 245879, 151987, 249774, 280777, 82404, -167039, -202229, -15057, 215532, 412534, 619412, 807565, 881238, 850111, 805675, 740416, 575227, 353772, 219197, 206887, 255480, 395676, 680095, 930638, 860140, 512883, 277681, 347585, 476289, 429033, 342729, 394444, 427704, 245942, 32109, 86605, 312281, 364039, 209214, 133027, 241151, 367228, 457075, 610606, 703401, 429454, -140090]
32736a40090l36901J79438L30479L3933j59105L3091K53964J68393m5077q9320
32726B28805o636K9103M9610J40357J87317M0731k14724l56375k85570o7127J68139
32715h6370K64301J36276p4010r3315J27358L11192K21510k7168j55433q2386
32705E41955M1266P2155J4670l8138k7879q206q5481k33754k57112o8519J10187
32694F1144N2825p7195L5566K90502K65527q3329k97846j52259j4163j78758l21923
32683d19909o3016L16312K85308m8124r7578K29993L67502m99m36187m17504o3655
32672c47357J48843Q9808J8240P9256J21823J2586j38075j44386L131J36994J15664
32661I6527j5216o7774O7586K55808K36939n4066l55645l49824m0646K34925K07190
$$ y = [-140090, -476991, -297553, 32926, 66859, -92246, -59155, 194809, 363202, 318125, 228805, 222169, 251272, 300882, 441239, 628556, 669287, 454563, 98188, -187382, -254509, -86370, 177931, 314207, 240197, 146882, 274240, 585432, 806942, 779774, 624341, 541955, 583221, 655376, 670046, 631908, 604029, 595823, 510342, 276588, 19476, -49043, 61144, 113969, 36774, 72340, 362842, 628369, 545040, 247194, 94935, 80772, -97986, -419909, -482925, -166613, 118695, 70571, -27007, 202986, 570488, 569989, 133802, -283702, -347357, -198514, -108706, -90466, -11210, 110613, 123199, -14876, -159262, -156131, -19137, 96527, 81311, 13537, 81123, 336931, 573870, 519804, 164159, -185665, -226311, 8614, 215804]
32650B15804o375q3743N0182J34597j0102j79804r1161J55323K01755j9708j89730
32639A77038j10786J3610l7921j42645r1756L2807L0109m6882o882J03751O9114
32628a0443j00534j64556n4951J9868n7945j14740K3603K39709K75744P0506j72595
32617d6334k13726j9378K05287K34368Q4224j7341L7650Q1962l8666j87938j47468
32606b7360K7882J07438N0402J1813L6563K2026l5482l5774k0192j37604l29469
32595c29757l32045o9650K07271K67946J64001O4989L9222P2346J13397N7547
32585B55267j23385k35557r3630J26155Q9383j37180j38358J60292L22893J12965
32575C38845j02658K9135K59389J80580r3207j73224o9879j01780k80269k99631
$$ y = [215804, 209429, 125686, 175868, 310465, 300363, 120559, 29398, 184721, 386476, 366768, 177038, 66252, 79862, 41941, -100704, -192460, -159653, -129544, -176426, -183308, -79557, -10443, -110977, -275533, -330484, -310616, -368561, -483301, -459698, -219989, 55755, 126261, -46334, -260060, -279438, -74151, 160217, 244441, 227100, 264750, 346712, 308046, 120108, -27360, 522, 107960, 158362, 170175, 206738, 228764, 193282, 157508, 137316, -288, -329757, -661802, -731452, -524181, -256235, -92234, -27245, 11977, 84323, 197720, 255267, 131882, -103675, -197305, -71150, 18233, -118947, -257305, -97013, 225880, 338845, 236187, 265322, 524711, 705291, 612084, 438860, 368981, 267201, -13068, -312699]
32565c12699q8311J01508J49659J77313J86693K8795k07245k00668Q3967K73731
32555A92743J33587j16892k01714j63204j35191o3885R1947J60143L8822n1066
32545a14710R7526K84637J90998q1017j39492P1499J78081k3244k39104j40042
32535H5132J29433J73882o3440k29099p7667J86432J97011r1220l63072l39663
32525c92271p4937J60320J80726K3985j32899j33410K7906J85786J71864L4020
32515E1090j3010Q5586J00105j33938l87803l10134M3890K55774J42081m902R9967
32504g1294L01597K77327L0143j61102j60173p2513Q773R3211J41136O4361q9240
32493C62226j54987r4485l4930l0339J5569J22850J39049j1647j57734j12815
$$ y = [-312699, -401010, -299502, -149843, 27470, 214163, 242958, 35713, -164955, -80988, 192743, 326330, 209438, 7724, -155480, -290671, -354556, -262609, -102466, -63644, -114710, -17184, 267453, 458451, 377434, 237942, 309441, 487522, 464278, 225174, 85132, 214565, 388447, 325007, 95908, 18241, 204673, 401684, 310464, -52608, -392271, -467208, -306888, -126162, -102177, -235076, -368486, -340580, -154794, 17070, 51090, 38080, 123666, 223771, 89833, -297970, -608104, -564214, -308440, -166359, -171261, -71294, 230303, 507630, 537773, 376671, 216498, 143985, 152758, 245969, 387105, 451466, 362226, 207239, 112754, 77824, 47485, 63054, 185904, 324953, 313306, 155572, 42757]
32483D2757M6709R6356k7635j84126k34366j56247O426J76319K44726J60061J2954
32472A83934n6096k6213J563m6001j32812j64750p2771J14788K42539J53320r3163
32461A04338k38328j57375l1595l6419k7501J97251M46295L19087j48028m14907
32451A2818j63274K52962L17785L8272j79401j46127l8906j8628l3394j8640k0553
32440B914n6927o0267k2278k7188q9640j15452o9462k3329J3387J30402K97841
32429a9999K96554K5018k62981k36434N5472K24224O4127j73873j43987J14124
32419e7755K50924J08128q2361o4468P7780Q9247m8977j09089J4197J55148J50571
32408D83345O1723K2640L0584J5100j0743n811j6094j05187k34965l17981l22698
$$ y = [42757, 89466, 185822, 158187, -25939, -260305, -416552, -410126, -233807, 10919, 170980, 183934, 127838, 101625, 103188, 57187, -75625, -240375, -313146, -198358, 44181, 197501, 104338, -133990, -291365, -322960, -359379, -386880, -189629, 256666, 575753, 427725, 12818, -150456, 102506, 420291, 458563, 279162, 133035, 94129, 75501, 42107, 23467, 2914, -54013, -114280, -136558, -163746, -253386, -368838, -438300, -461629, -448242, -317840, -19999, 276555, 301573, 38592, -197842, -142370, 81854, 145981, -27892, -171879, -57755, 193169, 301297, 218936, 154468, 232248, 321495, 272518, 163429, 177626, 332774, 483345, 545068, 567708, 598292, 613392, 602649, 596838, 580744, 475557, 240592, -77389, -400087]
32397d00087k48778r0693R4821J98958K22028K84113L82479L26816O1449j58036
32387F73070j22101l40m8775j70131j05661P1037M8905j86945l23316k32427j20430
32376e17114j07306n5791P5205J00416r340N590K30420L39410R9282k06073j86913
32365b32214O3906J60020K7063o3153J9163J05164O2013k4579n7315p4727j13926
32354a28585j06625l22J28466J51479K9147j43447k04362p3333J34104K04962
32344h516Q1977o7766q2188J3300J16015J97992K47033J95154L7166r6328j14795
32333E19044j00422j35410j34110j2470J06204N8358q0404r5811M1971J59100
32323C26050J51440Q8778N1675K3419m4705j65157k93136l09093j10257J95358
$$ y = [-400087, -648865, -739558, -644737, -445779, -223751, 60362, 442841, 769657, 831106, 673070, 550969, 550629, 501854, 331723, 226062, 297099, 346004, 159059, -164257, -396684, -517114, -624420, -680211, -605006, -504590, -513930, -508340, -277920, 61490, 160772, -45301, -232214, -168308, -8288, 18775, -44378, -25215, 79949, 141962, 117383, 60068, -14659, -128585, -235210, -235532, -107066, 44413, 73560, -69887, -274249, -347582, -213478, -8516, 73461, 5695, -76493, -63193, 52822, 250814, 497847, 693001, 730167, 633839, 519044, 418622, 283212, 149102, 136632, 242836, 301194, 220790, 124979, 166950, 326050, 477490, 566268, 617943, 641362, 596657, 431500, 138364, -170729, -280986, -85628]
32313h5628L20374J51091q0863j36235r7386j44691j96584p5018J17876J45707
32303h1357O5984J19654K37343R8757k68740m12459j34495J72099J11622j50714
32293b42306k18623o3895N9332Q8292J55232K30035J34735j04153k41547j79866
32283c82764p5524m2117j1790M0164k010j39082j40011J26881M17182L96094J07263
32272B94286q6671j2860J04278J2368j98012k43186n2250J51178J49722k6283
32262I2570j84901k02168j14175k9014M78J0239M3121O6208K2791m3336j4398
32251c52585J12670J77588Q0132n8108p2978Q338O3803J00981J85581K31057J05811
32240E82290r3449j46063p4978j12104k67053k62883n264K13653J53129k7138
$$ y = [-85628, 234746, 385837, 304974, 168739, 71353, -73338, -269922, -344940, -227064, -81357, -15373, 104281, 341624, 440381, 171641, -240818, -375313, -203214, -91592, -242306, -460929, -524824, -465492, -377200, -221968, 8067, 142802, 38649, -202898, -382764, -458288, -500405, -512195, -472031, -474041, -613123, -753134, -626253, -209071, 187023, 294286, 207615, 194755, 299033, 311401, 113389, -129797, -182047, -30869, 118853, 92570, -92331, -294499, -408674, -437688, -437210, -426971, -383850, -317642, -294851, -338187, -352585, -239915, -62327, 17805, -40303, -113281, -104943, -41140, 59841, 245422, 476479, 582290, 488841, 342778, 267800, 155696, -111357, -374240, -379504, -165851, -12722, -39860]
32230c9860o5959J0475L5235J1156K2189K0841n0907r4413l5412k14q9658j69904
32218d46431j20476o8968j13539o4036K05555L97951K02013j45394j79649O1720
32208b71254J45214j7634r6683K263m538j79446j97654L8687J57943n1008k48111
32197g22221r9131J92864K69291J75909J53682J57405J070k12266k19824n3793
32187c57014M857j13777j75936j9663K34135L80676L52862K10685M6188o6942
32177D96071j03235q0424k1289L2084k696j33729j90407j5792K55830L50104K72977
32166H59494K67745L20850J20805l34901n35926j73089L21097L51148j6076k63499
32156I17648k34808k06340k64219j74163R3421K27679J03909j197Q6452J22616
$$ y = [-39860, -105819, -95344, -60109, -48953, -26764, -5923, -56830, -151243, -186655, -186869, -276527, -446431, -566907, -635875, -749414, -813450, -607895, -209944, -7931, -153325, -332974, -271254, -126040, -143674, -240357, -238094, -242632, -422078, -619732, -581045, -423102, -474110, -722221, -821352, -628488, -359197, -183288, -29606, 127799, 128869, -83397, -303221, -357014, -352157, -465934, -641870, -661533, -427398, -46722, 306140, 516825, 563013, 496071, 392836, 312412, 291123, 323207, 320511, 186782, -3625, -19417, 236413, 586517, 859494, 1127239, 1448089, 1568894, 1233993, 698067, 524978, 846075, 1197223, 1181147, 917648, 682840, 476500, 212281, 38118, 131539, 359218, 463127, 461930, 548382, 670998]
32146F70998r9377l15334j65363K11509L40857R2476j66227j38540m104q8815
32136C38080l40470l96083j27506J49125J26501l2139O9280M31520N83581K35691
32126A037580k68107l88602j09087R6528l7356k37221j53657J29051K63053J50140
32116D82322J6090R571k430j47236k75639j80205L5992O8238j23465k31325p0355
32105d18442J37941J35154L2727O9820J60275N4798j48304r2407K17431L30338
32095D79331K5076l34728l42341r4298P9571J26399J78440J90062M0553j45656
32085B02409j42938q445O244j23911j78168o9757N3022R1554J05938J13900L7322
32074H7170j07270j90098j74411j30736m0307J64094L40025K21487j36809l02235
$$ y = [670998, 571621, 256287, 90924, 302433, 643290, 735766, 569539, 430999, 426895, 338080, -2390, -398473, -525979, -376854, -250353, -282492, -213212, 218308, 801889, 1037580, 769473, 380871, 271784, 368312, 330956, 93735, -59922, 69129, 332182, 482322, 498412, 507983, 505553, 358317, 82678, -97527, -61535, 6703, -116762, -348087, -418442, -280501, -145347, -112620, -42800, 117475, 172273, 23969, -68438, 148993, 479331, 504407, 169679, -172662, -266960, -187389, -60990, 117450, 307512, 348065, 202409, 59471, 51026, 57270, -66641, -244809, -314566, -261544, -169990, -64052, 49848, 87170, -20100, -210198, -384609, -515345, -555652, -391558, -51533, 169954, 33145, -269090]
32064b69090l7312L22417L14370j0095j94292m3702J41796N2945j95045k78575
32054a96583j31163L1592P4501Q5430J32495J17483r838r4551k2880M1196p8637
32043e0955j97399m344L66762M11217o544l88728k97009M3710J44295l1995j44263
32032a55253q5013p8836k10371k58522p7934J62844K42865J71606R7498Q7550
32022a03566J00327Q7963N3674L7536N0293K4604q5570j54551j2361K16592J56484
32011C71425k68342n89818l83289J20547L56647J95285j211R139J01021J29336
32001D0740J22246R2535J0461r861J53836L07410J48246j83589k20349Q5752K31656
31990G79083m0154l18290j85736J43223K18353J7861j78919k74417k97718j41084
$$ y = [-269090, -306402, 16015, 330385, 320290, 125998, 82296, 224092, 277037, 81992, -196583, -327746, -296154, -221653, -136223, -3728, 113755, 103917, 9366, -13514, 27682, -50955, -248354, -252698, 114064, 525281, 518737, 130009, -167000, -123290, 21005, -10990, -155253, -240266, -319102, -529473, -787995, -865929, -703085, -460220, -288614, -191116, -103566, -3239, 84724, 138398, 175934, 226227, 250831, 165261, 10710, -1651, 214941, 371425, 103083, -486735, -870024, -749477, -392830, -197545, -198756, -189617, -88596, 40740, 162986, 255521, 265982, 256121, 409957, 717367, 865613, 682024, 461675, 547427, 779083, 738929, 420639, 234903, 378126, 596479, 614340, 435421, 161004, -136714, -277798]
31980b77798K03184L71403P9163l23688k67688J59218L03208p0489m41150l31125
31970e95762N7663K66215K35798K03016K12851J14055p8803j51224j5625J57327
31960D05511J71043K2918j39610j89027j17893k0158J4689k734J993M0661M1908
31949B29301k7985j07417j33777j08096l1001J15967K61956K41088Q456k28536
31939B19956k31121k8691J34067J09782k9490j55154k11701j79705o5803L7580
31929d00280K6587m1796o320J18692J08959j12400k73814j04466K49002L87697
31919d8139J77907j27805k63840k09691n3105J61879L49880L38471N9253l05404
31909G9406m77423l46196m1038J95595J97408K2264q9252P585J66607J70460P5693
$$ y = [-277798, -74614, 296789, 375952, 52264, -215424, -56206, 247002, 176513, -264637, -595762, -538099, -271884, -36086, 166930, 379781, 493836, 415033, 263809, 248184, 405511, 576554, 599472, 459862, 270835, 152942, 132784, 147473, 144739, 146732, 187393, 229301, 201316, 93899, -39878, -147974, -178975, -63008, 198948, 440036, 448492, 219956, -11165, -39856, 94211, 203993, 174503, 19349, -192352, -372057, -437860, -400280, -373693, -415489, -421809, -303117, -194158, -306558, -580372, -684838, -435836, -48139, 129768, 1963, -261877, -471568, -524673, -362794, -12914, 325557, 384810, 79406, -398017, -744213, -785251, -589656, -392248, -369984, -459236, -451651, -285044, -114584, -38891]
31898c8891J11181K62600K57774K3224j59486r0304N1560L9234m3094j8354L6869
31887D32313m7874j96825j99030m7718R3517J64094J97543J42444m5391k14384
31877B78689j83837l8059n521j01324j33396j5468J53373K62200K31470j1677
31867D36450l59487m59495j30333K74421K69570q2732k88413j61159l547k6620
31857e31345n3046O9079J67734O3834j28790k17910k05202j92442k26329l29421
31847a583838m66351m48263j56414J26957o404m19945m90846o631M70947M22038
31837b558750J02833O4137K97259L53713J07332j01632k2552K15955L76282L54303
31827h11120J48926j37429k64842p1481K59993L68182J65493p0364q7276M0388
$$ y = [-38891, 72290, 334890, 592664, 615888, 456402, 366098, 417658, 456892, 413798, 395444, 432313, 384439, 187614, -11416, -59134, 34383, 198477, 396020, 538464, 493073, 278689, 94852, 56793, 51272, -50052, -183448, -198916, -45543, 216657, 448127, 436450, 76963, -382532, -512865, -238444, 31126, -51606, -340019, -501178, -504725, -531345, -584391, -515312, -347578, -283744, -412534, -630444, -835646, -1028088, -1254417, -1583838, -2050189, -2498452, -2654866, -2527909, -2534313, -2954258, -3445104, -3451735, -2980788, -2558750, -2455917, -2391780, -2094521, -1740808, -1633476, -1735108, -1757660, -1541705, -1165423, -811120, -662194, -799623, -1064465, -1135946, -875953, -507771, -342278, -412642, -499918, -459530]
31817d59530P1176o7834j98601j19846J30511K88140J79603l5339o5409J03790
31807a73339J92607M0769j70464j89907r763J88809K52706J40748o6454j87057
31797A8655j16564p63m8318j91215j84002k0201P9290R8769K40162M35595L22899
31786F34307j19130l95869k18932O6835J00423O7814K27277L31702O8827k83759
31776D79495k50304M9755J15712j02628k09749r9508n8870j50449r4428J59060
31766a61914K78322R7574j36853j91330j21730k8781Q9811J58990N3767j23553
31756h5697j31561R111N1755l1014k5070Q9469R8675j5932l8973M7054L8437m3109
31744c6855L0246J75086M9790k72583k89036R0136L12978Q0276j65464k8249J76728
$$ y = [-459530, -388354, -456188, -654789, -774635, -644124, -355984, -176381, -211720, -277129, -173339, 19268, 60037, -110427, -300334, -310097, -121288, 131418, 272166, 205712, 18655, -97909, -98672, -146990, -338205, -522207, -542408, -463118, -364349, -124187, 311408, 634307, 515177, 119308, -99624, -32789, 67634, 135448, 362725, 694427, 763254, 479495, 229191, 278946, 394658, 292030, 82281, -17227, -76097, -226546, -320974, -161914, 116408, 213982, 77129, -114201, -235931, -264712, -174901, -15911, 37856, -85697, -217258, -208147, -156392, -187406, -212476, -123007, -24332, -40264, -79237, -32183, 6254, -36855, -6609, 168477, 218267, -54316, -343352, -253216, 59762, 140038, -25426, -53675, 123053]
31733A23053M4010j82790q4767J63183J40604m3870N127K01481J35662j46985
31723C54708k04199J2447P0371j88945l86549k22444J21986L33271L25191J48768
31713C64605r9682k11683m9376J71118J25924r9939j48173j5168m2180k39020
31703b43574j93956J80655L94820J49185j81513j85998l6296m3087n8502J49225
31693f9041L14424Q2477k77569k33217J01563J17048k65209m32875p6573L27896
31683d11076K99435L6382m5429J2797n8155j93579j31598R0820K05358J56494
31673c8551J10793J14793Q2527M7379R3471R6863j17754l87231l40831L6013L14022
31662A1494K01725q4650j79043m5178P9682M6746p3066j27693m0439J16152J73619
$$ y = [123053, 167063, -15727, -100494, 62689, 203293, 159423, 164550, 366031, 501693, 354708, 150509, 162956, 233327, 44382, -342167, -564611, -442625, -109354, 215837, 364605, 264923, 53240, 3864, 174982, 300906, 200967, 52794, 37626, -4554, -243574, -437530, -256875, 137945, 287130, 105617, -80381, -116677, -159764, -218266, -69041, 245383, 327860, 50291, -182926, -81363, 35685, -229524, -662399, -738972, -411076, -111641, -75259, -120688, -107891, -166046, -359625, -491223, -400403, -195045, -38551, 72242, 187035, 269562, 316941, 410412, 507275, 389521, 2290, -338541, -302528, 11494, 213219, 128569, -50474, -95652, -15970, 30776, -42290, -169983, -210422, -94270, 79349]
31651G9349P2159k7552K1879Q7810l3315k01448p9151K76240L79575L8324l00953
31640C12917k09462P9156P4414j87027k45656J0759J85927L1676j76035r5078
31630b18409J71332K65169R1690j01159j05220r828k5730j67741k32125r1833
31620d23854J11424J75841J43654K01548L14867K31656q1422k91480j55078J20106
31610C47262J88158L7899r7071j31809j49877j50089o8557J6381j7749p8174L0804
31599g2822K51005K89325K1989l29921m60456k65991J04342L45852K20399j57129
31589e3407l60893j68237J16672R8559j22697j47782O5957J70399K6955r4291
31579d68765N793J63247J74281R1682M7484L7258J8081J2774J8317o717k3285
$$ y = [79349, 151508, 123956, 145835, 233645, 200330, -1118, -80269, 195971, 575546, 613870, 312917, 103455, 182611, 257025, 69998, -175658, -164899, 21028, 52704, -123331, -218409, -47077, 218092, 309782, 208623, 103403, 93575, 67845, -99896, -332021, -423854, -312430, -136589, 7065, 208613, 523480, 755136, 673714, 382234, 227156, 347262, 535420, 573319, 476248, 344439, 194562, 44473, -24084, -7703, -25452, -103626, -72822, 178183, 467508, 489497, 159576, -300880, -566871, -462529, -116677, 103722, -53407, -414300, -582537, -465865, -367306, -490003, -637785, -571828, -401429, -374474, -468765, -462972, -299725, -125444, -33762, 13722, 50980, 69061, 81835, 100152, 93435, 70150]
31568G0150K4936M4442o8078j62258k4859J99924J61675j19926k58098j29068
31558b61160k7454q0311j9998K47569L63284J18549j30440m1816J32453o21k89248
31547A0807l12476q7697K9167j0412O2379K60192K72069J5336j86205r1222J33898
31536I5836K11071J12852L09j9106L2410N9511j3870j33475j35916K3644J54757
31525C88023Q0839r9436j75739j47023j61652k12144j33675J09321L50542M41721
31515D40777L69761J70094r0009k45420j47105J13117K44511Q6418j99948l15866
31505D26330j51377R5922J28931r3145k50743m2798L57273M50565P7968l25681
31495F73245l03286L3718K15922M2305k56846l71422j95518J57759M28831L80511
$$ y = [70150, 95086, 139528, 71450, -90808, -115667, 84257, 245932, 126006, -132092, -261160, -288614, -368925, -388923, -141354, 221930, 340479, 210039, 168223, 300676, 300055, 10807, -301669, -389366, -360199, -370611, -308232, -48040, 224029, 239365, 53160, -38062, 95836, 306907, 419759, 420068, 400962, 433372, 492883, 479013, 345538, 209622, 233266, 388023, 468862, 369426, 193687, 46664, -114988, -327132, -460807, -351486, -944, 440777, 810538, 980632, 890623, 645203, 498098, 611215, 855726, 942144, 742196, 426330, 274953, 370875, 499806, 406661, 155918, 113120, 470393, 920958, 998926, 673245, 369959, 403677, 619599, 661904, 405058, 33636, -161882, -4123, 424708, 805219]
31485H05219O2548j92492j80048p4336j04184j88479j39408l1011n3612j44251
$$ y = [805219, 867767, 675275, 495227, 420891, 316707, 128228, -11180, -42191, -95803, -240054]
$$ [...]
##END NTUPLES=NMR SPECTRUM
##END=
