##TITLE=31Pdec_LR-740-i-2MePH
 CDCl3, 24 sc
 28.10.2021
##JCAMPDX= 6.0         $$ Bruker NMR JCAMP-DX V2.0
##DATA TYPE= NMR SPECTRUM
##DATA CLASS= NTUPLES
##ORIGIN= UXNMR, Bruker Analytische Messtechnik GmbH
##OWNER= root
$$ XWIN-NMR		Version 3.5
$$ Thu Oct 28 11:55:42 2021 Russian Standard Time (UT+4h)  she@DPX200
##.OBSERVE FREQUENCY= 81.013821
##.OBSERVE NUCLEUS= ^31P
##.ACQUISITION MODE= SIMULTANEOUS
##.ACQUISITION SCHEME= undefined
##.AVERAGES= 24
##.DIGITISER RES= 16
##SPECTROMETER/DATA SYSTEM= spect
##.PULSE SEQUENCE= zgpg30
##.SOLVENT NAME= CDCl3
##.SHIFT REFERENCE= (INTERNAL, CDCl3, 0, 248.564)
##AUDIT TRAIL= $$ (NUMBER, WHEN, WHO, WHERE, WHAT)
$$ ##TITLE= Audit trail, XWIN-NMR		Version 3.5
$$ ##JCAMPDX= 5.01
$$ ##ORIGIN= Bruker BioSpin GmbH
$$ ##OWNER= she
$$ F:/spectra/data/she/nmr/P31/1/pdata/1/auditp.txt
$$ ##AUDIT TRAIL=  $$ (NUMBER, WHEN, WHO, WHERE, WHAT)
(   1,<2021-10-28 11:54:33.56 +0400>,<she>,<DPX200>,
      <created by zg, POWCHK disabled, PULCHK disabled
       configuration hash MD5:
       00 E9 B6 7A A2 85 ED C7 34 08 36 98 17 FE 4E 26
       data hash MD5: 32K
       0E AD A4 9D 8C 2C 8D DD B4 B6 19 9F 32 41 6F CE>)
(   2,<2021-10-28 11:54:37.23 +0400>,<she>,<DPX200>,
      <Start of raw data processing
       efp BC_mod = 2 LB = 1 FT_mod = 6 PKNL = 1 PHC0 = -8951.851 PHC1 = 400.4694 SI = 64K 
       data hash MD5: 64K
       CE 1F C6 0F 6C DA E5 53 83 B5 53 35 0A 54 77 6D>)
(   3,<2021-10-28 11:54:55.03 +0400>,<she>,<DPX200>,
      <pk PHC0 = -15.82812 PHC1 = 0 
       data hash MD5: 64K
       03 6C 4B 07 FB 4E 24 A9 F3 25 42 88 EC 18 D8 CB>)
(   4,<2021-10-28 11:54:58.32 +0400>,<she>,<DPX200>,
      <abs ABSG = 5 
       data hash MD5: 64K
       F3 80 9B 4D 4B B5 47 23 CD 31 D2 C5 DA 37 5F 66>)
$$ ##END=
$$ 
$$ hash MD5
$$ 02 68 0A 57 8E FB CA 4A 1D 34 E9 71 42 7A 62 67
##$RELAX= 
##$RELAX= 
##$RELAX= 
##$RELAX= 
##$RELAX= 
##$RELAX= 
##$RELAX= 
##$RELAX= 
$$ Bruker specific parameters
$$ --------------------------
##$DU= <F:/spectra>
##$EXPNO= 1
##$NAME= <P31>
##$PROCNO= 1
##$TYPE= <nmr>
##$USER= <she>
##$AMP= (0..31)
100 100 100 100 100 100 100 100 100 100 100 100 100 100 100 100 100 100 
100 100 100 100 100 100 100 100 100 100 100 100 100 100 
##$AQSEQ= 0
##$AQ_mod= 1
##$AUNM= <au_zg>
##$AUTOPOS= <>
##$BF1= 81.014009
##$BF2= 200.13
##$BF3= 200.13
##$BF4= 200.13
##$BF5= 200.13
##$BF6= 200.13
##$BF7= 200.13
##$BF8= 200.13
##$BYTORDA= 1
##$CFDGTYP= 0
##$CFRGTYP= 5
##$CHEMSTR= <none>
##$CNST= (0..31)
1 1 145 1 1 1 1 1 1 1 1 1 1 1 1 1 1 1 1 1 1 1 1 1 1 1 1 1 1 1 1 1 
##$CPDPRG= <waltz16>
##$CPDPRG1= <>
##$CPDPRG2= <waltz16>
##$CPDPRG3= <>
##$CPDPRG4= <mlev>
##$CPDPRG5= <mlev>
##$CPDPRG6= <mlev>
##$CPDPRG7= <mlev>
##$CPDPRG8= <mlev>
##$CPDPRGB= <>
##$CPDPRGT= <>
##$D= (0..31)
0 1 0 0 0 0 0 0 0 0 0 0.03 2e-05 3e-06 0 0 0 0 0 0 0 0 0 0 0 0 0 0 0 0 
0 0 
##$DATE= 1635407672
##$DBL= (0..7)
120 120 120 11 120 120 24 19 
##$DBP= (0..7)
150 150 150 150 150 150 150 150 
##$DBP07= 0
##$DBPNAM0= <>
##$DBPNAM1= <>
##$DBPNAM2= <>
$$ [...]
##$SUBNAM3= <"">
##$SUBNAM4= <"">
##$SUBNAM5= <"">
##$SUBNAM6= <"">
##$SUBNAM7= <"">
##$SUBNAM8= <"">
##$SUBNAM9= <"">
##$SW= 501.771253377433
##$SWIBOX= (0..15)
0 1 3 0 0 0 0 0 0 0 0 0 0 0 0 0 
##$SW_h= 40650.406504065
##$TD= 32768
##$TD0= 1
##$TE= 0
##$TE2= 300
##$TE3= 300
##$TEG= 300
##$TL= (0..7)
0 120 53 12 22 120 120 120 
##$TP= (0..7)
150 150 150 150 150 150 150 150 
##$TP07= 0
##$TPNAME0= <>
##$TPNAME1= <>
##$TPNAME2= <>
##$TPNAME3= <>
##$TPNAME4= <>
##$TPNAME5= <>
##$TPNAME6= <>
##$TPNAME7= <>
##$TPOAL= (0..7)
0.5 0.5 0.5 0.5 0.5 0.5 0.5 0.5 
##$TPOFFS= (0..7)
0 0 0 0 0 0 0 0 
##$TUNHIN= 0
##$TUNHOUT= 0
##$TUNXOUT= 0
##$USERA1= <user>
##$USERA2= <user>
##$USERA3= <user>
##$USERA4= <user>
##$USERA5= <user>
##$V9= 5
##$VALIST= <valist>
##$VCLIST= <CCCCCCCCCCCCCCC>
##$VD= 0
##$VDLIST= <DDDDDDDDDDDDDDD>
##$VPLIST= <PPPPPPPPPPPPPPP>
##$VTLIST= <TTTTTTTTTTTTTTT>
##$WBST= 1024
##$WBSW= 4
##$XGAIN= (0..3)
0 0 0 0 
##$XL= 0
##$YL= 0
##$YMAX_a= 20960
##$YMIN_a= -24186
##$ZGOPTNS= <>
##$ZL1= 120
##$ZL2= 120
##$ZL3= 120
##$ZL4= 120
##$ABSF1= 248.5645
##$ABSF2= -253.2056
##$ABSG= 5
##$ABSL= 3
##$ALPHA= 0
##$AQORDER= 0
##$ASSFAC= 0
##$ASSFACI= 0
##$ASSFACX= 0
##$ASSWID= 0
##$AUNMP= <proc_1d>
##$AZFE= 0.1
##$AZFW= 0.5
##$BCFW= 0
##$BC_mod= 2
##$BYTORDP= 0
##$COROFFS= 0
##$CY= -3
##$DATMOD= 1
##$DC= 0
##$DFILT= <>
##$DTYPP= 0
##$F1P= 0
##$F2P= 0
##$FCOR= 1
##$FTSIZE= 65536
##$FT_mod= 6
##$GAMMA= 0
##$GB= 0
##$INTBC= 1
##$INTSCL= 5.30512e-09
##$ISEN= 30
##$LB= 1
##$LEV0= 0
##$LPBIN= 0
##$MAXI= 10000
##$MC2= 0
##$MEAN= 0
##$ME_mod= 0
##$MI= 50
##$NCOEF= 0
##$NC_proc= -3
##$NLEV= 6
##$NOISF1= 182.463
##$NOISF2= 159.3651
##$NSP= 0
##$NTH_PI= 0
##$NZP= 0
##$OFFSET= 248.5645
##$PC= 4
##$PHC0= -8967.679
##$PHC1= 400.4694
##$PH_mod= 1
##$PKNL= yes
##$PPARMOD= 0
##$PSCAL= 0
##$PSIGN= 0
##$REVERSE= no
##$SF= 81.014009
##$SI= 65536
##$SIGF1= 159.3651
##$SIGF2= -187.1042
##$SINO= 113.3802
##$SIOLD= 16384
##$SREGLST= <1H.CDCl3>
##$SSB= 0
##$STSI= 65536
##$STSR= 0
##$SW_p= 40650.406504065
##$SYMM= 0
##$S_DEV= 0
##$TDeff= 32768
##$TDoff= 0
##$TI= <>
##$TILT= no
##$TM1= 0
##$TM2= 0
##$TOPLEV= 0
##$USERP1= <user>
##$USERP2= <user>
##$USERP3= <user>
##$USERP4= <user>
##$USERP5= <user>
##$WDW= 1
##$XDIM= 65536
##$YMAX_p= 323957210
##$YMIN_p= -13502097
$$ End of Bruker specific parameters
$$ ---------------------------------
##NTUPLES= NMR SPECTRUM
##VAR_NAME=  FREQUENCY,     SPECTRUM/REAL,   SPECTRUM/IMAG
##SYMBOL=    X,             R,               I
##VAR_TYPE=  INDEPENDENT,   DEPENDENT,       DEPENDENT
##VAR_FORM=  AFFN,          ASDF,            ASDF
##VAR_DIM=   65536,         65536,           65536
##UNITS=     HZ,            ARBITRARY UNITS, ARBITRARY UNITS
##FACTOR=    0.620285442955139, 1,           1
##FIRST=     20137.2065510759, 0,            0
##LAST=      -20513.1999529892, 0,           0
##MIN=       -20513.1999529892, -13502097,   0
##MAX=       20137.2065510759, 323957210,    0
$$ Real data points
##PAGE= N=1
##DATA TABLE= (X++(R..R)), XYDATA
$$ [...]
40293 81302 230691 346573 412934 405584 304952 160105 64038 40494 25466 -11240 -9759
40282 -9759 66702 149399 166365 148191 146398 126028 49896 -2417 58929 156477 136855 22858
40270 22858 -1846 120402 228922 197317 108003 81516 86549 46523 6172 37991 76261
40259 76261 13115 -95657 -93007 30333 114666 72809 2240 17408 102592 188487 258097
40248 258097 299241 248152 79923 -100978 -156714 -78836 20784 64368 78313 110204 150830
40237 150830 168858 174004 201766 251513 276412 241657 174699 142689 176527 221678 177593 3492
40225 3492 -212442 -312190 -219972 -24490 122704 183830 255418 395613 504047 443429 234107
40214 234107 32231 -68278 -103118 -100959 -12409 160255 278042 220337 57659 -41876 -32607
40203 -32607 -2112 5560 40764 112734 134282 54181 -48915 -64709 20749 140797 229271
40192 229271 241108 158025 33330 -23203 28227 88090 44083 -67388 -107691 -31016 52758
40181 52758 29134 -74748 -135279 -86977 9490 45103 -17908 -109891 -130715 -56057 42509
40170 42509 82214 51283 -6133 -59714 -113642 -169123 -205237 -205747 -182831 -168203 -191856 -258375
40158 -258375 -320627 -292221 -130035 91892 232387 220435 110331 -2846 -71283 -83544
40148 -83544 -36068 31919 30488 -79479 -208778 -241564 -191305 -165512 -186743 -160233 -41953
40137 -41953 74364 92745 37954 -27808 -114181 -230644 -291129 -220746 -102752 -75114 -111214
40126 -111214 -63469 76757 143918 72873 29245 154387 325550 326588 165746 46252 54998
40115 54998 60763 -48996 -185529 -196410 -86434 2861 -7070 -49979 -37321 16249 36098
40104 36098 15993 32818 119717 185605 117121 -65346 -217681 -235118 -145559 -39446 21920
40093 21920 12009 -66312 -148810 -140467 -32155 67318 65978 -2271 -58823 -103470 -175887 -248072
40081 -248072 -252426 -189125 -116665 -58929 -10885 -11298 -100332 -206707 -192984 -45574 76143
40070 76143 30141 -136533 -254368 -222574 -94794 -5935 -36644 -127556 -132962 2584 144747
40059 144747 117141 -67753 -223625 -240600 -200004 -199025 -192968 -110419 -22598 -57565 -191601
40048 -191601 -268803 -227501 -176645 -214337 -285394 -283780 -209437 -139969 -105910 -89364 -113503 -224965
40036 -224965 -380436 -452020 -384618 -267277 -198080 -155464 -75730 10583 20844 -41781 -101363
40025 -101363 -137874 -186852 -220141 -161438 -39462 17211 -12828 12758 166149 296992 236752
40014 236752 46897 -79611 -87075 -79356 -127748 -206476 -287559 -354762 -341886 -200591 -25629
40003 -25629 22102 -83256 -236210 -388500 -572934 -733704 -724455 -543274 -401323 -451877
39993 -451877 -582302 -596446 -502871 -484725 -638608 -874666 -1063926 -1178805 -1271162 -1387681
39983 -1387681 -1547908 -1772788 -2081535 -2428861 -2663596 -2618166 -2279192 -1819672 -1414703 -1083068
39973 -1083068 -769376 -496000 -320127 -206469 -82521 24141 50998 56491 133436 202958
39963 202958 114628 -47877 -16220 244954 428497 320862 115972 115972 306713 438915 396470
39952 396470 270380 153484 61813 11124 3966 -22624 -102518 -148181 -81128 16762 25166
39941 25166 -12815 30829 149289 229169 252255 289415 316847 225326 27252 -112742 -97103
39930 -97103 -17257 -11689 -97543 -180172 -167383 -61429 25751 -19086 -150597 -193248 -90842
39919 -90842 -7961 -71589 -148993 -59670 109553 133224 20634 287 143829 265402 233849
39908 233849 144529 107296 78168 87 -67788 -64763 -28962 -511 40090 72490 24042 -74479
39896 -74479 -75329 64958 203077 229962 215776 240369 245596 178563 126488 163359 193088 98997
39884 98997 -56981 -131726 -100743 -18582 118755 309607 429491 358176 179382 89400 131028
39873 131028 165110 90604 -43181 -139011 -149149 -74968 30540 72200 14901 -47905 -15315
39862 -15315 72236 106014 85219 100781 176657 252281 298976 327099 298957 172829 24543
39851 24543 -20836 14533 -15803 -138256 -197841 -104601 4673 -45906 -224428 -346197 -318330
39840 -318330 -224529 -184310 -208956 -211149 -122337 17096 97411 80687 65324 156501 304727
39829 304727 358937 271062 150470 104216 124744 163588 210038 246082 224821 165438 179153
39818 179153 310023 423593 361943 163346 15928 13658 67212 59911 -9108 -63682 -50656
39807 -50656 36327 169447 279688 285697 180028 61373 37662 106972 165260 126250 9241
39796 9241 -90683 -102879 -51046 -29936 -105548 -233568 -293559 -219414 -80388 -7729 -48723
39785 -48723 -124696 -136911 -78899 -22542 -19410 -50568 -65238 -35307 29928 91490 94984 10024
39773 10024 -122008 -200349 -151763 -1600 149890 206533 126791 -64000 -272416 -372532
39763 -372532 -299823 -118016 42872 116999 136423 144991 143417 136392 160984 216440 222055 116560
39751 116560 -33882 -103194 -61994 12339 68994 129265 186518 168408 52535 -64045 -78885
39740 -78885 -7567 66532 103568 104864 68610 26736 55467 153499 183499 58979 -78793
39729 -78793 -31250 152884 232028 123487 -6180 -35741 -54827 -148362 -224033 -189771 -126672
39718 -126672 -126885 -113382 1163 112949 88144 16096 77614 234105 279935 163873 27495
39707 27495 -57815 -154104 -247488 -219056 -77795 913 -53646 -102863 -55774 -31144 -140596
39696 -140596 -283212 -301212 -208540 -126364 -99907 -106802 -146614 -193906 -151098 23607 213860
39685 213860 288707 279711 299627 352854 354496 290087 228305 196864 157988 102866 79450 116920
39673 116920 180616 209732 176160 116190 100695 136474 122815 -12708 -162651 -150587 14574
39662 14574 153623 198479 263850 386677 415978 275811 129723 131268 197925 201192 193972
39651 193972 248219 246636 78418 -106622 -102960 13557 28931 -35969 1329 117161 117347
39640 117347 7592 -10765 74679 47898 -138221 -261491 -222170 -208599 -330738 -395193 -238411
39629 -238411 -25193 6496 -103200 -158612 -120212 -83902 -79495 -84318 -127488 -205490 -202466 -65327
39617 -65327 49661 -17900 -180038 -236372 -174795 -142040 -178864 -185169 -119963 -51725 -14041
39606 -14041 31155 83940 97336 81785 97919 141974 144748 85917 19121 -9326 7678 58266
39594 58266 90708 24446 -130960 -232118 -180887 -75839 -61077 -102314 -72945 3219 -5587
39583 -5587 -80096 -52179 106216 206032 127302 30 -6789 72163 94000 34950 -15912 -24144
39571 -24144 -40201 -88612 -133722 -153031 -165368 -181702 -188518 -187840 -203947 -233986 -229593 -157927
39559 -157927 -66429 -47705 -121141 -182541 -124664 2781 32483 -96866 -246807 -274690 -237314
39548 -237314 -287937 -424978 -486335 -392613 -257379 -212389 -234308 -212387 -112444 -2303 44443
39537 44443 16120 -40843 -62217 -26120 13617 -14008 -102526 -176634 -194749 -181684 -152382 -79180
39525 -79180 37041 135738 178080 194640 204679 152664 -8919 -219805 -364972 -399106 -357897
39514 -357897 -275944 -165530 -61137 -6772 8891 37759 75881 47943 -73968 -190414 -174379
39503 -174379 -28808 115051 154030 110722 62952 37324 14879 -2992 4918 35226 75160
39492 75160 145330 259218 351370 333268 231768 177031 218382 248118 165770 26819 -50756
39481 -50756 -47522 -17354 25330 82449 97494 32719 -19236 61185 225643 307847 261703 199106
39469 199106 178973 125572 8728 -56038 17177 134108 153760 80486 18489 10365 25982
39458 25982 53336 96838 124849 110119 91714 120357 176915 214783 237975 259669 233103 119072
39446 119072 -13885 -57822 -12029 36338 59178 106147 177802 193881 117593 18223 -30854
39435 -30854 -43432 -70328 -121375 -179110 -236584 -276300 -251636 -135848 28837 159666 197494
39424 197494 134174 6072 -122755 -197813 -215428 -214495 -224817 -246319 -276626 -319321 -349613
39413 -349613 -307724 -160308 37786 165465 135342 -15934 -144440 -138070 -44920 -16330 -103166
39402 -103166 -179672 -128038 -25325 -39391 -178939 -278628 -233353 -114210 -21185 45404 101102
39391 101102 86795 -37269 -189865 -262123 -252001 -217649 -165834 -90737 -57241 -116708 -186255
39380 -186255 -154284 -76862 -107035 -231327 -260878 -132541 -34284 -125478 -286871 -295229 -135968
39369 -135968 23363 96926 134738 142752 43647 -146528 -268187 -222599 -106041 -55148 -57869
39358 -57869 -18168 67285 115918 107262 107077 141087 146862 86217 29548 70365 192913 283979
39346 283979 273317 214349 203458 254001 299598 312297 340751 391503 353390 144726 -103151
39335 -103151 -150491 40885 239083 244047 125445 63022 82164 101222 138857 267296 399159
39324 399159 349746 143220 39865 170534 335642 300229 126865 37106 54533 -849
39314 -849 -195415 -359785 -320757 -113708 88677 161589 98758 -22053 -101679 -104001 -102502
39303 -102502 -190981 -340556 -413946 -338420 -192489 -91597 -54754 -26602 20241 54118 32112
39292 32112 -48410 -131173 -135535 -43530 53895 44221 -77051 -212243 -281332 -272136 -195354 -86614
39280 -86614 -45329 -149865 -310447 -330920 -163738 17536 57750 1964 -40118 -68441 -111341
39269 -111341 -102424 2322 87206 33335 -70244 -66096 -8002 -67742 -196213 -150061 102856
39258 102856 274769 165426 -56702 -133647 -76486 -54796 -90681 -88113 -64443 -120192 -222555
39247 -222555 -230523 -124370 -22064 32186 110277 212742 224905 114547 10524 11259 53397
39236 53397 47483 12888 -12474 -73573 -196123 -281908 -232619 -110484 -53056 -78959 -101122
39225 -101122 -95785 -126155 -207087 -273898 -301727 -339110 -387173 -354404 -198272 -32759 -11825
39214 -11825 -144109 -294447 -349656 -318018 -268204 -233243 -201781 -166777 -142919 -140105 -146877 -146835
39202 -146835 -130362 -77907 40288 209315 329633 295288 132882 1848 9189 76202 59862
39191 59862 -34382 -63244 35765 150138 156628 80490 23269 14621 25944 65556 144979 186054
39179 186054 91892 -87160 -183996 -139272 -75420 -97552 -142503 -109468 -32230 -5045 -17638
39168 -17638 155 19286 -55834 -208770 -302630 -259605 -130278 19836 163445 239302 172896
39157 172896 10235 -104550 -129290 -159091 -218603 -199657 -90329 -64364 -196513 -281384 -137615
39146 -137615 75851 98632 -12473 -7776 97287 44988 -179844 -260625 -51983 165227
39136 165227 114471 -71386 -101899 40093 173455 247813 319684 321219 146280 -85903 -130893
39125 -130893 21730 142505 138098 182426 395397 613743 616787 428576 251535 193413 195226
39114 195226 183535 172648 206945 273634 305821 259683 168819 98919 51461 -34095 -158023
39103 -158023 -215292 -138107 -13537 35895 30223 71042 143575 124113 -15511 -148019 -161730
39092 -161730 -78035 27107 109579 135708 82217 -1494 -22867 26370 56735 18997 -35919
39081 -35919 -57789 -60092 -56754 -35501 -18982 -49809 -96513 -88432 -53644 -78551 -115930 -21919
39069 -21919 160785 174729 -74816 -321276 -298057 -126540 -115319 -292164 -392144 -260128
39059 -260128 -18660 162361 239299 211184 69693 -105049 -169342 -111544 -86837 -189281
39049 -189281 -313924 -316966 -201752 -70370 14024 42325 19792 -16585 -7565 44396 66305
39038 66305 33199 12062 34150 20377 -81746 -169887 -105453 85014 231374 224344 113730
39027 113730 15077 -5064 44760 101458 88921 -11255 -129422 -182965 -166495 -132470 -115262
39016 -115262 -127212 -190997 -295047 -339608 -227833 -19149 107236 73245 -7757 -11289 24439
39005 24439 -6231 -83091 -89198 -9800 29550 -51140 -174617 -232780 -228001 -211137 -160584 -36669
38993 -36669 83722 57150 -125682 -295098 -299888 -168744 -27711 65637 133662 180968 178559
38982 178559 134470 104221 118794 151766 168942 173136 191431 247585 348990 470718 552056
38971 552056 541939 452943 341409 233391 108656 -29779 -111043 -57939 117178 303973
38961 303973 384008 319801 161775 -10466 -138544 -189829 -151268 -51142 29091 15458 -67695
38950 -67695 -105494 -22244 123024 206796 186968 132189 109338 95079 28881 -76416 -126937
38939 -126937 -65961 32074 31950 -92129 -207911 -188053 -80198 -39199 -103767 -140285 -43460
38928 -43460 98538 116607 -14026 -147131 -147241 -25634 105653 156459 120903 54642 8615
38917 8615 -17596 -47158 -60677 -12003 74640 95043 4067 -101070 -109945 -53168 -33840 -54020
38905 -54020 -31837 27692 17060 -96150 -203300 -216142 -183217 -177169 -164859 -81689 37590
38894 37590 107076 125915 161236 212153 192782 62001 -114514 -255344 -342454 -375889 -323480
38883 -323480 -183396 -54280 -58095 -187410 -292862 -247775 -84180 59298 86684 9472
38873 9472 -102141 -184249 -210665 -203453 -207624 -228805 -219895 -163033 -118856 -128348 -114577 8955
38861 8955 156948 143673 -38867 -162188 -53767 178345 312122 296214 248553 251275 279079
38850 279079 287053 252554 159335 36004 -27973 6072 51999 31818 10152 73024 147934
38839 147934 105525 -10227 -33661 62212 140414 133995 118089 129487 107056 58496 96975
38828 96975 234365 307189 201259 3555 -158300 -278921 -373717 -362225 -193588 13387
38818 13387 91972 24090 -87329 -170578 -209709 -184607 -89760 27897 119557 176758 184969
38807 184969 118097 24284 12328 89176 119028 17642 -122269 -178253 -156655 -119233 -69605
38796 -69605 -5731 33200 64713 176718 346337 397574 258854 98106 58597 39410 -82153
38785 -82153 -197526 -167359 -103646 -175229 -274305 -192509 -22564 -28980 -171818 -143625 100291
38774 100291 234853 79839 -137849 -183190 -148776 -197688 -254039 -187961 -91559 -119182 -205611
38763 -205611 -178128 -38621 75327 117712 127342 77470 -69581 -214896 -220965 -125982 -86580
38752 -86580 -124874 -102008 47250 207498 249531 186299 110288 57367 -8054 -108968 -202379
38741 -202379 -215980 -134392 -34425 -10296 -77637 -187852 -305643 -401065 -399177 -254481 -73109
38730 -73109 -30068 -141276 -246939 -248864 -216510 -212508 -181671 -97077 -52406 -95056 -114434 -23373
38718 -23373 86369 105449 86642 109680 101958 -22280 -160534 -167196 -111475 -169314 -315586
38707 -315586 -351969 -219873 -67342 -928 23449 41521 9221 -65537 -90550 -40356 4262
38696 4262 4423 8169 15735 -48325 -179402 -249937 -182712 -53511 22067 -2283 -124876 -296637
38684 -296637 -381157 -261666 -23153 117577 94464 41800 27927 -56118 -254498 -396929
38674 -396929 -334902 -167173 -72529 -50162 6707 85508 78493 -34782 -181232 -313912 -406470
38663 -406470 -397608 -281612 -187747 -221504 -289285 -239445 -118499 -103826 -215142 -290736 -255979
38652 -255979 -224646 -293720 -402654 -448866 -402006 -260977 -44480 125286 88480 -120001
38642 -120001 -247337 -133402 82541 179727 161526 202320 380156 619919 845944 1029260
38632 1029260 1109418 1034074 887641 829256 864811 820021 606512 390278 389797 585515 748595
38621 748595 726488 589547 490079 473737 474038 432120 359652 299326 273204 278845 301191 305732
38609 305732 245284 114044 -10187 -26854 66282 159530 169774 139232 140326 140200 61994 -48439
38597 -48439 -54042 52780 103427 -770 -126385 -107660 -175 22283 -44747 -39971 85429
38586 85429 185368 156551 85185 76219 85248 30901 -42352 -40533 23236 72890 105931 160826
38574 160826 200479 163433 99621 113783 182143 171359 61266 3512 96500 225639 225743
38563 225743 120243 81189 180591 295518 284867 174960 102549 111075 94407 -30691 -177093
38552 -177093 -194343 -79010 34818 87498 157314 270251 296229 143385 -59356 -113470
38542 -113470 -7611 117747 194661 255232 283598 225895 139388 148956 237814 258900 186433
38531 186433 170151 275155 348842 248336 50428 -77673 -93224 -56866 -13261 -1469 -73808
38520 -73808 -191543 -206808 -63392 89460 102762 34321 14790 29439 4817 172 95647
38509 95647 165035 12642 -273329 -359165 -116226 186804 244778 91169 -21193 14663
38499 14663 73702 28454 -73672 -87659 35589 171533 153374 -17951 -145214 -65576 140171
38488 140171 251292 181163 43862 -28442 -13644 51872 126874 147927 73662 -28086 -43564
38477 -43564 19227 40451 -19962 -73345 -67974 -53199 -38434 42329 156238 144174 -20486
38466 -20486 -120542 5406 204493 232059 105057 26714 56977 89155 97046 160945 257351
38455 257351 258936 169165 135724 186465 172044 39889 -57894 -34756 -30155 -153347 -267977
38444 -267977 -223890 -132906 -179653 -285363 -232126 -56128 -22667 -197017 -324562 -222181
38434 -222181 -38443 13102 -30101 -12099 50077 22719 -80534 -103770 1957 115300 142301
38423 142301 124082 118113 107226 75257 62771 89215 102735 59490 -14659 -80997 -137428 -173781
38411 -173781 -150426 -67605 8781 34509 36811 38888 12309 -44780 -66187 -23056 11136 -16098
38399 -16098 -31462 37555 106960 48342 -88601 -126949 -31506 38030 -19485 -95784 -57878
38388 -57878 42631 62677 -5184 -25757 78496 224337 281634 223904 137461 112833 151050
38377 151050 173935 120481 19270 -54692 -81989 -112137 -168872 -200137 -160977 -101784 -111671
38366 -111671 -185794 -213519 -122644 9811 42817 -40550 -92911 7949 174516 200863 41678
38355 41678 -102484 -41088 147111 216469 79463 -89505 -86553 85840 252240 259329 96517
38344 96517 -119767 -237655 -186716 -43857 39873 -3700 -104235 -159257 -146823 -108445 -63778
38333 -63778 16331 160312 334647 435481 369776 174948 22556 44066 175914 246838
38323 246838 200209 144758 189348 319515 450124 514195 482396 376614 281153 263597 283220
38312 283220 268877 273257 413585 647013 766765 675949 508789 405401 330241 221485
38302 221485 155187 204862 271647 235604 176251 248516 408949 471009 401230 355526 412959
38291 412959 463995 409110 312425 293475 377909 506917 605932 610214 503823 356602 251816
38280 251816 178528 78342 -19771 -27023 43831 72888 12844 -48084 -42413 -26682 -70219 -136230
38268 -136230 -142277 -74812 11856 65869 74276 68149 100361 175844 219537 173958 96623 74048
38256 74048 77944 27486 -35407 10100 140667 181514 68516 -44628 -17980 78847 100523
38245 100523 40461 3813 45032 124042 168515 120690 -16852 -145488 -158167 -85845 -55377
38234 -55377 -85215 -63255 33583 66534 -36893 -146848 -134808 -61274 -30678 -4339 88131
38223 88131 177250 161323 81676 24359 -53039 -217779 -374096 -371937 -239616 -123119 -56579
38212 -56579 13892 42527 -54572 -182943 -151931 19257 102136 -5274 -157722 -221075 -234866
38201 -234866 -243851 -178263 -21309 73317 -23737 -210249 -265082 -109238 124226 232101 115984
38190 115984 -122285 -248518 -136645 71586 149122 84975 44911 67972 30371 -67554 -40267
38179 -40267 159824 303461 217815 43599 -18315 -19412 -103846 -196869 -109897 130279 298384
38168 298384 278579 156662 41169 -21609 10442 129715 194385 68024 -166522 -299697
38158 -299697 -287549 -279574 -361295 -449270 -460958 -423706 -382688 -338827 -297891 -256699 -148734
38147 -148734 58549 239823 252841 172590 183693 263657 219547 47779 -27127 65386 119579
38136 119579 28067 -24312 85051 164829 50638 -74391 -109 103545 -37699 -293620
38126 -293620 -311828 -116934 -79489 -279715 -355894 -104934 181465 191095 54775 62260 181298
38115 181298 175011 28634 -55494 -1579 81074 139514 224453 309529 296893 220355 233169
38104 233169 354883 419032 327696 187379 122983 116034 118247 180095 338666 477065 437517
38093 437517 236124 53487 25320 126069 250103 328079 348761 323336 262490 177384 90101
38082 90101 33396 22328 26728 -987 -62842 -106756 -90612 -28533 36492 78489 93515 82368
38070 82368 45169 -13601 -73738 -90672 -27504 82648 149326 142968 145789 209730 225489 65124
38058 65124 -170539 -218733 -9232 213064 209192 44428 -58626 -37697 7318 43350 128435
38047 128435 222839 182111 -3450 -125890 -15860 224682 351234 271020 104160 -12782
38037 -12782 -73625 -137708 -203893 -208651 -124217 -6325 65712 63541 5774 -85465 -179102 -208666
38025 -208666 -121943 31273 125406 96537 -5457 -118066 -231838 -314418 -277604 -114128
38015 -114128 18618 -24877 -171449 -227868 -149063 -66239 -62198 -72097 -28414 39716 95978
38004 95978 155773 200138 153473 18390 -79143 -63582 -28042 -80759 -161206 -128466 21617
37993 21617 148748 158682 101119 77700 127204 206184 234103 166374 58516 26542 99866
37982 99866 158994 83633 -78829 -173817 -141445 -69428 -54869 -104918 -183697 -266423 -311169
37971 -311169 -253507 -91509 63925 88281 -11555 -100517 -79868 -12105 -38810 -183165 -299008
37960 -299008 -255033 -110111 -20500 -5309 70955 259821 405951 349960 161232 53934
37950 53934 117550 240042 278109 201988 71333 -41933 -85704 -44935 51085 165729 284139
37939 284139 374393 368876 255496 145935 155606 235402 229163 95525 -42516 -87692 -87910 -117273
37927 -117273 -149084 -128469 -91025 -116061 -207125 -298578 -346864 -343745 -273691 -141365 -23711
37916 -23711 -6890 -65167 -80998 -6249 69494 50127 -30215 -61141 -5622 76869 139187 195052
37904 195052 243606 228783 128418 24567 10289 60650 78105 44259 26192 30011 -31038
37893 -31038 -171027 -243149 -113444 141859 314389 304837 192426 85819 4983 -81435 -185689
37882 -185689 -292418 -364402 -344258 -204805 -12505 107955 92855 -4981 -81848 -74487 5327
37871 5327 86409 88517 -10469 -157834 -287346 -366276 -365684 -250223 -52222 108389 156126
37860 156126 156163 194822 236050 215860 205575 307819 427773 358411 113491 -42205 29988
37849 29988 141728 77653 -86475 -135642 -46243 34553 55740 104071 210000 297896 332643
37838 332643 354428 349722 237189 20731 -171499 -247832 -243027 -205957 -116294 18965 94769
37827 94769 32809 -94488 -164228 -173856 -202724 -236249 -161881 34704 188852 151330 -7080
37816 -7080 -83518 -10308 67047 -3923 -189535 -336946 -368077 -329079 -280694 -226541 -154000
37805 -154000 -77355 -19925 5986 -2691 -23239 -2472 75093 131160 85315 -3946 5875 122794
37793 122794 172574 35038 -170389 -232559 -118876 6188 -544 -126358 -280969 -413485
37783 -413485 -515187 -558793 -487882 -282520 -29719 110097 58884 -71571 -101130 -9806
37773 -9806 49648 -15645 -115984 -146655 -145834 -174693 -153626 23040 271808 390789 331836
37762 331836 245842 246193 276976 255681 210534 204368 221604 209256 163466 107637 37387 -47735
37750 -47735 -95361 -48164 69466 156811 133453 15884 -97936 -115565 -29273 90513 176282
37739 176282 211668 195574 115033 -4678 -75239 -39895 35434 35131 -58566 -153336 -162690 -70479
37727 -70479 93465 260544 321285 208757 -2460 -150292 -150420 -57368 26828 41099 -20003
37716 -20003 -102320 -111251 -10240 111031 141711 98782 80176 99307 86367 42204 53016
37705 53016 133746 188464 161308 106478 70521 24455 -42107 -74803 -51734 -19439 7515 66361
37693 66361 132560 127369 84460 144614 310707 387832 281034 171223 234197 349279 295195
37682 295195 111573 27125 98658 166702 149912 145646 209990 250056 197459 115264 63408
37671 63408 10106 -47808 -17443 141575 309897 347872 264964 168881 116709 97422 101912
37660 101912 124116 128267 89525 47781 64029 136838 205462 224927 207256 199811 242189 329092
37648 329092 405600 422690 402882 415443 474486 501952 417523 239731 77527 38122 145046
37637 145046 314309 403854 327014 140425 -5728 -21286 43714 83415 67097 56382 107410
37626 107410 189491 216488 154266 76210 85970 189593 285752 296792 260475 256732 290693 303804
37614 303804 268901 213888 170617 153719 166844 175932 111559 -29238 -118607 -34744 148892
37603 148892 220369 89319 -113475 -224532 -231360 -217874 -223697 -235706 -251732 -267186 -235599
37592 -235599 -117239 51459 191574 263833 269694 201169 56060 -106086 -191113 -172066 -119371
37581 -119371 -106143 -118268 -95223 -41825 -41985 -133168 -212102 -137853 68629 206123 118673
37570 118673 -117658 -291268 -290791 -174161 -42589 60211 128755 160940 161251 131317 63234
37559 63234 -15016 -25774 53441 113268 43615 -89039 -121537 -39917 -596 -86420 -189155
37548 -189155 -185506 -98389 -22076 -6773 -74946 -223445 -343540 -280813 -63204 75665 11279
37537 11279 -82940 -4362 167368 216800 135938 97712 151585 179204 138179 126749 181434
37526 181434 209342 165767 122294 109764 63699 -17316 -29576 45295 73919 -10701 -83751
37515 -83751 -39017 23310 -31489 -131882 -103338 63032 215647 271709 274983 244301 133170
37504 133170 -37251 -149984 -145577 -94797 -75592 -80913 -99193 -179493 -330561 -432871 -360022
37493 -360022 -158646 -10618 -16960 -100616 -137774 -107702 -70135 -53468 -32498 5055 35457
37482 35457 47003 59246 79520 85161 71412 76000 123385 175277 171459 98865 -4271 -83025
37470 -83025 -81517 26032 174121 225880 121398 -30037 -76030 -2331 90276 142431 159166
37459 159166 115541 -13611 -134635 -109677 19993 56963 -45443 -84744 71455 250833
37449 250833 233474 94006 65134 157204 168794 45764 -33717 27855 92097 39496 -24418
37438 -24418 42877 174630 189628 42067 -153903 -279757 -279864 -142071 70081 215650 216533
37427 216533 156331 140939 123461 -1326 -176789 -224396 -107802 2713 -22551 -97268 -70966
37416 -70966 44545 102420 26085 -101295 -143051 -51116 96332 173478 130637 44610 20914
37405 20914 51647 28030 -89150 -184762 -134596 12252 79937 -7635 -122477 -92427 78109
37394 78109 208461 168041 46830 47300 226139 418654 443689 310277 162223 81744 43744
37383 43744 30764 74073 166177 235849 246044 232102 206916 118919 -37853 -151670 -108128
37372 -108128 70493 260546 363210 342979 205783 18560 -96365 -74487 3651 4870
37362 4870 -101387 -236055 -317152 -306473 -198129 -46844 31187 -20890 -111852 -128890 -106111
37351 -106111 -140105 -178151 -69352 154019 236294 31525 -270922 -380502 -263202 -125797
37341 -125797 -107245 -141750 -125398 -77843 -80763 -138601 -177128 -157377 -128177 -145897 -177900 -135068
37329 -135068 -4303 107260 100568 11911 -51411 -69655 -120575 -240623 -365844 -422303 -395887
37318 -395887 -303641 -185222 -137961 -254053 -478694 -626558 -597674 -496590 -483184 -588415
37308 -588415 -737324 -868078 -956274 -1000640 -1057475 -1206533 -1405311 -1473251 -1325285 -1134429
37298 -1134429 -1139148 -1359998 -1635492 -1864931 -2053670 -2164204 -2110290 -1911464 -1695061 -1515731
37288 -1515731 -1310768 -1064153 -873837 -801787 -777660 -713910 -615079 -513087 -391062 -242053
37278 -242053 -124320 -86258 -95272 -100614 -112961 -166009 -243253 -289961 -265629 -163880 -27441
37267 -27441 47375 -7713 -126222 -160346 -69480 29310 32931 -25321 -79268 -146250 -246930
37256 -246930 -300790 -227581 -101257 -68867 -128519 -117933 47517 235945 266521 148949 65182
37245 65182 122183 210118 156663 -31407 -174770 -169478 -115060 -134586 -177043 -123335 -13316
37234 -13316 4739 -67568 -58774 94605 225837 177499 16849 -91850 -105898 -78118 -19364
37223 -19364 77037 144462 107422 -1261 -82762 -86314 -9085 138629 280600 284226 138842
37212 138842 29869 100371 235658 248699 184354 226046 356170 355543 150876 -68538 -131320
37201 -131320 -75774 3388 99935 193817 187054 64768 -27522 7498 63486 13009 -75691
37190 -75691 -53180 74599 181213 225578 266588 311382 302166 246076 222288 246646 242850 171864
37178 171864 93886 67602 63693 22343 -49063 -76862 -7652 123076 214975 208683 158631 159135
37166 159135 202398 184979 79649 8232 76058 210420 255122 173859 63022 -2589 -36496
37155 -36496 -68688 -99011 -120431 -116912 -51594 70522 153023 112088 13263 361 89590 147229
37143 147229 91819 2154 -25285 -21679 -69985 -155426 -179622 -90389 71423 231322 326330
37132 326330 309580 180391 22644 -41798 23738 116569 105837 -2222 -60222 28986 172629
37121 172629 218060 183080 221200 340701 329896 70303 -223518 -254473 -41731 137791
37111 137791 159957 168831 267937 346530 307595 252766 296873 367843 352231 301225 315657 339603
37099 339603 264042 155382 171064 288461 328568 243906 174393 186737 161560 15248 -141507
37088 -141507 -174699 -120319 -86580 -67272 13915 135112 184593 123744 41937 39583 119730
37077 119730 205495 225057 171117 93569 35876 -10815 -66747 -99850 -62238 18443 60843
37066 60843 48469 38947 41055 -8353 -103375 -124346 -12808 114152 124461 53914 14015 4306
37054 4306 -40525 -83893 -38447 46389 29377 -80128 -101378 50984 239835 311933 282604
37043 282604 228116 138639 3748 -71239 9257 151778 170779 40552 -80117 -66481 47728
37032 47728 166671 238052 241221 174136 93292 86213 158892 209787 153499 21686 -87078
37021 -87078 -109983 -51117 35081 65769 -7467 -124752 -161098 -76962 32462 74962 75369 91584
37009 91584 93283 24068 -65576 -71408 -9878 -8945 -96926 -127911 8348 202174 255627 139690
36997 139690 4618 -39093 -24620 -2947 57265 178355 281648 287237 249803 285379 386403
36986 386403 425628 353076 271347 269716 292851 255493 196019 200743 236967 204643 136232 187889
36974 187889 395758 586487 609690 538383 528234 574069 550201 440374 366427 383910 395144
36963 395144 311292 185976 122026 128418 138259 109685 48339 -21612 -55239 -3895 111237
36952 111237 190200 177647 149013 205333 321214 375172 307342 172182 52640 -3372 21318
36941 21318 95225 120042 17549 -156572 -266102 -267492 -239221 -228904 -189128 -112674 -108725
36930 -108725 -246351 -411031 -438205 -338445 -264758 -281059 -295902 -236619 -159558 -135885 -132994
36919 -132994 -88346 -30163 -34041 -95548 -133904 -114447 -88825 -98863 -105891 -51468 51308 126226
36907 126226 114547 16545 -131243 -282173 -382969 -389028 -300617 -172723 -71714 -23157 -8304
36896 -8304 -4202 -14727 -60409 -143483 -226302 -247800 -168332 -3169 184701 317690 333710
36885 333710 216037 24123 -126169 -162500 -135200 -146924 -203646 -206603 -112616 -14893 -6951
36874 -6951 -47945 -50576 -31945 -58676 -92566 -41209 48657 15194 -162679 -291904 -227054 -68212
36862 -68212 7568 -8685 -16214 -11803 -70879 -166284 -178190 -90319 -24874 -48490 -77405 -34409
36850 -34409 14294 -34077 -151454 -214679 -173967 -99260 -63183 -51430 -16061 28799 13911
36839 13911 -85065 -197105 -234470 -197990 -159580 -151174 -132572 -77892 -19243 31049 124786 277404
36827 277404 383274 320519 114762 -78716 -142028 -83900 10069 47254 -23485 -155348 -218101
36816 -218101 -147289 -50782 -72652 -175606 -177277 -8034 186907 237483 143109 34375 18704
36805 18704 103018 205061 213995 101744 -13078 12528 150136 221712 142087 31538 31215
36794 31215 106626 120789 34213 -64737 -97549 -73792 -26352 62066 218612 377479 381884
36783 381884 161265 -112072 -163972 39507 224762 178606 30805 5768 48007 -39969
36773 -39969 -181190 -85430 258713 493096 390110 137372 -12232 -73801 -128238 -79813
36763 -79813 125203 274352 178804 9851 44436 217243 243400 84514 -38581 -43932 -69035
36752 -69035 -157654 -178122 -92332 -29580 -37725 -8990 91171 158740 171386 236007 345967
36741 345967 330892 147181 -7101 10069 74652 23471 -85013 -93331 4179 84911 84837 41950
36729 41950 15199 37746 93486 109091 47887 3724 75352 167263 98638 -88496 -157270
36718 -157270 -54006 -6834 -153056 -317623 -300425 -153300 -12415 119504 238393 207932
36708 207932 -11294 -193300 -151206 -40867 -101510 -252177 -242937 -85710 -9231 -53398 -38962
36697 -38962 75324 125815 62410 36634 109495 140692 53763 -30096 -19454 6406 -12125
36686 -12125 9224 112993 178068 117388 35442 49409 94419 52875 -38840 -61367 -3914
36675 -3914 50354 64420 56231 26807 -16516 -22834 20000 25606 -71884 -197949 -237936 -204161
36663 -204161 -196537 -237825 -256816 -210407 -121700 -15013 90628 138087 83165 -10217 -21545
36652 -21545 65829 142253 130313 80810 73735 101087 107214 90048 87749 87851 26702 -104098
36640 -104098 -205945 -171426 -20299 100216 65196 -91109 -203888 -146227 38372 182182
36630 182182 175660 88599 82857 206638 323856 283229 114973 -11581 -12805 15160 -47919
36619 -47919 -179669 -263155 -244019 -166679 -85078 -12882 40543 46302 -13077 -116758 -220017
36608 -220017 -287761 -319704 -341672 -353959 -303437 -154196 25923 124486 133685 145339 177218
36597 177218 128926 -25277 -128738 -42374 143731 230613 173315 89616 62801 77757 112988
36586 112988 150288 117968 -31888 -206158 -268953 -234084 -209879 -182530 -44758 157192 219429
36575 219429 82571 -56334 -26979 85595 105595 18867 -60564 -66640 -8093 92865 185318
36564 185318 188479 93736 -2511 -32777 -35944 -42958 -6397 72765 81786 -23331 -99664 -23536
36552 -23536 96482 81240 -34432 -71978 -8134 6914 -75437 -115715 -23503 91910 91634
36541 91634 1330 -59901 -59358 -60155 -88936 -81138 27322 191530 276024 204269 73231 56992
36529 56992 180764 275957 215103 95911 83140 143386 97625 -77717 -175709 -41884 201896
36518 201896 313066 228841 109736 116460 235803 338030 343341 291785 265860 283980 294654
36507 294654 260510 204054 154015 88348 -24540 -142924 -159590 -14105 216556 363049
36497 363049 321261 166019 73893 117916 194957 198604 180015 231616 285532 201012 30424
36486 30424 -11505 114709 184690 60358 -82020 -34300 116135 151277 77524 76300 183204
36475 183204 261328 257125 247505 238988 147113 -2273 -62521 2764 70777 85602 142190 285415
36463 285415 410075 436747 416474 382282 271133 91710 65 82237 205049 216868 170011
36452 170011 198134 277182 266948 128912 -35412 -125800 -117324 -34951 53877 64467 -7886
36441 -7886 -61718 -21619 68674 141675 202158 253721 235768 135289 62192 97753 162428 159685
36429 159685 151071 233287 328958 286948 141975 82156 171496 283998 318086 305481 287802
36418 287802 249888 211995 236857 300580 296498 212103 160107 180652 163113 45850 -46963
36407 -46963 22577 208298 369128 462272 521721 519736 398093 212081 109196 150777 251344
36396 251344 311053 325472 338349 355567 348160 300917 219766 111410 -11807 -111657 -136943
36385 -136943 -73644 25615 84851 85375 80581 113044 145677 113806 27458 -29353 -2014 78383
36373 78383 151187 197943 240921 295378 336792 310993 194857 59956 30789 137071 258165
36362 258165 282084 264723 326504 433032 423629 258614 82490 3547 -32672 -80523 -64584
36351 -64584 69123 205641 216368 166385 202547 303122 322526 259002 285473 480643 688623
36340 688623 712344 536062 298393 137348 114729 207160 309732 312783 227793 184110 263795
36329 263795 400950 482831 483185 445851 400705 360264 354067 401825 477184 542533 591802 625449
36317 625449 626024 601824 610355 683545 764734 777398 728247 683275 666356 651326 648647 727290
36305 727290 922158 1159930 1313671 1330697 1293234 1337381 1500516 1665782 1687535 1554914
36295 1554914 1382664 1256991 1170217 1111960 1119292 1186253 1217498 1150730 1056500 1033350 1061124
36284 1061124 1047072 974258 919666 960829 1132786 1416295 1683239 1732683 1509058 1224958
36274 1224958 1119877 1142233 1038894 730469 397882 185900 36011 -123943 -230489 -233464
36264 -233464 -221537 -272574 -325100 -327625 -370890 -517954 -634912 -574590 -428146 -394571 -468918
36253 -468918 -471095 -353398 -267754 -316599 -428802 -518342 -594063 -659452 -655769 -569520 -469731
36242 -469731 -382251 -251788 -86813 -10072 -81527 -186207 -196628 -155053 -192214 -335271 -495037
36231 -495037 -590078 -593155 -502016 -356172 -251175 -251066 -303563 -310033 -260554 -235045 -283996 -366421
36219 -366421 -402713 -352692 -255036 -211132 -290236 -417431 -409274 -179289 132436 298047 238889
36208 238889 63568 -91731 -176165 -192193 -144722 -55603 18683 16921 -81880 -231866 -331844
36197 -331844 -304457 -192715 -127780 -156024 -161027 -35117 130151 142235 -26676 -203374 -255615
36186 -255615 -235319 -229882 -203217 -89329 46945 74819 -13374 -100548 -123397 -132050 -153720
36175 -153720 -122249 -8912 80173 42523 -47321 -26687 113937 209507 161732 75353 90028
36164 90028 183405 239178 234702 241744 278256 279492 212097 114524 17779 -84471 -180752 -240890
36152 -240890 -269561 -273457 -189719 34489 290781 379628 264370 117481 70501 67705 30648
36141 30648 286 11967 -7724 -80985 -68311 108770 267963 198504 -3967 -64757 66572
36130 66572 180680 155569 94048 90539 93572 64983 74714 154257 221509 224208 204374 163198
36118 163198 33924 -140791 -188336 -62352 51653 -168 -133122 -202188 -222125 -263015
36108 -263015 -280129 -219903 -166247 -199392 -219442 -101081 68447 105771 17008 -32577 13686
36097 13686 60545 51735 18862 -32109 -102297 -100399 45568 204119 175336 -4765 -115252
36086 -115252 -99463 -111210 -183714 -134427 98732 289967 252858 115162 81106 107265 35510
36075 35510 -89676 -82768 67446 169866 112169 -11478 -70901 -51734 -3160 54250 118202
36064 118202 159673 126565 -8060 -183880 -254928 -133385 56217 78734 -109670 -285209
36054 -285209 -253347 -85449 44480 113452 187219 231233 177622 99412 119479 198155 203618
36043 203618 148182 150944 197601 157967 36362 -21311 14317 21359 -17177 31527 172187
36032 172187 214151 96602 34885 180278 354017 321246 146349 48756 51430 20766 -46689
36021 -46689 -38343 25820 12344 -66256 -46941 103139 214918 179151 93826 82030 125103
36010 125103 157855 192414 258753 328411 373286 406913 407159 303030 111694 -13582 35945
35999 35945 176584 255877 250319 238075 237313 197367 130660 130648 232044 340928 350413 275292
35987 275292 223136 253224 311349 313370 256669 210030 205953 202803 174024 167649 220554 272798
35975 272798 254679 217005 261763 361157 381684 309496 307968 480657 699807 776728 716802
35964 716802 684603 763674 872495 911724 895403 915050 1031286 1218475 1393762 1511036
35954 1511036 1636125 1880713 2232238 2515462 2579033 2453100 2247396 1971676 1582314 1160391
35944 1160391 881453 784870 711614 532041 327262 259374 333344 386376 292617 100098
35934 100098 -45182 -62294 767 44954 29105 -16756 -65545 -125936 -187126 -198505 -156132
35923 -156132 -146348 -221113 -283596 -212960 -72611 -50154 -181091 -289273 -256254 -193784 -244587
35912 -244587 -346929 -347722 -259243 -227093 -278404 -279512 -160973 -29403 -4838 -73460 -168163
35901 -168163 -285321 -429459 -519282 -457889 -272447 -99776 -32228 -31659 252 101504 205503
35890 205503 209134 96681 -14317 1518 106135 129486 3509 -124421 -84602 82166
35880 82166 185524 133399 9888 -68527 -61050 22372 134394 171773 65275 -90256 -119244
35869 -119244 -9510 63836 7873 -53250 -6712 47977 -20259 -123586 -84307 63833 117661
35858 117661 19003 -83903 -94884 -81217 -89250 -55189 23872 21169 -108682 -217580 -193220
35847 -193220 -152389 -250565 -418467 -463529 -355649 -238936 -204565 -211442 -206991 -183620 -133892
35836 -133892 -79184 -115495 -292068 -467731 -441020 -221370 -22963 16139 -43005 -108819 -180496
35825 -180496 -252595 -256273 -173164 -87295 -58690 -56771 -65963 -122758 -189238 -144192 7267 66600
35813 66600 -90847 -311747 -368413 -252304 -110945 3435 140118 272952 306369 233241
35803 233241 128035 9428 -137795 -240362 -209117 -113139 -101077 -159657 -145220 -57848 -61741
35792 -61741 -190718 -264549 -185773 -97696 -123098 -156734 -79873 11523 -6982 -40075 52636
35781 52636 161938 81065 -118140 -150218 43124 190229 84194 -153743 -288415 -245670
35771 -245670 -79175 149878 343877 381094 282735 233012 318740 392555 324221 231448 281201
35760 281201 392286 359660 199879 132137 225357 288591 156469 -97048 -289943 -331121
35750 -331121 -231996 -54309 87749 90329 -5965 -40818 53788 169310 202797 206633 273385
35739 273385 372306 402772 342366 250356 176419 139238 139425 128758 34165 -121813 -208018 -172534
35727 -172534 -146306 -244781 -356673 -284176 -41135 153366 163537 64618 -19290 -52074 -36934
35716 -36934 23308 72741 36570 -45648 -47594 32269 28216 -138852 -300960 -263326 -84562
35705 -84562 10226 -64046 -182969 -223409 -194766 -147714 -86350 -20676 -8834 -83711 -194187
35694 -194187 -265298 -272084 -222295 -120068 7769 92085 81024 -1430 -91500 -152683 -173328
35683 -173328 -139598 -70450 -49283 -141476 -285293 -348521 -310160 -298395 -404361 -542394 -571611
35672 -571611 -490751 -408910 -358361 -258522 -75782 93503 144370 85266 -9067 -95346 -157289
35661 -157289 -164776 -104811 -19465 38051 56988 46155 3158 -52655 -64637 -4309 88081 165185
35649 165185 220296 236690 166965 24854 -82066 -92922 -90020 -158292 -227270 -178483 -47055
35638 -47055 31392 37432 74622 171267 232894 209359 170017 187787 271799 429624 666126
35627 666126 905913 1056336 1165756 1366965 1637673 1791314 1759890 1704712 1758928 1834014
35617 1834014 1798864 1695477 1638656 1631606 1625932 1654234 1754792 1856336 1883934 1904580 2032364
35606 2032364 2256754 2485148 2677108 2816197 2839760 2731422 2595170 2501674 2360189 2090395
35596 2090395 1805230 1641661 1523313 1305381 1053090 928575 883321 744314 554405 514446
35586 514446 594668 540059 313381 192722 317728 466189 446213 402545 509888 628146
35576 628146 536172 311292 192940 209375 213977 186150 223389 302207 306357 253847 258541 298605
35564 298605 256291 162024 157891 228974 223283 151167 195651 368809 430366 262712 81668
35553 81668 113758 266584 310293 231294 194879 252135 291000 241980 160582 109683 88839
35542 88839 79991 66592 19091 -57804 -89966 -23191 90583 175137 244328 338481 404909 364576
35530 364576 256253 181246 136295 49619 -36602 4482 153710 227242 152559 94053 201985
35519 201985 381378 443533 378565 325174 332245 302361 162521 -21674 -113162 -26659 194888
35508 194888 384547 387142 244895 172705 280917 423156 421329 326876 305564 365333 399384
35497 399384 427194 550235 691549 647373 436979 335903 468780 617513 567232 413103
35487 413103 351945 372684 357868 324340 341432 345637 264171 208264 308669 458978 470209
35476 470209 393299 419088 529980 553883 524030 644200 876740 924128 714087 557949
35466 557949 669482 842428 814218 666114 602795 571654 405928 180154 105321 167457
35456 167457 171552 87723 61252 99725 41187 -136193 -239564 -167183 -59988 -54161 -76915
35445 -76915 -643 152963 275356 320560 295844 204912 90040 44706 101400 173190 167495
35434 167495 93338 13521 -34709 -36676 -1902 5279 -63106 -117546 -16116 190852 267275
35423 267275 124135 -29413 5423 132326 164801 157021 280925 473626 500491 349955
35413 349955 266752 340111 348967 141303 -92021 -109283 24613 98776 114559 218231 371906
35402 371906 382269 244174 179731 286730 395601 363171 278556 247564 184172 2175 -149524
35391 -149524 -69127 174149 322963 294672 245311 278695 306467 243705 159994 154057 210489
35380 210489 256525 256869 196523 75417 -27786 1583 148425 254822 233793 179168 192992
35369 192992 232712 223998 196593 188764 138819 16543 -46874 66904 242742 276833 187863
35358 187863 178929 308510 410608 365437 251299 174087 127333 97265 138989 244660 275679
35347 275679 146175 -30838 -95321 -49512 -235 29860 100840 207061 259980 220719 156393
35336 156393 149439 207306 267184 255487 154386 35798 2443 69695 144702 149124 108166
35325 108166 79435 58006 15032 -20969 4625 89426 181976 244903 261470 218608 136721
35314 136721 74136 48495 5137 -77534 -118523 -53099 44433 63064 27275 45701 127904
35303 127904 187174 200000 213676 205528 104840 -24133 -5891 172141 285399 181877 12466
35292 12466 8380 152547 245755 218314 186915 232794 305118 354440 401230 437719 401615 296093
35280 296093 214971 196695 169321 100234 76959 145788 180385 44611 -175525 -243505 -64326
35269 -64326 209667 371829 364563 275576 219882 258033 364812 441678 403547 277451 178912
35258 178912 180923 250101 316439 346706 334950 289571 262860 326488 466118 555007 495047
35247 495047 345079 244029 237086 251521 229543 204051 229927 309247 415523 539935 668497
35236 668497 740433 679855 481087 243804 104309 120349 222599 288801 265187 199155 157974
35225 157974 155982 178561 228927 304100 357884 350110 319896 345291 428499 488520 487381 497090
35213 497090 595672 743826 825991 796206 724607 693692 699035 683006 638511 632717 716970 843731
35201 843731 903913 842026 709678 606680 598223 690524 841356 966848 978751 866483 729406
35190 729406 682899 734018 785978 763502 695709 667577 720015 811257 861999 834010 772225
35179 772225 760974 827972 907366 911892 821203 686692 584852 586317 715583 889578 945575
35168 945575 806137 588447 472935 488768 521472 517371 562061 724952 925333 1010772 911543
35157 911543 682955 452443 349904 419266 559233 611546 540415 459837 457247 480732 453884
35146 453884 407590 410498 441397 434278 403304 414967 458761 451033 368916 288263 271190 291121
35134 291121 293536 269053 235813 197757 157489 142542 182032 261681 325739 334473 311247 310611
35122 310611 333575 312629 217041 130883 151667 235616 246566 161966 109970 167364 250466
35111 250466 275823 297869 378822 440536 389231 293192 269125 264511 150168 -9373 -6012
35100 -6012 168991 262714 132323 -21340 60811 321071 471271 377760 191511 118070 203040
35089 203040 357668 479460 507563 437225 328644 265733 276038 308588 299712 241265 178254
35078 178254 155110 168943 168744 105447 -10662 -112555 -144881 -117174 -76495 -38603 32977
35067 32977 172047 341731 440963 400878 270277 171419 162194 183365 161783 111566 88137
35056 88137 92616 87579 71766 68610 70587 67719 94464 158030 158515 2496 -219118 -306097 -215418
35043 -215418 -109648 -103645 -117202 -55085 13724 -22988 -127772 -175476 -140290 -97184 -84953
35032 -84953 -82503 -86283 -105996 -110181 -68483 -17828 -1332 13980 62128 74713 -23917 -159040
35020 -159040 -188789 -129995 -143640 -277507 -381675 -335502 -217814 -166679 -182835 -175903 -130120
35009 -130120 -119126 -192636 -326430 -457828 -516414 -461493 -348891 -315686 -424479 -555316
34999 -555316 -534533 -356401 -191750 -168934 -228794 -233497 -154270 -87178 -111029 -203269 -311431
34988 -311431 -443047 -624534 -799134 -852064 -763657 -663645 -672530 -743276 -742755 -652639 -579849
34977 -579849 -571288 -543012 -437127 -336204 -340695 -419136 -482830 -547766 -697533 -907746 -1038743
34966 -1038743 -1026448 -968344 -970450 -1005096 -995467 -964144 -991498 -1062887 -1077061 -1017433 -998688 -1083193
34954 -1083193 -1146194 -1031995 -800076 -684372 -787953 -937162 -909664 -718875 -565209 -550621
34944 -550621 -570267 -500968 -379925 -329326 -374367 -420046 -386602 -299924 -242773 -259735 -321898
34933 -321898 -361283 -330222 -235261 -113137 23019 191207 387219 559463 669069 750470
34923 750470 867533 1017892 1128448 1153454 1132741 1130244 1149272 1141157 1076159 969490 848376
34912 848376 733556 653910 636000 661723 675021 660145 677510 774506 887044 899665 806050
34901 806050 733500 771629 840960 795271 617999 444415 396054 457084 524791 529373 480124
34890 480124 428391 414320 440097 480336 513467 531750 521752 470690 411528 415710 496952 566471
34878 566471 548641 501683 533983 624901 642984 550272 466436 487438 555341 577493 570405 589462
34866 589462 602022 549635 478657 478712 522168 503242 435506 465033 642778 811581 802704 655211
34854 655211 541260 529717 535303 489259 449622 499607 606946 652590 579811 456455 381168
34843 381168 375733 397874 420226 443444 449984 414823 372983 404928 516969 599606 564530 473889
34831 473889 457784 534240 596717 571123 498274 448456 432922 426721 414340 382991 326316 280123
34819 280123 296257 354367 365503 300521 244164 267185 315938 308869 285304 353003 511912
34808 511912 640609 666804 649470 658438 663879 607081 517028 480425 523994 593108 637019 656475
34796 656475 662770 640836 574135 476365 379597 309610 284416 315159 389078 465161 507306 516819
34784 516819 516620 509203 471888 399774 336863 346828 448461 585483 670877 670687 639086 651727
34772 651727 702809 701071 594430 470348 479670 658980 877489 977262 924523 800233 688294
34761 688294 618340 589549 596301 631768 696650 793794 889878 913214 837791 746537 748623 840405
34749 840405 911949 893940 831646 800548 817481 861136 913686 943462 907263 819571 769589
34738 769589 816282 908273 960319 967733 986524 1038995 1104420 1168742 1211521 1176847 1045350
34727 1045350 915849 915338 1023014 1079277 988750 825319 711609 689489 748980 882753 1039749
34716 1039749 1110164 1050497 966280 975900 1038070 1019955 907948 830683 865937 938316 945818
34705 945818 893647 847979 833886 850144 930456 1102217 1298816 1392236 1334762 1221805 1185169
34694 1185169 1248589 1320151 1319701 1274291 1262870 1296057 1309627 1281135 1277444 1339348 1390119 1347051
34682 1347051 1273974 1302036 1418372 1481360 1467317 1532246 1745501 1929232 1914809 1827250 1906667
34671 1906667 2122167 2211857 2108102 2059490 2236111 2448726 2435295 2257823 2194986 2334603
34661 2334603 2507309 2601622 2711389 2915997 3110734 3170116 3151794 3211788 3390656 3596568
34651 3596568 3752800 3855535 3915074 3948833 4030438 4243757 4566086 4883222 5151972 5462151
34641 5462151 5885234 6345079 6725199 7043383 7411189 7861791 8358757 8967625 9836890
34632 9836890 10938267 12002565 12859945 13710196 14869615 16357769 17976872 19738677
34624 19738677 21907762 24591700 27614903 30932423 34870003 39751326 45561976 52257772
34616 52257772 60179372 69849049 81575013 95661717 112876719 134294944 160775263
34609 160775263 192834006 230228088 270037649 304734129 323957210 320616340 296171264
34602 296171264 259558679 220801861 185723470 155760611 130679994 110173047 93662266
34595 93662266 80177107 68941498 59634419 51967468 45466267 39826357 35102758 31326182
34587 31326182 28186549 25301972 22611337 20293721 18420504 16875767 15541928 14374342
34579 14374342 13304097 12226074 11129076 10141684 9388385 8841742 8363116 7867208 7392653
34570 7392653 6998894 6649131 6257833 5834724 5493038 5285147 5110193 4845962 4511549
34561 4511549 4225486 4048602 3945197 3858439 3740384 3545873 3291174 3086655 3009981 2979090
34551 2979090 2867039 2707875 2636132 2633051 2520285 2250591 2018445 1984975 2052940 2040568
34541 2040568 1940930 1854830 1776522 1630666 1463296 1409335 1478255 1530782 1480744 1384408 1312937
34530 1312937 1265639 1238959 1261043 1313397 1318902 1252886 1178673 1134490 1076548 982861 926277
34519 926277 978805 1103539 1196205 1188343 1080545 936876 871894 957218 1095526 1079137 843612
34508 843612 582287 526307 681182 872421 983612 1030522 1039449 988781 887409 809200 811230
34497 811230 871715 926344 928534 878090 827169 838179 897023 908659 834745 780004 852672 987987
34485 987987 1029909 962186 919534 965647 1007605 968227 900835 867508 836905 794115 828335
34474 828335 984735 1120912 1060643 846703 698310 730364 844963 906487 895723 855745
34464 855745 800977 748533 758522 858542 966827 967533 856570 755473 768316 861587 907769
34453 907769 830632 681243 568961 544144 571002 595968 598757 574070 514451 439876 405865
34442 405865 442591 507260 530523 491512 417275 334119 263087 247077 327617 480954 608659
34431 608659 615639 502011 376631 360206 448430 494206 384278 218656 215123 409943 570965
34420 570965 487585 246072 101893 156633 303385 439572 559914 638587 598172 458387
34410 458387 380096 477050 671902 804741 808342 725013 634460 622948 740947 924392 1027014
34399 1027014 986132 882529 793206 693517 575710 536616 625623 713116 664576 565553 596697
34388 596697 736300 787937 696136 621221 653278 659536 525962 380062 413625 586342 673142
34377 673142 566017 385316 296559 333831 420851 477798 479965 465664 498610 584340 640662
34366 640662 607869 563428 636809 808050 895402 787659 600742 530547 610719 702937 694104
34355 694104 609270 533095 513659 573163 730398 945686 1088301 1039390 834251 652250
34345 652250 643906 788520 933586 959249 891629 856849 930345 1047233 1084427 1023020 977284
34334 977284 1036939 1137735 1154082 1084308 1051450 1120421 1215948 1261498 1306168 1434113 1609861
34323 1609861 1715884 1725608 1740124 1835199 1953607 1995065 1962023 1959362 2063743 2237688 2382673
34312 2382673 2455275 2511745 2633742 2823004 2995372 3088970 3150123 3279518 3504832 3744706
34302 3744706 3904450 3978025 4043806 4180528 4398789 4639414 4827598 4937536 5009264 5094164
34292 5094164 5185586 5218924 5143978 4983402 4813863 4698539 4638306 4574974 4438560 4205464
34282 4205464 3917898 3637515 3378601 3104946 2802318 2530172 2366512 2302119 2231505 2077895
34272 2077895 1896025 1796826 1780060 1718645 1540847 1351424 1295011 1348273 1350211 1224330 1058189
34261 1058189 942508 842941 685990 479443 275565 89245 -69809 -151969 -145635 -143578
34251 -143578 -229429 -340437 -353487 -276871 -231056 -245371 -209341 -59758 102647 146489 76648
34240 76648 1559 -11612 12230 23454 23251 70941 206780 353813 351596 157115 -43302
34229 -43302 -40508 111422 167083 46540 -61497 -3373 122255 159298 137608 167945 224963
34218 224963 213784 162584 163520 181156 106606 -31848 -99263 -82196 -99502 -176664 -196714 -110738
34206 -110738 -18885 9845 26779 50915 6108 -101518 -124517 -16216 40506 -87596 -225044
34195 -225044 -120570 156358 290713 168393 17453 65042 248970 355130 297888 159842
34185 159842 43141 -16684 -26744 -149 56684 136625 204086 200768 122349 56034 74554
34174 74554 129059 136681 132995 208140 313174 295365 149469 60307 131055 238868 260137
34163 260137 272627 384535 500912 453533 284089 199782 275447 378900 390650 335331 278209
34152 278209 237831 233240 293786 389156 453390 492595 560215 623766 588814 470150 394212
34141 394212 399858 388375 319008 292002 360634 419775 386378 346698 402235 500923 556194 607497
34129 607497 706648 762730 686743 595879 658409 791654 748988 502377 303586 315858 399275
34118 399275 360519 242441 232025 390461 602500 733353 736100 642817 529579 472258 487908
34107 487908 530968 557459 557451 526558 466392 419849 439287 511248 580246 642524 725833 779987
34095 779987 711600 555842 480053 554277 644353 621013 557996 601311 728677 780507 690301
34084 690301 555921 492257 518144 590102 660769 696639 705841 749549 866614 993456 1021348
34073 1021348 931830 816892 763664 774493 806715 838475 875907 926883 983030 1017249 1008521
34062 1008521 985364 1021436 1153602 1316777 1396326 1345765 1228143 1138348 1100970 1055949 951714
34051 951714 843287 853454 1005607 1146970 1110811 921992 748561 671505 622028 548411
34041 548411 502862 520016 543752 539348 553546 593721 583301 525375 559298 726673 829973
34030 829973 698601 473142 416423 528733 583387 499621 431151 474097 527735 506656 481600
34019 481600 517171 541616 483604 404806 396623 449444 501205 515375 452271 280330 80872
34008 80872 16173 115818 219023 209533 167317 183999 184383 88615 17261 129034 333216 384246
33996 384246 238727 103657 108990 138783 60601 -55120 -65027 20209 75890 63878 63006 121904
33984 121904 193159 221090 206185 161374 81192 -7933 -31346 43554 145182 189528 197239
33973 197239 235659 269002 187094 5709 -96694 -23727 74838 10067 -164283 -239874 -171125
33962 -171125 -111718 -137129 -139088 -51818 20363 13181 58070 261173 460809 407757 120795
33951 120795 -132459 -184015 -111830 -38861 26765 103900 154664 171007 219874 310614 320209
33940 320209 157522 -70002 -166447 -85309 44607 106882 107401 99011 100609 121526 181128 254244
33928 254244 259868 160932 29103 -45801 -65513 -74626 -50636 52198 167422 155579 11550
33917 11550 -91862 -39381 56567 24357 -115548 -199108 -163793 -99555 -74013 -52964 -8638
33906 -8638 25320 38252 64851 89470 44307 -53848 -82603 8967 106579 82863 -46566 -180668
33894 -180668 -253863 -237974 -126358 6855 31420 -69123 -148411 -106009 -35834 -54529 -94030
33883 -94030 -16772 143178 220999 159872 55513 -8888 -28643 -3027 63881 105830 71596
33872 71596 33409 77213 121972 23248 -161623 -215084 -89184 11416 -62164 -204901 -258292
33861 -258292 -229245 -189922 -118411 11822 104583 62610 -43073 -71220 -16948 16540 2152
33850 2152 5635 48467 86447 110044 141237 137471 28933 -131995 -185148 -74063 61503
33839 61503 72863 2682 10038 137414 249354 211756 55853 -79286 -120949 -114177 -110928
33828 -110928 -86921 -6544 87259 111385 45328 -56568 -128524 -117784 9763 210641 353192
33817 353192 367328 365196 479708 614124 538340 255703 60742 137319 298328 278691 120876
33806 120876 67607 184066 308357 319433 240008 99442 -94551 -244211 -226289 -99356
33796 -99356 -58136 -140196 -169395 -52185 69240 59372 -4114 -4175 1790 -83048 -173471 -115483
33784 -115483 54041 157911 150639 148367 193556 179701 50873 -85888 -120705 -95414 -118993
33773 -118993 -208000 -280041 -256904 -133490 11544 58868 -37071 -168244 -183808 -87368 -24868
33762 -24868 -57920 -77148 -878 71205 12695 -119370 -161800 -72463 53518 157310 265837
33751 265837 374700 419083 391135 377398 438160 532713 599101 632265 648264 640546 608668
33740 608668 572116 527903 453753 374278 353445 393338 415228 377374 334621 335963 342405 306261
33728 306261 257627 240271 228131 188625 174202 257676 409329 524549 552579 524683 481411
33717 481411 449072 462501 525038 558165 474337 299611 154567 117782 171019 262637 349527
33706 349527 388368 366465 336348 342441 326420 199322 4027 -101707 -44558 80674 153484
33695 153484 155063 115643 36290 -70640 -137727 -109725 -10184 103139 199521 258489 257026
33684 257026 218098 208438 238782 229524 129584 4518 -58043 -68149 -81385 -83109 -22886 63830
33672 63830 72828 -19101 -101239 -56736 101964 252920 297707 255543 228357 280105 367121
33661 367121 404872 379593 347866 341929 344195 354767 398693 445028 411486 294997 209784 234258
33649 234258 303035 325648 330018 387018 455747 424889 285332 156473 142739 240245 373034
33638 373034 451315 416392 304200 241603 302565 397955 396887 324159 322954 434027 539472
33627 539472 547188 513802 535357 605217 640108 597024 527195 543312 726904 1018431 1229075
33616 1229075 1249004 1218061 1370409 1719063 2041633 2196445 2277489 2388613 2451287 2377127
33606 2377127 2279529 2317968 2417211 2353835 2102437 1894471 1898014 2010249 2037777 1945596 1835123
33595 1835123 1777413 1773719 1819805 1908086 1991690 2022784 2010466 1983298 1919395 1778006 1583887
33584 1583887 1413249 1297586 1197861 1071974 911853 715983 489669 281232 151515 87920
33574 87920 13266 -94840 -163097 -138339 -73490 -47221 -68408 -121898 -228768 -369364 -422603
33563 -422603 -310179 -152384 -133217 -233707 -262927 -159410 -80746 -143551 -252819 -283009
33553 -283009 -270109 -299227 -333210 -295743 -220932 -175180 -121545 -13537 60731 -2993 -130272
33542 -130272 -170932 -142988 -180914 -279462 -303640 -244846 -239926 -309733 -309807 -201638 -143034 -210475
33530 -210475 -251412 -147267 -19711 -4152 2594 158013 371227 417654 282432 166569
33520 166569 182122 244878 265280 256478 228436 137633 -14184 -152260 -227189 -240004 -175589
33509 -175589 -37431 58137 -21300 -208948 -279213 -152624 -3546 8903 -43144 -24066 25086
33498 25086 -20972 -126919 -128862 7130 119202 68375 -98424 -244056 -303995 -302091 -273044
33487 -273044 -225458 -145692 -6705 187247 344059 338717 181462 73757 202543 494360
33477 494360 675812 600954 418691 352064 399286 368670 172907 -49275 -133401 -95877 -72856
33466 -72856 -132987 -233561 -312153 -335265 -282155 -163753 -52158 -19709 -43868 -31801 54571
33455 54571 152168 183577 141482 76343 42680 66693 129209 173869 163371 122847 93634 63908
33443 63908 -113 -71160 -83536 -40122 -19862 -63719 -126868 -162246 -171352 -146230 -54061 70064
33431 70064 106478 2847 -132269 -174412 -153804 -176006 -229910 -212011 -123977 -96499 -183902
33420 -183902 -267456 -230718 -123979 -63542 -50752 -7566 54228 33425 -83686 -169743 -133379
33409 -133379 -56614 -71074 -155333 -163414 -46076 64749 32044 -109613 -220584 -240343 -216687
33398 -216687 -180821 -100718 22202 103070 72207 -35578 -138483 -200209 -212784 -148781 -16204
33387 -16204 75573 9834 -170403 -279063 -200982 -22293 85260 50876 -62598 -158115 -183322
33376 -183322 -142278 -80352 -48524 -54368 -60141 -40121 -8191 24519 69936 112252 94436 6039
33364 6039 -69186 -61908 -27058 -57500 -121570 -97954 28350 122172 85281 -16301 -70705 -77370
33352 -77370 -103896 -147279 -133897 -37472 79724 140159 113397 17918 -86415 -119276 -51416
33341 -51416 41499 44063 -70321 -208939 -261694 -206462 -112424 -61519 -68516 -73719 -29899 12228
33329 12228 -38130 -154738 -181805 -42371 120355 114476 -39902 -147613 -113355 -38957 -31203
33318 -31203 -53175 -23737 48667 106654 134244 135139 91537 14003 -29952 -4918 30816 15174
33306 15174 -25431 -39235 -40708 -61201 -67726 -20741 35911 37422 7972 7115 4235 -74529 -190601
33293 -190601 -212122 -105012 8123 12900 -68975 -153198 -202481 -211703 -161925 -55856 46824
33282 46824 82899 45473 -35824 -127907 -177353 -117370 55196 245594 354226 380633 395509
33271 395509 439836 504063 589098 725804 922585 1140387 1348628 1579558 1885429 2236978
33261 2236978 2503028 2567508 2452670 2282122 2126140 1945925 1708509 1478661 1337908 1273984
33251 1273984 1228921 1207216 1237809 1260460 1168372 967024 778176 663103 549447 374983
33241 374983 203702 135887 178110 263513 337387 367043 332665 272299 275868 362953 418069
33230 418069 328323 151580 64239 149861 306308 369364 286343 158467 126417 211569 282211
33219 282211 210586 41718 -65909 -54138 -8100 27945 129395 312041 420121 326491
33209 326491 140335 64825 123380 185037 198659 219008 230930 146195 -7953 -80660 -22027
33198 -22027 47030 42315 33838 83956 121125 72220 -9125 -50131 -78459 -125716 -122528 -15864
33186 -15864 99973 100811 9727 -63975 -86862 -76083 83 137424 188911 38879 -158474
33175 -158474 -133704 103984 255540 159380 -3856 -33917 -12759 -113341 -282925 -335421
33165 -335421 -256550 -193348 -187520 -138604 -33859 -6705 -112266 -214645 -178680 -46006 60101
33154 60101 96987 87939 42214 -19725 -39228 -5641 2302 -51393 -67540 33824 137312 61633
33142 61633 -161124 -293996 -202208 -9483 100049 107777 109001 135779 138602 98782 63553
33131 63553 73915 114040 133061 92257 4988 -59873 -48205 -3286 -25909 -133452 -223092
33120 -223092 -209817 -135312 -93729 -113845 -167562 -226719 -248221 -177269 -47198 -1018 -109093
33109 -109093 -233870 -204708 -71274 -26346 -107680 -161244 -115099 -93667 -185511 -273275 -220219
33098 -220219 -98433 -82486 -188235 -261431 -200841 -75129 -13777 -60151 -142602 -152881 -62438
33087 -62438 28656 6396 -86861 -90528 31545 113528 38262 -67656 -33075 74470 60830
33076 60830 -60871 -77502 74146 190212 107706 -58944 -102498 1452 131752 221177
33066 221177 274113 257659 127189 -55552 -149197 -90161 47755 147345 143567 42205 -91347
33055 -91347 -165261 -133060 -30160 85247 192488 272947 270550 162448 34368 -501 53950
33044 53950 93086 68519 44612 79535 124097 84017 -50260 -170436 -148237 24624 189935
33033 189935 159376 -69180 -285273 -314761 -233052 -230844 -321490 -337385 -220476 -139602 -237507
33022 -237507 -403942 -430344 -301806 -190387 -197547 -247242 -242683 -203847 -200399 -231836 -237153 -184901
33010 -184901 -107794 -64984 -92807 -174112 -241146 -230948 -155241 -97749 -125692 -216909 -288644
32999 -288644 -287689 -236989 -197102 -195729 -204217 -183959 -143499 -128712 -154824 -179172 -165017 -147215
32987 -147215 -191631 -293871 -365533 -341004 -264687 -240793 -312092 -419319 -476397 -455979 -394439
32976 -394439 -340287 -316759 -316665 -308259 -256263 -167274 -110672 -156879 -286678 -402488 -447876 -468272
32964 -468272 -516869 -553226 -506416 -407646 -366752 -412747 -451834 -417760 -376263 -414634 -493377
32953 -493377 -498801 -417114 -361006 -404408 -464800 -404989 -224070 -81691 -104573 -211301 -200807
32942 -200807 -17556 170133 224068 270283 529180 951707 1226088 1198688 1092781 1179403
32932 1179403 1390284 1448515 1286289 1109203 1066829 1077330 1024137 940917 907647 895470 826852
32921 826852 716773 660668 717081 858127 1007254 1099271 1139724 1208192 1345375 1449659
32911 1449659 1383973 1188947 1061628 1084133 1113708 1020628 895477 890335 961314 936222 788650
32900 788650 676765 707766 808084 860414 852681 836810 824776 793495 750678 737075 767441
32889 767441 797487 762899 658074 562712 552078 582538 531988 376485 242124 223738 240319
32878 240319 167900 42465 -1801 46594 73149 52558 99711 253731 363964 296462 147975
32867 147975 124960 264514 408399 448214 470793 605875 807502 876668 698712 390612
32857 390612 171937 124302 141314 111615 66552 99062 206769 300916 335434 334979 311418
32846 311418 254178 209111 257213 375799 419624 305703 140212 82873 142053 193981 170682
32835 170682 128989 132466 157719 153868 129983 129772 153249 160335 143407 138398 145950 96858 -49843
32822 -49843 -205258 -226607 -103153 14453 8708 -57956 -56533 18921 76067 95316 149918
32811 149918 254513 318458 289751 241468 253993 291254 264556 164647 65972 40802 121005
32800 121005 296819 491293 577818 497207 337892 236459 216005 189972 116703 70370 130753
32789 130753 258877 331003 280340 165436 86984 60080 3100 -137940 -292220 -336234 -249698
32778 -249698 -143363 -120541 -162644 -179019 -129412 -61566 -51405 -133782 -273057 -379590 -373381
32767 -373381 -253296 -95760 19840 69951 76472 66204 44181 -9921 -106193 -188816 -161757
32756 -161757 -22398 83237 30455 -99010 -125449 -43334 -24107 -124116 -170642 -25752
32746 -25752 196214 300969 273515 218033 150405 31629 -60846 6315 201051 340403 343793
32735 343793 317961 356696 401139 361891 265242 200298 196364 221978 254700 291470 314986 291864
32723 291864 204400 82007 1131 17356 75627 48068 -88111 -182191 -102471 72785 168731
32712 168731 154811 129856 114859 40384 -63776 -57495 86646 218704 233619 202030 203391
32701 203391 183820 84395 -24845 -60078 -59597 -79751 -59846 64009 189828 155872 -18167
32690 -18167 -141386 -99546 24449 86069 41891 -38642 -60564 6363 90932 92375 10195
32679 10195 -52293 -45084 -43920 -99773 -116133 8901 190434 242211 118313 -55278 -164109
32668 -164109 -195010 -158886 -54861 77170 174305 230009 266667 245268 115706 -49645 -99934
32657 -99934 -1872 119873 154978 111054 34946 -44646 -72625 3517 121035 145732 72522
32646 72522 45970 121682 156494 33652 -137848 -177355 -84551 -2465 -2592 -37974 -55414 -31322
32634 -31322 58554 188257 244672 159350 35190 19323 93435 129600 115313 149916 220102
32623 220102 171970 -33630 -205915 -167443 6835 104777 46803 -69464 -135373 -130017 -77200
32612 -77200 -1805 62402 82284 57037 17718 2465 37701 106605 125901 17560 -162125
32601 -162125 -238361 -128309 26126 23897 -138706 -279132 -278400 -208228 -190271 -230368 -246645
32590 -246645 -196191 -112820 -51877 -42368 -70856 -80753 -15122 102786 155683 48031 -165747
32579 -165747 -312275 -276263 -120014 -2131 4169 -30253 -18101 14867 -17335 -110257 -158900
32568 -158900 -112041 -46782 -38960 -41924 21500 109860 117615 47730 10278 52370 107372 126733
32556 126733 141722 163188 145017 100756 130228 248565 307539 197048 24719 -35193 8880
32545 8880 15413 -49128 -84104 -48064 -12271 -8711 21605 92017 116972 44297 -72300 -171460
32533 -171460 -237564 -221909 -56978 179193 260964 93302 -125247 -149910 -2978 108663
32523 108663 108803 102197 140933 136757 45207 -25918 26392 148900 229751 267255 336448 425026
32511 425026 410342 220881 -46553 -214849 -206779 -98510 -2912 47664 78255 86015 47991
32500 47991 -7631 -22931 -8498 -33119 -96003 -108443 -43840 3879 -16431 -3736 129660
32489 129660 277618 270016 125576 23388 53160 143567 220183 274085 270440 156219 -6856
32478 -6856 -70019 -4489 59740 44085 16420 20832 -16476 -120647 -174258 -109370 -36828 -42024
32466 -42024 -9010 165550 321536 237460 92 -92674 21372 90149 -35451 -161324
32456 -161324 -52046 222187 405105 398928 323540 293587 289370 247359 170900 118207 123173
32445 123173 150124 131864 63886 31621 91152 156242 103318 -21934 -37669 101295 210417
32434 210417 141048 10038 35333 229768 401788 415139 313779 211217 178637 234241
32424 234241 331248 357937 251871 107199 60860 83146 15282 -171228 -303337 -253134 -121968
32413 -121968 -87842 -173554 -270113 -309222 -299039 -246573 -164693 -124391 -180443 -252595 -196459
32402 -196459 -11417 126247 82755 -59428 -107349 9815 173441 222195 118105 -36961
32392 -36961 -119749 -98837 -29437 39986 116123 211760 302139 365559 418321 455524 407621 240895
32380 240895 67898 46972 171168 271429 253506 210366 244529 302070 283592 224383 233043
32369 233043 302121 312078 207273 51945 -82983 -178284 -214155 -180498 -155532 -246687 -409168
32358 -409168 -447038 -269323 -38127 36698 -33056 -66623 16978 112970 106648 20160 -45892
32347 -45892 -37721 25484 103938 175924 234063 257521 202239 55574 -91823 -95286 71738
32336 71738 251813 280674 179985 85618 34610 -48995 -172443 -226811 -158157 -59673 -31427
32325 -31427 -51279 -54684 -52834 -93616 -177319 -280313 -386938 -430937 -304612 -30615 167193
32314 167193 103814 -116722 -239151 -195290 -128835 -106688 -25648 138833 205757 48215 -173166
32303 -173166 -210566 -74164 4336 -82178 -188533 -159770 -43107 18633 -4259 -26492 3280
32292 3280 51783 82662 99623 94388 27586 -96330 -190065 -182366 -127055 -139511 -230740 -289023
32280 -289023 -246256 -170085 -139394 -122580 -68468 -31615 -75474 -113060 -16925 130055 95426
32269 95426 -146380 -319920 -216822 20146 131483 107034 120710 206418 232766 162855 107703
32258 107703 104989 60315 -35886 -33820 134577 306798 309034 199694 159987 236335 332629
32247 332629 392993 442553 471412 421699 311584 262553 354735 517345 608850 578763 516657
32236 516657 540103 646931 704017 608410 432890 346397 394790 449024 395530 278767 197034
32225 197034 153612 103310 69090 96091 137121 106093 23621 -8470 30344 61051 54445 72627
32213 72627 130493 142395 74069 40894 156733 353111 454730 400576 286139 195200 102606
32202 102606 -14973 -67629 48367 266345 373450 261889 80260 55870 208093 339540
32192 339540 304770 168432 59121 -9109 -75998 -97491 -11932 100557 78961 -87958 -226122
32181 -226122 -209940 -113595 -66214 -58491 10241 150686 252028 222338 87454 -55835 -132045
32170 -132045 -120176 -38280 73380 165883 207155 208255 215528 260068 318890 346842 339986 329831
32158 329831 314638 251167 133078 19519 -42286 -60152 -34502 56803 156086 118495 -88876
32147 -88876 -277244 -260626 -108165 -13127 11511 96955 221723 207187 40346 -55077 36787
32136 36787 141375 91275 -2421 46385 192581 260053 227883 211602 240148 245689 219611
32125 219611 200675 156698 50340 -23874 52938 214793 288930 253497 228539 233207 166465
32114 166465 41100 13955 126861 220296 184182 108744 91294 72462 -10807 -66169 9454
32103 9454 143035 196149 175859 185102 225692 201957 92424 -15243 -56352 -52420 -43569 -41714
32091 -41714 -47916 -47563 -1117 95014 159850 115537 10806 -21893 63887 170100 178436 77496
32079 77496 -52763 -139446 -168929 -157038 -99099 21286 165885 230272 157689 37236 1158
32068 1158 34044 607 -119141 -170389 -72573 20378 -57161 -214237 -230316 -81986 45133
32057 45133 44651 -3697 -29140 -77778 -162252 -176526 -65401 54212 62746 26524 81802 200696
32045 200696 224435 111767 11813 56916 187575 242047 158797 26200 -46200 -47889 -43441
32034 -43441 -62218 -57161 13809 107590 147704 136643 143890 174213 137734 4879 -87769 13207
32022 13207 250775 383485 257018 -24668 -226436 -219843 -62405 104186 182508 173740 151822
32011 151822 180428 238028 244481 174792 104616 107075 148844 151139 121110 132475 177895 148162
31999 148162 4501 -123920 -102766 9406 37330 -59202 -130747 -59620 70276 86659 -57828
31988 -57828 -253163 -365823 -337671 -185804 18090 170834 203027 139057 64529 36788 52791
31977 52791 86209 112579 107336 66080 27200 34340 78449 117416 145910 192763 247810 253587
31965 253587 190343 114612 83165 85269 84894 86031 109315 134777 122010 77783 57813 96684
31953 96684 166343 211864 210516 188242 182810 192746 172416 93324 -2712 -48179 -44052 -57229
31941 -57229 -111642 -146201 -119395 -91006 -130755 -193010 -174159 -77367 -21049 -68885 -144972 -162343
31929 -162343 -160328 -246321 -442992 -661242 -809017 -872428 -896807 -939910 -1052371 -1262657 -1553518
31918 -1553518 -1857041 -2078730 -2138362 -2023764 -1827763 -1695254 -1680145 -1667586 -1498293 -1175130
31908 -1175130 -881731 -770415 -797444 -821170 -802354 -811615 -859149 -836891 -675713 -467975 -351229
31897 -351229 -325328 -283143 -198314 -169117 -254478 -369365 -401904 -360366 -330853 -340820 -346145 -323285
31885 -323285 -290405 -247611 -175301 -95513 -64916 -97416 -153798 -209012 -261851 -280883 -229917
31874 -229917 -159456 -169819 -249563 -262231 -153879 -56219 -85048 -143632 -66530 115457 219102
31863 219102 183313 125151 116214 81157 -27807 -114961 -90004 -8449 37585 63793 114871
31852 114871 129849 24744 -138136 -203056 -133153 -48265 -40694 -61672 -21856 81212 175569
31841 175569 194021 112334 -35441 -153647 -153550 -57760 13725 -5616 -46078 -16904 47991 36713
31829 36713 -66585 -140573 -85774 40043 97806 41850 -47146 -94625 -121211 -170634 -217957
31818 -217957 -216208 -194150 -222701 -290506 -297375 -192644 -50426 24644 10554 -42410 -79716
31807 -79716 -68857 -12619 31204 -462 -75993 -85998 3824 97529 115710 102057 109489 86445
31795 86445 -5668 -52609 76777 301161 398521 297571 142379 60021 23359 -19032 -28850
31784 -28850 34619 125746 179170 179576 124290 15300 -73375 -37848 89213 134375 20888
31773 20888 -108191 -101401 -21543 -28498 -121273 -147325 -42210 73260 52631 -102512 -251609
31762 -251609 -262318 -147420 -58543 -107589 -205415 -165461 25263 167015 126789 12585 -22067
31751 -22067 83 -9147 -5199 90975 190280 143372 7037 -12780 115296 185418 55381
31740 55381 -163624 -275817 -218452 -58610 100170 158489 84647 -18414 -15431 69589 85980
31729 85980 -6032 -84202 -81720 -77588 -104696 -57696 94468 178567 51769 -171628 -288912
31718 -288912 -285276 -270660 -250440 -160747 -58651 -61847 -130948 -119253 -28121 -832 -48496 -8615
31706 -8615 159957 262354 169574 47348 113037 295907 338218 171741 -3181 -14529 76333
31695 76333 115300 70803 27182 41586 96569 165582 249725 342025 401940 387448 295528 159524
31683 159524 21994 -75283 -94368 -35323 27107 -7434 -137534 -221037 -133867 46745 108138
31672 108138 -27242 -191637 -192672 -59890 29323 13849 4535 79469 162241 154935 79596
31661 79596 8333 -58984 -148310 -207955 -169407 -79821 -52325 -89739 -81335 5972 61990 12918
31649 12918 -54039 -36836 9609 -28162 -115794 -111718 -1275 60424 -19014 -121291 -85376
31638 -85376 62499 152922 111820 50563 105267 262300 382339 358541 213051 54542 -26451
31627 -26451 -22680 2216 -18013 -84451 -130926 -102232 -30458 -4285 -54583 -111466 -104420 -60474
31615 -60474 -45300 -44625 3210 66357 30892 -106874 -179622 -72325 87397 89561 -64894
31604 -64894 -180794 -161824 -120445 -154620 -174886 -60545 122361 199334 135883 72108 112166
31593 112166 200091 234012 198740 129317 32758 -68316 -80230 55999 224714 230496 58918
31582 58918 -80311 -33188 94356 119972 70779 123021 304376 445584 446116 409578 450528
31571 450528 519757 513269 432034 338282 260794 234372 319690 481691 564251 499864 421675
31560 421675 436728 431755 286440 143344 219853 432945 483423 294614 104609 101351 212069
31549 212069 299339 331885 297149 165083 14798 -6749 80186 102205 35487 46371 152934
31538 152934 137173 -64179 -179921 -26367 165671 113235 -66438 -78125 68175 144604
31528 144604 137894 216968 339223 278464 51458 -55443 44807 84954 -119650 -374491
31518 -374491 -410468 -250083 -93802 -27122 -18410 -63399 -153570 -197538 -129856 -32231 -18689
31507 -18689 -55036 -8003 160363 342266 413828 357369 267196 254943 321348 332795 189711
31496 189711 -543 -25305 153597 343983 377854 297329 233479 219918 208819 183925 171963
31485 171963 190337 233494 269521 242966 151979 109521 212731 356362 331053 131516 -13715
31474 -13715 17581 68766 -12355 -111325 -50600 92666 100582 -26952 -59558 115564 327429
31463 327429 356310 202035 51196 49482 156851 204894 90841 -82049 -105889 65752
31453 65752 235552 212150 58137 -14759 63975 162677 149910 37919 -77879 -124328 -82798
31442 -82798 7517 63947 30646 -62165 -142952 -179569 -178384 -145606 -103024 -99903 -150750 -202305
31430 -202305 -214251 -215176 -220103 -171664 -51290 30138 -29295 -150893 -168605 -53027 84092
31419 84092 170601 217641 206743 92440 -67367 -127315 -38949 94011 173242 207920 228796
31408 228796 212821 143539 58353 -10411 -71805 -125979 -149122 -148579 -158942 -166618 -112535 17235
31396 17235 173780 314460 409867 402469 269410 115991 77309 124555 111095 20677 -873
31385 -873 96085 159715 80287 -28046 -13336 83462 122671 81561 35561 15489 23634 108499
31373 108499 272067 369631 264049 39991 -91176 -73611 -37890 -61060 -60266 45934 208026
31362 208026 321085 324409 199319 -20209 -200209 -187830 -3206 141840 85511 -95219
31352 -95219 -201060 -148954 -21727 68053 79895 33525 -26316 -43021 23479 155972 279158
31341 279158 310692 224324 80649 -8712 21573 118656 162699 101498 7913 -12197 56237
31330 56237 128945 121659 31650 -80172 -168167 -240944 -311311 -330207 -222896 -9713 165839
31319 165839 187206 107552 66951 87680 56492 -69175 -156614 -86411 38534 8001 -186932
31308 -186932 -300895 -142270 174787 379974 376218 295049 252725 207134 104403 24514 62198
31297 62198 149637 142659 45725 -1476 40025 50253 -26882 -65736 34724 159920 135770
31286 135770 -12697 -113660 -108107 -95522 -134848 -160224 -119539 -56061 -5020 70299 178617
31275 178617 238556 185731 64132 -47258 -122809 -152514 -106916 -14059 16124 -59030 -115350
31264 -115350 -26546 128395 160217 47348 -33832 19067 78349 -18268 -219880 -320766 -221299
31253 -221299 -26183 113213 162876 179945 190321 161927 87309 25366 25380 45825 4797 -92009
31241 -92009 -133778 -44457 104940 173708 119897 37207 22783 57141 38799 -86439 -254249
31230 -254249 -335690 -256225 -66135 105754 169688 141620 97758 88567 110793 137440 145130
31219 145130 122155 73791 14850 -53260 -137803 -214003 -225826 -161964 -98318 -114983 -189919
31208 -189919 -226259 -174271 -79012 -19280 -45609 -155612 -268955 -251832 -52931 191674 284732
31197 284732 205922 119840 128984 147971 81737 -4526 -3044 51321 49322 -6883 -30829 -20677
31185 -20677 -43835 -69796 8305 158156 187907 20541 -157624 -138043 29434 132119 96120
31174 96120 38026 42835 52846 13819 -3312 86869 230409 290297 231176 160825 178331 251902
31162 251902 284612 251013 206351 178789 128337 35157 -39282 -35003 8043 7143 -33050 -34812
31150 -34812 9886 10383 -72980 -140987 -87510 41892 106070 51322 -41265 -79354 -55363 -13034
31138 -13034 16696 23608 8310 -6292 20651 105648 208852 256905 203140 73800 -44996
31127 -44996 -83900 -59022 -41186 -52653 -34278 62741 191252 247848 171491 -19869 -250277
31116 -250277 -413245 -429317 -324829 -212188 -149971 -82999 21604 63956 -50534 -221655
31106 -221655 -249833 -109192 20751 13431 -60475 -95205 -115976 -192628 -289502 -307406 -220012
31095 -220012 -86500 28415 83031 55159 -25900 -83205 -79311 -57146 -56069 -51442 -25279 -18983
31083 -18983 -48339 -44967 31905 98881 64704 -21579 -53744 -46677 -102272 -229552 -331782 -358680
31071 -358680 -341404 -282963 -153526 -9034 26152 -63574 -144975 -118004 -29419 35279 56613
31060 56613 27681 -79974 -223820 -279558 -211857 -148763 -184836 -218440 -117961 41159 74297
31049 74297 -23728 -70137 19350 109745 69973 -28322 -33440 62640 140842 150112 167937 255159
31037 255159 341970 313383 169593 40208 33368 116787 179783 182124 185685 240380 301826 294438
31025 294438 212448 116600 58797 49893 77292 108600 92334 3106 -110924 -158226 -89082
31014 -89082 59269 190995 218070 130207 19929 1453 73699 106557 10360 -124505 -128799
31003 -128799 26417 190417 215689 111871 737 -26640 17531 52488 15668 -70225 -120990
30992 -120990 -95696 -45399 -22319 8622 91683 155098 81209 -94920 -181240 -71089 113589
30981 113589 191456 148657 104948 112217 97862 1358 -123388 -168249 -86780 69187 203367
30970 203367 254838 235713 193382 146589 87107 38346 55510 143282 225389 234282 187619 136329
30958 136329 85570 21132 -29272 -27161 14718 65279 137062 240361 306833 257238 139003
30947 139003 92482 162983 246549 255732 235815 255761 280052 241508 171362 147425 157360 134767
30935 134767 110815 189840 350322 412408 282237 116531 130646 315987 477148 508376
30925 508376 488288 501266 516262 491877 471232 490874 494885 428928 336563 270166 191645 75230
30913 75230 26560 148267 337766 389803 285870 206491 243825 287847 248713 207815 254152
30902 254152 331941 369004 415385 516651 572573 482747 340327 311232 385021 414355 354926
30891 354926 292845 259631 195493 95948 30848 6684 -34123 -66618 -5002 103326 90027
30880 90027 -64827 -156089 -48490 110813 109528 -24696 -93156 -20421 79877 99754 53819
30869 53819 -917 -46530 -76902 -64766 7299 111187 180256 147977 5952 -160192 -228254
30858 -228254 -156759 -14287 115543 204253 242169 210320 129745 69910 59597 51958 21608
30847 21608 19043 67937 88832 9422 -113228 -171890 -158811 -141801 -134175 -91730 -15970 38810
30835 38810 55304 65814 77344 57937 -1184 -70177 -123237 -147202 -125267 -64019 -13203 -6298
30823 -6298 -12561 -1073 -4719 -49144 -70774 -2677 94940 100030 9148 -55254 -19093 59640
30811 59640 89942 44321 -50024 -135669 -139676 -47115 39537 325 -139980 -234348 -199157 -91141
30799 -91141 -2951 20938 -34371 -146211 -215190 -147038 1883 70306 9444 -64081 -72088
30788 -72088 -101824 -252547 -459956 -567836 -510015 -347402 -179468 -78463 -57241 -51897 11281
30777 11281 99690 98932 -10828 -95970 -47348 68941 112346 45781 -63070 -151548 -193442
30766 -193442 -176911 -128762 -114881 -150188 -157615 -79782 23050 53872 6616 -51340 -73193
30755 -73193 -50146 7843 52812 29315 -18863 37711 217876 350188 296930 157396 107885
30744 107885 126157 53759 -113712 -197900 -112134 14996 43807 4765 893 41897 65075
30733 65075 53277 49807 82838 127169 136036 96541 57597 82959 157230 181616 104943 3071
30721 3071 -39213 -63474 -154410 -270263 -284588 -180723 -73806 -32283 -3324 61452 127127
30710 127127 162171 196581 243048 248745 176749 66930 -19591 -54119 -25553 49056 90850
30699 90850 32491 -61075 -54784 52135 110493 50262 -14438 17950 72467 39052 -37942 -47298
30687 -47298 -8345 -34975 -138916 -200685 -134305 14917 137680 157038 71358 -38051 -65485
30676 -65485 -3411 31110 -43374 -136007 -97323 65547 191800 175741 73395 -6583 -24848
30665 -24848 1287 51387 97504 98076 43429 -15026 -14694 43972 91583 67005 -137 -5567 103199
30652 103199 236988 257641 152421 37658 -17742 -64083 -122245 -88114 106883 327991
30642 327991 367299 204747 16636 -56074 -32363 4294 8294 -29721 -85252 -90365 -11871
30631 -11871 64669 33908 -49325 -18849 149287 270398 201992 40336 -24142 44582 128348
30620 128348 143327 120929 120483 146668 161954 139351 100924 109451 189390 257383 201117 48796
30608 48796 -25870 82069 272274 383581 390175 360727 302768 183853 68907 84089 228374
30597 228374 350104 350061 298013 295783 327269 323417 299406 331047 432997 546774 630644 684265
30585 684265 696066 649173 589723 611896 744372 912769 1047607 1163191 1274221 1299359
30575 1299359 1145578 866051 628292 509924 422863 274812 104097 -15965 -113612 -250177
30565 -250177 -377804 -397975 -334032 -301887 -307417 -231091 -57127 46986 -21516 -117108 -57026
30554 -57026 88889 100697 -52284 -172750 -141378 -67798 -75230 -106718 -57440 28364 33088
30543 33088 -37652 -76061 -53195 -43767 -76590 -88352 -49498 -21686 -43298 -57733 -25078 -22252
30531 -22252 -134906 -297655 -351870 -255740 -134093 -97409 -107515 -76808 -19359 -13707 -58285
30520 -58285 -67506 -11262 36573 16714 -29364 -37994 -19461 -12903 -966 48004 83850 14154
30508 14154 -156206 -302916 -318514 -212573 -66134 45849 67911 -20927 -155550 -207341
30498 -207341 -119706 15377 69450 31512 -8457 -316 13766 -16081 -73139 -99462 -59606
30487 -59606 25662 82851 35554 -110357 -243240 -254203 -162234 -79984 -60345 -43593 27102
30476 27102 106279 108280 26956 -59346 -87220 -68281 -47130 -33186 517 55250 76053 19033
30464 19033 -65009 -80594 -39357 -72346 -220680 -306467 -153980 106495 144964 -125311 -398219
30453 -398219 -368463 -114522 64310 69941 58502 122269 145733 26966 -134134 -168054 -53112
30442 -53112 88328 144860 96067 -8999 -88162 -79530 -11682 12148 -59968 -159086 -192706
30431 -192706 -163358 -133986 -117533 -74982 -5852 34336 16969 -16592 -19570 -10394 -43473 -115721
30419 -115721 -135003 -17249 177215 252398 83074 -204755 -344860 -240469 -71570 -42267
30409 -42267 -117898 -117990 -5622 63253 -16880 -146274 -167483 -71162 24850 41840 716 -54950
30397 -54950 -112769 -162527 -175033 -134313 -60988 9892 52561 48415 -9456 -94410 -152185 -149289
30385 -149289 -102960 -49041 1358 50714 80700 70491 47115 69079 141225 191119 165252
30374 165252 109147 100569 133248 134310 83206 34366 15161 -14270 -70189 -95836 -52190 13752
30362 13752 51784 91162 165852 222993 202835 157939 178591 235670 227098 160866 142286 172603
30350 172603 129557 -2733 -59212 53362 189092 186698 119459 139125 181522 64892 -158853
30339 -158853 -211382 4661 235721 225160 47405 -51543 -8213 40568 16064 -8160 39171
30328 39171 122374 172715 171046 136269 99869 97571 126460 117604 15447 -125675 -192660 -152659
30316 -152659 -71548 -3971 56151 115380 148484 135853 73511 -42532 -173523 -212496 -106820
30305 -106820 18367 -3823 -126132 -132980 26564 141512 63150 -60842 -25706 112593
30295 112593 153039 74368 24796 44851 29223 -41121 -50573 29883 75703 30234 6413 71594
30283 71594 103160 -7410 -145739 -133384 -4632 48606 -32662 -105457 -51980 66830 128322
30272 128322 115128 102059 133367 173169 163427 98790 40151 54193 135703 203182 185917 103648
30260 103648 45771 80933 190914 276634 236238 75452 -61890 -29201 148184 302825
30250 302825 348673 378799 480399 556133 454498 223917 84800 138107 239639 221787
30240 221787 128695 129254 255028 349861 299193 211067 286625 542653 766629 787545 699908
30229 699908 710803 812816 774947 499608 220734 213925 418041 518528 361430 101605
30219 101605 -66212 -136374 -185370 -198685 -128151 -23416 22548 7276 -10674 -33090 -101489
30208 -101489 -179271 -174398 -88312 -33840 -73876 -136294 -136108 -99638 -100721 -136001 -146044 -127988
30196 -127988 -143329 -216244 -292946 -314427 -277059 -205375 -109197 8997 129954 215603 222180
30185 222180 136580 31875 44663 215096 372656 302903 46347 -111011 -13853 143689
30175 143689 103454 -85199 -174340 -115685 -102684 -212644 -264794 -129302 41998 49392 -53257
30164 -53257 -78704 -21778 -48132 -205289 -337969 -314677 -191527 -102740 -90353 -92550 -36621
30153 -36621 89926 217807 238523 116543 -43948 -100628 -40780 10388 -47459 -176241 -261198
30142 -261198 -239194 -149419 -86138 -107056 -168108 -158327 -22616 164806 271771 235565 106272
30131 106272 -5317 -12076 71475 125054 54926 -69423 -103166 -52719 -68271 -167052 -153039
30120 -153039 66460 269044 215246 13679 -47559 67268 143561 94159 48976 67476 45673
30109 45673 -41964 -72790 -22294 -30149 -131691 -173663 -106469 -100643 -224566 -266239 -76311
30098 -76311 146539 154798 36436 26741 99740 55829 -90689 -138814 -73319 -88808 -223991
30087 -223991 -272291 -129391 33121 52356 14777 75439 200867 238430 139642 -5308 -88461
30076 -88461 -57954 65904 188064 213217 162626 146614 194920 208358 118568 -5730 -70789
30065 -70789 -83624 -96394 -105700 -84070 -47085 -13382 47926 153343 231565 193654 57807
30054 57807 -59142 -68107 14130 98722 104289 20892 -76024 -91765 -12568 80752 112272 91365
30042 91365 72903 70679 43590 -45703 -178695 -280980 -274484 -149953 13037 118855 140439
30031 140439 108423 41131 -64120 -179906 -245424 -224214 -133039 -22021 43387 13965 -76216
30020 -76216 -111036 -29604 79136 105601 91454 147108 238866 225060 97429 -5578 -55635
30009 -55635 -186819 -408622 -502709 -373067 -287867 -519096 -873991 -883029 -424529 115399
29999 115399 339905 250316 83250 -27596 -81763 -71318 10228 90428 87647 26186 -5164
29988 -5164 29882 104009 176487 193148 107227 -26451 -55751 77949 226388 220611 103162
29977 103162 44170 79622 90060 19275 -53901 -80094 -115486 -186858 -225902 -202303 -188510
29966 -188510 -214971 -190240 -62226 60272 63703 4741 -78 28513 -12212 -125077 -233865
29955 -233865 -325233 -411995 -410297 -240131 -24165 12826 -144642 -281920 -269794 -201284 -165038
29944 -165038 -100301 19919 65664 -37147 -132753 -50543 123642 169940 45744 -97275
29934 -97275 -149606 -132881 -86998 -19759 43092 78182 117194 179972 199044 123090 43255 81542
29922 81542 190952 209230 91792 -45186 -100939 -78461 -10116 71465 95279 17052 -79397
29911 -79397 -72021 14636 42523 -32664 -122819 -164136 -167352 -123675 -21473 47810 -24081 -162328
29899 -162328 -181960 -79202 -45975 -153952 -246041 -219076 -188435 -249908 -286159 -169480 12343
29888 12343 100555 95816 82758 56316 -7153 -25362 62513 144917 98451 10932 49625 175632
29876 175632 195800 63536 -74014 -122497 -144189 -195353 -228948 -202985 -152592 -111252 -67080
29865 -67080 -28818 -39378 -96580 -141362 -138313 -93350 675 140100 232566 154125 -81181
29854 -81181 -293359 -321097 -182494 -27841 21412 -33779 -102533 -109857 -71994 -52993 -56834
29843 -56834 -21914 67077 144162 170210 182406 192207 148068 67092 71075 186061 240820 109503
29831 109503 -67318 -81225 27369 54959 -40923 -132002 -189649 -316768 -501153 -576633 -486808
29820 -486808 -385258 -399843 -464686 -455695 -346800 -173552 20467 151674 143843 46111 -21329
29809 -21329 -44010 -81098 -73515 94741 322521 340239 117285 -40792 62785 227323 196204
29798 196204 52263 28448 111470 122953 78178 155366 338952 381003 166371 -103276 -170067
29787 -170067 -18618 153372 163889 -23 -191338 -247140 -161154 -77837 -71925 -29112 146866
29776 146866 308266 222268 -82058 -310609 -262793 -39306 134620 154140 66155 -18868
29766 -18868 1234 137216 263042 245234 130729 91763 166726 199771 92727 -33248 -32413
29755 -32413 32887 -1517 -137789 -220547 -187425 -157684 -229635 -316848 -273888 -110440 23641
29744 23641 39954 -3476 -26014 -32745 -55475 -75807 -82190 -126848 -222998 -251097 -109828 76008
29732 76008 76275 -103482 -195174 -47920 157976 195419 113069 105600 201589 281538 310579 338874
29720 338874 330897 217191 89617 117555 260771 289541 130851 -23452 -23547 34477 15079
29709 15079 -41670 -49254 -50601 -99406 -100624 42401 212733 208653 44607 -62855 -3964 99752
29697 99752 104781 27392 -41941 -86330 -142751 -206066 -229356 -186524 -83978 62218 218105
29686 218105 322843 330631 255883 149540 40854 -65944 -144724 -145399 -63195 25513 41279
29675 41279 -128 -19840 -849 -8323 -61715 -69881 37989 178566 205927 107204 10242 6982
29663 6982 66577 127272 173382 199234 192991 190331 252408 348206 351664 213659 49470 -15704
29651 -15704 -6017 -13840 -36275 -6902 56357 63117 4041 -24525 26665 78780 40884 -63561
29639 -63561 -140380 -152141 -146793 -172829 -209506 -194043 -105296 -5851 14149 -59147 -134635 -113686
29627 -113686 -6446 76687 50834 -51807 -127597 -120332 -71643 -51661 -63007 -41536 47852
29616 47852 150294 178519 108916 -5499 -94495 -109716 -33173 97220 181744 140450 7146
29605 7146 -109611 -161321 -195219 -248171 -279418 -245008 -180689 -162134 -214487 -295150 -341958 -321315
29593 -321315 -260147 -237878 -302357 -387493 -374296 -249469 -134427 -126876 -183458 -202282 -155513
29582 -155513 -85223 -23576 21825 43460 48080 62428 86116 80531 39845 20320 56185 98934
29570 98934 84402 8784 -97518 -206031 -264176 -218689 -115539 -78857 -124343 -107586 46047
29559 46047 182841 132913 -21971 -66216 36754 141287 183155 231707 280436 209458 15661
29548 15661 -112419 -41960 130455 240724 258633 234995 175040 79284 15903 39973 107344
29537 107344 155722 195576 234578 202515 67309 -47871 -98 161081 253151 217707 182494
29526 182494 248797 340658 321305 175550 12152 -67263 -48213 16102 56202 33184 -27770
29515 -27770 -56390 -17198 38781 36924 -9742 -3423 99765 206645 201391 107023 47391 61877
29503 61877 68176 27670 16220 63369 55050 -81231 -203204 -128967 82340 203738 159519
29492 159519 84740 76694 89764 104464 191697 335084 380172 264415 132079 106051 103083
29481 103083 12096 -87255 -47705 109912 244742 295849 283298 193598 31051 -80466 -23547
29470 -23547 114994 131217 -26379 -211178 -280926 -215522 -63242 90958 129953 21831
29460 21831 -87699 -42269 95655 141532 82355 77231 166235 197884 96594 -8131 -11195
29449 -11195 -3693 -92643 -201284 -190277 -68486 52071 129295 194246 245778 259118 254643
29438 254643 256786 221994 100450 -58897 -149533 -138937 -93286 -80466 -96104 -81560 2421
29427 2421 104896 103180 -51272 -223675 -227668 -66455 73111 81824 44094 54193 78560
29416 78560 81587 123215 207597 186353 -26695 -269091 -337991 -281580 -285738 -357723 -350945 -252029
29404 -252029 -190617 -167228 -33806 201693 304638 159378 -28929 -23348 128679 229254
29394 229254 230383 211784 171667 57975 -42779 30411 244463 360474 252374 82097
29384 82097 64169 175495 226072 154674 110041 223032 410247 476170 360705 199431 132344
29373 132344 131040 73314 -54823 -123794 -43021 100922 148649 68897 -17889 -13032 31439
29362 31439 -8287 -154962 -284798 -263709 -103440 44770 53702 -47262 -122182 -92319 -12198
29351 -12198 19412 -17916 -61156 -59581 -39909 -68706 -163111 -251449 -236510 -106797 34127
29340 34127 77041 30243 -11905 -13972 -38120 -112342 -145679 -53433 87685 116513 7906
29329 7906 -92833 -77247 -8997 2682 -32618 -41649 -38629 -100499 -215847 -283578 -274547 -274631 -325005
29316 -325005 -335998 -240521 -135278 -150591 -238610 -232043 -104733 -30854 -138769 -319485 -361521
29305 -361521 -208769 786 118042 122973 87408 66457 53170 12004 -67406 -152353 -199624
29294 -199624 -194116 -142613 -50124 59346 113562 48351 -91980 -173149 -123836 -19990 19156
29283 19156 -30754 -106165 -148023 -132317 -53347 59789 143138 175214 220462 330750 442018
29272 442018 451545 368290 288218 234336 134807 -23851 -135000 -112649 -5520 87187 139748
29261 139748 175757 187247 158886 129083 142915 168651 144134 95325 118425 226911 302202
29250 302202 247800 131325 98583 170638 206987 85345 -148044 -345693 -426711 -424487 -405085
29239 -405085 -413145 -488147 -654020 -879138 -1119207 -1413328 -1842831 -2351389 -2709320 -2745138
29229 -2745138 -2537121 -2277844 -2025792 -1726128 -1420037 -1247925 -1226550 -1193594 -1041497 -869840
29219 -869840 -816908 -851276 -838386 -736733 -618137 -541480 -505541 -494926 -485595 -432161 -330185
29208 -330185 -261324 -290752 -348289 -313726 -208516 -185017 -299476 -406127 -342716 -146970 -7450
29197 -7450 -32764 -143048 -185965 -103335 31700 106415 72765 -25885 -107933 -124354 -86557
29186 -86557 -44903 -50719 -122233 -220876 -265943 -209000 -107788 -89001 -199549 -318579 -276996
29175 -276996 -69764 116290 121305 -3819 -97792 -115643 -141129 -190153 -152629 11479 153170
29164 153170 126463 6410 -25902 42473 61598 -17031 -60204 18359 109689 81573 -23314
29153 -23314 -76378 -65052 -76896 -125142 -120962 -25205 78462 100236 65619 69254 138397 193385
29141 193385 150849 31586 -67871 -98989 -104411 -125953 -140729 -138483 -185406 -313746 -405535
29130 -405535 -319785 -112824 16670 7551 -140 85119 168919 161826 136427 169916 177796 63012
29118 63012 -82776 -105874 -42774 -60505 -186199 -282058 -284232 -286980 -352896 -390810 -290633
29107 -290633 -80979 108941 185595 157011 110713 139299 248821 348784 366401 330645 295388
29096 295388 246695 166675 114193 128699 123427 15631 -96420 -58737 73505 95914 -20663
29085 -20663 -81225 10665 94217 13384 -147087 -218739 -195438 -175850 -172514 -134022 -84473 -91200
29073 -91200 -131706 -121170 -51141 9551 37225 71418 110210 88128 -8723 -75919 4300 206703
29061 206703 355320 299787 89288 -77119 -90293 -51000 -92239 -164403 -120326 34451 137512
29050 137512 117254 80326 112368 147812 105498 14385 -73449 -163230 -227654 -175581 -18601
29039 -18601 63736 -38135 -169596 -108861 120877 292851 279191 161765 68159 36025 39708
29028 39708 43942 24982 5588 45310 138724 179344 99037 -21998 -70201 -52448 -40543 -43088
29016 -43088 -45308 -92766 -202361 -270677 -222919 -174994 -266618 -396673 -338943 -98614 72159
29005 72159 36891 -60005 -45624 55507 124682 113816 25896 -123911 -250559 -242257 -136794
28994 -136794 -110670 -209054 -242677 -69115 170971 249397 165397 93601 97540 82061 3508
28983 3508 -51851 -25077 19400 6028 -41885 -61530 -53139 -61804 -89469 -82083 -9835 72670
28971 72670 74643 -22067 -131088 -159166 -109825 -58574 -57966 -118218 -243143 -398178 -462617 -329217
28959 -329217 -72187 96705 86680 37441 104056 236418 276662 200385 131947 148986 198225
28948 198225 216265 223321 250978 257566 186564 72884 17240 49296 76153 5566 -116204
28937 -116204 -153133 -63424 37598 32087 -45612 -68301 11491 115000 141335 61936 -68238
28926 -68238 -148459 -115678 -33550 -39359 -146247 -188612 -61089 93518 90439 5456 55425
28915 55425 221358 250943 67085 -89592 -26873 123719 142547 38186 -41298 -55973 -53091
28904 -53091 -23404 42024 52982 -47313 -139461 -89386 31492 64365 19074 17118 49898
28893 49898 14509 -50576 -5640 110962 84935 -136963 -328385 -294996 -126773 -29664 -50914
28882 -50914 -93542 -94547 -64771 -22427 7073 -25253 -123433 -206535 -211912 -193976 -241880 -333000
$$ [...]
##END NTUPLES=NMR SPECTRUM
##END=
