##TITLE=31Pdec_LR-740-B2
 H2O, 24 sc
 26.10.2021
##JCAMPDX= 6.0         $$ Bruker NMR JCAMP-DX V2.0
##DATA TYPE= NMR FID
##DATA CLASS= NTUPLES
##ORIGIN= UXNMR, Bruker Analytische Messtechnik GmbH
##OWNER= root
$$ XWIN-NMR		Version 3.5
$$ Tue Oct 26 09:41:19 2021 Russian Standard Time (UT+4h)  she@DPX200
##.OBSERVE FREQUENCY= 81.013821
##.OBSERVE NUCLEUS= ^31P
##.DELAY= (6, 6)
##.ACQUISITION MODE= SIMULTANEOUS
##.ACQUISITION SCHEME= undefined
##.AVERAGES= 24
##.DIGITISER RES= 16
##SPECTROMETER/DATA SYSTEM= spect
##.PULSE SEQUENCE= zgpg30
##.SOLVENT NAME= CDCl3
##.SHIFT REFERENCE= (INTERNAL, CDCl3, 0, 243.863)
##AUDIT TRAIL= $$ (NUMBER, WHEN, WHO, WHERE, WHAT)
$$ ##TITLE= Audit trail, XWIN-NMR		Version 3.5
$$ ##JCAMPDX= 5.01
$$ ##ORIGIN= Bruker BioSpin GmbH
$$ ##OWNER= she
$$ F:/spectra/data/she/nmr/P31/1/audita.txt
$$ ##AUDIT TRAIL=  $$ (NUMBER, WHEN, WHO, WHERE, WHAT)
(   1,<2021-10-26 09:40:04.31 +0400>,<she>,<DPX200>,
      <created by zg, POWCHK disabled, PULCHK disabled
       configuration hash MD5:
       00 E9 B6 7A A2 85 ED C7 34 08 36 98 17 FE 4E 26
       data hash MD5: 32K
       71 5D 96 BB 2D C6 B4 57 AD 77 E7 DB 8B 2E D8 1B>)
$$ ##END=
$$ 
$$ hash MD5
$$ C3 E0 EE C3 2A FF EA EC CC 2B DC E3 DF 8B D7 DC
##$RELAX= 
##$RELAX= 
##$RELAX= 
##$RELAX= 
##$RELAX= 
##$RELAX= 
##$RELAX= 
##$RELAX= 
$$ Bruker specific parameters
$$ --------------------------
##$DU= <F:/spectra>
##$EXPNO= 1
##$NAME= <P31>
##$PROCNO= 1
##$TYPE= <nmr>
##$USER= <she>
##$AMP= (0..31)
100 100 100 100 100 100 100 100 100 100 100 100 100 100 100 100 100 100 
100 100 100 100 100 100 100 100 100 100 100 100 100 100 
##$AQSEQ= 0
##$AQ_mod= 1
##$AUNM= <au_zg>
##$AUTOPOS= <>
##$BF1= 81.014009
##$BF2= 200.13
##$BF3= 200.13
##$BF4= 200.13
##$BF5= 200.13
##$BF6= 200.13
##$BF7= 200.13
##$BF8= 200.13
##$BYTORDA= 1
##$CFDGTYP= 0
##$CFRGTYP= 5
##$CHEMSTR= <none>
##$CNST= (0..31)
1 1 145 1 1 1 1 1 1 1 1 1 1 1 1 1 1 1 1 1 1 1 1 1 1 1 1 1 1 1 1 1 
##$CPDPRG= <waltz16>
##$CPDPRG1= <>
##$CPDPRG2= <waltz16>
##$CPDPRG3= <>
##$CPDPRG4= <mlev>
##$CPDPRG5= <mlev>
##$CPDPRG6= <mlev>
##$CPDPRG7= <mlev>
##$CPDPRG8= <mlev>
##$CPDPRGB= <>
##$CPDPRGT= <>
##$D= (0..31)
0 1 0 0 0 0 0 0 0 0 0 0.03 2e-05 3e-06 0 0 0 0 0 0 0 0 0 0 0 0 0 0 0 0 
0 0 
##$DATE= 1635226803
##$DBL= (0..7)
120 120 120 11 120 120 24 19 
##$DBP= (0..7)
150 150 150 150 150 150 150 150 
##$DBP07= 0
##$DBPNAM0= <>
##$DBPNAM1= <>
##$DBPNAM2= <>
##$DBPNAM3= <>
##$DBPNAM4= <>
##$DBPNAM5= <>
##$DBPNAM6= <>
##$DBPNAM7= <>
##$DBPOAL= (0..7)
0.5 0.5 0.5 0.5 0.5 0.5 0.5 0.5 
##$DBPOFFS= (0..7)
0 0 0 0 0 0 0 0 
##$DE= 6
##$DECBNUC= <off>
##$DECIM= 3
##$DECNUC= <off>
##$DECSTAT= 4
##$DIGMOD= 1
##$DIGTYP= 9
##$DL= (0..7)
0 0 52 120 120 21 21 25 
##$DP= (0..7)
150 150 150 150 150 150 150 150 
##$DP07= 0
##$DPNAME0= <>
##$DPNAME1= <>
##$DPNAME2= <>
##$DPNAME3= <>
##$DPNAME4= <>
##$DPNAME5= <>
##$DPNAME6= <>
##$DPNAME7= <>
##$DPOAL= (0..7)
0.5 0.5 0.5 0.5 0.5 0.5 0.5 0.5 
##$DPOFFS= (0..7)
0 0 0 0 0 0 0 0 
##$DQDMODE= 0
##$DR= 16
##$DS= 0
$$ [...]
##$SUBNAM1= <"">
##$SUBNAM2= <"">
##$SUBNAM3= <"">
##$SUBNAM4= <"">
##$SUBNAM5= <"">
##$SUBNAM6= <"">
##$SUBNAM7= <"">
##$SUBNAM8= <"">
##$SUBNAM9= <"">
##$SW= 501.771253377433
##$SWIBOX= (0..15)
0 1 3 0 0 0 0 0 0 0 0 0 0 0 0 0 
##$SW_h= 40650.406504065
##$TD= 32768
##$TD0= 1
##$TE= 0
##$TE2= 300
##$TE3= 300
##$TEG= 300
##$TL= (0..7)
0 120 53 12 22 120 120 120 
##$TP= (0..7)
150 150 150 150 150 150 150 150 
##$TP07= 0
##$TPNAME0= <>
##$TPNAME1= <>
##$TPNAME2= <>
##$TPNAME3= <>
##$TPNAME4= <>
##$TPNAME5= <>
##$TPNAME6= <>
##$TPNAME7= <>
##$TPOAL= (0..7)
0.5 0.5 0.5 0.5 0.5 0.5 0.5 0.5 
##$TPOFFS= (0..7)
0 0 0 0 0 0 0 0 
##$TUNHIN= 0
##$TUNHOUT= 0
##$TUNXOUT= 0
##$USERA1= <user>
##$USERA2= <user>
##$USERA3= <user>
##$USERA4= <user>
##$USERA5= <user>
##$V9= 5
##$VALIST= <valist>
##$VCLIST= <CCCCCCCCCCCCCCC>
##$VD= 0
##$VDLIST= <DDDDDDDDDDDDDDD>
##$VPLIST= <PPPPPPPPPPPPPPP>
##$VTLIST= <TTTTTTTTTTTTTTT>
##$WBST= 1024
##$WBSW= 4
##$XGAIN= (0..3)
0 0 0 0 
##$XL= 0
##$YL= 0
##$YMAX_a= 3245
##$YMIN_a= -4105
##$ZGOPTNS= <>
##$ZL1= 120
##$ZL2= 120
##$ZL3= 120
##$ZL4= 120
##$ABSF1= 60
##$ABSF2= -190
##$ABSG= 5
##$ABSL= 3
##$ALPHA= 0
##$AQORDER= 0
##$ASSFAC= 0
##$ASSFACI= 0
##$ASSFACX= 0
##$ASSWID= 0
##$AUNMP= <proc_1d>
##$AZFE= 0.1
##$AZFW= 0.5
##$BCFW= 1
##$BC_mod= 2
##$BYTORDP= 1
##$COROFFS= 0
##$CY= 9.86611175537109
##$DATMOD= 1
##$DC= 1
##$DFILT= <>
##$DTYPP= 0
##$F1P= 248.564497384935
##$F2P= -679.521563365616
##$FCOR= 0.5
##$FTSIZE= 0
##$FT_mod= 0
##$GAMMA= 1
##$GB= 0
##$INTBC= 1
##$INTSCL= 1
##$ISEN= 30
##$LB= 1
##$LEV0= 0
##$LPBIN= 0
##$MAXI= 11.51145
##$MC2= 0
##$MEAN= 0
##$ME_mod= 0
##$MI= 1.244541
##$NCOEF= 0
##$NC_proc= 0
##$NLEV= 6
##$NOISF1= 0
##$NOISF2= 0
##$NSP= 1
##$NTH_PI= 0
##$NZP= 1
##$OFFSET= 243.8632
##$PC= 1.4
##$PHC0= -8778.371
##$PHC1= -56.13109
##$PH_mod= 0
##$PKNL= yes
##$PPARMOD= 0
##$PSCAL= 0
##$PSIGN= 0
##$REVERSE= no
##$SF= 81.0140731611343
##$SI= 65536
##$SIGF1= 0
##$SIGF2= 0
##$SINO= 80
##$SIOLD= 65536
##$SREGLST= <31P.CDCl3>
##$SSB= 0
##$STSI= 0
##$STSR= 0
##$SW_p= 25641.0256410257
##$SYMM= 0
##$S_DEV= 0
##$TDeff= 0
##$TDoff= 0
##$TI= <>
##$TILT= no
##$TM1= 0
##$TM2= 0
##$TOPLEV= 0
##$USERP1= <user>
##$USERP2= <user>
##$USERP3= <user>
##$USERP4= <user>
##$USERP5= <user>
##$WDW= 1
##$XDIM= 64
##$YMAX_p= 0
##$YMIN_p= 0
$$ End of Bruker specific parameters
$$ ---------------------------------
##NTUPLES= NMR FID
##VAR_NAME=  TIME,          FID/REAL,        FID/IMAG
##SYMBOL=    X,             R,               I
##VAR_TYPE=  INDEPENDENT,   DEPENDENT,       DEPENDENT
##VAR_FORM=  AFFN,          ASDF,            ASDF
##VAR_DIM=   16384,         16384,           16384
##UNITS=     SECONDS,       ARBITRARY UNITS, ARBITRARY UNITS
##FACTOR=    2.46e-05,      1,               1
##FIRST=     0,             0,               0
##LAST=      0.4030218,     0,               0
##MIN=       0,             -4105,           0
##MAX=       0.4030218,     3245,            0
$$ Real data points
##PAGE= N=1
##DATA TABLE= (X++(R..R)), XYDATA
$$ plain form
0 0 0 0 0 0 0 0 0 1 1 0 -1 -1 2 -1 1 -4 4 0 2 -4 3 -3 5 -7 5 -7 12 -10 15 -22 35 -56 119 -2090 -2499 -3185 -3853 -4105 -3959 -3072
40 -3072 -3308 -3211 -1309 -1827 -824 -273 579 1189 1628 1410 1670 2234 1768 1013 1101 255 200 119 -1133 -1436 -847
61 -847 -1397 -1382 -1163 -1244 -977 -265 -329 174 507 1069 1340 1978 1668 1662 1714 950 1857 944 620 450 -844 -521
83 -521 -819 -935 -1444 -1486 -1944 -1729 -1493 -1121 -1196 -456 -315 177 535 563 1437 1358 1623 1760 2330 1580 1753 1862
105 1862 814 242 170 -693 -939 -613 -2056 -2009 -1411 -1573 -993 -1150 -968 486 858 311 1606 1370 1352 1998
125 1998 2176 939 1194 839 176 -35 -983 -1000 -1010 -1329 -1984 -1498 -1848 -1854 -990 -856 -752 221 333 611 1140
146 1140 1428 1333 1477 1140 1291 1257 25 507 612 -873 -798 -437 -1347 -1155 -1431 -1569 -1319 -912 -1424 -1038
166 -1038 -86 -467 200 626 466 1124 919 965 1907 1231 885 942 796 226 184 98 -785 -390 -1372 -1328 -1054 -1844
$$ packed form
0@%%%%%%%J%jj%LlKnQmKoPoQj2J2j2J9k2K5l7N7r1J75k209m09o86o68k52J46Q87
40c072k36R7J902n18J003N51Q52O10M39k18K60N64m66p55Q8q46n5q1j252l03N89
61h47n50J5K19q1K67P12o4N03L33N62K71O38l10oN2p64R07r13l24j70j294L23
83e21k98j16n09m2m58K15K36L72p5P40J41M92L58K8Q74p9K65J37N70p50J73J09
105A862j048n72p2q63k46L26j443M7N98j62N80j57J82J454L72n47J295k36j8O46
125A998J78j237K55l55o63k11r48j7j0l19o55M86l50oQ64J34J04R73J12K78N29
146A140K88r5J44l37J51l4j232M82J05j485P5L61r10J92k76j38K50M07n12L86
166a038R52l81O67M26j60O58k05M6R42o76l46N7j46n70m2q6q83L95r82M4K74p90
$$ plain form
188 -1844 -1261 -889 -962 -1489 -178 24 -229 607 546 1238 1355 1576 1549 2213 1268 949 1228 711 916 611 -267
209 -267 134 -315 -427 -1097 -516 -844 -582 -663 -539 498 -51 203 896 798 499 1006 599 211 809 31 -985
230 -985 -362 -1346 -1543 -932 -1461 -2024 -1891 -2248 -1809 -984 -1649 -854 359 -254 462 1108 315 1387 1589 483
250 483 1501 1431 588 955 1292 412 426 99 -738 -705 -328 -1250 -909 -945 -879 -620 -128 -521 124 422 400 789
272 789 1299 286 751 975 374 972 877 255 1192 166 59 247 -452 -653 -312 -963 -960 -697 -1268 -460 -254
293 -254 -325 226 996 670 592 1261 995 919 1159 557 951 1178 106 115 -306 -1453 -1056 -837 -1757 -1078 -1211
314 -1211 -1745 -1344 -546 -730 -191 414 285 1201 1462 1236 1591 1352 686 1216 739 637 781 407 -326 272
334 272 -1134 -1553 -567 -893 -1393 -654 -810 -1051 -447 -38 194 85 381 263 169 338 143 981 -348 -383
$$ packed form
188a844N83L72p3n27J311K02k53Q36o1O92J17K21k7O64r45l19K79n17K05l05q78
209b67M01m49j12o70N81l28K62q1J24J037n49K54O93r8k99N07m07l88N98p78j016
230i85O23r84j97O11n29n63J33l57M39Q25o65P95J213o13P16O46p93J072K02j106
250D83J018p0q43L67L37q80J4l27q37L3L77r22L41l6O6K59M92l93O45K98k2L89
272G89N10j013M65K24o01N98r5o22R37j026j07J88o99k01L41o51LK63n71Q08K06
293b54p1N51P70l26p8O69k66p6K40o02L94K27j072Rm21j147L97K19r20O79j33
314a211n34M01P98j84N39O05j29R16K61k26L55k39o66N30m77j02J44l74p33N98
334B72j406m19R86l26n00P39j56k41O04M09K32j09K96j18r4J69j95Q38j329l5
$$ plain form
354 -383 -139 -906 -342 -362 -1102 -572 -334 -1105 -820 -267 -1056 -721 27 -645 566 409 177 852 720 373
374 373 553 1168 365 1023 522 341 599 265 -971 -220 -471 -737 240 -434 -711 -395 -371 171 354 -78
394 -78 669 1040 575 991 1840 781 1269 1395 1178 250 439 -351 127 -102 -789 -1342 -856 -1349 -1376 -843 -1535
415 -1535 -736 -297 -839 569 101 -36 370 768 -83 557 759 392 424 -92 -712 621 -448 -785 -408
434 -408 -1285 -1168 -100 -1017 -666 -90 -349 15 288 250 711 841 269 728 1232 -12 403 537 -239 -145
454 -145 148 -655 -600 245 -927 83 -228 -888 -634 -188 -1272 20 184 196 568 621 369 716 1250 584
474 584 1626 902 1104 1549 394 629 537 246 -220 303 -493 -286 -305 -748 -1295 -569 -603 -896 -159 -425 -313
495 -313 317 -227 112 436 -510 402 519 236 303 183 -360 323 9 -758 -442 -256 -203 311 565 -504 303
$$ packed form
354c83K44p67N64k0p40N30K38p71K85N53p89L35P48o72J211j57k32O75j32l47
374C73J80O15q03O58n01j81K58l34j236P51k51k66R77o74k77L16K4N42J83m32
394g8P47L71m65M16Q49j059M88J26k17r28J89p90M78k29o87n53M86m93k7N33o92
415a535P99M39n42J408m68j37M06L98q51O40K02l67L2n16o20J333j069l37L77
434d08q77J17J068r17L51N76k59L64K73l8M61J30n72M59N04j244M15J34p76R4
454a45K93q03N5Q45j172J010l11o60K54M46j084J292J64J2L72N3k52L47N34o66
474E84J042p24K02M45j155K35r2k91m66N23p96K07j9m43n47P26l4k93P37k66J12
495c13O30n44L39L24r46R12J17k83O7j20n43O83l14p67L16J86N3N14K54j069Q07
$$ plain form
516 303 1107 261 1045 448 90 475 592 639 775 346 91 483 190 -295 -358 -505 -1285 -336 -594 -833 -868
537 -868 -1034 -816 -711 -1032 -1344 -390 -913 -440 -219 -501 -196 -19 -175 260 646 110 77 496 281 -194 260
558 260 -165 385 629 -124 -49 -6 -430 263 228 -569 -202 390 213 524 814 493 1200 869 437 943 875 669
580 669 414 -401 -220 172 133 -419 -124 -331 -861 -144 177 -684 1 301 -230 346 374 572 775 58 300
601 300 455 -73 231 392 -220 -417 -758 -866 -838 -541 -1325 -494 3 -1009 -123 -89 -344 41 460 61 -76
622 -76 597 498 896 389 -106 708 -70 1 206 -338 -689 -227 -311 -651 -625 -883 -707 -288 -817 -379 212 69
644 69 73 142 43 507 545 676 614 1236 259 469 451 -51 -66 175 -677 -210 -354 -556 62 -71 -32 30 566 39
668 39 276 856 764 632 671 291 1464 572 430 1069 225 488 -162 -716 -1197 -803 -1579 -1455 -588 -986 -1131
$$ packed form
516C03Q04q46P84n97l58L85J17M7J36m29k55L92k93m85o3j47p80R49k58k39l5
537h68j66K18J05l21l12R54n23M73K21k82L05J77j56M35L86n36l3M19k15m75M54
558B60m25N50K44p53P5M3m24O93l5p97L67N92j77L11K90l21P07l31m32N06o8k06
580F69k55q15J81L92l9n52K95k07n30P17L21q61O85L00n31N76K8J98K03p17K42
601C00J55n28L04J61o12j97l41j08K8K97p84Q31M97j012Q86L4k55L85M19l99j37
622g6O73r9L98n07m95Q14p78P1K05n44l51M62q4l40K6k58J76M19n29M38N91j43
644F9MO9r9M64L8J31o2O22r77K10j8n02j5K41q52M67j44k02O18j33L9O2N36n27
668C9K37N80r2j32L9l80J173q92j42O39q44K63o50n54m81L94p76J24Q67l98j45
$$ plain form
689 -1131 -896 -996 -795 -72 -123 -159 1003 510 721 1181 1118 1430 1624 696 747 1111 350 313 393 -152 39 -123
711 -123 -822 -389 -130 -582 -201 218 -675 237 448 91 430 722 -185 -52 802 -97 -190 -44 -625 -306 -398
732 -398 -972 -548 -1158 -1893 -311 -422 -1065 -146 -383 -280 306 -370 503 467 153 767 874 375 356 861 333
753 333 460 242 104 230 231 -453 -34 -748 -717 -131 249 -892 387 479 295 464 771 213 1110 676 429
774 429 1338 719 341 702 81 140 183 -437 -612 -233 -764 -721 56 -1024 -691 -231 -482 85 405 482 190
795 190 1041 680 53 717 -59 28 299 -651 -782 -85 -1150 -664 -725 -1143 -851 -664 -1187 -157 -363 -462 -167
816 -167 4 43 782 332 202 1015 1014 605 707 442 423 517 -83 -251 441 -239 -726 -501 -726 -121 -327 -561
838 -561 -778 -395 -315 66 303 171 394 1033 150 703 1257 401 646 716 556 378 801 111 243 18 -663
$$ packed form
689a131K35j00K01P23n1l6J162m93K11M60o3L12J94r28N1L64p61l7Q0n45J91j62
711a23o99M33K59m52L81M19q93R12K11l57L39K92r07J33Q54q99r3J46n81L19r2
732c98n74M24o10p35J582j11o43R19k37J03N86o76Q73l6l14O14J07m99j9N05n28
753C33J27k18j38J26Jo84M19p14L1N86L80j141J279R2j84J69L07n58Q97m34k47
774D29R09o19l78L61o21N9M3o20j75L79n31M3P77j080L33M60k51N67L20P7k92
795A90Q51l61o27O64p76Q7K71r50j31O97j065M86o1m18K92J87n23J030k06r9K95
816a67J71L9P39m50j30Q13jm09J02k65j9R4o00j68O92o80m87K25k25O05k06k34
838e61k17L83Q0L81K37j32K23O39q83N53N54q56K45P0j60j78M23o90J32k25o81
$$ plain form
859 -663 -778 -199 -604 60 -317 -845 60 150 -590 352 876 549 970 506 67 984 216 -64 249 -431 -587
880 -587 -764 -543 -748 -415 -968 -831 -799 -658 -609 -168 6 82 448 467 721 1572 301 402 840 1103 517
901 517 523 -55 -8 67 -841 -225 -291 -928 -799 -833 -887 -624 -748 -624 -685 -475 -407 -20 436 -142 515 412 122
924 122 248 320 -143 -169 -211 -571 -97 -474 -1214 -156 -516 -803 -147 -753 -823 31 -798 -297 267 -128 196
945 196 1072 59 526 1111 425 708 523 552 159 283 -290 49 -117 -523 -534 -2 -578 -532 -886 153 296
966 296 500 284 1132 1013 560 1421 928 983 1555 1085 153 1075 122 -139 221 -458 -1111 -386 -826 -965 -855
987 -855 -971 -488 -423 -752 -741 510 -160 -295 646 194 -73 594 110 130 -134 -742 -124 -1029 -666 -599 -192
1008 -192 -963 -127 -771 -166 51 -75 -60 697 381 387 1399 616 842 773 1493 493 1100 287 -330 52 120
$$ packed form
859f63j15N79m05O64l77n28R05R0p40R42N24l27M21m64m39R17p68k80L13o80j56
880e87j77K21k05L33n53J37L2J41M9M41J74P6L66J9K54Q51j271J01M38K63n86
901E17On78M7P5r08O16o6o37J29l4n4K63j24J24o1K10O8L87M56n78O57j03k90
924A22J26P2m63k6m2l60M74l77p40J058l60k87O56o06p0Q54q29N01N64l95L24
945A96Q76j013M67N85o86K83j85K9l93J24n73L39j66m06j1N32n76M6l54J039J43
966B96K04k16Q48j19m53Q61m93N5N72m70r32R22r53k61L60o79o53P25m40j39J10
987h55j16M83O5l29J1J251o70j35R41m52k67O67m84K0k64o08O18r05L63O7M07
1008a92p71Q36o44O05K17j26J5P57l16OJ012p83K26o9P20j000O07q13o17L82O8
$$ plain form
1029 120 -427 54 -490 -1080 -483 -1052 -1272 -117 -475 -672 -5 227 -311 349 615 556 984 981 826 1066 662
1050 662 236 1240 199 151 49 -806 -596 27 -1215 -755 -408 -1027 -290 -190 -224 699 382 -120 507 843
1070 843 224 995 983 761 1167 606 655 737 -98 -268 239 -702 -871 -397 -502 -413 -107 -27 -474 439 286 243
1092 243 397 626 682 962 473 420 327 -351 -641 -4 -515 -1131 -301 -915 -1063 -673 -763 -664 -663 -1191 -450 -24
1114 -24 -290 311 534 161 310 646 278 960 425 -101 155 -110 -659 -96 -320 -1036 -221 -219 -328 -193 -502
1135 -502 -174 -505 -137 -338 336 170 -352 327 390 -7 759 605 -165 764 370 689 910 -1 190 83
1155 83 208 -539 -74 -13 -252 319 -110 80 309 -50 331 795 581 1084 722 126 296 783 -124 223 243
1176 243 -496 90 -629 -550 -134 -929 -792 -593 -1056 -1095 -629 -641 -730 -204 -273 -42 894 -276 240 657 414
$$ packed form
1029A20n47M81n44n90N97n69k20J155l58j97O67K32n38O60K66n9M28lj55K40m04
1050F62m26J004j041m8j02q55K10O23j242M60L47o19P37J00l4R23l17n02O27L36
1070H43o19P71j2k22M06n61M9Q2q35j70N07r41j69M74j05Q9L06Q0m47R13j53m3
1092B43J54K29N6K80m89n3r3o78k90O37n11o16Q30o14j48L90r0R9Jn28P41M26
1114b4k66O01K23l73J49L36l68O82n35n26K56k65n49N63k24p16Q15Kj09J35l09
1135e02L28l31L68k01O74j66n22O79O3l97P66j54p70R29l94L19K21r11J91j07
1155H3J25p47M65O1k39N71m29J90K29l59L81M64k14N03l62n96J70M87r07L47K0
1176B43p39N86p19P9M16p95J37J99m63l9M66j2q9N26o9K31R36j170N16M17k43
$$ plain form
1197 414 166 304 287 -53 -6 207 479 -78 -338 -270 863 -60 60 208 82 18 -121 -532 61 625 -433
1218 -433 455 326 -378 908 26 -178 310 -308 -42 74 -244 -290 -131 -978 -67 -300 -243 -524 -318 -212
1238 -212 -105 71 39 299 402 74 -23 621 406 -104 930 -154 -325 150 -853 136 4 -887 -206 216
1258 216 -795 -162 290 -294 -231 600 -365 482 534 -11 681 950 787 925 1142 368 763 288 -114 441
1278 441 268 -205 76 -1093 -576 -723 -560 -526 -86 -494 -478 -38 -67 -385 319 111 -35 103 -248 32 424
1299 424 29 -747 103 -214 -190 198 -710 -277 41 -693 -510 -401 -754 -171 697 -289 315 470 -144 228
1319 228 893 160 670 777 244 437 431 -307 424 -188 -364 -11 -527 -408 179 -763 -481 161 -374 -903 552
1340 552 48 -230 589 812 231 853 683 643 775 544 729 1003 207 262 355 -228 -51 -154 92 -378 386
$$ packed form
1197D14k48J38j7l40M7K13K72n57k60O8J133r23J20J48j26o4j39m11N93N64j058
1218d33Q88j29p04J286q82k04M88o18K66J16l18m6J59q47R11k33N7k81K06J06
1238b12J07J76l2K60J03l28r7O44k15n10J034j084j71M75j003R89j32q91O81M22
1258B16j011O33M52n84O3Q31r65Q47N2n45O92K69j63J38K17p74L95m75m02N55
1278D41j73m73K81j169N17j47J63L4M40m08J6M40k9l18P04k08j46J38l51K80L92
1299D24l95p76Q50l17K4L88r08M33L18p34J83J09l53N83Q68r86O04J55o14L72
1319B28O65p33N10J07n33J93op38P31o12j76L53n16J19N87r42K82O42n35n29J455
1340E52n04k78Q19K23n81O22j70m0J32k31J85K74p96N5R3n83J77j03K46m70P64
$$ plain form
1361 386 -556 -484 -105 -532 191 -260 -38 121 258 -516 697 138 -846 -185 146 -653 -906 -480 -731 -415
1381 -415 -20 -893 -256 -324 -449 114 -517 -185 373 556 296 727 741 545 1065 -257 366 604 446 -5
1401 -5 429 -418 -401 32 -215 212 -232 -735 -384 -308 -816 65 33 -761 62 30 12 841 731 302 547 326
1423 326 141 597 500 -331 317 -320 -648 -441 -694 -446 -236 -370 -197 -160 -673 -93 -90 85 -281 954 -26
1444 -26 -96 1059 -1 510 658 425 -74 293 -40 -232 -194 -506 44 147 -427 -267 -303 444 272 496 -472
1465 -472 146 894 552 888 521 -13 471 422 -30 230 -47 -738 -171 -159 -842 9 -860 -611 -566 -221 -599
1486 -599 -526 -521 -244 -300 -331 -653 258 -260 -225 834 -487 -30 475 10 101 223 -528 75 56 -536 -155 356
1508 356 -596 218 32 -332 169 127 -210 -28 352 -498 560 517 390 865 346 147 119 409 -191 133 -300
$$ packed form
1361C86r42P2L79m27P23m51K22J59J37p74J213n59r84O61L31p99k53M26k51L16
1381d15L95q73O37o8j25N63o31L32N58J83k60M31J4j96N20j322O23K38j58m51
1401eM34q47J7M33k47M27m44n03L51P6n08Q81l2p94Q23l2j8Q29j10m29K45k21
1423C26j85M56r7q31O48o37l28K07k53K48K10j34J73L7n13N80LJ75l66J235r80
1444b6p0J155j060N11J48k33m99L67l33j92L8l12N50J03n74J60l6P47j72K24r68
1465d72O18P48l42L36l67n34M84m9m52K60k77o91N67J2o83Q51q69K49M5L45l78
1486e99P3NK77n6l1l22R11n18L5J059j321M57N05m65R1J22p51O03j9n92L81N11
1508C56r52Q14j86l64N01m2l37J82L80q50J058m3j27M75n19j99k8K90o00L24m33
$$ plain form
1529 -300 45 28 -112 -385 237 -12 -413 -28 -605 173 626 258 137 993 305 626 1394 516 131 676
1549 676 232 -126 548 -522 -44 -481 -679 -639 -362 -945 -345 -450 -1066 150 452 -315 -453 -354 -316 580
1569 580 451 147 417 -29 -565 414 26 -504 128 457 -542 -344 191 -811 146 -383 -300 309 -84 -421
1589 -421 546 -116 201 -10 -182 -95 452 206 315 457 -184 -234 408 -30 35 267 -284 -285 225 -354 -321 210
1611 210 -877 -238 146 -172 122 578 255 759 979 245 383 520 392 439 605 -371 -234 137 -618 -90
1631 -90 -555 -615 -352 -726 -723 158 -392 -223 230 15 154 704 590 343 751 817 216 350 27 188 906 -813
1653 -813 276 298 -928 -50 -20 -665 396 355 -227 509 437 -135 366 751 -271 721 363 119 474 383
1673 383 -459 274 -44 -798 -632 -568 -790 -822 -852 -1483 -311 -644 -1121 -30 -266 -553 356 281 -395 478 185
$$ packed form
1529c00L45j7j40k73O22k49m01L85n77P78M53l68j21Q56o88L21P68q78l85N45
1549F76m44l58O74j070M78m37j98M0K77n83O00j05o16J216L02p67j38R9L8Q96
1569E80j29l04K70m46n36R79l88n30O32L29r99J98N35j002R57n29Q3O09l93l37
1589d21R67o62L17k11j72Q7N47k46J09J42o41n0O42m38O5K32n51jN10n79L3N31
1611B10j087O39L84l18K94M56l23N04K20p34J38J37j28M7J66r76J37L71p55N28
1631i0m65o0K63l74LQ81n50J69M53k15J39N50j14k47M08O6o01J34l23J61P18j719
1653h13J089K2j226Q78L0o45J061m1n82P36p2n72N01L85j022R92l58k44L55r1
1673C83q42P33l18p54J66O4k22l2l0o31J172l33m77J091k36k87R09p5o76Q73k93
$$ plain form
1694 185 296 644 89 185 931 -168 101 164 -506 -56 703 -402 -17 104 -688 -304 -483 -425 -278 416
1714 416 -145 19 136 470 579 1096 695 842 917 330 213 428 -148 322 147 -365 -474 -293 -562 -173
1734 -173 -496 -890 -65 -219 -105 375 500 100 236 -14 131 352 84 82 354 -168 -509 -98 -992 -348 -126
1755 -126 -678 -566 175 -655 -102 -176 -566 -424 101 -88 385 708 364 284 756 98 312 603 -188 345 -112
1776 -112 -165 7 -29 -586 -158 -331 -885 99 -324 -470 -33 -103 -112 220 -236 -484 579 -33 -557 559 47
1797 47 90 771 -65 95 102 -359 -367 189 -393 -413 -114 -616 -94 319 -416 -241 374 148 604 619 -361 471 838
1820 838 -12 415 868 -271 27 -360 -649 -605 -203 -506 -492 -646 -1021 46 -135 -231 -33 223 -96 523
1840 523 326 394 888 298 378 464 461 465 467 -414 146 333 -114 -463 -30 -265 -10 -366 -468 197 152 -791 -175
$$ packed form
1694A85J11L48n55R6P46j099K69O3o70M50P59j105L85J21p92L84j79N8J47O94
1714D16n61J64J17L34J09N17m01J47P5n87j17K15n76M70j75n12j09J81k69L89
1734a73l23l94Q25j54J14M80J25m00J36k50J45K21k68kK72n22l41M11q94O44K22
1755a26n52J12P41q30N53p4l90J42N25j89M73L23l44q0M72o58K14K91p91N33m57
1776a12n3J72l6n57M28j73n54R84m23j46M37p0rL32m56k48J063o12n24J116n12
1797D7M3O81q36J60Pm61qN56n82k0K99n02N22M13p35J75O15k26M56J5r80Q32L67
1820H38q50M27M53j139K98l87k89M4M02l03J4j54l75J067j81r6J98K56l19O19
1840E23j97O8M94n90Q0Q6lMKq81N60J87m47l49M33k35K55l56j02O65m5r43O16
$$ plain form
1863 -175 454 -228 123 18 160 168 145 -647 83 44 -1150 -176 -22 -1127 -272 -571 -943 -187 -100 -606 144
1884 144 -515 -287 -112 -119 -524 908 213 27 688 227 -9 850 496 226 669 61 49 619 -418 -382 -140
1905 -140 -543 -150 204 -683 -203 657 -155 441 445 261 592 709 355 903 338 220 915 605 -192 -247 -113
1926 -113 -974 96 -254 -528 -591 -355 -398 -150 -637 -675 609 -184 -655 212 288 73 580 244 513 412 -34
1947 -34 -94 270 175 -8 143 -487 184 3 -684 -429 298 -261 -32 303 -345 781 725 -239 679 552 -473
1968 -473 255 865 155 186 50 -175 215 -302 -364 98 -492 -406 -269 -295 -262 -89 -411 -643 281 -250 -534 151
1990 151 9 242 196 648 391 747 -324 -79 417 24 184 141 209 -148 -197 115 -78 -229 -870 235 238
2011 238 -281 140 -29 -283 441 630 -201 130 486 -138 345 495 -354 148 -288 -758 83 -396 -633 109
$$ packed form
1863a75O29o82L51j05J42Qk3p92P30l9j194R74J54j105Q55k99l72P56Q7n06P50
1884A44o59K28J75pm05J432o95j86O61m61k36Q59l54k70M43o08j2N70j037L6K42
1905a40m03L93L54q87M80Q60q12N96Mj84L31J17l54N48n65j18O95l10p97n5J34
1926a13q61J070l50k74o3K36m3K48m87l8J284p93m71Q67P6k15N07l36K69j01m46
1947c4o0L64r5j83J51o30O71j81o87K55P27n59K29L35o48J126n6r64R18j27j025
1968d73P28O10p10L1j36k25L90n17o2M62n90Q6J37k6L3J73l22k32R24n31k84O85
1990A51j42K33m6M52k57L56j071K45M96l93J60m3O8l57m9L12j93j51o41J105L
2011B38n19M21j69k54P24J89q31L31L56o24M83J50q49N02m36m70Q41m79k37P42
$$ plain form
2031 109 -235 -697 181 -36 -550 -23 207 615 739 674 278 460 333 -309 721 163 -493 129 -186 -393
2051 -393 57 -690 -737 22 -775 -411 -126 -775 -305 -86 -1078 149 -47 -622 315 134 -42 459 280 -78
2071 -78 645 -184 50 -288 -539 -307 -172 -73 -648 51 -64 -568 109 -13 -384 577 -60 141 717 140 244
2092 244 504 231 244 716 315 351 346 161 181 147 62 295 213 -238 -52 618 464 -273 245 397 456 526 -25
2115 -25 905 467 192 574 151 -226 112 -434 -663 -141 -58 -534 77 -309 -773 -607 -559 -684 -95 -450 -502
2136 -502 193 -104 -268 447 -146 -297 599 310 -248 571 54 -238 284 -134 -536 292 -148 197 354 356 627
2157 627 518 -410 266 825 -427 148 583 -318 730 386 -439 -39 -414 -125 43 -395 -364 240 -79 -183
2177 -183 33 -481 -73 85 -463 -537 -1 -360 -132 105 -171 68 -135 50 -808 449 386 8 241 293 422
$$ packed form
2031A09l44m62Q78k17n14N27K30M08J24o5l96J82j27o42J030n58o56O22l15k07
2051c93M50p47m7P59p97L64K85o49M70K19r92J227j96n75R37j81j76N01j79l58
2071g8P23q29K34l38k51K32J35R9n75O99j15n04O77j22l71R61o37K01N76n77J04
2092B44K60k73J3M72m01L6nj85K0l4q5K33q2m51J86O70j54p37N18J52N9P0n51
2115b5R30m38k75L82m23l77L38n46k29N22Q3m76O11l86m64J66M8j25N89l55n2
2136e02O95k97j64P15n93j51Q96k89n58Q19n17k92N22m18m02Q28m40L45J57KK71
2157F27j09r28O76N59j252N75M35r01J048l44q25M00l75K89J68m38L1O04l19j04
2177a83K16n14M08J58n48p4N36l59K28K37k76K39k03J85q58J257o3l78K33N2J29
$$ plain form
2198 422 187 -140 499 310 -36 72 65 -507 -175 -90 -666 215 -60 -336 495 558 43 44 761 -77 340 455
2220 455 40 504 705 -322 508 50 -248 474 -262 -278 152 -649 -104 -90 -155 -1006 105 -157 -384 -18
2240 -18 -130 -809 450 -485 67 -29 -612 -641 415 -172 -553 168 -273 -481 151 -653 -112 255 -576 235
2260 235 807 -82 346 436 -237 -489 194 -20 396 143 51 306 215 -222 383 -22 -596 -73 40 -21 407
2281 407 -610 -317 248 -83 -159 175 -175 -220 489 653 120 915 132 -479 98 201 275 971 304 -332 61
2302 61 -244 -116 124 -298 -390 417 21 -307 388 176 180 14 -349 528 -83 -71 246 544 -47 237 -321 -205
2324 -205 -321 -278 -594 -78 -766 -698 -419 -524 -725 206 -153 -391 695 -140 -55 215 264 755 410 128 103
2345 103 414 -75 257 190 -61 -220 177 -638 -228 -192 -146 -113 -216 -499 -280 -71 -833 57 307 -590 335
$$ packed form
2198D22k35l27O39j89l46J08pn72L32Q5n76Q81k75k76Q31O3n15JP17q38M17J15
2220D55m15M64K01j027Q30m58k98P22p36j6M30q01N45J4o5q51J111k62k27L66
2240a8j12o79J259r35N52r6n83k9J056n87l81P21m41k08O32q04N41L67q31Q11
2260B35N72q89M28R0o73k52O83k14M16k53r2K55r1m37O05m05n74N23J13o1M28
2281D07j017K93N65l31p6L34l50m5P09J64n33P95p83o11N77J03P4O96o67o36L93
2302F1l05J28K40m22r2Q07l96l28O95k12Mj66l63Q77o11J2L17K98n91K84n58J16
2324b05j16M3l16N16o88O8K79j05k01R31l59k38J086q35Q5K70M9M91l45k82k5
2345A03L11m89L32o7k51j59L97q15M10L6M6L3j03k83K19K09p62Q90K50q97R25
$$ plain form
2366 335 531 -216 105 494 -375 273 130 -419 220 -264 -601 -144 -330 -650 139 -265 -402 380 -144 -656
2386 -656 272 -687 -38 157 -195 -45 289 599 3 475 -307 -338 58 297 292 116 -115 -366 196 -53 5
2407 5 637 224 210 625 218 376 466 -8 476 71 236 499 521 -180 -160 97 -123 -58 182 -660 -678 -272 -899
2430 -899 -263 -200 -819 -30 -112 -1009 38 -599 -408 -269 -257 35 542 -316 4 292 -313 -57 654 -233 -360
2451 -360 314 69 9 -11 -249 312 518 93 269 666 -401 -68 819 -457 651 448 293 161 474 -84
2471 -84 99 195 44 98 -237 -98 395 129 -1062 86 -116 -42 399 485 -295 775 -254 598 756 -67
2491 -67 456 952 162 -81 784 -62 342 373 -297 -117 32 -351 -211 236 -295 -231 409 -878 3 436 1
2512 1 127 200 -184 11 457 -380 179 480 -128 -182 -530 -284 -199 -254 -481 -479 -56 -200 424 125 -122 177 444
$$ packed form
2366C35J96p47L21L89q69O48j43n49O39m84l37M57j86l20P89m04j37P82n24n12
2386f56R28r59O49J95l52J50L34L10n96M72p82l1L96K39nj76k31k51N62k49N8
2407EO32m13j4M15m07J58R0m74M84m05J65K63K2p01K0K57k20O5K40q42j8M06o27
2430h99O36O3o19P89q2q97J047o37J91J39J2K92N07q58L20K88o05K56P11q87j27
2451c60O74k45o0k0k38N61K06m25J76L97j067L33Q87j276J108k03j55j32L13n58
2471h4J83R6j51N4l35J39M93k66j191J148k02P4M41Q6p80J070j029Q52J58q23
2491f7N23M96p90k43Q65q46M04L1o70J80J49l83J40M47n31O4O40j287Q81M33m35
2512AJ26P3l84J95M46q37N59L01o08n4l48K46Q5n5k27KM23j44O24k99k47K99K67
$$ plain form
2535 444 -73 607 -245 -330 781 432 -182 159 430 -101 -52 -493 -394 691 -335 31 406 -610 -571 -235
2555 -235 -318 -350 358 -608 -193 -105 -562 -178 451 -714 385 645 -182 423 286 221 57 310 21 -208 -112
2576 -112 -964 500 -211 -860 90 -323 -814 199 -556 -131 378 438 527 685 48 301 400 671 -86 667
2596 667 574 -120 550 -55 139 609 -627 89 -236 -191 312 680 -273 121 426 -587 308 42 -401 410
2616 410 251 -364 -73 -728 -365 -208 -252 -746 -220 -398 -1058 -610 -531 -402 -435 -441 -423 -339 125 102 -115 -218 -435
2639 -435 216 212 -224 539 -28 89 522 -152 -179 631 119 106 169 -62 -89 272 -146 -405 679 -290 -302 321
2661 321 -561 316 -29 -59 207 687 1 397 422 -4 167 407 -274 567 -21 -467 332 138 -420 96 -142
2682 -142 -103 220 539 -48 783 429 155 226 -81 322 497 184 -216 477 -112 -395 -418 -532 -172 -133 -486
$$ packed form
2535D44n17O80q52q5J111l49o14L41K71n31M9m41R9J085j026L66L75j016L9L36
2555b35q3l2P08r66M15Q8m57L84O29j165J099K60q27O05j37o5j64K53k89k29R6
2576a12q52J464p11o49R50m13m91J013p55M25N09O0Q9J58o37K53R9K71p57P53
2596F67r3o94O70o05J94M70j236P16l25M5N03L68r53L94L05j013Q95k66m43Q11
2616D10j59o15K91o55L63J57m4m94N26j78o60M48P9J29l3oJ8Q4M64k3k17j03k17
2639d35O51mm36P63n67J17M33o74k7Q10n12j3O3k31k7L61m18k59J084r69j2O23
2661C21q82Q77l45l0K66M80o86L96K5m26J71K40o81Q41n88m46P99j94n58N16k38
2682a42L9L23L19n87Q31l54k74P1l07M03J75l13m00O93n89k83k3j14L60L9l53
$$ plain form
2703 -486 -446 376 -623 -343 -18 -597 283 529 -244 145 283 398 656 632 132 525 285 -196 609 52 -477
2724 -477 78 -84 -394 -496 -92 46 95 -606 -277 88 -189 283 792 254 -495 452 89 -397 417 89
2744 89 -308 29 -228 -29 307 -359 -90 -192 -580 76 142 -303 117 766 -592 174 215 -61 995 461
2764 461 304 371 -9 -29 153 301 -250 459 -302 -19 272 -325 -328 283 148 -911 250 205 4 194 121
2785 121 -290 902 377 319 900 220 28 1221 154 -284 146 -143 -8 124 -455 -237 -129 -773 -212
2804 -212 34 -164 -383 -3 -212 -82 10 -469 36 212 -543 -57 186 -414 111 -729 -631 -612 -83 -788 -534
2825 -534 -205 -964 1 -469 -384 -198 -42 -310 -114 292 -107 347 230 -451 525 474 -205 128 -186 -266 150
2846 150 -48 -118 351 -644 -522 446 80 -284 88 540 53 304 -389 242 735 70 988 96 -228 764
$$ packed form
2703d86M0Q22r99K80L25n79Q80K46p73L89J38J15K58k4n00L93k40m81Q05n57n29
2724d77N55j62l10j02M04J38M9p01L29L65k77M72N09n38p49R47l63m86Q14l28
2744H9l97L37k57J99L36o66K69j02l88O56O6m45M20O49j358P66M1k76J056n34
2764D61j57O7l80k0J82J48n51P09p61K83K91n97lO11j35j059J161m5k01J90p3
2785A21m11J192n25n8N81o80j92J193j067m38M30k89J35J32n79K18J08o44N61
2804b12K46j98k19L80k09J30R2m79N05J76p55M86K43o00N25q40R8J9N29p05K54
2825e34L29p59R65m70Q5J86J56k68J96M06l99M54j17o81R76n1o79L33l14q0M16
2846A50j98p0M69r95J22R68l66l64L72M52m87K51o93O31M93o65R18q92l24R92
$$ plain form
2866 764 141 -552 442 345 -185 222 -393 -319 215 -429 -543 27 -445 -326 271 -35 -18 107 -155 -523 282
2887 282 106 -256 599 -412 -402 197 -267 148 180 -170 -497 403 -309 -1 337 -225 303 818 284 607
2907 607 575 373 662 823 542 629 260 -328 377 -36 -208 491 180 -606 -82 -164 -241 82 -215 -822 80
2928 80 -333 -557 -415 -187 -906 127 160 -791 801 422 -228 -29 -18 109 452 -55 64 387 316 -153 169
2949 169 -351 -509 290 -214 -197 -27 -591 228 669 165 220 210 -580 391 625 -47 233 324 263 -195 -102 -204
2971 -204 -348 220 -118 97 163 -582 310 -53 -858 -268 361 -726 440 -189 14 446 321 106 835 485
2991 485 -458 243 -32 -227 581 -294 -337 127 -958 -726 407 -394 -384 -114 -651 -488 307 -701 -223 154
3011 154 -439 336 -46 -35 271 8 -503 -434 215 210 -33 369 -562 112 -719 -697 62 -26 -536 169 9 -180
$$ packed form
2866G64o23o93R94r7n30M07o15P4N34o44j14N70m72J19N97l06J7J25k62l68Q05
2887B82j76l62Q55j011J0N99m64M15L2l50l27R00p12L08L38n62N28N15n34L23
2907F07l2k02K89J61k81Q7l69n88P05m13j72O99l11p86N24q2p7L23k97o07R02
2928H0m13k24J42K28p19J033L3r51J592l79o50J99J1J27L43n07J19L23p1m69L22
2949A69n20j58P99n04J7J70n64Q19M41n04N5j0p90R71K34o72K80R1o1m58R3j02
2971b04j44N68l38K15O6p45Q92l63q05N90O29j087J166o29K03M32j25k15P29l50
2991D85r43P01k75j95Q08q75m3M64j085K32J133q01J0K70n37J63P95j008M78L77
3011A54n93P75l82J1L06k63n11O9O49nk43M02r31O74q31K2P59q8n10P05j60j89
$$ plain form
3033 -180 318 -113 -308 43 230 265 111 221 29 399 14 498 465 24 -125 135 -926 -51 -327 -181
3053 -181 -294 402 -37 193 509 -651 160 122 -71 286 191 -365 90 267 -260 -408 155 -96 -670 -51
3073 -51 -663 335 -52 -346 -5 -519 -1013 237 -80 -239 -8 -214 -289 105 249 -226 246 -378 -152 247
3093 247 245 54 1044 -141 346 243 -116 303 576 86 -180 124 -369 480 302 -62 332 340 60 15 363
3114 363 -211 -359 153 -478 -446 -43 -606 -141 -345 -776 -169 -620 -725 -327 202 -710 379 -258 -302 261
3134 261 -233 211 386 33 -111 617 227 313 795 255 -188 241 -94 -308 -238 76 111 286 -97 252 630
3155 630 -33 -6 -27 -71 510 634 -14 -8 1059 -448 75 541 -358 185 308 -459 134 260 -298 304 91
3176 91 -500 261 55 -438 106 138 -206 385 469 -248 291 -75 -387 271 424 -127 7 -592 90 -91 -590
$$ packed form
3033a80M98m31j95L51J87L5j54J10j92L70l85M84l3m41j49K60j061Q75k76J46
3053a81j13O96m39K30L16j160Q11l8j93L57r5n56M55J77n27j48N63k51n74O19
3073e1o12R98l87k94L41n14m94J250l17j59K31k06p5L94J44m75M72o24K26L99
3093B47kj91R90j185M87j03l59M19K73m90k66L04m93Q49j78l64L94Qk80m5L48
3114C63n74j48N12o31L2M03n63M65k04m31O07m51j05L98N29r12J089o37m4N63
3134B61m94M44J75l53j44P28l90Q6M82n40m43M29l35k14P0L14L5J75l83L49L78
3155F30o63K7k1m4N81J24o48OJ067j507N23M66q99N43J23p67N93J26n58O02k13
3176I1n91P61k06m93N44L2l44N91Q4p17N39l66l12O58J53n51J34n99O82j81m99
$$ plain form
3197 -590 -131 -167 -405 -35 258 -306 -660 674 -485 -229 394 -382 -80 261 -384 444 465 -617 96 470
3217 470 -326 194 93 -78 637 301 -247 30 -46 76 -76 -262 -559 128 -261 -365 197 -33 -162 422
3237 422 -152 -59 518 -133 208 746 -353 -172 551 -133 -90 541 142 15 380 -272 -126 160 -569 -500 266
3258 266 -633 -370 747 -494 -355 285 -337 28 -15 -431 169 49 -745 228 6 -696 -403 25 -590 -348
3278 -348 64 -79 64 240 61 42 457 -144 576 -32 379 868 56 -318 328 -255 62 512 89 -202
3298 -202 362 -24 -211 -627 -613 92 279 163 -76 -171 -575 -6 115 -200 -129 424 -229 -49 581 -453 -205
3319 -205 -69 -461 -7 464 -585 9 -84 -302 204 29 291 -132 182 -210 371 37 -86 760 682 121
3339 121 289 -8 -15 833 -8 474 -222 -264 -213 120 -784 -193 34 -44 -305 440 121 875 348 -23 19 784
$$ packed form
3197e90M59l6k38L70K93n64l54J334j159K56O23p76L02L41o45Q28K1j082P13L74
3217D70p96N20j01j71P15l36n48K77p6J22j52j86k97O87l89j04N62k30j29N84
3237D22n74R3N77o51L41N38j099J81P23o84M3O31l99j27L65o52J46K86p29O9P66
3258B66q99K63J117j241J39O40o22L65m3m16O00j20p94R73k22p02K93M28o15K42
3278c48M12j43J43J76j79j9M15o01P20o08M11M89q12l74O46n83L17M50m23k91
3298b02N64l86j87m16J4P05J87j16k39r5m04N69J21l15P1N53o53J80O30j034K48
3319b05J36l92M54M71j049N94r3k18N06j75K62m23L14l92N81l34j23Q46p8n61
3339A21J68k97pQ48q41M82o96m2N1L33r04N91K27p8k61P45l19P54n27l71M2P65
$$ plain form
3361 784 57 211 216 20 725 352 -710 415 487 -771 -216 -381 -697 282 -68 -1 -485 -249 -434 -604
3381 -604 -183 -315 14 -467 -304 -550 62 -821 187 -179 -303 -108 -102 -811 811 -284 -470 302 -532 24
3401 24 447 -335 235 460 -47 423 182 232 -48 331 -281 663 11 -330 409 499 23 -47 242 -213 137
3422 137 -179 -340 153 -428 -468 59 12 -461 211 -101 58 379 283 -767 872 233 405 456 -185 364 579
3443 579 -61 -188 63 -216 -109 46 -469 399 149 -251 -245 -287 -333 273 -245 -46 367 608 -37 160 156 53
3465 53 -313 173 -551 -153 -238 40 269 353 -63 181 69 -511 187 -6 -141 184 -131 -478 647 284 -9
3486 -9 721 237 -164 370 261 184 414 -74 -12 -24 43 -468 -43 -341 184 352 -603 -46 -288 -133 -239 386
3508 386 -24 29 230 -233 11 -187 -126 -49 72 -492 -183 193 -35 179 780 -333 -115 49 -630 168 434
$$ packed form
3361G84p27J54Nj96P05l73j062J125P2j258N55j65l16R79l50O7m84K36j85j70
3381f04M21j32L29m81J63k46O12q83J008l66j24J95Op09J622j095j86P72q34N56
3401B4M23p82N70K25n07M70k41N0k80L79o12R44o52l41P39R0m76p0K89m55L50
3422A37l16j61M93n81m0N27m7m73O72l12J59L21r6j050J639o39J72N1o41N49K15
3443E79o40j27K51k79J07J55n15Q68k50m00Om2m6O06n18J99M13K41o45J97mj03
3465E3l66M86p24L98q5K78K29Q4m16K44j12n80O98j93j35L25l15l47J125l63k93
3486iP30m84m01N34j09p7K30m88O2j2O7n11M25k98N25J68r55N57k42J55j06O25
3508C86m10N3K01m63K44j98O1P7J21n64L09L76k28K14O01j113K18J64o79P98K66
$$ plain form
3529 434 -258 427 -108 -201 597 223 -53 394 32 60 247 -255 -101 357 -424 -132 -70 -157 -72 581 -473
3550 -473 -595 127 61 -30 -212 -33 -51 552 53 414 253 -230 -192 709 -69 1 377 -985 -656 -544 -285
3571 -285 34 -231 -436 -286 -210 -737 -54 -382 -445 642 161 -106 218 -91 -395 985 -89 -220 380 -104
3591 -104 -223 779 -27 -361 435 -136 76 -164 141 183 509 43 151 731 -492 -146 497 -246 80 483
3611 483 135 298 240 274 -250 363 -338 529 202 -376 116 202 -834 36 274 -556 421 -352 -440 601 148
3632 148 -92 692 195 -81 700 45 -18 94 -93 160 576 -161 96 32 -810 -233 181 -490 -527 298 -659
3653 -659 -518 49 26 244 -49 -309 341 488 -116 -219 4 111 44 29 -694 -243 170 59 367 65 -459
3674 -459 35 512 -438 501 -119 -425 289 208 229 556 200 207 542 66 -328 278 -38 -631 125 -421 -898
$$ packed form
3529D34o92O85n35r3P98l74k76M47l62K8J87n02J54M58p81K92O2q7Q5O53j054
3550d73j22P22o6r1j82J79j8O03m99L61j61m83L8R01p78P0L76j362L29J12K59
3571b85L19k65k05J50P6n27O83l28o3J087m81k67L24l09l04J380j074j31O00m84
3591a04j19J002q06l34P96n71K12k40L05M2L26m66J08N80j223L46O43p43L26M03
3611D83l48J63n8L4n24O13p01Q67l27n78M92Q6j036Q70K38q30R77p73q8J041m53
3632A48k40P84m97k76P81o55o3J12j87K53M16p37K57o4q42N77M14o71l7Q25r57
3653f59J41N67k3K18k93k60O50J47o04j03K23J07o7j5p23M51M13j11L08l02n24
3674d59M94M77r50R39o20l06P14q1K1L27l56PL35m76l94O06l16n93P56n46m77
$$ plain form
3695 -898 21 -26 -165 80 -205 -444 -292 -85 -186 520 -188 402 284 -96 -221 438 -95 642 742 -298
3715 -298 539 600 -308 -343 -100 -305 299 -265 -684 615 218 -297 120 -117 -367 164 34 -198 623 327
3735 327 -290 632 92 192 409 655 227 -7 -33 -284 572 -394 56 760 -49 -472 596 -89 -270 529
3755 529 65 712 174 95 25 -95 -287 127 270 -388 -411 -370 -330 -551 -349 -630 -382 298 116 -306 5 -213
3777 -213 -20 -328 -424 391 697 -151 650 -473 175 398 -29 -154 11 -388 105 304 175 -98 302 313
3797 313 -309 -377 -293 -110 510 -520 -171 143 170 -40 828 -8 258 363 -170 521 -26 -375 -246 250 -405
3818 -405 202 122 -243 -114 204 -272 -2 -116 -432 -23 152 -283 609 319 274 583 88 -113 388 228 -158
3839 -158 206 424 38 -246 -281 -325 565 -671 -296 364 -52 33 677 -203 -406 532 245 245 568 -128 -17
$$ packed form
3695h98R19m7j39K45k85k39J52K07j01P06p08N90j18l80j25O59n33P37J00j040
3715b98Q37O1r08l5K43k05O04n64m19J299l97n15M17k37k50N31j30k32Q21k96
3735C27o17R22n40J00K17K46m28k34k6k51Q56r66M50P04q09m23J068o85j81P99
3755E29m64O47n38p9p0j20j92M14J43o58k3M1M0k21K02k81K48O80j82m22L11k18
3777b13J93l08r6Q15L06q48Q01j123O48K23m27j25J65l99M93J99j29k73M00J1
3797C13o22o8Q4J83O20j030L49L14K7k10Q68q36K66J05n33O91n47l49J29M96o55
3818d05O07q0l65J29L18m76K70j14l16M09J75m35Q92k90m5L09m95k01N01j60l86
3839a58L64K18l86k84l5m4Q90j236L75O60m16Q5O44q80k03R38k87%L23o96J11
$$ plain form
3860 -17 -87 58 278 98 -95 178 194 -262 297 37 -723 301 77 -422 394 69 -639 -115 -119 -246 -7
3881 -7 113 -484 133 -302 108 190 77 -116 0 -131 -76 484 -238 -218 7 -165 -132 311 -354 2 354 -348
3903 -348 162 587 -348 36 385 21 -442 345 -201 676 538 -313 192 199 94 -171 -181 -465 159 73 -311
3924 -311 229 -38 -155 306 -4 -349 435 -108 -218 717 330 -436 382 491 -428 456 199 143 787 -21
3944 -21 -255 369 -45 -464 593 -293 -414 87 -554 -96 -299 -306 -3 751 -362 -181 -108 -222 451 430 -674
3965 -674 -320 -93 -352 337 232 -1132 377 205 -439 167 161 -851 205 572 -140 615 258 -300 313
3984 313 -349 256 -333 -267 -181 321 -159 524 500 448 7 -273 -83 -131 297 -382 -7 348 17 -332 330 -363
4006 -363 107 505 -342 -51 1018 -97 295 599 -705 -72 -95 -334 411 129 -559 -30 -156 -529 28
$$ packed form
3860a7p0J45K20j80j93K73J6m56N59k60p60J024k24m99Q16l25p08N24mj27K39
3881gJ20n97O17m35M10Q2j13j93J16j31N5N60p22K0K25j72L3M43o65L56L52p02
3903c48N10M25r35L84L49l64m63P87n46Q77j38q51N05Pj05k65j0k84O24q6l84
3924c11N40k67j17M61l10l45P84n43j10R35l87p66Q18J09r19Q84k57n6O44q08
3944b1k34O24m14m19J057q86j21N01o41M58k03pL03P54j113J81P3j14O73k1j104
3965f74L54K27k59O89j05j364J509j72o44O06oj012J056L67p12P55l57n58O13
3984C13o62O05n89O6Q6N02m80O83k4n2m41k80J90m8M28o79L75L55l31l49O62o93
4006c63M70L98q47K91J069j115L92L04j304O33k3k39P45k82o88N29j26l73N57
$$ plain form
4025 28 -61 -550 -89 152 -590 475 451 -161 108 83 -360 427 58 -373 538 -240 -565 580 32 -47 51
4046 51 -17 25 465 -272 -164 51 -120 -38 -263 442 79 230 -386 104 235 -582 264 -72 -60 -211 -35 -399
4068 -399 -63 -375 -471 -93 -457 -706 -68 -422 -364 -156 18 -299 411 -199 122 -175 44 473 480 146 24
4089 24 792 246 -56 655 211 129 488 -195 -234 395 -150 70 494 -439 -283 780 69 -27 62 -185 -133 109
4111 109 -492 -169 -315 -683 302 318 -204 375 -100 -335 354 91 -9 234 14 -395 -228 58 -31 383 246
4132 246 -641 -34 194 45 702 -428 -228 309 93 -39 235 -144 -304 62 -605 -142 -91 16 38 390
4152 390 -600 -477 462 -634 276 31 525 177 770 423 412 374 -360 13 379 -599 -475 325 -244 -270 349
4173 349 -1 -60 522 -137 448 -343 227 415 1 -430 772 63 -189 -57 -177 -518 324 25 148 -345
$$ packed form
4025B8q9m89M61K41p42J065k4o12K69k5m43P87l69m31R11p78l25J145n48p9R8
4046E1o8M2M40p37J08K15j71Q2k25P05l63J51o16M90J31q17Q46l36J2j51J76l64
4068c99L36l12r6L78l64k49O38l54N8K08J74l17P10o10L21k97K19M29Pl34j22
4089B4P68n46l02P11m44q2L59o83l9O29n45K20M24r33J56J063p11r6Q9k47N2K42
4111A09o01L23j46l68R85J6n22N79m75k35O89k63j00K43k20m09J67K86q9M14j37
4132B46q87O07K28j49O57j130K00N37k16j32K74l79j60L66o67M63N1J07K2L52
4152C90r90J23R39j096R10k45M94l48N93l47j1l8p34L73L66r78J24Q00n69k6O19
4173C49l50n9N82o59N85p91N70J88m14m31J202p09k52J32j20l41Q42k99J23m93
$$ plain form
4193 -345 -147 32 -259 -382 -469 546 -349 271 372 -640 122 159 -373 242 580 -72 357 360 171 265 35
4214 35 190 507 -282 -914 -168 190 -574 -556 -227 -311 183 160 -109 209 217 -66 30 -187 -43 365 299 49 554
4237 554 295 100 260 235 -19 415 -48 -155 434 -373 -412 343 -370 99 -9 -701 -63 301 -453 -479 -5
4258 -5 -211 -84 -305 -460 -460 -182 -375 -98 -78 -325 -83 -149 -261 -84 -105 -517 351 64 -234 849 -161 -443
4280 -443 171 135 446 692 -310 -241 276 550 823 416 182 -34 3 -184 162 591 -304 -322 333 -919 -98
4301 -98 462 -545 219 254 -191 -55 726 52 -225 153 -687 268 361 -543 -102 -132 -585 -32 -86 -435 88
4322 88 652 -730 270 167 -526 11 225 -26 501 273 -312 573 271 116 205 -62 -583 164 -137 -502
4342 -502 274 -112 -605 168 -287 -308 96 -227 -85 460 -22 178 350 -642 -551 404 -588 -107 627 -465
$$ packed form
4193c45J98J79k91j23q7J015q95O20J01j012P62L7n32O15L38o52M29Lj89R4k30
4214C5J55L17p89o32P46L58p64J8L29q4M94k3k69L18Qk83R6k17J44M08o6k50N05
4237E54k59j95J60k5k54M34m63j07N89q07l9P55p13M69j08o92O38L64p54k6M74
4258ek06J27k21j55%K78j93K77K0k47K42o6j12J77k1m12Q68k87k98J083j010k82
4280d43O14l6L11K46j002O9N17K74K73m07k34k16L7j87L46M29q95j8O55j252Q21
4301i8N60j007P64L5m45J36P81o74k77L78q40R55R3r04M41l0m53N53n4l49N23
4322H8N64j382J000j03o93N37K14k51N27k28n85Q85l02j55Q9k67n21P47l01l65
4342e02P76l86m93P73m55k1M04l23J42N45m82K00J72r92R1R55r92M81P34j092
$$ plain form
4362 -465 279 294 -147 109 255 -275 -69 304 -540 145 36 -278 -6 -380 -720 284 -140 -543 679 -36
4382 -36 -17 364 241 -586 185 -103 -298 559 -267 16 370 319 93 -58 -161 -88 448 -605 -104 665 -215
4403 -215 399 160 -682 266 661 -264 -99 -26 -411 -188 396 -406 69 523 -354 38 -546 -639 78 175 -78
4424 -78 -172 -60 5 373 -194 418 384 413 -225 702 185 -456 363 585 -205 305 -185 -606 226 -354 -511 327
4446 327 -428 -216 480 -419 93 66 110 156 408 -509 4 -120 -391 -327 62 -640 -146 317 -134 108 95 -635
4468 -635 298 51 -641 83 79 -266 410 330 -239 -184 328 -669 26 -261 102 357 435 123 350 280 -224 555
4490 555 300 80 62 -421 -384 -51 42 -330 78 -202 -120 427 -368 -220 806 142 44 108 -556 280 298 23
4512 23 -79 225 -582 121 -104 -422 187 -470 -752 19 -293 -413 148 -9 -158 -147 104 -775 50 -224 273
$$ packed form
4362d65P44J5m41K56J46n30K06L73q44O85j09l14K72l74l40J004m24m03J222p15
4382c6J9L81j23q27P71k88j95Q57q26K83L54n1k26j51j03P3N36j053N01P69q80
4403b15O14k39q42R48L95r25J65P3l85K23N84q02M75M54q77L92n84r3P17R7k53
4424g8r4J12O5L68n67O12l4K9o38R27n17o41Q19K22p90N10m90m21Q32n80j57Q38
4446C27p55K12O96q99N12k7M4M6K52r17N13j24k71O4L89p02M94M63m51K42j3p30
4468f35R33k47o92P24ml45O76q0n69N5N12r97O95k87L63K55P8l12K27p0n04P79
4490E55k55k20j8m83L7L33R3l72M08k80Q2N47p95J48J026o64r8O4o64Q36J8k75
4512B3j02L04q07P03k25l18O09o57k82P71l12j20N61j57j49J1K51q79Q25k74M97
$$ plain form
4533 273 295 314 -475 272 262 -205 137 -68 73 594 16 215 -126 -426 -21 475 -11 -254 176 10 19 207
4555 207 270 -14 224 -509 8 263 -241 -175 368 -264 -163 -253 -401 154 -108 -542 223 -32 -254 512 -38
4576 -38 -657 3 424 -116 236 167 33 580 524 311 293 161 113 24 285 -548 34 -233 -18 292 -369 -404
4598 -404 192 206 -549 286 -445 -23 492 -72 69 -286 -103 504 48 -193 -167 172 6 451 668 -164 -129
4619 -129 147 -244 104 3 -55 397 -54 -454 172 244 -544 409 268 -346 224 -257 -77 21 31 -178 -106 -343
4641 -343 131 -5 -420 -805 225 -488 29 116 -273 -74 -34 -249 -304 92 -585 578 218 -472 72 546
4661 546 -309 -111 281 -486 209 236 -189 -127 83 -152 4 467 -171 257 -207 -248 605 -78 -394 314 223
4682 223 -696 381 213 -544 255 -392 -17 121 -473 -160 591 205 -139 323 -239 179 157 -306 260 547
$$ packed form
4533B73K2J9p89P47j0m67L42k05J41N21n78J99l41l00M05M96m86k43M30j66RJ88
4555B07O3k84K38p33N17K55n04O6N43o32J01r0j48N55k62m34P65k55k22P66n50
4576c8o19O60M21n40L52o9j34N47n6k13j8j32m8q9K61q33N82k67K15L10o61l5
4598d04N96J4p55Q35p31M22N15n64J41l55J83O07m56k41K6L39j66M45K17q32L5
4619a29K76l91L48j01n8M52m51m00O26P2p88R53j41o14N70m81J80R8J0k09P2k37
4641c43M74j36m15l85J030p13N17Q7l89J99M0k15n5L96o77J163l60o90N44M74
4661E46q55J98L92p67O95K7m25O2K10k35J56M63o38M28m64m1Q53o83l16P08r1
4682B23r19J077j68p57P99o47L75J38n94L13P51l86l44M62n62M18k2m63N66K87
$$ plain form
4702 547 189 457 928 85 306 300 -353 -10 90 -237 442 -121 -645 -76 156 -492 309 53 -604 21 21
4723 21 -81 -307 10 -310 514 225 -192 -13 37 -149 251 469 38 697 1 45 494 103 -116 226 -161
4744 -161 115 732 -473 177 -138 -366 56 173 17 -247 310 -521 -358 454 155 -31 491 -161 321 -89
4764 -89 -27 46 -28 -296 -159 279 -606 78 178 -731 77 -234 -225 -46 89 -121 129 198 -323 493 -238 -445
4786 -445 188 -328 -174 -129 44 -368 332 61 199 579 -16 -165 -281 64 -71 518 28 -34 175 -117 216
4807 216 353 -418 -29 -279 -305 122 -16 -547 -326 -132 177 112 43 -254 60 276 -276 434 93 -539 450
4828 450 411 -435 361 92 -199 -38 -138 -410 426 159 -324 501 67 -492 278 -225 344 43 -464 -35
4848 -35 361 -13 122 286 -465 93 492 402 329 769 -38 -170 148 -110 149 168 -416 512 153 -448 353
$$ packed form
4702E47l58K68M71q43K21oo53L43J00l27O79n63n24N69K32o48Q01k56o57O25%
4723B1j02k26L17l20Q24k89m17J79N0j86M00K18m31O59o96M4M49l91k19L42l87
4744a61K76O17j205O50l15k28M22J17j56k64N57q31J63Q12k99j86N22o52M82m10
4764h9O2P3p4k68J37M38q85O84J00r09Q08l11RJ79J35k10K50O9n21Q16p31k07
4786d45O33n16J54M5J73m12P00k71J38L80n95j49j16L45j35N89m90o2K09k92L33
4807B16J37p71L89k50k6M27j38n31K21J94L09o5o9k97L14K16n52P10l41o32R89
4828D50l9q46P96k69k91J61j00k72Q36k67m83Q25m34n59P70n03N69l01n07M29
4848c5L96l74J35J64p51N58L99r0p3M40q07j32L18k58K59J9n84R28l59o01Q01
$$ plain form
4869 353 158 -329 -418 -262 -10 367 180 -108 -144 -411 -11 193 -230 -299 323 325 -377 631 149 21 5 -242
4891 -242 15 746 7 -370 -244 -491 83 222 114 -74 183 -475 95 420 -809 226 466 -703 -73
4910 -73 469 -99 -218 -248 -44 -144 -89 -739 363 138 193 373 269 -164 161 -136 -367 737 32 -199 273
4931 273 -160 137 754 -14 -222 871 -327 -246 395 -651 1 197 -167 -169 562 -612 -193 426 -379 -58
4951 -58 -16 -186 290 130 -461 252 662 -73 248 506 138 171 -125 -581 74 -8 -253 259 83 -723 -73
4972 -73 339 -258 474 90 -35 -241 43 45 407 93 180 336 39 -328 15 -226 -447 742 -262 92 461
4993 461 -251 -132 105 72 -361 258 258 34 401 -282 -116 834 -74 107 32 -361 -372 189 -632 106 -97 -616
5015 -616 167 112 -480 -164 118 -823 161 -50 47 234 227 -280 134 -270 -410 47 168 -64 257 -378 -395 114
$$ packed form
4869C53j95m87q9J56K52L77j87k88l6k67M00K04m23o9O22Kp02J008m82j28j6k47
4891b42K57P31p39l77J26k47N74J39j08j88K57o58N70L25j229J035K40j169O30
4910g3N42n68j19l0K04j00N5o50J102k25N5J80j04m33L25k97k31J104p05k31M72
4931B73m33K97O17p68k08J093j198Q1O41j046O52J96l64kP31j174M19O19q05L21
4951e8M2j70M76j60n91P13M10p35L21K58l68L3k96m56O55q2k45N12j76q06O50
4972g3M12n97P32l84j25k06K84KL62l14Q7J56k97l67L43k41k21J189j004L54L69
4993D61p12J19K37l3m33O19%k24L67o83J66R50r08J81p5l93j1N61q21P38k03n19
5015f16P83n5n92L16K82r41R84k11R7J87pn07M14m04j40M57J21k32L21o35j7N09
$$ plain form
5037 114 182 -323 313 97 -20 288 -149 -326 292 -273 170 273 -308 -56 817 -129 -45 568 -396 -3 497
5058 497 -143 222 581 -88 98 -375 -529 243 263 -389 503 46 -625 455 355 -2 -153 78 -132 505
5078 505 -13 165 -69 394 238 535 355 -171 94 -195 -325 42 19 -239 80 -582 -11 291 50 -445
5098 -445 74 -574 -75 -118 87 -105 313 -402 -69 916 -528 -161 590 -247 219 503 0 210 283 66
5118 66 -285 581 -208 -240 542 -428 330 121 105 56 157 -258 -182 -47 -886 53 -356 -193 441 -62 -525 120
5140 120 -197 -61 319 -264 -350 354 -662 -529 298 87 -2 544 -245 -83 654 48 243 813 -473 -89
5160 -89 354 -112 460 169 -170 251 -47 -71 96 632 -370 -263 -79 -189 576 92 -230 505 109 79 403
5181 403 269 -148 283 -616 89 720 76 -462 76 -30 -69 456 69 -53 272 -297 60 -131 -524 -51
$$ packed form
5037A14O8n05O36k16j17L08m37j77O18n65M43J03n81K52Q73r46Q4O13r64L93N00
5058D97o40L65L59o69J86m73j54P72K0o52Q92m57o71J080j00l57j51K31k10O37
5078E05n18J78k34M63j56K97j80n26K65k89j30L67k3k58L19o62N71L02k41m95
5098d45N19o48M99m3K05j92M18p15L33R85j444L67P51q37M66K84n03K10P3k17
5118F6l51Q66p89l2P82r70P58k09j6m9J01m15P6J35q39R39m09J63O34n03m63O45
5140A20l17J36L80n83q6P04j016J33Q27k11q9N46p89J62P37o06J95N70j286L84
5160h9M43m66N72k91l39M21k98k4J67N36j002J07J84j10P65m84l22P35l96l0L24
5181D03j34m17M31q99P05O31o44n38N38j06l9N25l87j22L25n69L57j91l93M73
$$ plain form
5201 -51 346 -193 -384 213 -153 -287 84 -102 -212 95 -286 -287 74 -355 -38 166 -752 358 404 -452 -164
5222 -164 618 -236 425 376 -327 338 327 -185 493 286 -373 611 -13 -204 214 -258 -187 327 -432 -523 417
5243 417 200 -200 467 -455 -230 537 -6 -355 714 -4 153 418 -501 428 -548 -252 403 277 -318 160
5263 160 519 -77 -316 -128 1 145 -157 203 658 262 -499 271 272 -241 107 198 114 267 -241 22 337
5284 337 -323 -190 727 284 -119 483 -380 96 266 41 -78 639 -125 -325 171 136 61 391 163 80 357
5305 357 -203 322 701 21 70 544 191 231 -25 -374 -78 -259 100 93 -274 -115 -45 195 -349 728 302
5326 302 -455 5 -54 -379 413 195 -295 276 534 -94 97 -20 -637 59 -220 -151 21 -144 -554 -218 -193
5347 -193 -12 410 -387 -126 -236 -11 -17 401 -447 478 733 96 213 146 -577 -36 511 -229 510 -111 -548
$$ packed form
5201e1L97n39j91N97l66j34L71j86j10L07l81jL61m29L17K04r18J110M6q56K88
5222a64P82q54O61m9p03O65j1n12O78k07o59R84o24j91M18m72P1N14p59r1R40
5243D17k17m00O67r22K25P67n43l49J069p18J57K65r19R29r76K96O55j26n95M78
5263A60L59n96k39J88J29J44l02L60M55l96p61P70Jn13L48R1q4J53n08K63L15
5284C37o60J33R17m43m03O02q63M76J70k25j19P17p64k00M96l5p5L30k28q3K77
5305C57n60N25L79o80M9M74l53M0k56l49K96j81L59pl67J59P0K40n44J077m26
5326C02p57M60n9l25P92k18m90N71K58o28J91j17o17O96k79O9J72j65m10L36K5
5347a93J81M22p97K61j10K25oM18q48R25K55o37J17o7p23N41N47p40P39o21m37
$$ plain form
5368 -548 77 236 -1 -51 148 145 -65 -94 -329 296 399 -246 613 534 -17 625 411 -144 87 -116 -292 543
5390 543 -149 -245 -132 -273 -951 160 -130 123 584 -683 -298 107 -474 -605 347 -80 -172 345 -283 -324
5410 -324 450 -401 -53 -391 -170 355 0 319 28 489 -85 -492 404 240 347 -49 -51 309 342 -17 441
5431 441 610 -447 707 -108 51 -79 -526 -576 760 -204 -939 471 -474 -198 203 -456 188 382 145
5450 145 -200 322 320 -25 148 33 15 310 -263 55 488 -493 36 778 -11 7 -68 -575 128 -155 -276 197
5472 197 -17 29 243 36 -246 372 199 -269 165 24 -708 225 186 -390 284 130 -431 332 -145 -90 255
5493 255 -317 -66 743 -208 310 112 90 43 119 39 114 461 -587 232 338 -264 -188 -48 -588 141 74 320
5515 320 122 32 -217 -177 -1 -135 247 502 -515 -489 -139 -542 10 261 -289 302 306 -196 271 -146 66
$$ packed form
5368e48O25J59k37n0J99lk10k9k35O25J03o45Q59p9n51O42k14n55K31k03j76Q35
5390E43o92r6J13j41o78J111k90K53M61j267L85M05n81j31R52m27r2N17o28m1
5410c24P74q51L48l38K21N25l55L19k91M61n74m07Q96j64J07l96kL60L3l59M58
5431D41J69j057J154q15J59j30m47n0J336r64p35J410r45K76M01o59O44J94k37
5450A45l45N22kl45J73j15j8K95n73L18M33r81N29P42p89J8p5n07P03k83j21M73
5472A97k14M6K14k07k82O18j73m68M34j41p32R33l9n76O74j54n61P63m77N5L45
5493B55n72K51Q09r51N18j98k2m7P6q0P5L47j048Q19J06o02P6J40n40P29o7K46
5515C20j98r0k49M0J76j34L82K55j017K6L50m03N52K51n50N91Mn02M67m17K12
$$ plain form
5536 66 43 -153 -143 -295 19 -56 -1 117 -196 562 -255 -628 192 -295 -41 405 -209 -162 109 -452 -48 139
5558 139 -56 -433 787 -576 -604 260 -151 273 305 -455 430 496 31 -3 133 134 1033 377 -9 455 -55
5579 -55 65 498 -141 -461 304 54 -777 132 -304 -562 38 199 -92 -26 -115 -264 177 -316 -239 121 -221
5600 -221 181 123 -163 0 230 -426 -297 634 -335 150 784 -504 128 582 -194 235 -43 -392 756 528
5620 528 -181 201 -15 -83 159 196 -235 266 -55 71 648 -338 -331 426 46 -285 314 -136 -667 670 -190
5641 -190 -447 145 -429 -264 582 -69 514 421 -350 46 281 127 -7 -147 -331 118 483 -611 76 226
5661 226 -294 67 30 -244 661 128 -705 455 216 -161 506 112 -337 372 345 350 -45 63 -281 279 237
5682 237 -551 536 -240 -438 434 -65 155 96 -301 35 253 18 -616 -138 -51 -633 196 -151 -16 314
$$ packed form
5536F6k3j96J0j52L14p5N5J18l13P58q17l73Q20m87K54M46o14M7K71n61M04J87
5558A39j95l77J220j363k8Q64m11M24L2p60Q85O6m65l4J36JQ99o56l86M64n10
5579e5J20M33o39l20P65k50q31R09m36k58O00J61k91O6q9j49M41m93P7L60l42
5600b21M02n8k86J63K30o56J29R31r69M85O34j288O32M54p76M29k78l49J148k28
5620E28p09L82k16o8K42L7m31N01l21J26N77r86PP57l80l31N99m50n31J337q60
5641a90k57N92n74J65Q46o51N83r3p71L96K35j54j34j40j84M49L65j094O87J50
5661B26n20L61l7k74R05n33q33J160k39l77O67l94m49P09k7Nl95J08l44N60m2
5682B37p88J087p76j98Q72m99K20n9l97L36K18k35o34M78Q7n82Q29l47J35L30
$$ plain form
5702 314 97 -109 555 25 -32 282 -512 -289 30 24 42 96 -242 -471 -70 -161 386 -236 -136 236 472 -168
5724 -168 -334 342 -396 540 -162 -517 200 -218 -357 90 416 -104 379 65 300 585 -132 -817 192 136
5744 136 -16 904 219 -367 607 282 -114 483 -121 -141 422 -127 -69 -44 265 215 299 12 496 407 -394 158
5766 158 217 -397 153 -88 -391 81 294 -271 442 -93 -676 574 -96 -44 -71 -309 -626 67 75 -554 -75
5787 -75 -275 -143 495 -295 -224 171 19 -724 -36 -5 -315 436 -169 79 495 22 -246 744 -400 -7 422
5808 422 -182 56 20 -315 30 332 -534 -91 343 -202 432 -228 -193 160 111 -240 172 11 -244 451 50
5829 50 -548 11 -7 35 158 5 0 333 -109 -409 -8 -173 -43 266 362 -61 216 -8 21 685 -293 -156
5851 -156 809 85 -62 -83 -831 285 269 -814 42 229 -563 -258 148 -42 139 63 -458 -167 249 -21
$$ packed form
5702C14k17k06O64n30n7L14p94K23L19oJ8N4l38k29M01r1N47o22J00L72K36o40
5724a68j66O76p38R36p02l55P17m18j39M47L26n20M83l14K35K85p17o85J009n6
5744A36j52R20o85n86R74l25l96N97o04k0N63n49N8K5L09n0Q4k87M84q9q01N52
5766A58N9o14N50k41l03M72K13n65P13n35n83J250o70N2k7k38l17O93Qo29M79
5787g5k00J32O38p90P1L95j52p43O88L1l10P51o05K48M16m73k68R90j144L93M29
5808D22o04K38l6l35L45L02q66M43M34n45O34o60L5L53m9l51M12j61k55O95m01
5829E0n98N59j8M2J23j53nL33m42l00M01j65J30L09R6m23K77k24K9O64r78J37
5851a56R65p24j47k1p48J116j6j083Q56J87p92L05M06j90J81p6n21K91M16k70
$$ plain form
5871 -21 62 107 -319 359 -263 -56 90 -47 -327 240 310 -265 1052 -362 209 211 -222 -436 46 31 -354 375
5893 375 -192 -363 -409 -11 -230 18 -750 -460 76 -303 91 130 -239 381 154 -541 403 570 -188 46 421
5914 421 -787 667 -127 -308 -90 -45 -547 672 -54 -40 75 276 -117 498 174 -72 -9 -279 -278 137 -224
5935 -224 -379 73 -401 -381 270 -249 -23 773 -110 -377 -94 25 -309 695 -333 -333 203 17 -487 88
5955 88 -148 -8 48 -694 -659 -292 -504 -467 227 -766 11 355 -275 -208 198 -14 -131 41 -585 3 -148 -578
5977 -578 241 489 -252 546 95 -585 289 -4 -293 215 -383 -181 53 -548 -234 189 -511 -39 788 -341
5997 -341 -447 900 -47 54 347 -91 119 305 34 9 371 -423 65 37 -604 16 -66 -223 328 73 -158
6018 -158 -34 256 -415 -239 718 -549 141 24 -631 496 527 -95 -14 -173 -184 280 -297 150 185 -116 149
$$ packed form
5871b1Q3M5m26O78o22K07J46j37k80N67P0n75J317j414N71Km33k14M82j5l85P29
5893C75n67j71m6L98k19K48p68K90N36l79L94L9l69O20k27o95R44J67p58K34L75
5914D21j208J454p94j81K18M5n02J219p26J4J15K01l93O15l24k46O3k70JM15l61
5935b24j55M52m74K0O51n19K26P96q83k67K83J19l34J004j028%N36j86n04N75
5955H8k36J40N6p42L5L67k12L7O94r93P77L44o30O7M06k12j17J72o26N88j51m30
5977e78Q19K48p41P98m51o80Q74k93k89N08n98K02K34o01L14M23p00M72Q27j129
5997c41j06J347r47J01K93m38K10J86k71k5L62p94M88k8o41O20q2j57N51k55k31
6018a58J24K90o71J76R57j267O90j17o55J127L1o22Q1j59j1M64n77M47L5l01K65
$$ plain form
6039 149 125 -53 -117 14 -157 -511 82 -185 -101 324 -107 -346 71 -311 299 8 -75 -88 -122 -407 -180 574
6061 574 -207 5 331 -538 -12 44 112 -361 -133 -194 77 425 4 234 372 -740 84 215 -479 206 28
6082 28 -272 662 67 -315 104 -422 27 295 -418 -136 -57 -444 -336 255 -50 417 153 -458 123 269 -423
6103 -423 462 688 -841 411 208 -63 251 476 -412 -258 -322 -392 -74 514 -180 402 159 -324 28 293
6123 293 79 134 -17 -28 86 256 -545 114 171 -297 430 206 -334 619 116 76 100 -185 40 196 -280 -388
6145 -388 573 -184 -468 -275 -124 -122 797 90 -178 638 -115 111 239 -600 -180 382 -438 -191 -30 -294 247
6166 247 40 -619 -60 -338 -291 138 -99 -234 422 277 -206 308 -85 -160 66 85 521 698 -22 -484 113
6187 113 -227 116 334 -7 488 721 -55 -170 935 -648 125 269 -202 -310 -126 -463 -485 236 -18 -13
$$ packed form
6039A49k4j78o4J31j71l54N93k67Q4M25m31k39M17l82O10k91q3j3l4k85K27P54
6061E74p81K12L26q69N26N6O8m73K28o1K71L48m21K30J38j112Q24J31o94O85j78
6082B8l00R34n95l82M19n26M49K68p13K82P9l87J08N91l05M67k64o11N81J46o92
6103d23Q85K26j529J252k03k71L14K25q88J54o4p0L18N88o94N82k43m83L52K65
6123B93k14N5j51j1J14J70q01O59N7m68P27k24n40R53n03m0K4k85K25J56m76j08
6145c88R61p57k84J93J51KR19p07k68Q16p53K26J28q39M20N62q20K47J61k64N41
6166B47k07o59N59k78M7M29k37j35O56j45m83N14l93p5K26J9M36J77p20m62N97
6187A13l40L43K18l41M95K33p76j15J105j583P73J44m71j08J84l37k2P21k54N
$$ plain form
6207 -13 584 -449 -167 493 -188 -83 437 -572 -407 166 -382 56 141 -73 244 267 25 205 279 -543 -2
6228 -2 44 -308 602 -223 -360 -194 -257 -457 388 -346 81 745 -207 -139 786 -439 127 -222 -281 24 322 -368
6250 -368 -163 -1 16 389 454 115 -31 498 -137 175 85 -9 -306 355 -9 347 133 -434 189 -135 155
6271 155 -68 -116 -69 183 234 -118 307 174 -558 -156 -220 -22 516 -41 -314 291 -136 -340 603 448 -449
6292 -449 199 -532 -84 405 -37 269 362 -315 53 -191 -364 258 397 -72 125 -256 -322 -84 83 -72 12
6313 12 -78 -694 93 470 -555 -75 71 -657 137 468 206 273 131 -656 323 49 -693 -66 55 -176 649
6334 649 -54 -685 18 -436 -602 406 -142 -439 452 -358 56 -292 -470 -178 631 -186 116 21 -315 120
6354 120 449 -573 351 -113 -335 290 -75 -651 -58 444 106 -185 115 -360 -22 535 -35 262 237 -185
$$ packed form
6207a3N97j033K82O60o81J05N20j009J65N73n48M38Q5k14L17K3k42J80P4q22N41
6228bM6l52R10q25j37J66o3k00Q45p34M27O64r52O8R25j225N66l49n9L05K98o90
6250c68K05J62J7L73O5l39j46N29o35L12r0r4k97O61l64L56k14n67O23l24K90
6271A55k23m8M7K52N1l52M25j33p32M02o4J98N38n57k73O05m27k04R43j55q97
6292d49O48p31M48M89m42L06R3o77L68k44j73O22J39m69J97l81o6K38J67j55Q4
6313A2r0o16P87L77j025M80J46p28P94L31k62O7j42p87R79k74p42O27J21k31Q25
6334F49p03o31P03m54j66J008n48k97Q91q10M14l48j78K92Q09q17L02r5l36M35
6354A20L29j022R24m64k22O25l65n76N93N02l38k91L00m75L38N57n70K97k5m22
$$ plain form
6374 -185 334 300 -411 165 315 164 266 173 212 330 17 46 297 -57 -172 370 -156 -287 568 1 -142
6395 -142 349 -125 173 -36 -437 174 415 -529 -14 -149 348 -38 308 160 409 530 -351 -60 -25 -1031
6415 -1031 348 -175 -609 414 218 -307 272 526 -604 -299 -383 -399 495 280 -236 -146 -193 263 399 -339
6435 -339 -544 195 -183 -377 217 -456 -86 294 171 -235 401 -302 -189 445 112 -125 362 -248 -177 119
6455 119 -344 -90 12 -364 -3 270 -252 -401 -113 -512 580 194 -251 101 -113 -492 -391 291 -441 -174
6475 -174 -231 -289 320 24 -302 -160 -197 -323 544 -40 -591 45 290 -106 -75 34 -182 628 181 424 558
6496 558 211 67 807 53 152 541 -545 -44 63 -333 -249 287 -362 -221 524 166 603 390 -129 -71 -117
6517 -117 315 361 -127 35 312 19 -34 596 -274 -349 542 507 -270 553 91 -582 155 -181 -230 270 251 -372
$$ packed form
6374a85N19l4p11N76J50j51J02r3L9J18l13K9K51l54j15N42n26j31Q55n67j43
6395a42M91m74K98k09m01O11K41r44N15j35M97l86L46j48K49J21q81K91L5j006
6415a031J379n23m34J023j96n25N79K54j130L05q4j6Q94k15n16R0m7M56J36p38
6435c39k05P39l78j94N94o73L70L80j23m06O36p03J13O34l33k37M87o10P1K96
6455A19m63K54J02l76L61K73n22j49K88l99J092l86m45L52k14l79J01O82p32K67
6475a74n7n8O09k96l26J42l7j26Q67n84n51O36K45l96L1J09k16Q10m47K43J34
6496E58l47j44P40p54R9L89j086N01J07l96Q4N36o49J41P45l58M37k13n19N8m6
6517a17M32M6m88J62K77k93n3O30q70p5Q91l5p77Q23m62o73P37l36m9N00j9o23
$$ plain form
6539 -372 639 291 -42 188 -474 -668 460 209 -397 205 -55 91 510 -239 -202 395 -370 137 370 -82
6559 -82 -67 292 -292 167 423 -504 -173 440 -427 -24 448 -202 542 376 -168 488 36 36 476 89 50 315
6581 315 -28 -152 215 304 -6 40 -55 -378 761 -157 1 448 -371 356 83 76 -95 565 -76 -344 613
6602 613 -202 -251 658 -44 46 198 -38 -20 388 -559 126 332 -482 109 436 -103 41 246 -546 344 200
6623 200 -314 159 -57 -688 -68 -17 -613 -192 238 491 493 -53 -138 126 454 -487 317 173 -176 347 -499
6644 -499 -749 274 -100 -170 567 -430 221 352 -489 -376 -228 65 379 80 -354 -123 -205 -506 -252 -33
6664 -33 -306 -698 91 -156 39 206 196 544 -18 -254 120 25 -342 -17 139 -45 134 -104 -325 304 -14
6685 -14 -583 251 -212 -29 350 -237 -408 340 197 -14 390 125 -348 95 -229 269 328 -126 183 273 -9
$$ packed form
6539c72J011l48l33K30o62j94J128k51o06O02k60J46M19p49L7N97p65N07K33m52
6559h2J5L59n84M59K56r27L31O13q67M03M72o50P44j66n44O56m52%M40l87l9K65
6581C15l43j24L67Q9l10M6r5l23J139r18J58M47q19P27k73pj71O60o41k68R57
6602F13q15m9R09p02R0J52k36J8M08r47O85K06q14N91L27n39J44K05p92Q90j44
6623B00n14M73k16o31O20N1n96M21M30K53Kn46q5K64L28r41Q04j44l49N23q46
6644d99k50J023l74p0P37r97O51J31q41J13J48K93L14k99m34K31q2l01K54K19
6664c3k73l92P89k47J95J67j0L48n62k36L74r5l67L25J56j84J79k38k21O29l18
6685a4n69Q34m63J83L79n87j71P48j43k11M04k65m73M43l24M98N9m54L09R0k82
$$ plain form
6706 -9 -187 445 -284 -75 301 -257 20 241 -97 39 473 -843 487 164 -163 766 -123 -505 149 -355
6726 -355 -89 585 248 -366 448 60 -224 360 -80 -9 56 -328 -462 61 -433 -362 -183 -561 -99 142 -563
6747 -563 -402 0 91 -180 359 133 123 278 -216 386 279 -207 -52 36 -160 -77 -70 -192 368 371 -368 306 712
6770 712 -491 -186 260 -41 -127 54 -518 116 -39 119 119 424 -318 -183 -114 -119 40 59 -205 -294 -2 -216
6792 -216 381 118 -323 -150 23 195 185 -360 -68 203 -409 158 647 358 351 996 -509 -553 -152 56 135
6813 135 266 -280 27 198 -152 -96 -230 1 356 218 -216 130 -210 1 82 23 -361 478 307 -51 -19
6834 -19 225 -306 412 -249 -540 11 -242 -623 308 -309 -277 233 -373 -600 156 -278 -421 676 135 -404
6854 -404 483 -287 -770 461 -665 125 634 -324 95 238 -30 461 618 -556 282 60 -69 62 557
$$ packed form
6706ij78O32p29K09L76n58K77K21l38J36M34j316J330l23l27R29q89l82O54n04
6726c55K66O74l37o14Q14l88k84N84m40P1O5l84j34N23m94P1J79l78M62K41p05
6747e63J61M02R1k71N39k26j0J55m94O02j07m86J55Q8j96Q3Pj22N60Lp39O74M06
6770G12j203L05M46l01q6J81n72O34j55J58%L05p42J35O9nJ59J9k64q9K92k14
6792b16N97k63m41J73J73J72j0n45K92K71o12N67M89k89pO45j505m4M01K08P9
6813A35J31n46L07J71l50N6j34K31L55j38m34L46l40K11Q1n9l84Q39j71l58L2
6834a9K44n31P18o61k91N51k53l81R31o17L2N10o06k27P56m34j43J097n41n39
6854d04Q87p70m83J231j126P90N09r58M19J43k68M91J57j174Q38k22j29J31M95
$$ plain form
6873 557 -155 463 286 -212 687 162 -65 -44 146 -355 159 207 -272 129 13 -441 -186 -161 -667 110 -195
6894 -195 227 404 -327 -372 -28 -85 -76 352 -141 425 457 -395 -571 333 -550 61 350 -76 -81 467 -463 -14
6916 -14 454 -591 6 38 -205 -349 393 -423 194 494 24 262 660 -759 24 -200 -134 302 208 -668 25
6937 25 -18 -621 -76 155 -453 426 -314 119 654 -226 -319 -206 -4 185 308 -532 -165 -67 -356 -443 170 -410
6959 -410 32 153 146 285 125 -305 356 297 -284 387 -188 -519 71 92 -366 517 246 -567 217 291 15 39
6981 39 344 -318 708 13 33 403 292 -341 -183 143 -549 660 61 -480 198 64 126 397 -55 36 437
7002 437 -315 394 292 -767 -250 556 -400 -597 472 -20 202 376 -102 -210 216 -671 627 533 -425
7021 -425 -60 -33 -38 203 98 -163 285 74 -582 103 186 -110 420 -437 -312 92 55 -596 357 -492 -239 69
$$ packed form
6873E57p12O18j77m98Q99n25k27K1J90n01N14M8m79M01j16m54K55K5n06P77l05
6894a95M22J77p31m5L44n7RM28m93N66L2q52j76R04q83O11K89m26nN48r30M49
6916a4M68j045N97L2k43j44P42q16O17L00m70K38L98j419P83k24O6M36r4q76O93
6937B5m3o03N45K31o08Q79p40M33N35q80r3J13K02J89J23q40L67R8k89q7O13n80
6959d10M42J21pJ39j60m30O61n9n81O71n75l31N90K1m58Q83k71q13P84P4k76K4
6981C9L05o62J026o95K0L70j11o33J58L26o92J209n99n41O78j34O2K71m52R1M01
7002D37p52P09j02j059N17Q06r56j97J069m92K22J74m78j08M26q87J298r4r58
7021d25L65K7nK41j05k61M48k11o56O85Q3k96N30q57J25M04l7o51R53q49K53L08
$$ plain form
7043 69 -38 -411 375 -400 -586 714 -183 136 594 15 -377 127 167 -184 44 -359 -122 829 -275 325
7063 325 680 -644 -13 254 -122 75 204 -230 466 246 -384 187 90 -600 170 -44 386 714 -129 -94
7083 -94 90 -16 -348 502 -574 -243 151 -156 61 494 -468 90 -42 -319 -26 260 -72 29 552 -94
7103 -94 262 396 -176 -437 -222 -114 -156 263 -445 -79 297 -173 -126 112 -300 47 35 52 164 512 -275 233
7125 233 100 -511 -20 68 -12 439 542 -269 79 -372 -277 24 -393 -405 156 -7 -764 276 -49 -324 304
7146 304 -78 -302 258 -179 -433 141 -270 -223 423 -742 5 268 -197 -479 301 -508 265 588 -322 -238
7166 -238 -2 334 183 343 -98 174 302 -312 1063 107 -367 151 187 133 423 242 -521 366 735 132
7186 132 76 212 -396 285 393 -266 468 -470 152 126 -92 -474 520 -75 -216 614 -43 -13 -132 14 -450
$$ packed form
7043F9j07l73P86p75j86J300q97L19M58n79l92N04M0l51K28m03K37R51j104O00
7063C25L55j324O31K67l76J97J29m34O96k20o30N71r7o90P70k14M30L28q43L5
7083i4J84j06l32Q50j076L31L94l07K17M33r62N58j32k77K93K86l32J01N23o46
7103i4L56J34n72k61K15J08m2M19p08L66L76m70M7K38m12L47j2J7J12L48p87N08
7125B33j33o11M91Q8q0M51J03q11L48m51R5L01m17j2N61j63p57J040l25k75O28
7146C04l82k24N60m37k54N74m11M7O46j165P47K63m65k82P80q09P73L23r10Q4
7166b38K36L36j51J60m41K72J28o14J375r56m74N18L6n4K90j81p63Q87L69o03
7186A32n6J36o08O81J08o59P34r38O22k6k18l82R94n95j41Q30o57L0j19J46m64
$$ plain form
7207 -450 392 54 363 356 -200 -29 606 -349 477 -121 36 200 111 -552 -121 51 -550 468 234 -119 291
7228 291 210 -363 533 114 -456 270 143 -628 -258 254 -158 301 -76 -290 125 -106 -545 387 -196 -140 276
7249 276 117 179 221 -97 5 255 -386 205 -116 -585 -227 421 -106 52 438 -773 258 186 -677 168
7269 168 395 -335 120 193 -597 328 -56 -264 349 40 -438 154 188 -290 518 345 -181 35 -719 -577 277
7290 277 -412 53 67 22 -323 229 -329 98 -281 -304 66 835 68 28 -154 -213 -72 514 -159 -109 -169 -77 48
7313 48 9 -53 272 376 29 559 136 -104 335 516 -45 -219 378 -303 138 340 -360 22 -115 -255 144
7334 144 -21 -472 -115 -87 -386 320 -474 -357 455 -515 -348 201 -325 -61 231 70 97 199 -123 -31 275
7355 275 -8 -28 662 -151 36 -6 -276 271 65 -20 76 295 -288 423 70 -82 -59 -14 -158 -135 333 -370
$$ packed form
7207d50Q42l38L09pn56J71O35r55Q26n98J57J64q9o63M31J72o01J018k34l53M10
7228B91q1n73Q96m19n70P26j27p71L70N12m12M59l77k14M15k31m39R32n83N6M16
7249B76j59O2M2l18J02K50o41N91l21m69L58O48n27J58L86j211J031p2q63Q45
7269A68K27p30M55P3p90R25l84k08O13l09m78N92L4m78Q08j73n26K16p54J42Q54
7290B77o89M65J4m5l45N52n58M27l79k3L70P69p67m0j82n9J41N86o73N0o0R2J25
7313D8l9o2L25J04l47N30m23k40M39J81n61j74N97o81M41K02p00L82j37j40L99
7334A44j65m51L57K8k99P06p94J17Q12r70J67N49n26K64K92j61K7J02l22R2L06
7355B75k83k0O90q13J87m2k70N47k06q5R6K19n83P11l53j52K3M5j44K3M68p03
$$ plain form
7377 -370 50 -102 -79 344 -103 -116 456 -218 -529 -313 -102 -140 -129 -508 -226 510 -43 -193 509 -295 -150
7398 -150 515 -347 -122 369 -33 -412 128 -526 -144 319 -591 280 47 -368 -51 257 -289 -78 265 181
7418 181 187 -265 -315 317 134 -9 283 205 -496 179 -9 -350 212 -240 -420 26 -163 110 199 -60 -426 741
7440 741 -309 -288 559 -173 -42 442 -107 -158 213 -25 -278 85 221 380 364 303 91 83 147 -1 330 -8
7462 -8 -322 503 -433 466 185 -298 682 -179 -62 443 -515 -149 -103 18 -472 873 -342 -283 54 -553 -375
7483 -375 437 589 -368 -125 -287 -502 93 187 -136 192 -214 -221 264 7 96 238 -140 -491 119 69 -449 96
7505 96 -541 -42 427 47 263 338 -289 15 -254 -84 -8 390 -300 812 286 -295 114 306 -71 -13 185
7526 185 -153 763 345 -331 692 132 -483 196 -205 6 75 -342 -178 684 -149 -152 640 -84 131 324 -366
$$ packed form
7377c70M20j52K3M23m47j3N72o74l11K16K11l8J1l79K82P36n53j50P02q04J45
7398a50O65q62K25M91m02l79N40o54L82M63r10Q71k33m15L17L08n46K11L43q4
7418A81Om52n0O32j83j43K92p8p01O75j88l41N62m52j80M46j89K73Q9k59l66J167
7440G41j050K1Q47p32J31M84n49n1L71k38k53L63J36J59j6o1k12qO4j48L31l38
7462hl14Q25r36Q99k81m83R80q61J17N05r58L66M6J21m90J345j215N9L37o07J78
7483c75Q12J52r57K43j62k15N95R4l23L28m06pM85k57Q9J42l78l51O10n0n18N45
7505I6o37M99M69l80K16P5o27L04k69J70P6L98o90J112n26n81M09J92l77N8J98
7526A85l38R16m18o76J023n60o15O79m01K11O9m17J64Q62q33lP92p24K15J93o90
$$ plain form
7547 -366 -93 -431 -1 471 448 44 -299 309 -307 -263 347 -328 77 -43 -638 -422 -287 -305 48 146 -371
7568 -371 40 300 -454 10 168 -270 496 120 -72 514 385 -72 454 -7 -588 68 718 -524 178 -154
7588 -154 -47 395 133 33 174 -372 -221 28 -610 -650 183 -405 -38 472 -273 -254 23 -351 -311 -40 -412
7609 -412 414 196 57 45 366 -711 -6 415 -28 -189 673 -556 486 -237 -249 707 352 -258 498 133
7629 133 -78 409 -21 -23 -18 94 -495 140 389 -470 -86 19 -309 7 3 -125 582 -133 -432 555 147 -79
7651 -79 88 -51 -42 328 -313 222 451 -459 41 304 -502 -441 550 -263 -269 393 -174 -64 604 -238 193 641
7673 641 -277 -76 135 -555 41 -126 -10 -122 -75 -87 83 -483 -285 210 274 27 498 286 -145 608 -95
7694 -95 -368 977 80 -57 138 -24 -88 7 3 41 575 -168 206 131 -256 -535 184 -48 348 389 -140 -58 138
$$ packed form
7547c66K73l38M30M72k3m04l43O08o16M4O10o75M05j20n95K16J35j8L53R8n17
7568c71M11K60p54M64J58m38P66l76j92N86j29m57N26m61n81O56O50j242P02l32
7588a54J07M42k62j00J41n46J51K49o38m0Q33n88L67N10p45J9K77l74M0K71l72
7609d12Q26k18j39j2L21j077P05M21m43j61Q62j229J042p23j2R56l55o10P56l65
7629A33k11M87m30kNJ12n89O35K49q59L84J05l28L16mj28P07p15k99R87m08k26
7651g9J67j39RL70o41N35K29r10N00K63q06O1R91q13oO62n67J10O68q42M31M48
7673F41r18K01K11o90N96j67J16j12M7j2J70n66J98M95O4k47M71k12m31P53p03
7694i5k73J345q97j37J95j62o4R5mL8N34p43L74p5l87k79P19k32L96M1n29Q2J96
$$ plain form
7717 138 -495 377 100 1 91 -18 -191 245 24 -505 91 -94 -192 602 -129 -29 289 164 145 105 -87 -210
7739 -210 54 -78 -359 13 -78 128 925 -156 156 504 -12 -44 112 230 53 113 -405 261 563 -413 -254
7760 -254 216 99 -46 -38 -611 288 362 -200 80 427 -358 154 147 -503 491 90 -274 590 -110 -388 173 -372
7782 -372 -270 18 232 -145 597 -15 -262 453 120 -333 702 -269 -328 336 -239 -66 45 -225 348 -224
7802 -224 -260 -54 377 -203 -550 424 345 116 284 -172 -271 377 -163 128 66 70 164 426 -551 -31 644 -391
7824 -391 -9 -346 -617 784 377 -178 316 37 83 353 -289 -285 221 23 -476 13 -285 294 -363 -160 -176
7845 -176 400 -418 67 619 127 76 633 -230 -459 20 -25 266 660 -19 550 341 -474 -161 86 -94 472
7866 472 285 -661 327 -144 -150 -251 438 -365 -326 -225 -267 309 37 -333 212 444 -79 52 -7 -208 -191 -241
$$ packed form
7717A38o33Q72k77r9R0j09j73M36k21n29N96j85r8P94p31J00L18j25j9m0j92j23
7739b10K64j32k81L72r1K06P97j081L12L48n16l2J56J18j77O0n18O66L02r76J59
7760b54M70j17j45Qn73Q99P4n62K80L47p85N12po50R94m01l64Q64p00k78N61n45
7782c72J02K88K14l77P42o12k47P15l33m53J035r71n9O64n75J73J11k70N73n72
7802b24l6K06M31n80l47R74p9k29J68m56r9O48n40K91o2MR4K62r77N20O75j035
7824c91L82l37k71J401m07n55M94k79M6K70o42MN06j98m99M89k98N79o57K03j6
7845a76N76q18M85N52m92n1N57q63k29M79m5K91L94o79N69k09q15L13K47j80N66
7866D72j87r46R88m71oj01O89q03L9J01m2N76k72l70N45K32n23J31n9k01J7n0
$$ plain form
7888 -241 -532 352 83 -289 280 -409 207 197 -135 -110 -207 -312 -473 157 -281 -106 167 -202 -13 229 -529
7909 -529 -73 471 -514 -63 236 -317 -30 567 -449 441 341 -483 -288 188 -110 58 15 -418 -13 -170
7929 -170 -8 237 -46 238 313 -227 -142 764 -158 -596 533 46 -145 246 -389 237 805 -3 -191 97
7949 97 -444 222 135 -618 35 55 -225 288 447 -14 -106 197 150 -248 535 -253 -58 583 223 304 368 -276
7971 -276 292 328 -721 -320 -44 -57 -532 -278 -506 337 108 -8 349 36 -659 270 68 -741 581 218
7991 218 -114 2 288 -55 389 -84 -187 453 -292 192 726 105 -367 563 -137 -74 602 -468 78 59
8011 59 146 275 -102 54 276 -175 -534 167 67 -116 265 134 -210 -144 826 -488 198 -106 -703 615
8031 615 -393 -471 44 128 -432 189 214 110 192 -137 -372 300 130 246 177 -175 -160 556 -145 -13 846 -116
$$ packed form
7888b41k91Q84k69l72N69o89O16j0l32K5r7j05j61O30m38J75K73l69J89K42p58
7909e29M56N44r85M51K99n53K87N97j016Q90j00q24J95M76k98J68m3m33M05j57
7929a70J62K45k83K84P5n40Q5R06r22m38J129m87j91L91o35O26N68q08j88K88
7949I7n41O66q7p53O53K0k80N13J59m61r2L03m7l98P83p88J95O41l60Q1O4o44
7971b76N68L6j049M01K76j3m75K54k28Q43k29j16L57l13o95R29k02q09J322l63
7991B18l32J16K86l43M44m73j03O40p45M84N34o21m72R30p00O3O76j070N46j9
8011E9Q7J29l77J56K22m51l59P01j00j83L81j31l44O6R70j314O86l04n97J318
8031F15j008p8N15Q4n60O21K5j04Q2l29k35O72j70J16o9l52J5P16p01J32Q59r62
$$ plain form
8053 -116 157 42 -568 -579 129 165 475 -51 -75 -360 -244 -134 48 373 -470 426 347 -132 36 -99 -129 233
8075 233 7 -675 441 415 -252 -358 34 7 108 -356 215 40 192 -117 58 -113 -35 525 -13 -46 237
8096 237 -306 -476 -29 -481 74 273 -235 -194 146 -200 140 324 -172 -356 117 -242 -162 62 -179 321 162
8117 162 6 -135 196 -422 -163 216 226 110 78 -741 -313 409 86 -139 -55 -515 -79 192 -484 -120 -701
8138 -701 -374 363 -398 -162 528 77 -270 78 -208 -332 155 -571 437 226 66 727 188 -380 -416 694
8158 694 55 -139 263 -170 273 564 138 117 239 -410 71 215 -294 317 364 -730 359 360 -25 309 337
8179 337 15 417 104 -371 62 466 -336 419 -274 -168 1006 95 -558 -179 -2 162 320 100 -327 232
8199 232 -326 -259 514 -356 -121 88 -242 -355 401 -203 -113 311 -545 452 305 -251 215 399 -28 -75 170
$$ packed form
8053a16K73j15o10j1P08L6L10n26k4k85J16J10J82L25q43Q96p9m79J68j35l0L62
8075B33k26o82J116k6o67j06L92k7J01m64N71j75J52l09J75j71P8N60n38l3K83
8096B37n43j70M47m52N55J99n08M1L40l46L40J84m96j84M73l59Q0K24k41N00j59
8117A62j56j41L31o18K59L79J0j16l2q19M28P22l23k25Q4m60M36K71o76L64n81
8138g01L27P37p61K36O90m51l47L48k86j24M87p26J008k11j60O61n39n68l6J110
8158F94o39j94M02m33M43K91m26k1J22o49M81J44n09O11M7j094J089Jl85L34K8
8179C37l22M02l13m75M33M04q02P55o93J06J174r11o53L79J77J64J58k20m27N59
8199B32n58O7P73q70K35K09l30j13P56o04R0M24q56R97j47n56M66J84m27m7K45
$$ plain form
8220 170 -426 145 -828 -161 172 71 -312 173 7 -294 185 -205 -308 308 40 -376 291 77 -790 211
8240 211 140 -39 438 -350 -386 603 196 -275 205 33 -169 229 -358 -52 182 -399 -517 397 -186 -227 501
8261 501 -260 -253 361 -562 103 274 -225 385 366 -149 -38 5 -39 444 213 249 548 -228 -613 422 168 -169
8283 -169 149 313 -296 410 322 -756 118 -295 -828 190 -260 -454 437 -58 -47 184 39 -112 883 -471
8303 -471 185 789 -351 -252 491 -100 -101 440 -177 147 249 79 -176 322 -381 203 140 -540 35 418 -292
8324 -292 123 -222 -273 392 145 -229 -79 284 -110 392 -64 -353 108 -49 -521 405 325 -318 394 251 -208
8345 -208 167 -130 -347 558 -260 -204 489 139 -248 224 -480 -107 274 62 75 291 -41 -7 409 -467 50
8366 50 152 118 550 63 -110 354 199 84 428 -213 50 554 76 -375 575 45 -418 149 -138 -600 264
$$ packed form
8220A70n96N71r73O67L33j01l83M85j66l01M79l90j03O16k68m16O67k14q67J001
8240B11p1j79M77p88l6R89m07m71M80j72k02L98n87L06K34n81j18R14n83m1P28
8261E01p61PO14r23O65J71m99O10j9n15J11M3m4M83k31L6K99p76l85J035k54l37
8283a69L18J64o09P06q8j078Q74m13n33J018m50j94Q91m95J1K31j45j51R95j354
8303d71O56O04j140R9P43n91jN41o17L24J02j70k55M98p03N84o3o80N75L83p10
8324b92M15l45n1O65k47l74J50L63l94N02m56k89M61j57m72R26q0o43P12j43m59
8345b08L75k97k17R05q18N6O93l50l87M72p04L73L81k12J3K16l32L4M16q76N17
8366E0J02l4M32m87j73M64j55j15L44o41K63N04m78m51R50n30m63N67k87m62Q64
$$ plain form
8387 264 28 -44 816 -377 -87 -129 374 -212 375 -286 158 6 -136 -172 130 186 325 386 -206 42 349
8408 349 -121 -282 603 -267 29 510 -348 303 721 -51 -125 425 190 -386 -74 -182 382 368 -542 448 -700
8429 -700 -385 336 -66 -304 421 -299 -321 -117 -129 -471 290 -83 -466 -184 -23 -77 206 -137 -717 -61 -446
8450 -446 -185 505 -238 21 -21 -212 -241 383 -376 -120 627 -435 -58 110 -245 -18 40 -238 -202 30 142
8471 142 549 399 -234 -127 -269 -531 -140 -60 -177 529 -138 -80 411 -45 -344 -325 -89 -624 -16 -291 -193
8492 -193 206 11 259 302 -180 -197 -61 -305 28 249 -756 -341 258 -73 33 543 -193 -207 111 -184 174
8513 174 -192 -442 -96 234 22 123 221 -130 -126 260 -531 417 543 -373 130 38 -816 92 103 -254 286 258
8535 258 -35 87 -265 -177 266 -484 -450 274 -293 40 370 -96 -279 350 -387 -227 111 -425 -250 436 -341
$$ packed form
8387B64k36p2Q60j193K90m2N03n86N87o61M44j52j42l6L02N6J39O1n92K48L07
8408C49m70j61Q85q70K96M81q58O51M18p72p4N50k35n76L12j08N64j4r10R90j148
8429g00L15P21m02k38P25p20k2K04j2l42P61l73l83K82J61n4K83l43n80O56l85
8450d46K61O90p43K59m2j91k9O24p59K56P47j062L77J68l55K27N8k78L6K32J12
8471A42M07j50o33J07j42k62L91Q0j17P06o67N8M91m56k99J9K36n35O08k75R8
8492a93L99j95K48M3m82j7J36k44L33K21j005M15N99l31J06N10p36j4L18k95L58
8513A74l66k50L46L30k12J01R8l51ML86p91R48J26r16N03r2q54R08J1l57N40k8
8535B58k93J22l52Q8M43p50L4P24n67L33L30m66j83O29p37J60L38n36J75O86p77
$$ plain form
8556 -341 166 425 34 156 -190 -318 -291 342 -269 -49 141 -233 155 432 58 32 408 -349 462 -59 -114
8577 -114 270 118 -138 499 153 -262 247 523 -156 151 -23 -155 384 -55 52 239 305 -303 228 3
8597 3 -67 118 -103 292 -75 -548 -444 469 -111 214 521 61 37 612 147 501 307 -315 -307 157 118 269
8619 269 -15 -297 354 -8 -38 325 312 -112 161 372 -358 223 -134 -343 37 170 -330 696 101 -128
8639 -128 201 -618 -370 230 -172 -354 276 -401 -332 160 -917 7 442 -94 -337 -99 134 142 336 -266 157
8660 157 21 -590 -91 31 -269 137 420 -149 311 -385 -259 208 271 -107 2 46 -334 539 -126 -345 558
8681 558 -181 -75 169 -294 269 267 -269 -437 516 -44 -212 174 -286 -309 622 -352 -647 -99 -142 151 15
8702 15 -127 -279 247 -251 270 314 -411 132 425 -260 599 -241 -453 28 509 -292 138 22 -555 186 -272
$$ packed form
8556c41N07K59l91J22l46j28K7O33o11K20J90l74L88K77l74k6L76p57Q11n21n5
8577a14L84j52k56O37l46m15N09K76o79L07j74j32N39m39J07J87O6o08N31k25
8597Cp0J85k21L95l67m73J04R13n80L25L07m60k4N75m65L54j94o22QM64l9J51
8619B69k84k82O51l62l0L63j3m24K73K11p30N81l57k09L80J33n00J026n95k29
8639a28L29q19K48O00m02j82O30o77O9M92j077R24M35n36k43K38K33QJ94o02M23
8660A57j36o11M99J22l00M06K83n69M60o96J26M67O3l78J09M4l80Q73o65k19R03
8681E58p39J06K44m63N63kn36j68R53n60j68L86m60k3R31r74k95N48m3K93j36
8702A5j42j52N26m98N21M4p25N43K93o85Q59q40k12M81M81q01M30j16n77P41m58
$$ plain form
8723 -272 -97 46 294 -316 441 -198 -142 -422 -297 -504 -290 16 -297 71 -138 -144 674 -21 -266 305 241
8744 241 -245 -28 -257 -661 385 -350 -149 705 -140 106 155 -635 -148 379 -485 336 752 159 -125 209
8764 209 287 -61 381 -220 573 -125 -395 446 -316 293 54 -472 -397 -174 94 -146 207 -4 -301 -23 436
8785 436 -469 435 -93 -85 291 -200 -361 -152 -355 53 -96 -53 -258 258 -255 -86 414 -404 -76 95 -421
8806 -421 -527 148 -336 12 236 -197 254 607 -367 -36 107 -882 316 244 -638 171 -494 -484 206 270 -403
8827 -403 182 300 -239 722 -142 41 277 -410 -389 278 246 25 517 210 -18 509 -543 -570 439 169
8847 169 -767 548 -731 2 290 -714 -93 602 -359 -172 457 -729 -94 190 -241 39 454 -343 -15
8866 -15 -173 -199 -132 -154 -770 -57 272 -127 -125 160 -613 396 -70 -324 569 108 -484 309 250 -321 244 353
$$ packed form
8723b72J75J43K48o10P57o39N6k80J25k07K14L06l13L68k09oQ18o95k45N71o4
8744B41m86K17k29m04J046p35K01Q54q45K46M9p90M87N27q64Q21M16n93k84L34
8764B09P8l48M42o01P93o98k70Q41p62O09k39n26P5K23K68k40L53k11k97K78M59
8785D36r05R04n28QL76m91j61K09k03M08j49M3k05N16n13J69N00q18L28J71n16
8806d21j06O75m84L48K24m33M51L53r74L31J43r89J198p2q82Q09o65J0O90O4o73
8827d03N85J18n39R61q64J83K36o87K1O67l2k21M92l07k28N27j052k7J009k70
8847A69r36J315j279P33K88j004O21O95r61J87O29j186O35K84m31K80M15p97L28
8866a5j58k6O7k2o16P13L29l99KK85p73J009m66k54Q93m61n92P93n9n71N65J09
$$ plain form
8888 353 -222 404 62 155 532 -129 -93 746 -84 -457 569 -655 18 566 -543 16 -273 330 -446 74
8908 74 -547 262 70 -145 34 -15 -215 -391 25 80 -217 49 -322 363 -108 -168 -75 -244 -223 222 293 -323
8930 -323 54 17 -542 354 284 -311 276 284 -293 512 -16 -393 -72 -561 -432 411 64 -39 503 -38 -322
8951 -322 113 218 -505 523 -431 -166 515 -297 -269 337 -58 239 81 -560 116 105 -507 13 348 -698
8971 -698 343 249 41 -131 510 -244 361 817 -306 128 -70 389 595 53 -336 538 19 -93 213 0
8991 0 219 71 -539 -48 136 -215 233 255 -424 -310 481 105 -3 354 -377 -50 281 -229 431 31 -318
9012 -318 340 -82 -267 225 -175 -219 74 -148 -224 -60 671 -456 188 -140 -174 -232 -169 -611 210 269 -427 242
9034 242 165 -15 286 289 -176 682 135 -593 487 -142 -347 417 -201 -238 458 -509 -60 293 -338 -231 201
$$ packed form
8888C53n75O26l42R3L77o61L6Q39q30l73J026j224O73N48j109N59k89O03p76N20
8908G4o21Q09j92k15J79m9k00j76M16N5k97K66l71O85m71o0R3j69K1M45P1o16
8930c23L77l7n59Q96p0n95N87Qn77Q05n28l77L21m89J29Q43l47j03N42n41k84
8951c22M35J05p23J028r54K65O81q12K8O06l95K97j58o41O76j1o12N20L35j046
8971f98J041r4k08j72O41p54O05M56j123M34j98M59K06n42l89Q74n19j12L06k13
8991@K19j48o10M91J84l51M48K2o79J14P91l76j08L57p31L27L31n10O60m00l49
9012c18O58m22j85M92m00m4K93k22p6J64P31j127O44l28l4n8O3m42Q21N9o96O69
9034B42p7j80L01Lm65Q58n47p28J080o29k05P64o18l7O96r67M49L53o31J07M32
$$ plain form
9055 201 -130 -267 487 216 112 274 -269 -156 -14 -378 124 373 -269 122 284 -140 -76 -30 -138 838 609
9076 609 -387 305 -91 -309 -8 66 -673 369 104 23 128 -316 7 396 -210 -913 176 127 -232 -112
9096 -112 -165 363 317 -17 -316 -328 -33 -16 181 -335 -25 268 -690 16 -20 -1001 -17 662 -264 79 57 -54
9118 -54 311 -45 47 -183 40 87 64 -239 -647 299 -440 -224 287 226 -2 92 -383 -603 446 674 -192 192
9140 192 -554 -225 270 127 -310 192 -242 -345 585 87 -384 246 -311 -385 139 -61 391 -427 -250 -164 127
9161 127 -483 189 107 -382 -481 91 0 9 256 -693 170 250 -70 249 24 -34 108 200 -144 -82 175 -440 82
9184 82 76 -362 1040 337 -181 38 -3 -321 584 -288 -293 31 -466 21 400 249 -149 123 -272 -484 712
9205 712 -130 589 250 -245 66 -101 -341 368 244 412 126 327 158 82 87 -287 304 -383 -248 214 -37
$$ packed form
9055B01l31j37P54k71j04J62n43J13J42l64N02K49o42L91J62m24O4M6j08R76k29
9076F09r96O92l96k18L01P4p39J042k65q1J05m44L23L89o06p03J089m9l59J20
9096a12n3N28m6l34k99j2K95J7J97n16L10K93r58P06l6r81R84O79r26L43k2j11
9118e4L65l56R2k30K23M7k3l03m08R46p39K16N11o1k28R4m75k20J049K28q66L84
9140A92p46L29M95j43m37N02m34j03R30m98m71O30n57p4N24k00M52q18J77Q6K91
9161A27o10O72q2m89r9N72r1RK47r49Q63Q0l20L19k25n8J42R2l44O2K57o15N22
9184H2om38J402p03n18K19m1l18R05q72nL24m97M87L79j51l98K72l95k12J196
9205G12q42P19l39m95L11j67k40P09j24J68k86K01j69p6Nl74N91o87J35M62k51
$$ plain form
9226 -37 -444 589 -139 -124 491 -148 -231 464 210 -210 326 -42 -480 -9 86 -61 416 475 -21 -56 -132 351
9248 351 -21 -335 -559 209 671 122 142 -148 121 -139 -391 -321 453 256 425 144 -351 -207 64 -329 159
9269 159 23 -214 276 -23 196 -444 -229 241 89 219 -354 543 326 -56 -103 280 -384 136 476 -74
9289 -74 388 465 -184 160 491 -125 36 -674 130 495 -388 -56 215 -348 340 472 -81 -189 183 -624 118
9310 118 427 -271 -227 23 -527 159 653 -20 -76 29 -277 225 80 -623 134 103 -560 -30 -142 -478 486
9331 486 4 -388 183 327 -681 86 124 92 -187 209 -252 135 -337 -614 297 -265 -171 -212 306 -129 267
9352 267 227 -276 -132 -575 -185 -147 -565 142 477 -144 177 4 -247 53 497 325 170 576 -335 130 416
9373 416 -217 479 -96 -407 203 -252 -227 486 -299 -129 88 -216 -753 427 -66 -849 156 -221 -394 327
$$ packed form
9226c7m07J033p28J5O15o39q3O95k54m20N36l68m38M71R5j47M77N9m96l5p6M83
9248C51l72l14k24P68M62n49K0k90K69k60k52P0P74j97J69k81m95J44K71l93M88
9269A59j36k37M90k99K19o40K15M70j52J30n73Q97k17l82m7L83o64N20L40n50
9289g4M62P7o49L44L31o16J61p10Q04L65q83L32K71n63O88J32n53j08L72q07P42
9310A18L09o98M4K50n50O86M94o73n6J05l06N02j45p03P57l1o63N30j12l36R64
9331D86m82l92N71J44j008P67L8l2k79L96m61L87m72k77R11n62R4m1N18m35L96
9352B67m0n03J44m43L90L8m18P07L35o21L21j73k51L00M44j72j55M06r11M65K86
9373D16o33O96n75l11O10m55K5P13p85J70K17l04n37J180m93p83J005l77j73P21
$$ plain form
9393 327 -393 -164 -47 -114 -1 123 -87 179 27 -480 160 -78 -238 76 218 -274 182 843 -39 162
9413 162 -224 458 77 55 43 53 172 24 518 137 -794 -368 -137 -97 448 -202 -624 -150 -354 -311 382 -227
9435 -227 -792 99 -65 32 150 -26 -180 312 225 257 368 48 339 143 107 19 677 -197 499 777 209 156
9457 156 208 -336 92 424 19 22 267 -641 322 391 -384 164 199 -210 -12 365 -253 246 6 -690 54 87
9479 87 -306 466 494 -228 -38 -29 606 -100 9 -685 424 -163 207 92 -147 -125 128 -4 -243 476 -108
9500 -108 -188 662 -198 193 318 -390 142 -37 -345 157 173 -246 -280 440 -510 -433 -76 -16 28 168 -327 -283
9522 -283 -17 -671 262 366 -36 122 132 -612 247 -4 -257 -88 -150 9 144 292 -100 282 310 -181 205
9543 205 38 -42 55 -61 -127 733 -214 -204 377 -290 219 -218 -29 -163 214 167 36 37 -410 323 -162 -71 249
$$ packed form
9393C27p20K29J17o7J13J24k10K66j52n07O40k38j60L14J42m92M56O61q82K01
9413A62l86O82l81k2j2J0J19j48M94l81r31M26K31M0N45o50m22M74k04M3O93o09
9435b27n65Q91j64R7J18j76j54M92q7L2J11l20K91j96l6q8O58q74O96K78n68n3
9457A56N2n44M28L32m05LK45r08R63O9p75N48L5m09J98L77o18M99k40o96P44L3
9479H7l93P72K8p22J90RO35p06J09o94J109n87L70j15k39K2K53j32k39P19n84
9500a08q0Q50q60L91J25p08N32j79l08N02J6m19l4P20r50P7L57O0M4J40m95M4
9522b83K66o54R33J04m02J58J0p44Q59k51k53J69o2J59J35J48l92L82K8m91L86
9543B05j67q0R7j16o6Q60r47J0N81o67N09m37J89j34L77m7j31Jm47P33m85R1L20
$$ plain form
9566 249 -39 -878 32 323 -121 157 -136 -133 372 -73 -411 117 -340 -441 104 -25 -249 88 357 -392 160
9587 160 328 -715 271 -35 -35 104 295 70 447 -54 -783 -207 -354 -507 62 95 461 354 -191 -58 410
9608 410 -622 216 440 -446 247 310 101 -320 326 -409 -260 427 -290 -128 14 -504 352 -102 -552 264
9628 264 332 -471 -133 213 -197 220 26 -213 224 -430 -194 500 -394 166 364 -279 -162 562 -48 -157
9648 -157 409 -229 123 264 -179 -639 304 -108 78 201 -482 -300 398 -82 -348 490 -391 -94 31 -284
9668 -284 271 55 -74 47 -230 -401 227 71 194 163 50 313 223 -70 -39 272 331 -118 -167 362 -471 -45
9690 -45 122 -283 105 -232 -184 31 -93 103 165 -236 -153 64 -8 137 401 -51 60 506 -95 -148 105 -430
9712 -430 225 227 -173 161 108 -109 -1 -245 -228 553 -365 -582 293 285 -412 189 -51 -265 -157 3 -321 285
$$ packed form
9566B49k88q39R10K91m44K78k93LN05m45l38N28m57j01N45j29k24L37K69p49N52
9587A60J68j043R86l06%J39J91k25L77n01p29N76j47j53N69L3L66j07n45J33M68
9608D10j032Q38K24q86O93O3k09m21O46p35J49O87p17J62J42n18Q56m54m50Q16
9628B64O8q03L38L46m10M17j94k39M37o54K36O94q94N60J98o43J17P24o10j09
9648a57N66o38L52J41m43m60R43m12J86J23o83J82O98m80k66Q38q81K97J25l15
9668b84N55k16j29J21k77j71O28j56J23l1j13K63r0k93L1L11N9m49m9N29q33M26
9690d5J67m05L88l37M8K15j24J96O2m01Q3K17p2J45K64m52J11M46o01n3K53n35
9712d30O55Km00L34n3k17J08k44J7P81r18k17Q75qo97O01k40k14J08J60l24O06
$$ plain form
9734 285 214 -182 254 -270 -230 225 -309 -445 227 155 -92 457 264 96 230 -461 -278 313 -198 -47 105
9755 105 -520 236 625 -48 -26 274 -362 -579 239 -478 -219 313 -334 -163 179 -765 -235 241 -41 302
9775 302 132 40 101 29 -200 -72 -12 13 -345 -265 -93 -198 -33 -362 824 -57 -217 862 178 -319 327
9796 327 -9 234 283 -89 49 -16 -494 -733 208 -183 -572 340 -567 179 293 151 -317 108 -16 -257 144
9817 144 -376 -35 -204 -14 172 149 -251 -28 57 -715 187 268 54 184 66 -119 627 40 -98 647 65
9838 65 166 96 -114 85 187 -98 19 193 -122 168 272 -710 -247 301 -375 -382 193 -5 -243 573 -159
9859 -159 -326 144 140 146 453 -264 105 -161 -152 318 397 -414 -64 -5 -371 -99 494 -120 51 -105 -75 64 -262
9882 -262 -67 -92 -208 70 456 56 25 -99 -112 -66 177 -38 -151 25 220 -39 425 -230 -609 500 -15
$$ packed form
9734B85p1l96M36n24M0M55n34j36O72p2k47N49j93j68J34o91J83N91n11J51J52
9755A05o25P56L89o73K2L00o36k17Q18p17K59N32o47J71L42r44N30M76k82L43
9775C02j70r2O1p2k29J28O0K5l58Q0J72j05J65l29J186q81j60J079o84m97O46
9796C27l36K43M9l72J38o5m78k39R41l91l89R12r07P46J14j42m68M25j24k41M01
9817A44n20L41j69J90J86k3m00K23Q5p72R02Q1k14J30j18j85P46n87j38P45n82
9838F5J01p0k10J99J02k85J17J74l15K90J04r82M63N48o76pN75j98k38Q16p32
9859a59j67M70mOL07p17L69k66RM70P9q11L50N9l66K72N93o14J71j56L0J39l26
9882b62J95k5j16K78L86m00l1j24j3M6K43k15j13J76J95k59M64o55l79J109n15
$$ plain form
9903 -15 214 206 327 -209 -78 -357 41 436 -283 -335 503 -384 2 401 -572 -285 -41 119 162 -181 -461 447
9925 447 368 -614 335 527 -254 374 51 -367 254 124 140 27 -120 -97 -40 -193 -14 391 -683 -201 853
9946 853 -249 78 284 334 -603 141 88 125 353 -441 164 330 -405 134 -158 -804 293 -194 90 160 -219
9967 -219 -75 326 58 -554 119 88 -213 207 -20 -414 -83 13 82 169 59 -23 -105 -164 -631 61 117 -243 18
9990 18 -236 -382 171 -96 -240 397 -281 -327 587 -59 -3 -287 7 -405 110 -16 328 290 -241 301 221 -208
10012 -208 74 172 277 47 329 16 498 -245 -154 -163 683 -559 -65 89 -55 513 118 -413 136 193 -467
10033 -467 418 147 -316 228 503 -368 -118 58 365 401 -487 -542 94 -276 -459 474 -276 -519 442 -119
10053 -119 345 -50 -49 -76 83 215 -83 209 -106 304 301 -458 -331 526 -14 -87 561 -243 75 93 -758 240
$$ packed form
9903a5K29qJ21n36J31k79L98L95p19n2Q38q87L86L99r73K87K44J60M3l43k80R08
9925D47p9r82R49J92p81O28l23m18O21j30J6j13j47K3N7j53J79M05j074M82J054
9946H53j102L27K06N0r37P44n3L7K28p94O05J66p35N39k92o46J097m87K84P0l79
9967b19J44M01k68o12O73l1l01M20k27l94L31R6O9Q7j10q2q2n9m67O92N6l60K61
9990A8k54j46N53k67j44O37o78m6R14o46N6k84K94m12N15j26L44l8n31N42q0m29
10012b08K82R8J05k30K82l13M82p43R1rQ46j242M94J54j44N68l95n31N49N7o60
10033d67Q85k71m63N44K75q71K50J76L07L6q88n5O36l70j83R33p50k43R61n61
10053a19M64l95Jk7J59J32k98K92l15M10lp59J27Q57n40p3O48q04L18J8q51R98
$$ plain form
10075 240 342 -550 402 -117 -447 -12 188 -492 -263 -29 -201 447 -86 -327 -29 -63 -15 379 -69 46
10095 46 559 94 135 266 -407 -255 703 -361 46 -12 -151 309 466 -222 331 57 -382 -13 361 73
10115 73 78 389 -780 -378 108 -299 417 124 -465 410 -225 -522 508 212 72 540 338 -319 132 25
10135 25 36 401 -474 -394 290 -242 -168 643 124 -251 166 1 -32 396 39 -246 358 0 -207 237 -425
10156 -425 295 88 140 -39 84 -440 52 146 -249 -45 345 -553 -269 500 -257 431 -8 -166 148 158 -853
10177 -853 405 -523 -259 56 -520 -385 66 52 -252 -333 -454 137 43 77 -238 269 -774 6 -8 -300 39
10198 39 766 -11 -174 216 187 91 75 -191 -297 56 -293 755 357 -184 -157 372 -39 -27 879 -262 76
10219 76 288 33 10 72 -148 219 -113 -189 818 -294 45 255 300 -526 345 96 -661 443 148 -84
$$ packed form
10075B40J02q92R52n19l30M35K00o80K29K34j72O48n33k41K98l4M8L94m48J15
10095D6N13m65M1J31o73J52R58j064M07n8j39M60J57o88N53k74m39L69L74k88
10115G3NL11j169M02M86m07P16k93n89Q75o35k97J030k96j40M68k02o57M51j07
10135B5J1L65q75Q0O84n32P4Q11n19l75M17j65l3M28l57k85O04l58k07M44o62
10156d25P20k07N2j79J23n24M92R4l95K04L90q98K84P69p57O88m39j58L14J0j011
10177h53J258r28K64L15n76J35M51j4l04q1j21N91r4L4l15N07j043P80j4k92L39
10198C9P27p77j63L90k9r6j6k66j06L53l49J048l98n41K7N29m11J2R06j141L38
10219G6K12k55k3O2k20L67l32p6J007j112L39K10M5q26Q71k49p57J104k95k32
$$ plain form
10239 -84 96 507 -414 97 -231 -467 -163 -88 -51 502 317 -535 -89 -249 -144 460 -316 27 -52 -79 -81 340
10261 340 -302 115 644 -213 -216 510 162 -142 37 -334 395 122 -503 67 416 -305 399 -85 -753 114
10281 114 -380 -470 447 3 -161 175 -44 -157 86 147 -355 446 -390 -65 -37 -272 98 148 32 262 -106
10302 -106 -689 -138 145 57 -415 399 -391 128 -223 -503 -28 294 -426 157 -111 133 576 34 -206 294
10322 294 103 -313 484 225 -286 14 228 -172 -8 -157 -606 155 249 116 37 -89 -453 193 179 -438 396
10343 396 -438 -385 491 210 -267 139 -107 -231 -238 43 -412 414 -93 31 394 -21 51 213 -124 -81 526
10364 526 -475 20 966 -644 -78 428 -381 237 96 181 140 701 -700 437 -62 -23 -70 -183 -144 2
10384 2 -18 -236 244 355 -176 323 249 186 342 -341 -18 -24 -669 -67 182 -244 -809 91 18 -78 116 55 93
$$ packed form
10239h4J80M11r21N11l28k36L04P5L7N53j85q52M46j60J05O04p76L43p9k7kM21
10261C40o42M17N29q57lP26l48l04J79l71P29k73o25N70L49p21P04m84o68Q67
10281A14m94r0R17m44j64L36k19j13K43O1n02Q01q36L25K8k35L70N0j16K30l68
10302a06n83N51K83q8m72Q14p90N19l51k80M75L22p20N83k68K44M43n42k40N00
10322B94j91m16P97k59n11L00K14m00J64j49m49P61R4j33p9j26l64O46j4o17Q34
10343C96q34N3Q76k81m77M06k46j24pK81m55Q26n07J24L63m15P2J62l37M3O07
10364E26j001M95R46j610N66N06q09O18j41Q5m1N61j401J137m99L9m7j13L9J46
10384Bk0k18M80J11n31M99p4o3J56o83L23oo45O02K49m26n65R00p3r6J94o1L8
$$ plain form
10407 93 54 -380 123 260 -42 -227 485 -561 -273 188 128 -38 44 -699 87 -107 -174 69 302 -337 -284
10428 -284 572 -694 -147 -92 -475 210 -92 -426 353 10 -574 212 -20 -621 668 -331 -65 84 199
10447 199 -142 137 99 -295 398 -595 96 -169 -377 -312 559 -169 -24 551 7 442 286 50 -149 746
10467 746 -351 630 245 -417 106 177 -78 253 -106 8 212 -130 -183 -117 9 -418 170 403 -659 393
10487 393 17 -131 192 -149 28 -244 20 -58 43 -419 2 80 22 173 72 159 193 450 -124 116 593
10508 593 -471 -449 -123 166 579 675 -79 353 292 -613 117 160 -527 334 -8 -58 98 224 -51 -34 228
10529 228 -482 -32 -252 -341 86 133 -953 705 -22 -246 626 -81 -425 269 68 -261 -609 -361 -418 180
10549 180 -370 -304 262 -411 209 164 -398 -264 254 -263 -448 97 -582 -121 58 -113 -72 96 -246 148 290
$$ packed form
10407I3l9m34N03J37l02j85P12j046K88M61o0j66Q2p43P86j94o7K43K33o39N3
10428b84Q56j266N47N5l83O85l02l34P79l43n84P86k32o01J289r99K66J49J15
10447A99l41K79l8l94O93r93O91k65k08O5Q71p28J45N75n44M35j56k36j99Q95
10467G46j097R81l85o62N23P1k55L31l59J14K04l42n3O6J26m27N88K33j062J052
10487C93l76j48L23l41J77k72K64p8J01m62M21P8n8J51j01Q7L4K57n74K40M77
10508E93j064K2L26K89M13R6p54M32o1r05P30M3o87Q61l42n0J56J26k75J7K62
10529B28p10M50k20q9M27M7j086J658p27k24Q72p07l44O94k01l29l48K48n7N98
10549A80n50O6N66o73O20m5n62J34N18n17j85N45o79M61J79j71M1J68l42L94J42
$$ plain form
10570 290 131 197 87 -72 441 425 -388 -29 256 71 824 138 -175 32 107 -356 44 106 -588 784 -19
10591 -19 -139 696 -289 -108 332 -544 58 364 -152 13 299 -130 285 225 148 -145 505 -269 -225 655 202
10612 202 -181 -15 -56 482 557 -308 319 155 -279 -270 152 -62 42 -21 -69 140 578 -315 5 112 -254 245
10634 245 300 -352 402 -109 -198 582 227 -432 -27 -186 -952 497 -328 -751 96 -363 -208 518 -300 43
10654 43 193 48 -121 211 -303 50 -342 -238 134 -94 7 234 243 -59 42 124 -169 -353 89 -349 138
10675 138 192 -117 408 197 -362 171 53 -396 247 -162 -190 654 133 -754 -13 -64 -199 598 161 -447 -74
10696 -74 36 -283 193 -390 369 34 -767 -270 522 -150 307 409 40 206 124 -843 -211 298 -422 453
10716 453 360 -345 227 367 -395 -37 75 -741 -225 320 -240 54 129 -297 350 103 -569 -450 -379 215 286
$$ packed form
10570B90j59O6j10j59N13j6q13L59K85j85P53o86l13K07P5m63M00O2o94J372q03
10591a9j20Q35r85J81M40q76O02L06n16J65K86m29M15o0p7k93O50p74M4Q80m53
10612B02l83J66m1N38P5q65O27j64m34RM22k14J04o3m8K09M38q93L20J07l66M99
10634B45N5o52P54n11q9P80l55o59M05j59p66J449q25m23Q47m59J55P26q18L43
10654D3J50j45j69L32n14L53l92J04L72k28J01K27Rl02J01Q2k93j84M42m38M87
10675A38N4l09N25k11n59N33j18m49O43m09k8Q44n21q87P41n1j35P97m37o08L73
10696g4J10l19M76n83P59l35q01M97P92o72M57J02l69J66q2r67O32N09p20Q75
10716D53r3p05N72J40p62L58J12q16N16N45n60K94P5m26O47k47o72J19P1N94P1
$$ plain form
10737 286 -676 -430 204 -525 -361 23 -533 -202 432 -28 -198 47 -183 -242 302 -369 -406 462 -297 96
10757 96 160 -511 170 -65 -777 -483 -74 209 49 422 -695 164 508 -137 309 -201 -251 -20 30 -202 128
10778 128 -355 -174 532 -118 -371 79 339 -46 165 292 48 254 158 245 366 -261 -133 465 213 -190
10798 -190 -122 -31 85 159 -43 -39 304 -299 141 499 -352 -166 465 -267 -418 175 -455 14 240 -139 596
10819 596 146 -612 425 186 384 158 230 -250 179 -92 -527 247 -217 -281 -15 221 -443 233 199 -239
10839 -239 386 -84 -446 301 -3 42 -25 -422 -113 454 -294 338 327 221 147 -178 195 -215 -176 -497 114
10860 114 -3 -162 4 230 -25 -197 350 244 54 131 -271 193 450 -279 222 -56 -285 360 190 -461
10880 -461 356 -439 -167 284 -335 -165 738 9 -44 346 -182 -278 56 100 -339 -97 -293 -75 -2 46 -167
$$ packed form
10737B86r62K46O34p29J64L84n56L31O34m60j70K45k30n9N44o71l7Q68p59L93
10757I6O4o71O81k35p12K94M09K83j60L73j117Q59L44o45M46n10n0K31N0k32L30
10778A28m83J81P06o50k53M50K60l85K11J27k44K06r6Q7J21o27J28N98k52m03
10798a90O8R1J16P4k02ML43o03M40L58q51J86O31p32j51N93o30M69K26l79P35
10819E96m50p58J037k39J98k26P2m80M29k71m35P74m64o4K66K36o64O76l4m38
10839b39O25m70l62P47l04M5o7l97L09N67p48O32j1j06p4l25L73m10L9l21O11
10860A14j17j59J66K26k55j72N47j06j90P7m02M64K57p29N01k78k29O45j70o51
10880d61Q17p95K72M51o19J70R03p29n3L90n28r6L34M4m39K42j96K18P3M8k13
$$ plain form
10901 -167 283 -331 -130 474 39 -252 394 -297 -20 619 50 124 332 -371 359 294 4 261 -147 -447
10921 -447 42 565 -371 405 641 -234 445 -12 -453 303 84 -409 -149 -655 -115 115 84 -323 46 -149
10941 -149 -154 103 420 -446 -16 -227 -205 302 -124 151 77 -684 -333 276 -240 -361 565 -505 -304 376 -424
10962 -424 -132 200 -2 -124 399 -147 714 392 -302 198 305 -438 -33 183 -605 240 479 -414 355 215
10982 215 -789 106 453 -216 402 -103 -264 579 216 -281 562 162 -113 427 271 -453 959 -173 -276
11001 -276 417 -490 137 -6 -370 -165 684 -410 236 219 -804 256 -12 -732 163 130 -290 610 416
11020 416 -251 564 179 -450 532 -154 -425 49 -324 18 222 -334 -133 -4 -129 -259 -86 -195 36 181
11040 181 303 -527 131 -564 -390 222 -66 -31 92 -204 -139 -18 -395 -148 197 -282 -138 57 -62 -259
$$ packed form
10901a67M50o14K01O04m35k91O46o91K77O39n69P4K08p03P30o5k90K57m08l00
10921d47M89N23r36P76K36q75O79m57m41P56k19m93K60n06N40K30l1m07L69j95
10941a49nK57L17q66M30k11K2N07m26K75p4p61L51O09n16j21R26j070K01O80q00
10962d24K92L32k02j22N23n46Q61l22o94N00J07p43M05K16p88Q45K39q93P69j40
10982B15j004Q95L47o69O18n05j61Q43l63m97Q43m00k75N40j56p24J412j132j03
11001b76O93r07O27j43l64K05Q49j094O46j7j023J060k68p20Q95l3m20R00j94
11020D16o67Q15l85o29R82o86k71M74l73L42K04n56K01J29j25j30J73j09K31J45
11040A81J22q30O58o95J74O12k88L5J23k96O5J21l77K47L45m79J44J95j19j97
$$ plain form
11060 -259 206 -188 -329 51 35 -338 496 -32 253 -100 -432 240 323 -639 -49 69 -578 -243 198 -214
11080 -214 -123 516 -520 310 159 -228 487 332 113 694 82 -283 710 -206 479 80 88 -67 295 201 -312
11101 -312 116 -320 -237 186 -150 158 339 112 411 496 -510 142 71 -744 -66 -96 -488 -83 -181 -591 -61
11122 -61 -88 -357 329 237 -116 569 -90 -339 59 -210 -598 503 -180 -104 -58 -121 -409 195 -506 -250 44
11143 44 376 -673 85 -220 45 591 -386 101 436 -135 24 301 -107 -125 314 153 62 152 -577 248 528
11164 528 -385 -207 254 -35 -174 -77 -130 494 344 -577 378 340 114 436 -70 -314 -88 4 18 463 -152
11185 -152 -243 -358 88 -393 998 -692 -166 373 217 277 275 -2 -446 569 31 -665 417 42 -153 -303
11205 -303 -272 -95 -35 -243 118 141 -274 160 272 -183 128 689 -326 781 342 -265 66 434 -464 -376
$$ packed form
11060b59M65l94j41L80j6l73Q34n28K85l53l32O72Q3r62N90J18o47L35M41m12
11080b14R1O39j036Q30j51l87P15j55k19N81o12l65R93r16O85l99Qj55L62r4n13
11101c12M28m36Q3M23l36L08J81k27K99Q5j006O52p1q15O78l0l92M05r8m10N30
11122f1k7k69O86r2l53O85o59k49L98k69l88J101o83P6M6o3k88O04p01K56K94
11143D4L32j049P58l05K65N46r77M87L35n71J59K77m08j8M39j61r1R0p29Q25K80
11164E28r13J78M61k89j39R7n3O24j50r21R55l8k26L22n06k44K26R2J4M45o15
11185a52r1j15M46m81J391j690N26N39j56O0kk77m44J015n38o96J082l75j95j50
11205c03L1J77O0k08L61K3m15M34J12m55L11N61j015J107m39o07L31L68q98Q8
$$ plain form
11225 -376 39 -336 411 -234 -237 264 83 -20 27 1 -627 158 130 -88 25 -360 -533 250 -9 56 347 115
11247 115 200 -30 -378 -439 627 -187 -20 554 -694 77 182 -36 53 -83 -334 -386 537 -502 451 354
11267 354 -516 135 387 -100 170 -275 -395 312 197 -265 591 -101 -701 651 59 -656 36 8 -762 251
11287 251 -421 87 -10 -131 -307 -40 -195 -550 436 49 -565 438 -113 -457 560 -188 235 792 -252
11306 -252 -308 84 -120 185 152 -394 84 -113 -507 405 89 41 140 71 -275 39 -66 -950 320 -359 -330
11327 -330 434 399 -441 -564 41 -505 263 -384 114 194 -652 -642 270 327 -232 253 -317 -248 635 192 -478
11348 -478 99 110 91 290 45 -7 232 160 -148 340 -494 34 570 -198 417 101 -230 210 683 -919 440
11369 440 409 -201 221 621 -384 -250 345 -321 192 -193 101 192 46 -225 191 271 77 256 -277 -424
$$ packed form
11225c76M15l75P47o45lN01j81j03M7k6o28P85k8k18J13l85j73P83k59O5K91k32
11247A15Q5k30l48o1J066q14J67N74j248P71J05k18Q9j36k51n2R23j039R53r7
11267C54q70O51K52m87K70m45j20P07j15m62Q56o92o00J352n92p15O92k8p70J013
11287B51o72N08r7j21j76K67j55l55R86l87o14J003n51l44J017p48M23N57j044
11306b52n6L92k04L05l3n46M78j97l94R12l16m8R9o9l46L14j05q84J270o79K9
11327c30P64l5q40j23O05n46P68o47M98Q0q46J0R12N7n59M85n70O9Q83m43o70
11348d78N77J1j9J99k45n2K39p2l08M88q34N28N36p68O15l16l31M40M73j602J359
11369D40l1o10M22M00j005J34N95o66N13l85K94R1j46k71M16Q0j94J79n33j47
$$ plain form
11389 -424 261 -14 -254 127 -80 3 753 -263 435 182 -536 -451 573 -477 61 476 -280 80 449
11408 449 -342 20 117 -105 249 492 -228 63 123 -258 132 474 -416 -191 202 11 -139 274 -495 235
11428 235 -209 -961 243 -233 10 226 19 -306 397 593 62 403 -435 -27 888 87 -241 664 -118
11447 -118 -276 202 -23 58 282 -245 -48 211 -97 6 346 -334 44 623 -497 35 289 -838 37
11466 37 141 24 -278 378 -74 -134 581 -311 -5 24 -126 -416 -77 -406 -10 268 -226 55 133 -519 547
11487 547 -458 177 536 -474 -16 281 -57 -316 370 223 -408 -332 7 -370 157 -176 -45 381 -535
11506 -535 -37 683 206 90 190 -280 261 333 26 -159 397 -581 -155 21 -133 510 122 -778 -31 140
11526 140 -728 9 -118 -402 181 282 79 371 311 -447 109 24 -418 563 -195 -480 573 141 66 266
$$ packed form
11389d24O85k75k40L81k07Q3P50j016O98k53p18Q5J024j050N38M15p56L60L69
11408D49p91L62R7k22L54K43p20K91O0l81L90L42q90K25L93j91j50M13p69P30
11428B35m44p52J204m76K43K16k07l25P03J96n31L41q38M08R15q01l28R05p82
11447a18j58M78k25Q1K24n27J97K59l08J03L40o80L78N79j120N32K54j127Q75
11466C7J04j17l02O56m52o0P15q92L06K9j50k90L39l29L96K78m94K81P8o52J066
11487E47j005O35L59j010M58K97l38k59O86j47o31P6L39l77N27l33J31M26r16
11506e35M98P20m77j16J00m70N41P2l07j85N56r78M26J76j54O43l88r00P47J71
11526A40q68P37j27k84N83J01k03K92o0p58N56q5m42R81p58k85J053m32p5K00
$$ plain form
11546 266 212 -143 397 -312 8 193 -268 66 9 -316 -94 149 -250 92 298 -510 -103 141 -386 104
11566 104 426 -422 352 386 -509 201 -192 -410 -167 -87 -270 309 -304 129 -104 290 -194 285 -142 176
11586 176 105 532 -170 302 422 -11 141 -327 -358 777 -359 -464 -271 305 198 318 -67 12 483 -64
11606 -64 258 -78 -470 33 376 -300 -50 705 -567 -133 411 -301 229 177 -418 244 180 -562 195 74
11626 74 -122 -27 387 -397 494 -379 -55 327 155 -105 635 -117 -368 10 -354 152 147 -105 -523 25 129
11647 129 329 351 -254 -284 3 52 169 161 -109 -60 495 -751 307 638 183 -238 -118 -181 290 428 -664
11668 -664 2 215 7 384 116 62 58 -62 -160 -40 176 -333 173 126 109 -15 332 -176 593 75 -34 115
11690 115 -304 41 -147 -735 138 448 -34 -198 238 -319 -503 530 -94 -154 -6 -451 120 518 -154 53
$$ packed form
11546B66n4l55N40p09L20J85m61L34n7l25K22K43l99L42K06q08M07K44n27M90
11566A04L22q48P74L4q95P10l93k18K43Q0j83N79o13M33k33L94m84M79m27L18
11586A76p1M27p02M72J20m33J52m68l1J135j136j05J93N76j07J20l85P9M71n47
11606f4L22l36l92N03L43o76K50P55j272M34N44p12N30n2n95O62o4p42P57j21
11626G4j96R5M14p84Q91q73L24L82j72k60P40p52k51L78l64N06nk52m18N48J04
11647A29K00K2o05l0K87M9J17qk70M9N55j246J058L31m55m21J20o3M71J38j092
11668f64O66K13k08L77k68n4mj20r8J20K16n09N06m7j7j24L47n08P69n18j09J49
11690A15m19L45j88n88Q73L10m82j64M36n57j84J033o24o0J48m45N71L98o72K07
$$ plain form
11710 53 92 -19 -109 415 -469 675 61 275 126 332 -304 470 260 -799 -79 90 322 127 -246 -16
11730 -16 231 154 -248 272 -207 -431 286 530 -607 486 -77 8 663 55 -343 183 57 -71 582 -494
11750 -494 -327 373 64 -432 1 -397 -73 22 -263 -207 -11 -99 261 -85 -49 132 19 -448 -162 359 -604
11771 -604 665 -87 -242 303 357 -86 231 496 -159 300 -260 61 547 -357 -281 622 -38 -53 193 -128
$$ packed form
11710E3L9j11r0N24q84J144o14K14j49K06o36P74k10j059P20J69K32j95l73K30
11730a6K47p7m02N20m79k24P17K44j137J093n63Q5O55o08l98N26j26j28O53j076
11750d94J67P00l09m96M33l98L24R5k85N6J96q8L60l46L6J81j13m67K86N21r63
11771f04J269p52j55N45N4m43L17K65o55M59n60L21M86r04P6R03o60j5K46l21
$$ [...]
16383C81
##END NTUPLES=NMR FID
##END=
