##TITLE=31Pdec_LR-740-02b
 D2O, 24 sc
 26.10.2021
##JCAMPDX= 6.0         $$ Bruker NMR JCAMP-DX V2.0
##DATA TYPE= NMR FID
##DATA CLASS= NTUPLES
##ORIGIN= UXNMR, Bruker Analytische Messtechnik GmbH
##OWNER= root
$$ XWIN-NMR		Version 3.5
$$ Tue Oct 26 09:33:43 2021 Russian Standard Time (UT+4h)  she@DPX200
##.OBSERVE FREQUENCY= 81.013821
##.OBSERVE NUCLEUS= ^31P
##.DELAY= (6, 6)
##.ACQUISITION MODE= SIMULTANEOUS
##.ACQUISITION SCHEME= undefined
##.AVERAGES= 24
##.DIGITISER RES= 16
##SPECTROMETER/DATA SYSTEM= spect
##.PULSE SEQUENCE= zgpg30
##.SOLVENT NAME= CDCl3
##.SHIFT REFERENCE= (INTERNAL, CDCl3, 0, 243.863)
##AUDIT TRAIL= $$ (NUMBER, WHEN, WHO, WHERE, WHAT)
$$ ##TITLE= Audit trail, XWIN-NMR		Version 3.5
$$ ##JCAMPDX= 5.01
$$ ##ORIGIN= Bruker BioSpin GmbH
$$ ##OWNER= she
$$ F:/spectra/data/she/nmr/P31/1/audita.txt
$$ ##AUDIT TRAIL=  $$ (NUMBER, WHEN, WHO, WHERE, WHAT)
(   1,<2021-10-26 09:32:19.39 +0400>,<she>,<DPX200>,
      <created by zg, POWCHK disabled, PULCHK disabled
       configuration hash MD5:
       00 E9 B6 7A A2 85 ED C7 34 08 36 98 17 FE 4E 26
       data hash MD5: 32K
       C5 D2 BC 3F F1 D2 6B 65 5B 72 56 88 1F 02 14 15>)
$$ ##END=
$$ 
$$ hash MD5
$$ EC 9B 52 0A 71 D6 15 C3 7F 85 3B 7A 24 F0 DE 7B
##$RELAX= 
##$RELAX= 
##$RELAX= 
##$RELAX= 
##$RELAX= 
##$RELAX= 
##$RELAX= 
##$RELAX= 
$$ Bruker specific parameters
$$ --------------------------
##$DU= <F:/spectra>
##$EXPNO= 1
##$NAME= <P31>
##$PROCNO= 1
##$TYPE= <nmr>
##$USER= <she>
##$AMP= (0..31)
100 100 100 100 100 100 100 100 100 100 100 100 100 100 100 100 100 100 
100 100 100 100 100 100 100 100 100 100 100 100 100 100 
##$AQSEQ= 0
##$AQ_mod= 1
##$AUNM= <au_zg>
##$AUTOPOS= <>
##$BF1= 81.014009
##$BF2= 200.13
##$BF3= 200.13
##$BF4= 200.13
##$BF5= 200.13
##$BF6= 200.13
##$BF7= 200.13
##$BF8= 200.13
##$BYTORDA= 1
##$CFDGTYP= 0
##$CFRGTYP= 5
##$CHEMSTR= <none>
##$CNST= (0..31)
1 1 145 1 1 1 1 1 1 1 1 1 1 1 1 1 1 1 1 1 1 1 1 1 1 1 1 1 1 1 1 1 
##$CPDPRG= <waltz16>
##$CPDPRG1= <>
##$CPDPRG2= <waltz16>
##$CPDPRG3= <>
##$CPDPRG4= <mlev>
##$CPDPRG5= <mlev>
##$CPDPRG6= <mlev>
##$CPDPRG7= <mlev>
##$CPDPRG8= <mlev>
##$CPDPRGB= <>
##$CPDPRGT= <>
##$D= (0..31)
0 1 0 0 0 0 0 0 0 0 0 0.03 2e-05 3e-06 0 0 0 0 0 0 0 0 0 0 0 0 0 0 0 0 
0 0 
##$DATE= 1635226338
##$DBL= (0..7)
120 120 120 11 120 120 24 19 
##$DBP= (0..7)
150 150 150 150 150 150 150 150 
##$DBP07= 0
##$DBPNAM0= <>
##$DBPNAM1= <>
##$DBPNAM2= <>
##$DBPNAM3= <>
##$DBPNAM4= <>
##$DBPNAM5= <>
##$DBPNAM6= <>
##$DBPNAM7= <>
##$DBPOAL= (0..7)
0.5 0.5 0.5 0.5 0.5 0.5 0.5 0.5 
##$DBPOFFS= (0..7)
0 0 0 0 0 0 0 0 
##$DE= 6
##$DECBNUC= <off>
##$DECIM= 3
##$DECNUC= <off>
##$DECSTAT= 4
##$DIGMOD= 1
##$DIGTYP= 9
##$DL= (0..7)
0 0 52 120 120 21 21 25 
##$DP= (0..7)
150 150 150 150 150 150 150 150 
##$DP07= 0
##$DPNAME0= <>
##$DPNAME1= <>
##$DPNAME2= <>
##$DPNAME3= <>
##$DPNAME4= <>
##$DPNAME5= <>
##$DPNAME6= <>
##$DPNAME7= <>
##$DPOAL= (0..7)
0.5 0.5 0.5 0.5 0.5 0.5 0.5 0.5 
##$DPOFFS= (0..7)
0 0 0 0 0 0 0 0 
##$DQDMODE= 0
##$DR= 16
##$DS= 0
$$ [...]
##$SUBNAM1= <"">
##$SUBNAM2= <"">
##$SUBNAM3= <"">
##$SUBNAM4= <"">
##$SUBNAM5= <"">
##$SUBNAM6= <"">
##$SUBNAM7= <"">
##$SUBNAM8= <"">
##$SUBNAM9= <"">
##$SW= 501.771253377433
##$SWIBOX= (0..15)
0 1 3 0 0 0 0 0 0 0 0 0 0 0 0 0 
##$SW_h= 40650.406504065
##$TD= 32768
##$TD0= 1
##$TE= 0
##$TE2= 300
##$TE3= 300
##$TEG= 300
##$TL= (0..7)
0 120 53 12 22 120 120 120 
##$TP= (0..7)
150 150 150 150 150 150 150 150 
##$TP07= 0
##$TPNAME0= <>
##$TPNAME1= <>
##$TPNAME2= <>
##$TPNAME3= <>
##$TPNAME4= <>
##$TPNAME5= <>
##$TPNAME6= <>
##$TPNAME7= <>
##$TPOAL= (0..7)
0.5 0.5 0.5 0.5 0.5 0.5 0.5 0.5 
##$TPOFFS= (0..7)
0 0 0 0 0 0 0 0 
##$TUNHIN= 0
##$TUNHOUT= 0
##$TUNXOUT= 0
##$USERA1= <user>
##$USERA2= <user>
##$USERA3= <user>
##$USERA4= <user>
##$USERA5= <user>
##$V9= 5
##$VALIST= <valist>
##$VCLIST= <CCCCCCCCCCCCCCC>
##$VD= 0
##$VDLIST= <DDDDDDDDDDDDDDD>
##$VPLIST= <PPPPPPPPPPPPPPP>
##$VTLIST= <TTTTTTTTTTTTTTT>
##$WBST= 1024
##$WBSW= 4
##$XGAIN= (0..3)
0 0 0 0 
##$XL= 0
##$YL= 0
##$YMAX_a= 2199
##$YMIN_a= -2441
##$ZGOPTNS= <>
##$ZL1= 120
##$ZL2= 120
##$ZL3= 120
##$ZL4= 120
##$ABSF1= 60
##$ABSF2= -190
##$ABSG= 5
##$ABSL= 3
##$ALPHA= 0
##$AQORDER= 0
##$ASSFAC= 0
##$ASSFACI= 0
##$ASSFACX= 0
##$ASSWID= 0
##$AUNMP= <proc_1d>
##$AZFE= 0.1
##$AZFW= 0.5
##$BCFW= 1
##$BC_mod= 2
##$BYTORDP= 1
##$COROFFS= 0
##$CY= 9.86611175537109
##$DATMOD= 1
##$DC= 1
##$DFILT= <>
##$DTYPP= 0
##$F1P= 248.564497384935
##$F2P= -679.521563365616
##$FCOR= 0.5
##$FTSIZE= 0
##$FT_mod= 0
##$GAMMA= 1
##$GB= 0
##$INTBC= 1
##$INTSCL= 1
##$ISEN= 30
##$LB= 1
##$LEV0= 0
##$LPBIN= 0
##$MAXI= 11.51145
##$MC2= 0
##$MEAN= 0
##$ME_mod= 0
##$MI= 1.244541
##$NCOEF= 0
##$NC_proc= 0
##$NLEV= 6
##$NOISF1= 0
##$NOISF2= 0
##$NSP= 1
##$NTH_PI= 0
##$NZP= 1
##$OFFSET= 243.8632
##$PC= 1.4
##$PHC0= -8705.26
##$PHC1= -220.7311
##$PH_mod= 0
##$PKNL= yes
##$PPARMOD= 0
##$PSCAL= 0
##$PSIGN= 0
##$REVERSE= no
##$SF= 81.0140731611343
##$SI= 65536
##$SIGF1= 0
##$SIGF2= 0
##$SINO= 80
##$SIOLD= 65536
##$SREGLST= <31P.CDCl3>
##$SSB= 0
##$STSI= 0
##$STSR= 0
##$SW_p= 25641.0256410257
##$SYMM= 0
##$S_DEV= 0
##$TDeff= 0
##$TDoff= 0
##$TI= <>
##$TILT= no
##$TM1= 0
##$TM2= 0
##$TOPLEV= 0
##$USERP1= <user>
##$USERP2= <user>
##$USERP3= <user>
##$USERP4= <user>
##$USERP5= <user>
##$WDW= 1
##$XDIM= 64
##$YMAX_p= 0
##$YMIN_p= 0
$$ End of Bruker specific parameters
$$ ---------------------------------
##NTUPLES= NMR FID
##VAR_NAME=  TIME,          FID/REAL,        FID/IMAG
##SYMBOL=    X,             R,               I
##VAR_TYPE=  INDEPENDENT,   DEPENDENT,       DEPENDENT
##VAR_FORM=  AFFN,          ASDF,            ASDF
##VAR_DIM=   16384,         16384,           16384
##UNITS=     SECONDS,       ARBITRARY UNITS, ARBITRARY UNITS
##FACTOR=    2.46e-05,      1,               1
##FIRST=     0,             0,               0
##LAST=      0.4030218,     0,               0
##MIN=       0,             -2441,           0
##MAX=       0.4030218,     2199,            0
$$ Real data points
##PAGE= N=1
##DATA TABLE= (X++(R..R)), XYDATA
$$ [...]
10663A05q95L67O91m93K77k12l1j59P01l22l26K59k47J65O15l97l17O99p43K76
$$ 105 -790 -423 268 -225 52 -160 -191 -350 351 29 -297 -38 -285 -120 495 98 -219 480 -263 13
10683A3N31p60J46M22l88n1J57l15q8N40n40L41L27o58R7J99K82k76l22K63M48
$$ 13 544 -216 -70 352 -36 -87 70 -245 -333 207 -333 8 335 -323 -226 -27 255 -21 -343 -80 368
10704C68n68K9j43O35q14J012o66l23P71k82l03Q51p06l06K63l00M53L57n18o
$$ 368 -200 -171 -314 321 -493 519 -147 -470 301 19 -284 567 -139 -445 -182 -482 -29 328 -190 -196
10724a96O02q71L13K11k63R1K83l18L54j22j76r7N76m64k70J23j43L50J62l35
$$ -196 406 -465 -152 59 -204 -113 170 -148 206 84 -92 -189 387 -77 -347 -224 -367 -17 145 -190
10744a90L05l02K63M72k99m09N32J21J36j36k44m19J89k86l00R69q57K67O36n66
$$ -190 115 -187 76 548 249 -160 372 493 629 493 249 -170 19 -267 -567 402 -455 -188 448 -118
10764a18MM48k26O3M9l67m70R20j81m10j69K06J66M74l62m83K66L51M1m35k33
$$ -118 -114 334 108 171 220 -147 -617 303 122 -288 -457 -251 -85 389 27 -456 -190 161 202 -233 -466
10785d66j44O90j71N36l73m23J74L83n55R81J8j356P73k03l26N61m80K5K59J65
$$ -466 -610 80 -91 445 72 -351 -177 206 -349 632 650 -706 67 -136 -462 99 -381 -356 -97 68
10805F8n80L71K91rJ4j20K4K7J39l57j01K18j29J06j62m21J007m07q20J292q00
$$ 68 -512 -141 150 141 155 35 59 86 225 -132 -233 -15 -144 -38 -200 -621 386 -21 -841 451 -349
10826c49O22q7k67n42Q29p7L06K10p67M04P5q15P31k04p12Q64l05k54L57k94J53
$$ -349 273 186 -81 -623 206 129 435 645 -122 282 357 -458 273 69 -643 221 -84 -338 19 -275 -122
10847a22K73K57p27N45m35n54L99J82Q7L43j19r99J455p87L62M41l39n34O32m38
$$ -122 151 408 -319 226 -209 -763 -364 -182 -95 248 129 -870 585 -202 160 601 262 -272 360 -78
10867g8l47J07N76p13M23p2K69o5n10P84j12l42p3L92m06Q4M3j43l70J030p39
$$ -78 -425 -318 258 -455 -32 -104 165 100 -410 374 262 -80 -153 239 -167 -83 -40 -183 -553 477 -262
10888b62J95l9j47J144n47l45r7N87q72P06j63j62M4j66k03P68o27j48Q65n19
$$ -262 -67 -106 -253 891 344 -1 -98 489 -383 323 160 -2 42 -124 -327 441 -186 -334 531 12
10908A2m09N89r2n66M68n71L66N07j92m77N01k7r4P37j191L89M08j99n86J059
$$ 12 -397 192 100 -466 2 -569 -203 304 112 -365 136 109 15 752 -439 -50 358 159 -427 632
10928F32j398N25M48n98L7P02p37L71P40p68J79L00p60K09O8j94L75L28m9r39
$$ 632 -766 -241 207 -391 -354 348 -389 -18 722 -46 133 433 -327 -118 -50 -244 131 459 410 -529
10948e29Q71p47K86M70j024R55N8l48N00q2p99N78k11Q5L51p66O08K19m96k63
$$ -529 342 -405 -119 351 -673 282 340 -8 492 410 -389 189 -22 63 414 -352 256 475 -21 -284
10968b84O8O40q31N16k6j52N55l50j73j20m7N94l7k49n10N74o89L99N55k57l53
$$ -284 -216 424 -407 109 83 -69 486 136 -37 -157 -204 390 353 104 -406 168 -521 -122 433 176 -177
10989a77J8K16m1O47r78L57P92j164L24k1p46J012p3l3M32k46l81J80k26m33O82
$$ -177 -159 57 16 663 -315 42 834 -330 -6 -27 -773 239 166 133 565 319 -62 118 -108 -541 141
11010A41l14K33J31k61j04O93q56K39L98m86M0K80l08JN24p05K04M61n03q5K33
$$ 141 -173 60 191 -70 -174 519 -337 -98 300 -186 -146 134 -174 -173 351 -354 -150 311 -192 -277 -44
11031d4m8lP4n03J48P39j112O12K16n98Q13J51k95P9%o51N40P3n76Q12J17j007
$$ -44 -92 -95 -21 -524 -376 363 -749 -137 79 -519 294 445 150 229 229 -422 118 191 -385 427 544 -463
11053d63Q39m9n98J44L93l02K03k25k85M82n67M32J19K85j80K93k60k26L80p68
$$ -463 376 327 -271 -127 266 -36 167 -58 -343 139 -428 4 123 408 228 521 261 35 415 -353
11073c53L96M83l29k00N76q26K40L65o33M7P74l20j79N8l33j31O93o83l02P25
$$ -353 43 526 197 -3 573 -253 -13 352 -281 -234 540 220 41 99 -234 -365 328 -355 -657 68
11093F8k51Q61o33l82M56K78q76M06J72m54M32L28m86l93K41l52R31n23l23P25
$$ 68 -183 678 45 -337 119 397 -479 -73 99 -355 77 405 -81 -474 -233 -585 346 -177 -500 225
11113B25j95n49M54l26K18N40l99J85N57r91K37O61p25N8Q2m57K46K14n35N48
$$ 225 30 -519 -65 -391 -173 367 -32 153 710 -281 -44 617 -108 -50 32 -425 -179 35 -500 48
11133D8O8o11M28K04l09M35n60L65k51L12j92P5L13J53j95P4o02L72k37k58M53
$$ 48 116 -495 -67 137 -172 263 -297 68 -183 129 -63 12 325 478 283 357 -245 127 -110 -368 85
11154H5M60q45J58N7J37L01k12r33J219l36l55P00p78M71M5n73J34L81n60M93
$$ 85 545 -300 -142 -85 52 353 141 -792 427 91 -264 436 -342 129 174 -399 -265 116 -444 49
11174D9m0o64N59O74p30K6M47o39K27O10l85K7j91p5p4O64m88K61j89o14L19K50
$$ 49 9 -655 -96 578 -152 -126 321 -318 -91 519 134 161 -30 -105 -179 485 -3 258 69 -545 -226 24
11196B4m25K48J00j36K93n39J72L2J41j4L11j46l35O31n29J50K65o72O8N47j45
$$ 24 -401 -153 -53 -189 104 -435 -263 -231 -90 -104 207 61 -274 357 -172 -22 243 -429 -361 186 41
11217D1j62L17m47l4O19p6o43P26r18J85K88N69k86P8n57j19K89J69J68K44j327
$$ 41 -121 196 -251 -285 334 258 -385 341 -577 -392 -104 465 179 257 -300 -419 -130 39 207 451 -876
11238h76Q92K94n69N07j74n91M76L55r48N91J75n60L83k7j83L43l64j11R9K06
$$ -876 16 310 -259 248 74 -517 -41 314 -634 -43 132 -428 -45 -72 -255 88 -276 -387 -288 -82
11258h2k89L84m6j29M89j35n53Q39o54M02J43n57J26O36o91Q7%o4n8K86o83L91
$$ -82 -371 13 -33 -162 327 192 -361 478 -176 226 369 -188 -62 574 -117 -30 -30 -94 -152 134 -549 -158
11280a58R82j230K74M87l47k5O41r97L50J94n28L52M49l86M9L17p30K25L62m86
$$ -158 824 -406 -132 355 8 -17 624 -373 -23 171 -357 -5 444 58 107 424 -306 -81 281 -205
11300b05J16p2m94M34O42q33J186m62n87L33m8l53O70q61K41O60m56l20L88k07
$$ -205 -89 -161 -655 -221 421 -412 774 312 -275 58 10 -343 327 -534 -293 367 -89 -409 -21 -228
11320b28L32j51r3m11Q39k61l82Q89j97l41O07p92o5O50q27M13M25l80N4J34j20
$$ -228 104 -47 -140 -551 288 27 -355 534 337 -4 603 -189 -254 396 -431 -18 407 27 81 215 95
11341I5K55K69j288J090j80r51Q79p1p6M77n69r3O13n44J40L79k04p27Q38m12
$$ 95 350 619 -669 421 241 -710 169 98 22 499 -70 -163 450 -94 46 425 221 -506 332 -80
11361h0L0Q08o52k92O57m95n17J079j057L2N23j21J26K23p71M98K72o44L05K91
$$ -80 -50 758 106 -186 471 -24 -541 538 -519 -487 36 -85 41 264 -507 -9 263 -381 -76 215
11381B15M0m4Q1l53L07k87l05M37J88l97K8L82q01O59m27m82J074m37m7L49j18
$$ 215 255 211 292 -61 246 -41 -346 91 279 -118 -90 292 -509 150 -277 -759 315 -122 -169 180 62
11402F2k92J42k08k84Q84r4m4j49r0k17P14n03j12N21j84l70K78k35j02Q77p47
$$ 62 -230 -88 -296 -580 304 210 166 17 -73 -290 424 -79 -191 330 146 -224 54 -181 -283 594 -153
11423a53j0O42p92l75J264p94J27L11j23j69K65m20Q9M62k55K47L65p86j34M56
$$ -153 -163 479 -313 -688 576 -218 -91 220 97 -72 193 -227 -138 324 69 316 681 -105 -239 217
11443B17m09j46L01K97l06J57k49L79K8n94P49l91n3J35J33m45J47l52j11M22
$$ 217 -192 -338 -37 260 -46 111 -138 241 269 -325 424 33 -20 115 248 -197 -50 -402 -513 -91
11463i1l0l74R52o6n83K57m28M28k14L98p58K18m4L32J28O2p44O78q8l06P91l62
$$ -91 -121 -495 457 391 -192 65 -363 65 -149 249 -509 -291 -335 -3 125 187 -557 121 33 -273 518 156
11485A56J30P9l40n2L46p70O74m02l38O21k0k53J42N37o22Q3L0j81K83j73p30
$$ 156 286 365 25 -27 319 -451 223 -179 -517 104 84 -169 -27 510 -112 -29 1 -180 103 -70 -800
11506h00J087l41J2L89k05j80J52l31N2J049l30q56N86l79j32P52o87O5L43m46
$$ -800 287 -54 -42 347 142 -38 114 -217 -165 884 554 -302 284 -95 -227 525 -162 -97 246 -200
11526b00L60n25O27p43K14k15K64L08n63J38M75k65J49J40j91l1M22l71J59K91
$$ -200 160 -365 262 -481 -267 -482 -218 90 -473 -335 140 -125 24 164 -27 -58 364 -7 152 443
11546D43j228O57n6l88N30K2m02R79j70q89L48J80k8Q5j48j16K30k30j67P87n19
$$ 443 -785 -128 -184 -572 -42 -20 -422 557 387 -502 -154 26 -2 83 -65 -181 49 -181 -348 439 -80
11567h0j47P21j027N15K53m69j52N21k04r5K24n77M90j0j25N1L21n94P9O31l76
$$ -80 -227 494 -533 -18 235 -234 -386 135 -69 -164 60 -517 -27 -37 -162 -111 210 -384 -305 326 -50
11588e0o5K50o83O30j67o94J081l0m26J33m0K31j12M81n16R0r6p81Q88k25j87
$$ -50 -115 135 -548 82 -85 -779 302 272 -154 -21 -61 170 58 539 23 113 17 -764 124 -101 -288
11609b88N43q19j32J193p08K21K8j8m23M41m67M38J77n36L98J8j83j82N02k7j80
$$ -288 255 -564 -696 497 -211 10 38 20 -403 38 -429 9 186 -350 48 66 -117 -299 203 176 -4
11630dN92q74K57J28m90N45R2L90p27J85o9L98o42K92j64L93m83N14M5r94P32
$$ -4 588 -286 -29 99 -391 154 246 636 -91 94 25 423 -219 73 -91 302 -181 333 378 -616 116
11651A16j50m84R17l95p3P9o1l36Q40j16m37N16p25K05K09k17n18R24m54l8P19
$$ 116 -34 -518 399 4 -69 10 -51 -387 453 337 -100 416 -309 -104 105 -112 -630 294 -160 -198 521
11672E21o05o8P08p69K80j0J9j31N07o61L98m7j41L76k75m55M8P31q36k05J155
$$ 521 -84 -152 556 -213 67 57 76 -55 452 -209 189 142 1 377 102 -353 -305 426 -410 -615 540
11693E40q74M85k86m04R04j30m74K52k53n21R67k28j43J74k04J03K64m40L4M71
$$ 540 -334 151 -135 -539 365 235 -239 13 -240 -761 206 -22 -165 9 -195 -92 172 -268 -234 237
11713B37n76K07P8J49j68M76l43o14P13k25j13m0l52K2P53p78M33P45o59k2M90
$$ 237 -339 -132 -54 95 -73 403 60 -554 159 -66 -179 -219 -571 -549 204 -574 -141 604 -55 -77 413
11734D13p02K8J150j284O17j2p29R16j60j30L59k35l27L87o5j123J215n29m29
$$ 413 -289 -261 889 -395 222 210 -519 397 237 107 466 231 -96 291 226 -897 318 -211 -640
11753f40Q83m60K78j42M78p61N86k04k17Q21j00p37P34j085J2J094j045j36J256
$$ -640 243 -217 61 -81 397 -364 222 18 -199 622 522 -215 519 -566 -554 540 -505 -641 615
11772F15n05m0L10n18O37n13j85L33M78p41J44M63p33K92M67p66K59J78o34N56
$$ 615 110 70 380 -138 499 -14 -199 134 612 -129 15 478 -255 37 504 -262 -3 175 -459 97
11792I7l50K92J28j82p73J576r59n09P02j57k68Q20n08Q5J35o56M1N76k37O5L09
$$ 97 -253 39 167 -15 -788 788 -171 -680 22 -135 -403 417 -91 -6 129 -527 -486 90 -147 -82 227
11813B27l60R4PM4OL60o78k04R58l31m33Q61l34l39N01o37P19q6n52l13N33o7
$$ 227 -133 -39 -32 12 18 378 -300 -504 454 123 -310 551 217 -122 379 -258 461 375 -177 -490 43 -24
11835b4l2M40m39L04j07n74L87L99n08N13m99o65R20M11n16N92l60l01K66nm72
$$ -24 -56 384 -55 249 142 -432 -45 354 -154 359 -140 -805 115 526 10 602 242 -59 207 202 -270
11856b70J034q01j036J283m69k19O50j0m74N23k09j31O31j048L94P89p23O49k24
$$ -270 764 -37 -1073 210 -259 -478 172 162 -312 211 2 -129 502 -546 -152 637 -86 563 339
11875C39n78J27P1J38l76J183j419M80N93r53L98L09m70K24J6l12M3K19j82J86
$$ 339 -239 -112 -41 97 -279 904 -515 -35 558 -395 3 312 -158 66 82 -230 -187 32 -150 36
11895C6l02r3M78l29n9N90k65k78K3J39k42J63p5j53P68q5n38N00j58l58J077
$$ 36 -266 -359 119 -210 -269 321 56 -222 -199 -60 -302 -139 -214 -367 401 316 -222 278 120 -238 839
11916H39o28j20O2k19j86M64l16k65N54p60O27P4l83N06k9n56K35O7J44P5M80
$$ 839 211 91 153 -66 -252 212 -104 -369 185 -575 52 126 -257 249 220 -336 -101 -34 110 185 665
11937F65p16J10Q1j60M41n36l91O93M1l92O35l7r02J87P55o31P3J86n57M65L04
$$ 665 -51 59 140 -20 421 -115 -506 187 228 -164 471 434 -468 -281 474 -157 -84 102 -455 10 314
11958C14l98P3L6k92N70l79J93L08m01k9l3J84J14L20p34j54K60j39L66j70m45
$$ 314 -84 -11 25 -267 303 -76 117 425 24 -5 -38 146 260 580 -154 -308 -48 -187 179 9 -436
11979d36M09K97o34O17M47o99l12J61K14j51L17l27P60m26o61M44K63p48O38j18
$$ -436 -27 270 -364 253 700 1 -311 -150 64 -87 230 -97 663 237 -424 20 283 -465 173 55
11999E5j29l7J47j99L15L32m78Qk89J18L58j92p1L41m32n4K76l28p2M49k80k10
$$ 55 -74 -111 36 -163 152 484 6 14 -275 -157 201 9 -62 279 -153 -207 69 -259 -331 118 -162 -372
12021c72M42J74r8q9k2Q9P0o74M54q4k2L79L52p10K67K01p86O43j18k43J12M65
$$ -372 70 244 146 57 35 124 194 -480 -26 -110 -132 247 599 -111 156 357 -429 214 96 -147 -35 430
12043D30o41M68j74o19P90l87j94M14K63J78k03R9m62PR8l85J7R30q29L13j99
$$ 430 -211 257 83 -536 254 -133 -327 87 350 528 325 424 -38 -31 67 -318 -301 629 -200 113 -86
12064h6J62l0O6o30L50J43j49O07n25k8L94n53J85J20J29n01L28l95K57L63p64
$$ -86 76 46 112 -518 -168 -25 -174 433 -92 -120 274 -279 -94 26 155 -346 -18 -413 -156 207 -557
12085e57M33N13m18j46K12l47K77J86r08J384o05o44O80J49k54j24L09l28L73
$$ -557 -124 389 -29 -175 37 -310 -33 153 -755 629 24 -620 60 209 -45 -169 140 -188 185
12104A85k62n8K6Rk8J10j54k27L27L53n61O31k78m56P58n39m59R16j17j35M23
$$ 185 -77 -135 -109 -100 -128 -18 -172 -399 -72 281 -280 351 73 -383 375 -164 -623 293 176 41 464
12125D64o53K2M29p95N07L56k72k83R86j219M31pJ79Q1J25o13L1L93m00M97J7
$$ 464 -189 -167 262 -533 -26 330 58 -225 761 -458 -27 -34 145 226 351 -262 -231 162 -238 259 276
12146B76n25M20K03j81j22l53Q1J1N45o96M13J35o79O18m65M74L2j69l50N16j75
$$ 276 -249 171 374 193 71 -282 -201 -190 355 -341 72 207 -472 146 -319 155 187 18 -332 184 9
12167In74J023l75r1L10m82l08M79k70j22O08l63J0L90m7k85M18q56J178n52n98
$$ 9 -565 458 83 -8 302 -180 -488 -9 -279 -401 207 -156 -146 244 197 -88 330 -526 652 100 -498
12188d98Q86q5j81K45j03o39N14n5l65K09L46l79QO15r28N22n7n43L44J1J33M2
$$ -498 388 303 122 367 264 -375 139 84 -281 -72 274 -105 -97 518 -410 112 55 -488 -144 -133 0 42
12210D2j20l25J79N1J75j17l1K70K74l90n63J134n21J9r3k9j53M16m0k79J40k47
$$ 42 -78 -403 -224 -173 2 -115 -146 124 398 8 -555 579 58 77 -16 -45 -198 218 178 -101 39 -208
12232b08K77N94q41%M65o48K64M8m40P58l35m46Q61k45j03J57J42m96pK86p03
$$ -208 69 663 -178 -178 287 -361 -97 -49 -489 269 -66 -512 349 104 1 158 300 -196 -203 83 -620
12253f20R78k87o29J256p67k26N19l24m28O74k03o6L72p22J76M87j80m2k45K62
$$ -620 358 71 -558 698 -69 -295 224 -100 -528 146 -57 -123 249 -473 -297 190 10 -32 -277 -15
12273a5q9Q57o59P0L93n35p5N9n4l89P46n19J36L59p15M33L1j0j32L05m42O36
$$ -15 -104 753 94 164 557 22 -53 6 -48 -437 309 -210 -74 285 -430 3 34 24 -108 197 -245 391
12295C91n68r5K18L97o83M28O12p24o4K85p27J580j043p93Q95j30o57R58j26o71
$$ 391 -177 -272 -54 343 -340 88 700 -24 -88 197 -530 1050 7 -786 109 -21 -678 280 154 -517
12315e17O88n29r3O52l12OM48l08j22M19q33j6N41j41j93L41m42L81M10p01L02
$$ -517 171 -358 -451 201 -111 -105 343 35 -87 332 -501 -517 24 -117 -310 31 -411 -30 380 -321 -19
12336a9K65q26O08L57r91O18k46l2J60J33j36K26O7l74N12l79l53N94L05p30N61
$$ -19 246 -580 28 385 -606 12 -234 -266 -106 27 -109 117 184 -190 322 -57 -410 184 489 -241 320
12357C20Qo45N87k82o46Q30l02k9O35q72L03K04k80k28Q19p17L11M32n36m58J012
$$ 320 328 -317 270 -12 -658 172 -130 -159 476 -396 -93 111 -169 -397 422 -295 16 448 -88 -546 466
12378D66o35L3J40n27O80J26k08K1l79j2KK20o8K00N2m17J0O43o50N15jr50R12
$$ 466 -169 -136 4 -523 157 283 75 96 -283 -295 -293 -73 -141 59 111 -306 -296 347 -303 212 211 -739 173
12401A73j76j49n9L76n58J65J63k87M85J57o02M38j99l31Q00j113N10M07l83o4
$$ 173 -3 -152 -211 165 -393 -228 -65 -352 133 290 -312 126 -73 -404 396 -717 -207 200 -183 -247
12421b47N72l80j08N98m03k74M60p94O59Jl36k71R96p96j74N35k4P1O40p78J51
$$ -247 325 -55 -163 435 32 -242 218 -576 83 84 -252 -523 473 -323 -497 38 14 85 725 -53 98
12442I8j00j07L23j78j02LJ51p85R84l0k25M70m5o00K07l27N30k64L00j10k32
$$ 98 -2 -109 214 36 -66 -63 88 -697 287 257 32 502 457 -143 64 -263 267 3 303 193 -39
12463c9K05p14J027o88q3R36j142M18L00l76r1J2j44N73j26l19M54J11m01L00
$$ -39 166 -548 479 -209 -292 644 -498 -80 220 -156 -247 -235 -379 194 68 -251 203 314 -87 213
12483B13k12N2K6M32n20K9j1j39k91M09L1N28k16o59K21O47q88L84J70o02Q27
$$ 213 1 53 79 511 -9 20 9 -130 -421 -12 19 547 331 -328 -107 540 -348 36 206 -396 431
12504D31l74m65O83m65j75K66l70J36P40k78r92R10k41j80L03j47k7J168n78p12
$$ 431 57 -408 275 -190 -365 -99 -469 -333 407 129 -863 47 -194 -374 -71 -218 -245 923 345 -367
12524c67N89m46k22O88j71J38%p53P38k2m79M68N98q03q3j37K80J33J85j68l03
$$ -367 222 -224 -446 242 71 209 209 -544 194 172 -307 161 759 -44 -127 -264 16 149 334 166 -137
12545a37K72o21P09L21l83l95J70j79K7J65o81R62m01K80n42M75j13q7k32k14
$$ -137 135 -486 223 544 161 -234 -64 -243 -216 -51 -732 230 -171 109 -433 42 -71 -158 -390 -604
12565f04Q02m07M50m42L18m46P79r45P57L3r47N55K1l16N00L89p75K48L19n34
$$ -604 198 -209 241 -201 117 -329 450 -495 262 295 -652 -97 -76 -392 108 497 -278 -30 289 -245
12585b45L65L61o47O14p9l39j67N36p49K83L90r56O09L57j6j51pk61M70l20m21
$$ -245 120 481 -166 448 369 30 -137 399 -350 -67 323 -633 -24 333 317 166 159 -102 368 48 -373
12606c73N58K3l86N16k6k46M1j45l26Q27p4l76Nnm46O49k95k48M99l64J02O63
$$ -373 185 208 -178 338 312 66 107 -38 -364 463 389 13 18 13 -433 216 -79 -327 172 -192 -90 573
12628E73n31j77N06n97L32N99p30J56O28j018Q39n58m24L89P27j153P05k01l89
$$ 573 42 -135 371 -226 106 705 -25 131 759 -259 580 22 -402 -13 714 -439 266 65 -324
12647c24M25Kl99K58L59o34K99N15n58J16k76l53Q29n01Mp0Q16q26Q01o19P7R5
$$ -324 101 103 -296 -38 321 -313 -14 501 -57 59 -217 -570 259 -242 -238 -308 508 -318 483 -136 -59 36
12669C6l02K30L31l20L93K10n30j77p3O8K18K00n52K05J32j98M84k9p7n16Q46
$$ 36 -266 -36 295 -25 368 578 48 -129 -202 -134 84 284 -268 -63 69 -129 355 326 249 -267 579
12690E79k89r9P2r50M11K14J21J25n50m08J285j18j179J118j50n32N47k84K84
$$ 579 290 191 263 -687 -276 -62 59 184 -366 -774 511 393 -786 332 182 -350 197 -87 197
12709A97j36J46o20M55K05m90O94p77J22K15j94j30Q79N6p80N20l69n12O91m76
$$ 197 61 207 -413 42 247 -243 451 -326 -204 11 -183 -313 566 622 -158 362 -7 -519 172 -304
12729c04N04P04j391N16J67q46J108j88n91O52J5p95O02J13r36R01P0r28L66N52
$$ -304 200 904 -487 29 196 -650 458 270 -321 331 346 -449 153 266 -670 231 301 -627 -261 291
12749B91p62O78m82NO13j80m26M82k0m82L64l9n35O32l22l72O12K05o55Q26p32
$$ 291 -471 207 -275 -270 343 163 -263 219 199 -283 81 42 -493 139 -183 -555 57 262 -393 433 -299
12770b99O2J29n00O81L38n45K21k9l65j39Q47p82J59K55l81K55N38j126O59J40
$$ -299 -237 -108 -608 73 411 -134 87 58 -307 -446 401 -381 -222 33 -348 -93 445 -681 -22 118
12790A18m93M10Rl10K60Q6j57J40L04p85O60m55n6R3L15o08L82M15n99P35k54
$$ 118 -375 35 44 -266 -6 80 -77 63 367 -418 242 -213 -269 -176 139 -469 -87 328 -271 464 210
12811B10k84K72o00K32Q36r47mN30l29o4P36r53Q9M95j16o0P0l41P9O86o69j88
$$ 210 -74 198 -402 -170 666 -281 -285 245 -84 -148 588 -365 -276 219 103 43 113 -228 -149 537 -132 -320
12833c20K24L04l54N67p65k86J123m34P3K0k40L69l94k14N49J51o82N50k95k92
$$ -320 -96 208 -146 421 -344 -630 493 59 132 152 -88 281 -113 -327 222 373 -309 241 -54 -346
12853c46M31L65j167R19m58k10P48l0n55K29j59j41O69m71OL17k14j72M75m47
$$ -346 85 450 -717 202 -256 -466 282 252 -303 -74 -233 -374 295 -176 -170 147 -67 -239 236 -211
12873b11l94J130j194N07M40o09J79L46p54Q49K53j149J060P3j000N77L37q52
$$ -211 -605 525 -669 -162 278 -331 -152 194 -560 289 542 -607 453 526 -474 103 440 -412
12891d12O7K01K11n5J15m25L85r4m42N76J92p17J84K72m17Q21m62m78P87k43l09
$$ -412 -345 -144 67 12 127 -298 87 -7 -449 127 319 -398 -214 58 -359 462 0 -478 309 66 -243
12912b43J114p22o74O22p9n84O33l65N07j66j56r0K13j79j4L91p63L03M89n41
$$ -243 871 149 -525 97 18 -566 67 -298 209 43 -113 -203 10 -169 -183 208 -555 -252 237 -304
12932c04K23J25n93O51j23l01L21j3N1K78l04M4K23k90o42N50k70J28L78M6k04
$$ -304 -81 44 -549 102 -21 -322 -1 -14 37 315 11 55 278 -12 -654 -104 -374 -246 132 178 -26
12953b6L44k46l11N71k55l19N97o15j68O94m02j92O95m54j9M7R0J58N82o06k49
$$ -26 318 72 -239 332 77 -242 355 -260 -428 266 -136 -328 367 -87 -106 -59 31 189 771 165 -84
12974h4N71p31K03J92j12l42L30m21L05P29o49M38nn05J72R5o26J93M30l16L94
$$ -84 487 -244 -41 151 39 -303 27 -394 -89 640 -9 429 424 -81 91 186 -440 -247 183 -133 261
12995B61m10L34k64L36r01P13k4m37Q09l47lJ52l19K02J48l73m5N98l2m88J68
$$ 261 -149 185 -79 257 -644 69 45 -392 417 70 67 219 -100 102 250 -123 -168 430 398 -90 78
13016G8l29P5O1j35L1J112r65J66K44j76m30N6L46L82J12o66k82J060j429N34
$$ 78 -251 -176 -115 -250 -219 893 -72 94 338 162 -268 -212 134 516 628 -38 -320 740 -689 -155
13036a55M29r66N34K28j54n7P83p70p6M7l57M53M34p82R46l57o71P47j2p4m1k28
$$ -155 274 -692 -158 70 -84 -141 642 -128 -204 -157 -514 -61 373 -409 537 180 -491 256 244 170 129 -99
13058i9k9O41o12m4R1k3l1L69k2o81Q48n94J49J65k80l05O41q7K66j95o09J25
$$ -99 -128 513 -99 -143 -52 -75 -106 263 241 -440 408 -186 -37 128 -152 -457 184 97 363 168 -441 -316
13080c16P32q55M95K39m34L50j49n27N68j25l46L19L65p99M39L77o95L12M65j108
$$ -316 416 -439 56 295 -139 211 62 -465 103 -22 -368 -49 316 -483 -44 333 -362 -50 415 -693
13100f93Q41k36k34N69k2l28n2P27r70P66l06m40O63l01l0J39L7j1P7k93j29K94
$$ -693 148 -88 -322 247 225 -103 -155 572 -398 368 62 -378 285 -16 -46 93 130 119 196 -97 -226 68
13122F8J46l75N50p56M03P5m50L11L46o75L53P2l13j15L03J05k61L22k53Q23r55
$$ 68 214 -161 389 -367 36 111 -339 -28 318 -357 -4 68 -245 -360 -57 48 -213 109 -144 679 -276
13143b76J26K62J20Q6j31p0l16N93k44l40L38n78K24Q70l53m66M06n79q1K38J49
$$ -276 -150 112 232 318 187 117 -199 394 150 -190 148 -430 -206 664 311 -155 251 -328 -409 -171 -22
13164b2k48J04L53l38J39j30k42P95l95J36J54m80P1N22m53O10j40p77qP56m49
$$ -22 -270 -166 187 -151 -12 -142 -384 411 16 152 306 -174 -103 419 -34 576 436 -341 -349 407 -42
13185d2J26L30r27M31K49m03k01Q23n90J57M03q41L22j28k23L96O70j271M92j6
$$ -42 84 414 -513 -82 167 -236 -437 386 -204 -47 356 -485 -163 -291 -514 -118 552 -719 -227 -243
13205b43l3O55n70J36M13m02n65Q36m89j00M15r8n11Q33q00P42j86k04n6L52m07
$$ -243 -276 379 -191 -55 358 -44 -609 227 -262 -362 53 -45 -556 277 -523 219 33 -171 -227 125 -282
13226b82M04L04p94P15j47j0n70O16k66L23K18n32N52n35l07N49j40j77K64k96
$$ -282 122 426 -368 347 200 190 -380 236 -30 293 511 -21 531 -4 -311 238 98 -79 185 -111
13246a11l2K05k63L14P2m4J62P1k44l12O20o29l22N63l42R8O74n43L28m60J67
$$ -111 -143 62 -201 113 185 141 303 374 130 -182 438 -191 -513 50 -292 -194 480 -63 265 -195 -28
13267b8l96Q69o48J78P2k10k55Q37o61r6J004p02Lq3l5N20j18n3n67Q60r81j36
$$ -28 -424 445 -203 -25 47 -163 -418 419 -242 -338 666 -36 -33 -116 -151 369 251 198 -369 491 -490 -626
13289f26R69q58K30K82K2j94O24o67N36l70l30L02m53M06K22k04o25J236p04p3
$$ -626 343 -515 -285 -3 19 -175 449 -218 318 -52 -382 -80 -533 -127 95 -109 -734 502 -202 -275
13309b75M36l34L6J33Q5P6J28K48n54L2M5n26P41n70J19L78j32j16L76r39Q32
$$ -275 161 -173 -137 -4 81 157 285 533 -21 11 56 -470 271 -299 -180 198 66 -50 326 -613 219
13330B19j49j30p56R44l65J87M79l14K05l2m84K1K69j12k11K51o60N83J70m77
$$ 219 70 -60 -816 128 -237 -50 429 115 320 288 -196 -175 94 -18 -229 22 -638 -55 115 -362
13350c62L06L23l91M10j13n09O94k01j64j32Rn16R84o23L06J44n86O85J23m32
$$ -362 -56 267 -124 286 173 -336 358 157 -7 -139 -130 -646 338 -285 21 165 -421 264 387 -45
13370d5K04K89n02j82K58k43N0J69k09L80K32m29k57M27p25L26O70q19J03P96
$$ -45 159 448 -54 -236 22 -221 -171 -2 -211 169 401 -28 -285 142 -583 -257 413 -406 -303 493
13390D93j135N01P66j206N80K15m60Q74q16M7K12J25m55M24k11l08P31m84L11
$$ 493 -642 -141 625 -581 -1 214 -246 628 -188 -141 71 196 -259 165 -46 -354 377 -107 204
13409B04L6n40j8M53Rj9J74n24l21P46p3l72J119j147l30O70l82J12R6k3j03O75
$$ 204 240 -300 -318 135 144 125 299 -225 -546 200 127 -245 874 -273 -603 67 -315 -203 -107 -130 -233 442
13431D42n00ML62m98J84N93j002L98K90n33M46pl35M34j08j41M38l30m00O35k80
$$ 442 -58 -54 308 -190 -6 587 -415 -17 273 -260 186 179 -156 278 170 29 467 137 -263 372 92
13452I2j49J48Op97O04N47o79K93L46q76P87r3n75R53q10K20O9j52m17N50j44
$$ 92 -57 91 97 -700 -96 451 -228 65 411 -465 322 229 -346 607 -203 17 86 -66 -483 67 -77
13473g7l99O68n37M64J58o73O02k88l10J87M50p14N59N69j020J39J214j470J369
$$ -77 -476 192 -345 119 277 -396 206 -82 -392 -205 245 -469 90 659 -361 -222 992 -478 891
13492H91q44q4O77n13Q0k51J002j206N37J91q92N57j56n28J042p60k89Q16o29
$$ 891 47 -37 640 127 207 -44 958 -248 289 480 -412 145 -11 -539 503 -257 -546 270 -359
13511c59K25K84N9m64M39n59K18L95l51k47P07o26j15Q19q00K68O36m54p36J313
$$ -359 -134 150 209 -255 184 -375 -157 238 -113 -360 347 -279 -394 425 -375 -107 529 75 -661 652
13531F52r28J21J49n72O39J54l46J19L71k92J41r5m18j1J76L7K45r0m55J92N45
$$ 652 -276 -155 -6 -578 61 215 -131 -12 359 67 208 113 -305 -316 -140 -103 142 52 -403 -211 334
13552C34n57K18J51n7K66k23m41L29J96j169J041k83j19K30J67k00ML34j92O04
$$ 334 -223 -5 146 89 355 132 -309 20 216 -953 88 -195 -314 -84 83 -117 -113 221 29 633
13572F33m71qJ82o31L21J91p45N78k92q7K71N77q11M11L98q36M31k77j06J19M61
$$ 633 162 154 336 -295 26 217 -528 50 -242 -329 -58 519 -292 119 517 -319 112 -165 -271 -152 309
13593C09k35K00m59o0J54pn09O43J77n52O62p21N7N75l44o5M50o33j01N51k29
$$ 309 74 274 -185 -245 -91 -98 -607 36 213 -339 323 -398 -341 234 -110 -175 275 -358 -459 92 -137
13614a37j09N55m62j53M71k78l93J041l62J20j23o5k72L49m28O1K70k81J46K57
$$ -137 -246 309 -153 -306 165 -113 -506 535 173 293 170 105 -167 182 -246 -185 85 -196 -50 207
13634B07q74P06M05m42K21qp44M32L25o55M22J58l72L44Q1l83O86n83J72J66J3
$$ 207 -667 39 444 2 223 215 -529 -97 228 -427 -5 153 -219 125 206 -177 509 -74 98 264 277
13655B77p68P32l86k04N94n16L40L54l22j18O21q17k54P90l26k49L85m68K84M59
$$ 277 -491 241 -145 -349 245 -271 69 423 101 -17 604 -213 -467 323 -3 -252 133 -335 -51 408
13675D08m19j11M48J2n08M78n19M40J64n49J65K2J55j76l9k40K07N67r43L78J30
$$ 408 -11 -122 326 338 -170 308 -211 229 393 -156 9 31 186 10 -29 -269 -62 505 -438 -60 70
13696G0k61o1L29l48L62j94j89J068j054J6O84p73%M47J49o63N46k01j27K71M86
$$ 70 -191 -252 77 -271 91 -103 -292 776 -278 -262 422 -351 -351 96 245 -418 128 -73 -200 71 557
13717E57l13l51n45J55J146o51n9K02k26L89p1o96N27O25j452Q65K62l54j6Nk00
$$ 557 244 -107 -652 -497 649 -2 -61 141 -85 304 233 -463 64 689 -763 102 364 10 -6 -1 -201
13738b01m50O93j068J059L9k37l02O03n06R81p98j75P25k24m12N66j75m10N84
$$ -201 -651 42 -1026 33 72 -165 -467 136 -370 611 -187 -362 363 139 -273 293 118 -292 292
13757B92k3m68N89l49n88Q26p17L23K74j72n2L75n91J93j33M19K3l45k29M42L86
$$ 292 269 -199 390 41 -547 279 -438 -115 159 -13 -65 310 -281 -88 -221 198 221 -124 -353 89 475
13778D75k67m33L85k39j25L99k40J23L87p58P2N28o20L10P1p62P12N92r82M15
$$ 475 208 -225 160 -79 -204 195 -45 78 465 -293 -221 307 -313 -3 68 -694 18 610 -372 43
13798D3j73k86P92k30l86N55p63M94J37j83k9K99j79rJ72n11J9J84M06n16j39
$$ 43 -130 -416 376 146 -240 315 -448 46 183 0 -29 270 91 82 254 -257 -238 -54 352 -164 -303
13819c03K43o9L17l92P3R06j369P21M54j048O49M26k66o05M47j066Q07J5m16M62
$$ -303 -60 -129 188 -204 -131 775 -594 127 581 -467 182 608 342 -263 184 -882 -75 -60 -476 -14
13839a4l91p7J10Jk09P95R9k93k8O54p06n5L10m67l4K68L17O1n45K84l3m05R2
$$ -14 -405 -482 -372 -371 -580 215 314 21 -7 647 -59 -114 196 -271 -305 -37 280 341 -204 80 47 -358 -266
13862b66L57N11j115R09j26o49N78l44l7J37N2k49M9o59J181j71l79P9K85o77
$$ -266 91 602 -513 396 270 -379 199 -145 -182 -45 7 -242 -193 -852 329 158 -221 -142 143 -534
13882e34J18P23m78j25Q50r40O82k12j6j0K82p48K65N22q79M15m1k97L65L46o75
$$ -534 -416 307 -171 -296 554 -386 296 84 68 58 340 -408 -143 379 -500 -85 -126 -423 -58 288 -387
13903c87P62k1m85O98l43n05N68M35j014K07m9r2K37j17j30P82j111M18Q88j202
$$ -387 375 354 -131 567 224 -281 287 722 -292 -85 -134 -226 11 -106 -236 546 -565 -147 741 -461
13923d61L58P4l19N1N80l65N4k23O8L16K47n64j92R09p85J78Q1J85l21M58m40
$$ -461 -103 -29 -348 -297 283 -82 -28 -251 -183 133 380 -184 -376 533 -252 -74 7 192 -129 329 -111
13944a11N20j26m07O12m93j86L34M46q35J32jm50O84r6p8K17O5q19M52J23o52
$$ -111 409 283 -124 488 -5 -191 143 589 -246 -114 -115 -565 119 23 -55 162 227 -592 -140 -17 -669
13965f69L81R7L19k48l2o3R33o66J9L10q03L05L79o96K54L82l42R4J09l03O5N80
$$ -669 -288 -191 128 -120 -152 -215 718 52 71 381 -422 -117 262 -434 -180 202 -140 -46 63 -240 -175 405
13987D05n37J84K0m17O39j9j056Q17j75l77O88R8p49k4L72j19J92J72p89P16L08
$$ 405 -132 52 72 -345 294 275 -781 36 -139 -516 172 270 -479 -503 -131 -250 -58 114 -675 41 349
14008C49m59K69m40J61J09J49o29O42O1n83Q47l30m96L93J55m48Q25j042O27L52
$$ 349 -110 159 -281 -120 -11 138 -491 151 212 -371 476 146 -350 43 198 -250 575 -467 160 512
14028E12r72L59M95l33o3L90o14lP99r76J060n88l81L78M12j151O87j14l95M91
$$ 512 -460 -101 394 61 -2 388 -226 -229 570 -406 654 66 -315 63 475 -676 11 -103 -498 -7
14048gJ63j40L82n21l70M94J18k96M50k62n0K52m03J62K73J89r52N02J69n31L50
$$ -7 156 16 398 -123 -493 1 119 -177 273 11 -39 213 -190 -28 245 434 -518 -16 153 -378 -28
14069b8k47j37N92k96j25N24n01J64L00m47j9M03r04M48K41K76P1l16l12J57K32
$$ -28 -275 -412 180 -116 -241 283 -218 -54 246 -201 -220 183 -721 -273 -32 244 315 -1 -313 -156 76
14090G6l84L48R7o27M03L52l78j02l7P8M19o3l37N9O53p61K38j64l69P44K03j260
$$ 76 -308 40 137 -490 -87 265 -113 -215 -252 -174 245 182 -155 -96 557 -204 34 -130 -499 245 448 -812
14112h12R75l22Q2M48n34L94N77j078k47P75q2j37Kj39l31N44j52K39j63n37Q9
$$ -812 163 -159 -77 371 -163 231 808 -270 -517 258 176 39 41 -98 -429 115 -37 202 39 -498 -409
14133d09J100r56j67R01j230Q23Km21N12K5q92O80L12o62Q16o89l91Q86P0l83
$$ -409 691 -265 -432 469 -761 62 64 -357 155 180 -712 -32 280 -382 434 -255 -646 240 310 -73
14153g3M00m64j69M32k19L6p3J61J5L1q2J01l9L2k75K02k4l45N07j35j65O09q08
$$ -73 327 -137 -306 126 -93 -57 -130 31 46 77 -5 96 57 89 -186 16 -8 -353 154 19 -146 463 -345
14176c45O32k49l23j29N18k5j90O5J45k30M96j21k98L13m85L31k95J97m40N95
$$ -345 287 38 -285 -414 104 79 -111 -46 99 -131 365 244 -54 259 -226 105 -190 7 -433 162
14196A62l58L87J20r40Q58m50l85P26j07O3K26p42K43M71o43L75L00p60N24J158
$$ 162 -196 191 311 -629 229 -221 -606 120 13 76 302 -440 -197 274 -369 6 306 -454 70 1228
14216A228j322j86O5L53M9l4N4l24P62m50m75J93m84J041o72J56k66Q22j122N93
$$ 1228 -94 -280 -215 138 187 153 207 -117 645 195 -280 -87 -571 470 -202 -46 -312 510 -612 -19
14236a9p9j07J27O21o90K58J26k44J85K26j064J146j81k98N74p20j48K44j3j76
$$ -19 -98 -205 -78 543 -147 111 237 -7 178 404 -660 486 305 7 581 -139 -287 -43 -56 -232
14256b32O19n10k03P25o86K27N45o81o3N97l43p14J114m08P7J58m66J57N04n42
$$ -232 387 -123 -326 399 -287 -60 485 -196 -259 338 -5 -719 395 -13 64 222 -244 -87 417 -125
14276a25j60O90l90K1O45p21k68M30r4q6Q91q18k38Ol42P14N2n40L88O15q85k45
$$ -125 -285 405 15 36 681 -40 -308 122 28 -58 833 15 -223 -217 -559 155 207 -333 55 670 -215 -460
14298d60M09k84Q50l41l29N7O5l8J51N4n01R04l30n89R33l38m57O55l7q81J185
$$ -460 -51 -335 515 174 -155 -98 -33 -71 80 134 -367 537 207 -382 551 213 -244 411 374 -507 678
14319F78q91J11P98o59k73N74M6p23J31l13L88L57n07L99J63l79K09K32j107M63
$$ 678 -213 -102 696 37 -236 338 384 -339 -208 -521 -133 224 -283 116 279 -100 109 341 -766 -303
14339c03M23m22OP72j250P40R3j98J75K6k54P00r49k8L26K41kK73l40l87M68j56
$$ -303 120 -302 -296 476 -774 -34 59 -139 36 62 -192 508 -441 -469 -143 98 96 369 29 -358 110 -46
14361d6j28P2K18j88O96k95j50L26o55j46M11j80L6J31n11J13M41k93l72kN76
$$ -46 -174 -102 116 -72 624 329 179 505 -150 -296 115 -65 -29 102 -409 -296 145 -148 -520 -522 54
14382E4j98P42j053O29L53p88M33j27j08o6L72l06J33O06p13M0N16n55L43m15
$$ 54 -144 598 -455 174 527 -261 172 45 -63 -129 243 -63 70 676 -37 3 519 -36 307 -108
14402a08k71L51O26r11O56n88O6P47m06k28k4m40K66M20K32l10k19J35N0Q00r51
$$ -108 -379 -28 598 -313 343 -245 -179 568 162 -66 -90 -530 -264 156 388 78 -141 -6 44 844 -107
14423a07j7j45N62P5j22l13j29N98k93j34O39o50l69K78K50k73P20j244P78K12
$$ -107 -124 -269 293 368 246 -67 -196 402 109 -25 614 -36 -405 -127 123 -150 570 -674 104 316
14443C16r63Q40N5k12K92k03n09N93l53j03o7K26p00Q65k98p5N06r4l47M68L1
$$ 316 -647 193 248 36 328 125 -384 209 -144 -247 -314 -88 -788 77 -221 -296 210 116 -231 237 268
14464B68n69L58m80O29k3m06j14K33O9j06P91p85r4O15p71J08O84o57L24j00J07
$$ 268 -301 57 -423 206 183 -223 -337 -104 -35 -141 650 -135 -229 386 -385 -277 407 -250 74 -26 81
14485H1j28j2o48O00K59n04K84K92r49O99J02k07J81L40j91J10n18o3L95k71j27
$$ 81 -47 -59 -707 -107 152 -352 -68 224 -725 -26 76 -131 50 390 199 309 -209 -272 123 -148 -275
14506b75L55J29l40Q10n24p68M25k49q6Q55k53o49P86j39l18J58o16M99N90o21
$$ -275 80 209 -131 679 155 -613 -188 -437 -523 332 79 -570 216 77 -241 -83 -699 -200 390 -231
14526b31J06L78k73o3k37K59m74O88o26M91r9j75J0M63n90J37N21k08J58o4k92
$$ -231 -125 253 -20 -83 -320 -61 -535 153 -473 18 -81 -256 -246 217 -373 -236 285 77 235 171 -121
14547a21J91k65j04N23k59k10O26l51k30O91o4k69P9k71n29R79j76n58J150o00
$$ -121 70 -195 -299 224 -35 -245 381 30 -200 491 427 158 237 -34 -563 416 240 -318 832 232
14567B32p19R74o60m4N07k95l80M18l2K88k25k04P2l5j57L56k00j83L11K34k62
$$ 232 -487 487 -173 -217 290 -5 -385 33 1 289 64 -140 -68 -103 -260 96 -104 -287 24 258 -4
14588dM33J9p08N43J31q21P13j10q25J088l32k60M47n59K65N2j94k30R30q95k52
$$ -4 429 448 -260 283 414 -407 306 196 -629 459 127 -133 314 -245 20 72 -122 -352 578 -317 -569
14609e69Q10p22N1O04N6m4L41o92L83J46l79K02k17L2J68j53k13L9M95n61K20
$$ -569 241 -481 -430 174 230 186 527 -165 218 364 -15 187 -30 2 170 17 -196 -157 338 -223 -3
14630cK16m02N52k17l82NO88Rk95N1m15M01J56k53l76K40n94P06L0j9K02p38j62
$$ -3 213 -189 363 146 -236 -231 457 466 171 222 -193 208 364 111 -265 -25 -619 87 117 98 300 -438 -600
14653f00J004l43j56l4J69J64J47k13l17P03l56l30O00k47m49R73p40J24J22l13
$$ -600 404 61 -95 -129 40 204 351 138 -179 524 168 -162 438 191 -258 715 -25 99 221 -92
14673i2J84N62o30k41J44j79L47L49k88n53L63R1pL21m77J50P3j48l7L93p35J020
$$ -92 92 654 24 -217 -73 -252 95 444 156 -397 -34 57 50 371 -106 44 117 -31 -68 325 -410 610
14695F10o62j93J46M97o22L90l72j4M33k95k39P22k18o96P87l37k42N11k61m95
$$ 610 -52 -245 -99 398 -224 166 -206 -220 213 -82 -321 401 183 -513 274 -63 -305 206 -55 -550
14715e50O27j23m24P80o33N54M00p75R0R21j170J15O90p02kN74n32J20M17m11
$$ -550 77 -46 -470 310 -323 231 631 -144 -54 867 -303 -188 502 -200 -202 372 -160 -40 377 -34
14735c4K24K80q74J99P56p95r5O45n42K08J49k08N67k45n82K81J59l85M43m26
$$ -34 190 470 -404 -205 551 -244 -339 306 -236 -28 121 -87 480 235 -347 -66 93 -292 151 -275
14755b75J46J53k90m44J442n29o19P33k31n21N75J09o95L39l13L10N41m86j42
$$ -275 -129 24 -266 -710 732 203 -416 317 86 -435 140 249 -446 -107 -420 -110 431 -55 -197
14774a97J85N0k26N50o79N58K46o24J6M26l25m04J82o7L35N25o46pM96p39M30
$$ -197 -12 38 -188 362 -317 241 487 -137 -121 305 -20 -424 -242 -309 26 551 -95 -102 394 -345 85
14795H5K76j277J150n29K36L12o12J96K58J80k39L4l7K4M75r32M0Q32l29p32K61
$$ 85 361 -916 234 -295 -59 253 -359 -163 95 275 36 70 33 57 532 -400 -360 472 143 -589 -328
14816c28J96j60L54q7k72M22n26M5O70o31K01M31l37j04M50l76K16J98o25O8O07
$$ -328 -132 -292 62 -25 -297 125 -401 -356 314 -317 -116 315 -22 -126 324 -52 164 362 -263 -195 412
14837D12m56J60K23p96R23k97n02k25R39n90M38J44l89L17k11l52O79l72r8L92
$$ 412 -44 116 339 -457 466 169 -333 -558 381 -209 229 373 -16 301 90 -262 417 45 -53 339
14857C39m49k14M04m6j52L63l92k67O78k1k73K07o19M17N77n39m71O11l9K4M6
$$ 339 -110 -324 80 34 -118 245 -147 -414 264 243 -30 177 -442 -25 552 13 -458 153 114 138 184
14878A84j70JJ58m05O34r0Q3j73l06m09N81J46o44J81K77j46m7p3l69P05N8r06
$$ 184 14 15 173 -232 402 312 395 222 -84 -493 88 234 -410 -229 48 -98 -145 -218 -587 118 176 -730
14900g30J071n85m9N34o46J75N35n03K37M37k75K7J67n06l37R35l84o0P40m59
$$ -730 341 -244 -293 241 -405 -230 305 -198 39 476 201 228 395 -111 -448 487 103 43 783 324
14920C24p5n1l34l42M63OL18j8m06N59Q4r44N65P0m51k82P10m96K2K04j44N07
$$ 324 249 198 -136 -478 -15 -9 309 291 -115 444 528 -416 149 219 -232 -514 196 -300 -278 -74 -218 289
14942B89K42q48Q04k14m64Q84o65j52J07r8k91N27K04l94J78k49k95N15P3m02
$$ 289 531 -317 487 273 -191 693 28 -124 -17 -115 -406 121 325 -69 109 -140 -435 80 153 -249
14962b49K53j80j78O35n19J30O50l38m19L45l91P0P71p01j40L48n84j03L94L04
$$ -249 4 -176 -354 281 -238 -108 542 204 -215 130 -261 -191 580 -121 -261 87 -497 -600 -206 98
14982I8j41N83o46K68K72q32N5N42m72M60Q1n35K79K44l96K99K71r26L35R2LL40
$$ 98 -43 540 -106 162 434 -398 -343 199 -273 187 268 -267 12 256 -140 159 430 -496 -161 -69 -66 274
15004B74n80j72J027l61p34O86K7q27P37l21P9N76p14k89Q78m61o0Q4k51M19M51
$$ 274 -306 -478 549 188 -546 140 167 -660 77 -244 -165 411 -303 -592 286 -175 -235 -151 -402 17 468
15025D68j202Q38M65n87J22L58r40N31K79l87J35k54J4K43N65l96m20P1l18R07
$$ 468 -734 104 569 -18 104 462 -478 53 332 -55 80 -174 -160 83 648 252 -168 -97 -415 492
15045D92m32k13O01n14k20M36j86K80J71p62Q4M91Ko98L21Rq9P75n19n16R48n60
$$ 492 60 -153 448 -66 -286 150 -36 244 415 -347 -263 228 230 -468 -147 -138 -227 548 29 -487 461 -99
15067i9L04N6n77M27J83n4k31L31l21k75P47r42O71O5m99L61N02n40J28j25n94
$$ -99 205 261 -316 111 294 240 9 340 19 -256 491 -451 220 285 -214 147 649 109 237 112 -482
15088d82M02j26J33M11J02r83R79m11k38M38M30j374P63j91p9P55m97l17P33R5
$$ -482 -80 -206 -73 338 440 -543 436 25 -213 225 655 -719 44 -147 -226 529 32 -285 448 543
15108E43j001P26o41L05L14k31m76N56o59J04M70n91O04j68J61j60L32j61K50
$$ 543 -458 268 -373 -68 246 15 -461 95 -564 -460 10 -581 23 -145 16 -144 188 27 277
15127B77J22n46n6M13l28l23P65o46K00M48n15o3P94o47K10K93n69o2K98k13M70
$$ 277 399 -147 -203 210 -118 -441 324 -322 -122 326 -189 -252 542 -105 105 398 -171 -233 65 -148 322
15148C22n71j0N54m27K34Q3l32k12M59j80k91L21J77j04j10J70l61L75O2p2K15
$$ 322 -249 -259 295 -132 102 185 -147 -359 100 -80 -371 -50 127 23 -87 83 -278 97 159 87 302
15169C02j74m66J17j13L37Q3N9J43L7j93m47P30q16j91Q68j87l61K20l87K87N84
$$ 302 128 -338 -221 -334 3 86 145 288 325 132 -315 415 -401 -592 276 89 -272 -52 -439 -152 432
15190D32j075Q02L5l79k5L48m46L87P08j366N37M65o46J71M26o65N02j89j64j04
$$ 432 -643 159 194 -185 -210 138 -308 79 787 -579 -42 423 -223 -52 374 -291 211 22 -142 -246
15210b46J03K77l04N17r62O67L6m78N55n03R5N28n95N61k74m87J23J232j055K8
$$ -246 -143 134 -170 347 -615 52 88 -390 165 -338 -243 285 -310 251 -23 -510 -387 845 -210 -182
15230a82M82n40J81O2n25O47J89r71N78k46j11J94N17o80L04P51n39K18k80J48
$$ -182 300 -240 -59 3 -522 125 314 -657 -79 -325 -436 -242 275 -405 -101 650 111 329 49 197
15250A97l17L65m29J95Q2n68R93m85k05N81n0m50R15o63n37N89m48K45J22j81
$$ 197 -120 245 -184 11 93 -475 518 33 -172 409 359 -91 824 161 -376 213 -235 10 132 -49
15270d9k61M57k72K84k33k59M65M27m16j67K81n14Q9M77m73J33M86m22j16M34
$$ -49 -310 147 -125 159 -74 -333 132 559 143 -24 257 -257 -168 309 -164 -31 455 33 -83 351
15290C51o57j09M55p30N93k38j59J79L00l66M10o4j23L60m45J08O21k82m25N88
$$ 351 -306 -415 40 -690 -97 -335 -494 -315 -15 -381 29 -35 -158 202 -243 -135 486 204 -221 367
15310C67o57m2O74M4m91L47l70j12M42p6n45P66o95L23K44m60K56L94m77K14L04
$$ 367 -290 -332 342 386 -105 242 -128 -240 202 126 -419 347 -348 -25 219 -241 15 409 -68 146 450
15331D50l30m94O34k60J23J18k98R1j53j4M6J9N8L12k68n20R01j50n88N33j66
$$ 450 120 -374 260 0 123 241 -57 34 -119 -133 -87 -68 -10 302 34 -486 415 265 -323 210 44
15352D4k88J95K22o9nP4n54P19Mp49M03M06l75L23n51l1M76k78O7K93n62K94o7
$$ 44 -244 -49 173 104 99 173 -381 338 342 -407 -4 402 27 350 -201 -232 244 -34 33 326 -236 58 -9
15375io8O3M06m28K47k80j10l2K59k32K71L95r79M96J78q45Q65l37J38L34r0l42
$$ -9 -77 -14 392 -36 211 -69 -179 -211 48 -184 87 482 -497 -1 177 -668 197 -140 -2 332 242 -100
15397a00M4n9m22O80P13j261O10k4q57P52J71r64J448n09l24N27m23p3N7k38k18
$$ -100 -56 -115 -537 143 856 -405 205 181 -676 76 247 -717 731 222 -102 425 2 -71 -14 -252 -470
15418d70O70o0l44k3J9j5R92r12K88K63o97M15l1m75M72J12l06O2p2O8K90J70
$$ -470 200 140 -204 -227 -208 -223 769 -143 145 408 -289 126 95 -380 92 204 -102 -40 -112 -44 246 416
15440D16r78P40J05o83pN97l89L15j94m8k19N65k32P65o14q49R90o46J22P26o80
$$ 416 -562 178 283 -400 -407 190 -199 116 -78 -126 -345 220 -12 753 139 -710 280 -366 -244 482 -198
15461a98J54M02k24m11N59l89k0N92o89j2O90j060L29L85L5m09O99p29L71M14
$$ -198 -44 358 134 -277 282 -107 -127 465 -224 -236 454 -606 -277 108 143 -266 433 -296 75 489
15481D89j011O74J11o2k50L66m73N6J33J64k63J78j34K73j98o37M53J26n61O02
$$ 489 -522 152 263 201 -49 317 -156 -100 33 197 -66 112 -22 251 53 -584 -131 -5 -566 36
15501C6M50j087P28L27r33M76ml90J066o2r23K4Q36o97M52n37j70P01n22m08Q34
$$ 36 486 -601 127 454 -479 -3 -7 -397 669 607 -316 -292 544 -153 299 -238 -408 293 -229 -637 197
15522A97m25R6N10r18J095n44J95k95J68J48k19j22k96N19M06p27K70K20p09J38
$$ 197 -228 -132 378 -540 555 11 206 -89 79 227 8 -114 -410 109 515 -212 58 278 -431 -293
15542b93R07q64M64K2p0J94l50l6N75l58j68J24L33q36P89K64p42N59o44L5J84
$$ -293 614 -250 214 236 166 360 10 -26 549 191 23 147 480 -356 433 697 -45 514 -130 -95 89
15563H9k18n11J500r93K59J26n63J26M38k42m02O25k43j01N17q55Q5P34q49Q06
$$ 89 -129 -640 860 -133 126 252 -311 -185 253 11 -391 234 -9 -110 407 -448 -363 371 -478 328
15583C28K24q29M76K30n34Q1l4l29O46M30j178J000j27j62J01j0n11l72N41o12
$$ 328 552 -277 199 429 -105 -24 -58 -387 259 689 -489 511 384 222 323 313 -198 -570 -29 -641
15603f41J190o24n99R71k51j2O4j89l38O92m7l65M87m74l21Q91k86n39Q08p44
$$ -641 549 -75 -674 297 46 34 98 -91 -429 263 216 -149 338 -136 -457 434 148 -391 417 -327
15623c27Q8Q31q69J96J98n67N2M55l85L20L78j347P07M30o17M47O42r51L20N48
$$ -327 -239 592 -277 -81 117 -450 -398 57 -328 -8 370 -977 -270 160 -457 -10 632 -319 1 549
15643E49j167M80O30n33l7J16j26K26L79r91P18j17m88P60l14o5m1k74j45P94
$$ 549 -618 -138 492 -41 -78 38 -88 138 517 -474 244 127 -361 399 85 20 -21 -295 -440 354
15663C54n04k30L65j87K93K74r08K74J146j331N72K80n07k29M44l55L88J15k67
$$ 354 -150 -380 -15 -202 91 365 -543 -269 877 -454 118 398 -109 -338 106 -249 139 254 -13
15682a3q0J56m07L75J81n46M37K63q13K06Q05j130J478n96l21k8J75p52J092k83
$$ -13 -93 63 -344 31 212 -334 103 366 -447 -241 564 -566 912 316 -5 -33 142 -610 482 199
15702A99k10J99l06l58Q88n67l36P35r7l35L33N53j077O24l49l53J168q51k5N5
$$ 199 -11 188 -118 -476 412 -155 -491 244 147 -188 145 698 -379 245 -104 -457 711 -140 -165 -110
15722a10J62J56K84p60m50J067J2q24N40n17L46J01o54J45Q25q06M98R7m57N58
$$ -110 52 208 492 -268 -718 349 361 -463 77 -440 -94 7 -647 -502 323 -483 15 112 -345 213
15742B13k70o34J212j39j074K71P21o44M85K61l52J76J06p91O75l73r3O02J11
$$ 213 -57 -691 521 382 -692 -421 300 -344 141 402 50 226 332 -459 216 -157 -250 352 463
15761D63l22n0n97J08N26m65L46O6k8J78J0l20K55J29j26Q1Qk19J45M38o38j73
$$ 463 141 91 -506 -398 128 -337 9 75 47 225 235 -85 170 299 173 254 262 43 188 626 -12 -185
15783a85J69j20R7P0k2%R42r61l98Q97r03K96K12j92M91J1k01p44M52J50nl91
$$ -185 -16 -136 -39 31 9 9 951 -10 -408 489 -414 -118 94 -98 393 404 203 -541 -89 61 56 -335
15805c35L11N04q98L7J093r53R0j76N25r88R20j45K32k09N6l67O74j86n27M36
$$ -335 -24 480 -418 -381 712 -241 -151 -327 198 -790 130 -15 217 8 64 -303 371 185 -342 94
15825I4n9N9j78m89L54M46om23K17l07M4Q82p65M35J95o39N3M15m42J64l82q1
$$ 94 35 94 -84 -573 -219 227 221 -202 15 -292 -248 634 -131 304 499 -140 -87 328 -114 50 -332 -413
15847d13Q44k28n89R43r73M1M17J85m52M80J23o94L02K49n74Q50m12l0K67m70
$$ -413 431 203 -386 557 -416 -375 42 227 -225 255 378 -316 -14 235 -339 511 99 69 336 -134
15867a34J17L60p26K59Q81j163J82N64l15K15n11M43l20O94q43oP38m89K30L66
$$ -134 -17 343 -383 -124 757 -406 -224 340 25 240 -271 172 -148 546 -297 -303 435 -54 176 542
15887E42p46L11L35q78L58J55n45L47J00m56O71M23j043N93j84k26L23j60pN47
$$ 542 -204 107 442 -436 -78 77 -468 -121 -21 -477 194 617 -426 167 -17 -243 80 -80 -87 460
15907D60k44o92L18L63l19L89n36l11O36k79j68L88j24M6k60Q8K45L75m20j94
$$ 460 216 -476 -158 205 -114 275 -261 -572 64 -215 -383 5 -119 -73 -333 -245 0 375 -45 -239
15927b39N64o0l82K83j93R8K92m76K57N7k38L03m96J6P6M11m24M97r8o26N1K5
$$ -239 325 265 -117 166 -27 71 363 -113 144 201 -37 266 -230 -214 -138 273 -151 346 248 -378 -327 -302
15949c02J86M91m52m9M04j51k78Pk1j97K71K56l66M15N1k01J75k44j38L52m49
$$ -302 -116 375 -77 -126 278 127 -151 -144 -165 -362 -91 165 -201 214 265 64 239 -5 -143 209 -240
15970b40o62J504j042K47N41o90O46j40m40J90O30p73J23K15l39P5J093o59m87
$$ -240 -902 602 -440 -193 348 -342 304 164 -276 -86 544 -229 -106 109 -230 -155 938 279 -208
15989b08P1m51P98K4m64M27L24j189J047k70l09O43m49o90J033p80PJ014q01q3
$$ -208 -137 -588 210 234 -230 197 521 -668 379 109 -200 443 -6 -696 337 -443 -436 578 -223 -306
16009c06O73j94q72O07k4J74Q4m36L13K52k13l61Q78r01M16K41p38N23qJ14K79
$$ -306 367 173 -699 -92 -116 58 142 -294 19 271 58 -303 575 -326 90 331 -407 116 108 222 501
16030E01q7q10N88K34p43j12O47J71l39P2J04m96L66l40l3R12o59M70j07k64n4
$$ 501 414 -396 192 426 -317 -429 218 389 50 122 226 -270 96 -244 -277 635 -24 446 339 75 21
16051B1N2o02N45rn32L92l56L85J14K25l8N44n41o82Q86l06j35J51j01J31K56
$$ 21 73 -529 16 7 -525 -133 -489 -104 10 235 197 741 200 -482 404 98 -37 114 13 144 400
16072D00n55L97j12l76N72O5r25K76M43k45k77L80j35r6R03p57J84L30m59j96
$$ 400 -155 242 130 -246 326 391 -534 -258 185 -60 -337 43 -92 -188 715 -42 142 472 13 -183
16092a83M45p03P60n2m04J73K34n54K53J94m36L13J3n81P64j96oM86k25o67P08
$$ -183 262 -441 319 267 -137 36 270 -284 -31 163 -273 40 53 -528 236 40 34 520 295 -372 336
16113C36R4m77N42l08o43J011m71k35M20j66q11O72j01J95L07p47K55N07p50L37
$$ 336 430 -47 495 187 -456 555 84 -151 269 103 -708 -36 -137 58 365 -382 -127 380 -370 -33
16133c3O43o46kK11j053J281j61l38N24k37m72K67j07j3K05J61p08N51o9m11N18
$$ -33 610 -36 -38 173 -880 401 240 -98 426 189 -283 -16 -123 -136 69 230 -478 73 4 -407 111
16154A11J4l37N76o05O5RL13j89L30k38k28N61n20o46J188n81J50p7m46O67j02
$$ 111 125 -212 364 -241 -176 -167 146 -43 287 49 -179 382 -138 -784 404 -177 -27 -104 -550 117 15
16175A5p5L06J13p63m62J072j13m45M79l90Q19k50r35P47k24N4l11P48m53M44
$$ 15 -60 246 359 -404 -866 206 93 -352 127 -263 556 306 -629 118 -106 -52 -363 385 -68 376
16195C76m62j42M56J8q18R42n8l31J56K67n18N92k88j10M76o59k08J80J69m97
$$ 376 -86 -228 228 246 -572 370 312 -19 137 404 -114 478 190 80 556 -103 -311 -131 38 -459
16215d59N63m99M7K82m36M38M72o28l2N21m33J67pk97L45K27j40K91p47q7N1O70
$$ -459 104 -395 -348 -66 -502 -64 408 -220 -252 269 -164 3 -4 -301 44 271 131 422 -325 -412 -361 309
16237C09q17N46K34m06J3P00p70L26l87l52L96mj90J3Q22q31N71L59r22N17j32
$$ 309 -508 38 272 -134 -121 579 -191 135 -252 -604 -208 -212 -402 -389 433 -398 173 532 -390 127 -5
16258en54R10k15m06N52k38k91L61j24n80N06k51k70Q06p57Q6J289j112M11N42
$$ -5 -559 351 136 -270 282 44 -247 114 -10 -590 -84 -335 -605 201 -556 -470 819 -293 118 660
16278F60o38J94K73r58N37M1n55K92N88n58K00M34j11k97K62n91J70K86q29P16
$$ 660 22 216 489 -469 68 109 -446 -154 434 -124 76 510 399 102 364 -227 -57 229 -600 116
16298A16j32k06J57l4j03M20N3q83R56o42q5R68p35j75L38J34n30O51n75j50N68
$$ 116 -16 -222 -65 -99 -202 218 271 -612 344 -298 -383 585 -150 -325 13 147 -383 268 -307 -457 111
16319A11l52m9O40l19l69R06m78r1L98l99K1L51n21J72L77l52n05M93l70L50J43
$$ 111 -241 -290 350 31 -338 568 90 -1 397 -2 19 370 -151 21 398 46 -459 34 -336 14 157
16340A57l51Q5R0q9K69j63m96L11N4L4L29k00j90K8L03p29P64n24N3M62o02L02
$$ 157 -194 -109 -19 -108 161 -2 -498 -187 -133 -99 230 30 -160 -132 171 -558 206 -318 -265 197 -405 -103
16362a03L26m98J87Q74o70l68Q71j63m91K61l78O9K39k88r5N80o69K73L13l78
$$ -103 223 -275 -88 786 116 -252 619 456 -35 226 -152 -83 156 -132 -227 353 -316 -43 270 -108
16382a08R3
$$ -108 -15
16383a5
$$ Imaginary data points
##PAGE= N=2
##DATA TABLE= (X++(I..I)), XYDATA
0@%%%%%%%%%JkKkPj4J6j6J7j6J5k1K7l1L4m0N0n8O9q0R5j23J74k89J816l9m80
$$ 0 0 0 0 0 0 0 0 0 0 1 -1 1 -1 6 -8 8 -8 9 -7 8 -13 14 -17 17 -23 27 -31 38 -42 53 -70 104 -185 1631 1592 1112
36A112j005m06j71j003J52j94r26O59N04l76O38R16l95J391M37n7K91J43L4O8
$$ 1112 107 -299 -470 -1473 -1321 -1515 -2441 -1782 -1278 -1654 -1016 -100 -495 896 1333 1276 1567 1710 1744 1812
56A812q34j88o27q8r17L32l31j15k07o09q5R64J8Q79O8R5M99Q59k03R4M27p99
$$ 1812 978 790 163 75 -842 -510 -841 -956 -1163 -1772 -1857 -893 -875 4 72 167 666 1525 1322 1416 1843 1044
78A044N8k26m07m42l64o44R6o4n59j73KL63L12R23l18Q83K34j37N04J53J5M76
$$ 1044 1102 876 469 27 -337 -981 -885 -949 -1508 -1681 -1679 -1316 -1004 -81 -399 484 718 581 1085 1238 1253 1729
100A729m15m77l74P21j554Q7j084MJ87j03n7L91M10j30O12j68R15pN61m6L08j84
$$ 1729 1314 837 463 1184 -370 -283 -1367 -1363 -1176 -1279 -1336 -945 -535 -665 -53 -221 694 687 1248 1202 1510 1326
122A326l23K98r95j75l09n11l85R1o8o98R48n08j75J059r8N64O43n81R22L71l52
$$ 1326 1003 1301 306 131 -178 -689 -1074 -983 -1051 -1749 -801 -1309 -1484 -425 -523 41 684 103 1025 1396 1044
143A044L9J98l78j64k17q31k6m65p90P63p96J57P17m10P62KN40P2O22M38q02J026
$$ 1044 1083 1281 903 739 522 -309 -335 -800 -1590 -827 -1623 -1466 -749 -1159 -397 -395 145 217 839 1277 475 1501
165A501p22L82M01q76p00N31l88p41j2q01J97M31l87n3J132p13O64K02L75M07
$$ 1501 779 1161 1562 686 -14 517 129 -612 -624 -1425 -1228 -797 -1184 -1237 -105 -818 -154 48 423 830
185H30O08q68P85K85q20n45J76k33n05l23n01L61m45J78j00L75l94Q98p2q2R70
$$ 830 1438 570 1355 1640 820 275 451 218 -287 -610 -1111 -750 -1195 -1017 -1117 -742 -1136 -238 -310 -392 578
206E78l00K54L08J25m75J007m99p44L98p18m16L19o17m40L10L56l44K18K87o0
$$ 578 278 532 840 965 490 1497 998 254 652 -66 -482 -163 -780 -1220 -910 -554 -898 -680 -393 -453
226d53P03j5J94K27L12Q2l18n6l3N23j388O28m45r77k1O17n47j76N90n86L76P50
$$ -453 250 235 429 656 968 1050 732 676 643 1166 -222 406 -39 -1016 -1037 -420 -967 -1143 -553 -1139 -763 -13
248a3m34k6R52j87O42k19l4j44N03j016M95kn67k51l2m30R25j122R9P54l06J77
$$ -13 -447 -473 479 292 934 715 681 537 1040 24 519 517 -50 -301 -333 -763 162 -960 -861 -107 -413 -236
270b36O07l03p4M30r6J93K62k55J67j46J2j06k99o03K53J94p25j45J57K36l76
$$ -236 371 68 -6 424 328 521 783 528 695 549 561 455 156 -447 -194 0 -725 -870 -713 -477 -853
291h53Q26l72M94K61JP9K49l67N71k61n29N34L4o62K70o82J9J12l66n38P68q10
$$ -853 -27 -399 95 356 357 436 685 318 889 628 99 633 667 5 275 -407 -388 -276 -642 -1180 -412 -1222
313a222L45P58n39P28K72l47L57M50k42P1P6m53L06l31o74l7J82q20K99N40n26
$$ -1222 -877 -119 -658 70 342 -5 352 802 560 631 707 254 560 229 -445 -482 -300 -1120 -821 -281 -807
334h07J13P63n82j8N80r6L30M95l33M43J99q11K48J51r54K65k32k9M2m28l62M40
$$ -807 -694 69 -513 -531 49 -47 283 778 445 888 1087 276 524 675 -279 -14 -246 -275 -233 -661 -1023 -583
356e83K73l46N30Q9p3O84K37o13M12l8k45K94J68j011O59n51j53J41l26l01L80
$$ -583 -310 -656 -126 -37 -110 574 811 198 610 572 327 621 789 -222 437 -114 -267 -126 -452 -753 -373
377c73k50k54P65m62N30L41n28O13o8q7J19L16m40L48j07n5J64n35l1N6o9n90
$$ -373 -623 -877 -112 -574 -44 297 -231 382 314 227 346 662 222 570 463 408 572 37 6 62 -7 -597
399e97J29M31q65N02N1K27N34l33J00K65M07k80l72M87o67R2l74j10N33m05m89
$$ -597 -468 -37 -902 -400 -349 -122 412 79 179 444 851 571 199 686 19 111 -263 -373 160 -245 -734
420g34O09m81q25J090J80n15J058l44l12Q63K52n91P26n95k40M91l49j03k28j61
$$ -734 -125 -606 -1431 -341 -161 -676 382 38 -274 589 841 250 976 381 141 632 283 180 -48 -209
440b09q2m8k20L62m22L40j6K11j86L39J34j08J45K97n27N83k87m71N37j01m91
$$ -209 -291 -339 -559 -197 -619 -279 -295 -84 -270 69 203 95 240 537 10 593 306 -165 372 271 -220
461b20P16k44r55L93Qo09M54J41l36R50k73k13O69j46j77N06n25K8J46j26J82
$$ -220 496 252 -703 -310 -302 -911 -457 -316 -652 298 25 -188 481 335 158 664 139 167 313 187 369
482C69m7o15J7J28J2n55N30k17R9j82k38Q40K87n44M57K06r83Q18J00n78L15K38
$$ 369 322 -293 -276 -148 -136 -691 -161 -378 -279 -461 -699 141 428 -116 341 547 -436 382 482 -96 219 457
504D57p38N32o0m74M46l20l67M46k92l03O24n7q1O60k68k57L49J30p9q7k80j93
$$ 457 -281 251 191 -283 163 -157 -524 -78 -370 -673 -49 -106 -187 473 205 -52 297 427 348 261 -19 -212
526b12M03Qo52M63Q7k66k7o7P66m84j35j28K87n23M54Q32q75L84j19r5J29o1n52
$$ -212 191 199 -453 10 97 -169 -196 -263 503 19 -116 -244 43 -480 -26 806 -69 315 196 101 230 169 -383
549c83Q2M20j24j54M64l86L33J48q99O54k26l48O08l43K57K03R2p08N34q6m68
$$ -383 -301 119 -5 -159 305 -81 252 400 -499 155 -71 -419 189 -154 103 306 398 -310 224 138 -330
570c30P09k40m51O98r16N47R4l15J5O35q48n61J365q30N93K63j75m73P97p43j3
$$ -330 379 139 -312 386 -530 17 111 -204 -189 446 -402 -963 402 -428 165 428 253 -220 577 -166 -179
591a79J40k55O26Mo14J18J79m04O23k75k18K74K2o98P39M19q57N76p5j52N12o68
$$ -179 -39 -294 332 336 -278 -160 19 -385 238 -37 -255 19 41 -657 82 501 -356 220 145 -7 505 -163
613a63J8O02k93n61K68k09N75K77n76O7K22m90M61p5k08m75Q52p43M82j62m6L74
$$ -163 -145 457 164 -397 -129 -338 237 514 -62 5 227 -263 198 123 -85 -560 292 -451 31 -131 -177 197
635A97Q8l5J71L32n11P8Q09q54l53J71j62K22k08k63N22R8l62O8n48K52J91O74
$$ 197 285 250 421 753 242 320 1129 275 -78 93 -69 153 -55 -318 204 302 -60 8 -540 -288 -97 577
657E77m98k57M64m31R74l03k35Q6m23j62O09m76n01L69J85n36N30o86M01L80o63
$$ 577 79 -178 286 -145 829 526 291 377 -46 -208 401 -75 -576 -207 -22 -558 -28 -714 -313 67 -596
678e96M55P93o49K44K11o56K05L79k31Q7R2n47l8P26j118N02J6o77P99n5n91P26
$$ -596 -141 652 3 247 458 -198 7 386 155 242 334 -213 -251 475 -643 -141 -125 -802 -3 -58 -649 77
700G7L64q25P87o93L82L16l04n6N20k59r53J186m52l76l60N68j55qO0l24L31J54
$$ 77 441 -384 403 -290 92 408 104 48 568 309 -644 542 90 -286 -646 -78 -233 -241 -181 -505 -174 -20
722b0j52J87J01K07M30j86l37P18p80L45p26M30l00L9m07m05R92j259Q42J2q5
$$ -20 -172 15 116 323 753 567 230 948 168 513 -213 217 -83 -44 -451 -856 136 -1123 -281 -269 -354
743c54k0K86M01j09N9J09J06J22l95L62O18q71j22K13p78N52o47r2K51j27p07
$$ -354 -374 -88 313 204 263 372 478 600 205 567 1185 314 192 405 -373 179 -468 -560 -309 -436 -1143
764a143J117P1l19P70Lp45J024l56k8N25o11m99J75k26M10J5p01j64L73l11k39
$$ -1143 -26 45 -274 496 499 -246 778 422 394 919 308 -191 -16 -242 168 183 -518 -682 -309 -620 -859
785h59N23o8j05N38o9R9L39n04P14N17p58j46K1n20O40l28p53R25p56J38N3K8
$$ -859 -336 -404 -509 29 -40 59 398 -106 608 1125 367 221 242 -278 362 34 -719 206 -550 -412 -359 -331
807c31j63Q57q63k16J057r4j21J31K82j39L87o2p04N09l90k42m5qm62K11l82M43
$$ -331 -494 363 -500 -716 341 247 126 257 539 400 787 725 21 530 140 -102 -147 -155 -617 -406 -788 -345
829c45j9l23L95K18N2q4J157j119N75M96P8m61K33q57K30q6m99J08L1n55N90K68
$$ -345 -364 -687 -292 -74 -22 -106 1051 -68 507 1003 1081 620 853 -4 226 140 -359 -251 -220 -775 -185 83
851H3n48p8M37m24O68J07k50J63N74l20N49l14l94M08p99R4J69k59p07N49m41
$$ 83 -465 -543 -106 -530 138 245 -5 158 732 412 961 647 253 661 -138 -44 125 -134 -841 -292 -733
872g33k64J096k44m22J098r43K63K12M28m5M08o73M31j79j59p3J43o68j14N15
$$ -733 -997 99 -145 -567 531 -412 -149 63 491 446 854 181 612 433 274 201 344 -324 -438 77
892G7p94J3M30j005J083J17o10O01O2l75O03K7m26N62N68q48R48j65r72K20l77
$$ 77 -717 -704 -274 -1279 -196 -79 -689 -88 -26 -401 202 229 -197 365 933 85 1033 868 -104 116 -261
913b61m57K84l46N30K51p44j27Q22l20J73M76j54M23J19k70m04P22j222P61M7
$$ -261 -718 -434 -780 -250 1 -743 -870 -48 -368 -195 281 127 550 669 399 -5 717 -505 256 303
933C03j062P24J37q8o51K58o79N34K08l86M25N25o17M92N42l00J73j48k14N63
$$ 303 -759 -35 102 14 -637 -379 -1058 -524 -316 -702 -277 248 -369 123 665 365 538 390 176 739
953G39j14p70L5N2J0m87K26k97O69l14m55K32q4K03O41M58p98P69o40j2M34l18
$$ 739 625 -145 -110 -58 -48 -535 -309 -606 63 -251 -706 -474 -558 -355 286 744 -54 715 75 63 497 179
975A79LM0K3k20P2l05m66K13k24k87J318r38J60N42l42M27M74L7o94J064j118
$$ 179 182 222 245 25 97 -208 -674 -461 -685 -972 346 -592 -432 110 -232 195 669 706 12 1076 -42
996d2O08L9k96N3R4j150M05k56l50K76L06o53N70J99p05P85M7o7J340m01p35Q07
$$ -42 566 605 309 362 456 -694 -289 -545 -895 -619 -313 -966 -396 -197 -902 -117 -70 -137 1203 802 67 874
1018H74m11k72J1k45j96M32o95L9M61q87K83M60n18J48K74mM4P91m34M18k91K91
$$ 874 463 191 202 -43 -239 193 -502 -463 -2 -889 -606 -146 -664 -516 -242 -246 -202 589 155 573 282 573
1040E73K51K09n64k24k21j80j01j57n15L23L61n99K71N75q78J056J17n81P04k12
$$ 573 824 1033 469 245 24 -156 -257 -414 -929 -606 -245 -844 -573 2 -876 180 297 -284 420 208
1060B08J75J31n3l70Q98j066J31j00J78j099O19k62r2M70j41l85L42J55j50O75
$$ 208 383 514 461 91 989 -77 54 -46 132 -967 -348 -610 -702 -232 -373 -758 -416 -261 -411 264
1080B64l32K0Q47n38J31O99o75K00j83n06J17L10r51L19L43r28M93K81r15O67
$$ 264 -68 -48 799 261 392 1091 416 616 433 -73 44 354 -597 -278 65 -863 -370 -89 -1004 -337
1100c37L10n38L48M88k99P56l25L1K12j73p84P36r6j085N92n20n00N11k41J68
$$ -337 -27 -565 -217 271 -28 728 403 434 646 473 -311 425 329 -756 -164 -684 -1184 -673 -914 -746
1120g46M67J77l79J056k26L2P46n84m4P63q89O3K11o40l87qJ51l48N9p24M86K94
$$ -746 -279 -102 -481 575 349 381 1127 543 499 1262 373 436 647 7 -380 -388 -237 -585 -526 -1250 -764 -470
1142d70n7n4J100o44R9P34o35O42K20m92L12p63O73l02o2o74k20j91n04P53R9
$$ -470 -527 -581 519 -125 -26 708 73 715 935 443 755 -8 665 363 301 -373 -593 -784 -1288 -535 -436
1163d36m21K64N3M11m8K93K22K93o0L76j28k78k85L43r03J63K25p28R5J9J3l62
$$ -436 -857 -593 -540 -129 -177 116 338 631 571 947 819 541 256 599 -304 -141 84 -644 -549 -530 -517 -879
1185h79M05m3L07N64o78J55R29r00Q77N55j159K48L54q58L13K58j197J007o29
$$ -879 -474 -517 -210 354 -324 -169 760 -140 737 1292 133 381 735 -123 190 448 -749 258 -371
1204c71p7J64l84k04O00M5R8L24J15j92M65R1o02P61j051N10k6M4M3m35j42j98
$$ -371 -448 -284 -668 -872 -272 -227 -129 195 310 118 583 674 72 833 -218 292 266 310 353 -82 -224 -422
1226d22L31m89J67L32n52L30M25m35O16M59j252R00M42l94j18O25o67o7N59j047
$$ -422 -91 -580 -413 -81 -633 -303 122 -313 303 762 -490 410 852 458 340 965 298 231 790 -257
1246b57J32K54o31j19O77o47K17J02L67O6J86q05J299m40l75P61j88j05k65j99
$$ -257 -125 129 -502 -621 56 -591 -374 -272 95 161 347 -458 841 401 26 787 599 494 229 30
1266C0m14M86m2l58N44q75J12O1m4M1L98L7o0O04l86K26M30n68M8P42r16P1L73
$$ 30 -384 102 60 -298 246 -629 -517 -456 -500 -459 -61 -24 -84 520 134 360 790 222 270 1012 96 167 540
1289E40o81n0J9p9k58K73j47o5P39o58N29J09o27J72O42o10K22L6Q1Q7m4n67M71
$$ 540 -141 -191 -172 -251 -509 -236 -383 -448 291 -367 162 271 -356 -184 458 -152 70 106 187 274 230 -337 134
1312A34l85o97R15j09j81q8J48N5K5K23j24J57l06J71L55l04J67J33J12k83K45
$$ 134 -251 -948 -33 -142 -323 -411 -263 -208 -183 40 -84 73 -233 -62 293 -11 156 289 401 118 363
1333C63o24l23J036j125L11J18l41N58l63K93L60k17M35n1l1j21K31k85J9O33
$$ 363 -261 -584 452 -673 -362 -244 -585 -27 -390 -97 263 46 481 430 399 278 509 224 243 876
1353H76l14j033L66L64o24J27J44l67L80J47l69N09k77k2J61j47N21J4n31J26
$$ 876 562 -471 -105 259 -365 -238 -94 -461 -81 66 -303 206 -71 -93 68 -79 442 456 -75 51
1373E1L07M5k19L73n93p1l07L57l61N51k10Q4J3m40K87L43n43K70L15l67J10l1
$$ 51 358 403 184 557 -36 -107 -414 -57 -418 133 -77 7 20 -420 -133 210 -333 -63 252 -115 -5 -36
1395c6J62M61r2p72n3N25n15J47K27j6m55P53q04O88L45j005N02L12j083Q42P78
$$ -36 126 587 495 -277 -330 195 -320 -173 54 38 -417 336 -468 220 565 -440 62 374 -709 133 911
1416I11o69J03K57q01P70J78j259J135p99l63J108q42Q3N33q48m4P46o63M47j10
$$ 911 242 345 602 -199 571 749 -510 625 -174 -537 571 -271 -188 345 -503 -547 199 -464 -17 -127
1436a27J6R6L71r04Q72l7m61J82M18m41o5L30r50L00J12n7K61K54r93Q11r9m5
$$ -127 -111 -15 356 -548 324 287 -174 8 426 -15 -80 250 -700 -400 -288 -345 -84 170 -823 -12 -111 -156
1458a56K99m5j55P82r17k00R51j87n96J66l46J04M13K52m51J43l72j28R30j162
$$ -156 143 98 -57 725 -192 -392 559 372 -224 -58 -404 -300 113 365 -86 57 -315 -443 487 -675
1478f75M89N17m30j63M73Pj59L75m65j43M57k80K11k41k67r8K89m37P31k12k04
$$ -675 -186 331 -99 -262 211 218 59 434 -31 -174 283 3 214 -27 -294 -392 -103 -540 191 -21 -225
1499b25Q5K15m04N56J47m36N68m65Q9K07j21m50K58K4p85J043o95l2N49J02q39
$$ -225 -140 75 -329 227 374 -62 506 41 130 337 216 -234 24 48 -737 306 -389 -421 128 230 -609
1520f09N83j68m1M87q30M49O32n09Q7J3O6m48P97p88q5R46j205P24J02q34M58
$$ -609 -26 -194 -235 252 -578 -129 503 -6 81 94 160 -288 509 -279 -364 582 -623 101 203 -631 -173
1541a73K50n70O43K06m47n4J95j42J94O92p07K3k40l05J338n88q35O32K14n60
$$ -173 77 -493 150 356 -91 -145 50 -92 102 794 87 110 -130 -435 903 315 -520 112 326 -234
1561b34L46l17k45L04K03J10k1m89r8J096n74j83L41K11o84M55k03J98p5l68o22
$$ -234 112 -205 -450 -146 57 167 146 -343 -441 655 81 -102 239 450 -234 221 18 216 141 -227 -849
1582h49R90k15k82O09n81J51Q8j91L28K35r35J076l45j55K65J29n40N37k64j86
$$ -849 141 -74 -356 253 -328 -177 -89 -280 48 283 -652 424 79 -76 189 318 -222 315 51 -135
1602a35J91q2p8j92M15o52J194q36n6N02j63j37L62l01O7N4L13o89O23k13o8J5
$$ -135 56 -26 -104 -296 119 -533 661 -175 -231 271 108 -29 333 32 99 153 466 -223 400 187 119 134
1624A34m88K36L86l23n43P23m45m16P53l19L06K21n18L11p9M7J37K7k77O3R26
$$ 134 -354 -118 268 -55 -598 125 -320 -736 17 -302 4 225 -293 18 -61 -14 123 150 -127 -64 862
1645H62q95r9M29j1l30N14m80j44O81j030l8N25l49R88q48l9N63K7o94N97R9l74
$$ 862 -33 -132 297 286 -44 470 -10 -154 527 -503 -541 -16 -365 623 -225 -264 299 326 -368 229 328 -46
1667d6k49M12j35J12q6l97K78po7J07o29J20N91o0J27K35m27PN20l77J99L26o32
$$ -46 -295 117 -18 94 8 -389 -111 -118 -185 -78 -707 -587 4 -56 71 306 -121 -114 406 29 228 554 -78
1690g8j12L76l07N11n0m17J99q1o46N88J5k60L48J15p55M30K15j46k74K02J53
$$ -78 -190 186 -121 390 340 -77 122 41 -605 -17 -2 -262 86 201 -554 -124 91 -55 -329 -127 26
1711B6K19L35k58J35k09l39K14J73o28N27k17m59J253p28k25O37j75n70N16l65
$$ 26 245 580 322 457 248 -91 123 296 -332 195 -22 -481 772 44 -181 456 281 -289 227 -138
1731a38L79J0j84n6N66p67R2P60j168O46j60l37K13J51m53l2P30j024R01K45q26
$$ -138 241 251 67 11 577 -190 -98 662 -506 140 -20 -357 -144 7 -446 -478 252 -772 129 374 -452
1752d52P37j44m79R40J70j260Q49m53k25R63j65p00O70j098J16J172m51m37L62
$$ -452 285 141 -338 602 772 -488 361 -92 -317 646 481 -219 451 -647 -531 641 190 -247 115
1771A15k25j38M62o73Q93p0n15P0M39J04n42L68J09n64J02q34Q69J30q84O40n95
$$ 115 -110 -248 214 -459 434 364 -151 -81 358 462 -80 288 397 -167 -65 -899 -30 100 -784 -144 -739
1792g39M33J62K67n43K95K05o84O01K67L9m27L7P8j00L21o03Q67l33o75M56J81
$$ -739 -306 -144 123 -420 -125 80 -604 -3 264 303 -124 -87 -9 -109 212 -391 476 143 -532 -76 105
1813A05l02K29l6p37J052n37J31N4O63n03M42j60o13J087j105L74K06p06J91K91
$$ 105 -197 32 -4 -741 311 -226 -95 -41 622 119 561 401 -212 875 -230 144 350 -356 -165 126
1833A26j63l82M49j17k08n0k40P71j34o51Q28J60r74P25K43m13O08k07k35m90
$$ 126 -37 -419 30 -87 -295 -345 -585 186 52 -599 229 389 -585 140 383 -30 578 371 136 -354
1853c54N73j16K41lj050O84m30o25R20J82l17Q50m70J75j67J56k59P64m67l55
$$ -354 219 103 344 341 -709 -25 -455 -1080 -160 22 -295 555 85 260 93 249 -10 754 287 -68
1873f8O71q10o8N96k89p73J78Kj41L28o86R54N92q24M59M83r27K10P87m87R7N12
$$ -68 603 -207 -275 321 32 -741 -563 -561 -702 -374 -1060 -106 486 -338 121 604 -323 -113 674 187 284 796
1895G96p19M00k26r16Q66J76j256M23J67K96p5o3m52Q62k30J4J45L92m28Ml22
$$ 796 77 477 251 -665 201 377 -879 -456 -289 7 -68 -131 -583 279 49 63 208 600 172 176 -146
1916a46Q4J049p33l88k6m24N9O87n27j57k79J08L37N18k26L35N87o37NM93j111
$$ -146 -62 987 254 -134 -160 -584 -525 162 -365 -522 -801 -693 -356 162 -64 271 858 221 226 719 -392
1937c92N88N5q54O31L33l74J36k68k09M23l93l59O91j46m93P73M84p75L13L34
$$ -392 196 251 -603 28 361 -13 123 -145 -354 69 -324 -683 8 -138 -631 142 626 -149 164 498
1957D98q60M65J75j80K52L01j000M92m25m81Q52J6m94K45j54k46L02k27L08K55
$$ 498 -362 103 278 98 350 651 -349 143 -282 -763 89 105 -389 -144 -298 -544 -242 -469 -161 94
1977I4k28J89K07j66k08N53r19R97l60l78K6J19n92M85M66o62j5N29l88L91L46
$$ 94 -134 55 262 96 -112 441 -478 519 159 -219 -193 -74 -666 -181 285 -377 -392 137 -251 140 486
1998D86q76N66M52n30N4M70n29K3k28k27O84J1j002O34j29o61J111J46j094N06
$$ 486 -390 176 628 98 152 622 93 116 -112 -339 345 356 -646 -12 -141 -802 309 455 -639 -133
2018a33l12P53K2o43N33M36l68j17K80k32l73L7K80l21L71q19n6Q99r65R28k47
$$ -133 -445 308 330 -313 220 656 288 171 451 219 -154 -117 163 -158 213 -606 -662 237 -728 200 -47
2039d7m35L90N08q19Q75n97j61O65L2K8J81k28m64J22Q1r19P86k15J67J54k41
$$ -47 -482 -92 416 -403 472 -125 -286 379 411 439 620 392 -72 50 131 -788 -2 -217 -50 104 -137
2060a37l49M51Kn68L19M49m64N14K65k17L97k38n03%M47k24M82q85k72M42l1m46
$$ -137 -486 -35 -33 -601 -282 167 -297 217 482 265 662 424 -79 -79 368 144 626 -259 -531 -89 -120 -566
2082e66N58m52J09M76k45J04L99k26K8K29o95O54j96n43K72K26p10J97R1l65O86
$$ -566 -8 -460 -351 125 -120 -16 383 157 185 414 -281 373 177 -366 -94 132 -578 -381 -290 -655 31
2103C1l16l20N72P3n87P60J9r2P34j74l66K48l32k60O70q35MN59l90o16O48m80
$$ 31 -285 -605 -33 40 -547 213 232 140 874 700 334 582 250 -10 660 -175 -171 388 -2 -618 30 -450
2125d50K84r9l46M42L05p86N65P06l08o2P84j115M91l72J22Q1m37MJ9K39m18J21
$$ -450 -166 -265 -611 -169 136 -650 -85 621 313 251 1035 -80 411 39 161 242 -195 -191 -172 67 -351 -230
2147b30P3n82R94o16l8N02J7o87J117k05l53O81n7m69J80K43n16J68j72m49N31
$$ -230 -157 -739 255 -361 -399 103 120 -567 550 345 -8 673 616 147 327 570 54 222 50 -399 132
2168A32q2q24J055n25n74J344r26J42Q15n05rL41j27L9Rk36j42L16q06K68K6l67
$$ 132 50 -774 281 -244 -818 526 -400 -258 557 52 43 384 257 296 305 69 -73 243 -563 -295 -269 -636
2190f36p9P52n72j81M53k86K76N78m70N96J98r72J170p80j22M57n00N8N03p63
$$ -636 -715 37 -535 -716 -263 -549 -273 305 -165 431 629 -343 827 47 -75 382 -118 -60 443 -320
2210c20N9J26J42r77J015j41qj56M35k30N33j69k22R6K83k81j88l45L26N3j26
$$ -320 -261 -135 7 -970 45 -96 -104 -260 175 -55 478 309 87 183 466 185 -3 -348 -22 31 -95
2231i5r3N8m5k99L90q69N09L92m06n6L52j89K50L50K18J40J22p82N32Qo68M11
$$ -95 -188 -130 -175 -474 -84 -953 -444 -52 -458 -514 -162 -351 -101 249 467 607 729 -53 479 487 -181 230
2253B30L5o24K78O1m56L39R0k30P6J60j57M36l67J62Q12n74j84N26p17k68P76
$$ 230 265 -359 -81 -20 -476 -137 -47 -277 -201 -41 -198 238 -129 33 845 271 87 613 -104 -372 404
2274D04j28o48N65j54k55M62n46k0L27k52O0K26o48M75O74o11K05M28o10N95L28
$$ 404 276 -372 193 39 -216 246 -300 -320 7 -245 -185 41 -607 -132 542 -69 136 564 -46 549 877
2295H77j461P88K59p95J93M60m98k51N20p49N53l9jJ83Q2N0L38m27l9J056n71
$$ 877 -584 204 463 -332 -139 321 -177 -428 92 -657 -104 -143 -144 39 121 171 509 82 43 1099 528
2316E28p44J66K20n93L56k01k51O98n95K32M07p08L84N02o67Q25r3j09q1Rk55
$$ 528 -216 -50 170 -423 -67 -268 -519 179 -416 -184 223 -485 -101 401 -266 559 466 357 276 285 30
2337C0L6M6k55L49J13n62O8J27m89P50j54o62L69L27n57L25K35L05j39m50M37
$$ 30 66 112 -143 206 319 -243 -175 -48 -537 213 59 -603 -234 93 -464 -139 96 401 262 -188 249
2358B49O2J10q75P44M00r19Q71j110k7L71k38k25M98j92O7O04m63l34N12r26J252
$$ 249 311 421 -454 290 690 -229 642 -468 -495 -124 -362 -587 -89 -281 -214 390 -73 -407 105 -821 431
2379D31M35r39r1L78m3J3k12J9m56P59n56K60Q8j91j74J91l17J78K25j42M24j39
$$ 431 866 -73 -164 214 171 184 -28 -9 -465 294 -262 -2 86 -105 -279 -88 -405 -227 -2 -144 280 141
2401A41j01LM43m51M51k98q03R34q2n23K56m02k88J219m89j84N01l25o57R56m37
$$ 141 40 43 486 35 486 188 -615 319 237 -286 -30 -432 -720 499 10 -174 327 2 -655 301 -136
2422a36l21Q80m11o8O94q72kL39j25J2L16q18L38J16n52N27N7k33J94k52P7K71
$$ -136 -457 423 12 -56 638 -234 -236 103 -22 -10 306 -512 -174 -58 -610 -83 -26 -259 -65 -317 -240 31
2444C1J06Kj52L00l0j4K44o61L49n71M4P3O02m81j5O49q57O67k88Q8K7j82l62
$$ 31 137 139 -13 287 257 243 487 -174 175 -396 -352 -279 323 -158 -173 476 -381 286 -2 86 113 -69 -431
2467d31N79K4o20J040n30o2K93n90L15K9j70j86O8q7m31J107o44K40J06l21j23
$$ -431 148 172 -448 592 62 0 293 -297 18 47 -123 -309 -241 -328 -759 348 -296 -56 50 -271 -394
2488c94N62n13o1P79l82M82J53r04L46K11l46N07j28m35l07O51o68P19j39k04
$$ -394 168 -345 -406 373 -9 473 626 -278 68 279 -67 440 312 -123 -430 221 -447 272 133 -71
2508g1M16Q0p48R87l91p50J272n38n71P54n70n10J065o88M01N9k43K55k44j72
$$ -71 345 425 -323 664 273 -477 795 257 -314 440 -130 -640 425 -263 138 197 -46 209 -35 -207
2528b07J39O91p25J60j24j91J80M85q24N87k14J32j46N32n27M68j53o04L41l33
$$ -207 -68 623 -102 58 -66 -257 -77 408 -416 171 -43 89 -57 475 -52 416 263 -341 0 -333
2548c33l58O12M58k26m99P84n96M91O9m77M94m63l09O73k24l33O06k09m61L82
$$ -333 -691 -79 379 153 -346 438 -158 333 402 -75 419 -44 -353 320 96 -237 369 160 -301 81
2568H1l55k11P17n47j06P01n54n27J018m28K48M15q01J79K42j49M02J01j92l02
$$ 81 -274 -485 232 -315 -421 280 -274 -801 217 -211 37 452 -349 -170 72 -77 325 426 234 -68
2588f8L19k57K96k15m68N24M37n72J05K76m81M44J0k47j45M7m61N75j60J37K0
$$ -68 251 -6 290 75 -393 131 568 -4 101 377 -104 340 350 103 -42 5 -456 119 -41 96 116
2609A16q6l09K62L31o13M31P0l39N08o40R3L42k78m16J082p91P8O96m75m04O24
$$ 116 30 -279 -17 314 -299 132 202 -137 371 -269 -176 166 -112 -528 554 -237 -159 537 62 -342 282
2630B82m91o2Q32n62k14q0N91k66n5m52L05Q6l93P56p4n86R1J07l5N16J8j72N7
$$ 282 -209 -271 561 -1 -215 -295 296 30 -25 -477 -172 -86 -479 277 203 -383 -292 -185 -220 296 314 142 199
2653A99K14k32n20L79Q5k66J30O0nn16O2J57N51l19J21K11n77K50M3j79O75j20
$$ 199 413 181 -339 40 125 -141 -11 49 44 -472 -410 -253 298 -21 100 311 -266 -16 27 -152 523 403
2675D03q60O89j00l73L81N5r50L85N43j26J44m79P4K16M10o35M21o27M25l5n2
$$ 403 -457 232 132 -241 140 195 -755 -370 173 47 191 -288 -214 2 412 -223 198 -429 -4 -39 -91
2696i1N3Q2m22M93O38q46J24L72r83N44O2p52J019j66q6L70l95o56Q80k35l65
$$ -91 -38 44 -378 115 753 -93 31 403 -580 -36 26 -726 293 127 41 411 16 -640 240 5 -360
2717c60O18j60n38Q38p14L8P28p31J82P91o95k09O26p71m6O31n45K15L99o44N26
$$ -360 258 98 -440 398 -316 -278 450 -281 -99 692 -3 -212 414 -357 -403 228 -317 -102 297 -347 179
2738A79M62o60J72j46l16K36J08J04k94O87q71M41m9m19L73j73k1M68l41j31Q29
$$ 179 641 -19 153 7 -309 -73 35 139 -155 532 -339 102 53 -366 7 -166 -187 281 -60 -191 638
2759F38p15P3L45l16P9m4J14r3K4k48l54M50P3k28N74n84o53R69j76O03j80n95
$$ 638 -77 -4 341 25 104 60 174 81 105 -143 -497 -47 26 -202 372 -212 -865 104 -72 531 351 -244
2781b44K6O58q55J77M48l74K17M85o48K14Q03j014k14O91j247R25r9K6J95Q2l53
$$ -244 -218 440 -415 -238 210 -164 53 538 -110 104 907 -107 -321 370 -877 48 -51 -25 170 252 -101
2802a01N82K45j189N88j34M0K41L2n40N00l65k77Q97m37m28P88m72j85M30n43
$$ -101 481 726 -463 125 -9 31 272 304 -236 264 -101 -378 519 82 -346 442 -30 -215 215 -328
2822c28J31r9k77N38L53p85P41K39l13l41M76m35O77k35l98K15K30r46P29k3n64
$$ -328 -197 -296 -573 -35 318 -467 274 513 200 -141 335 -100 577 342 -56 159 389 -557 172 149 -415
2843d15L86N39n91K60m17K94JJ87r29P90K7O1L81l37q50N65k61P0J10J75l87L70
$$ -415 -29 510 -81 179 -238 56 57 244 -685 105 132 193 574 237 -613 -48 -309 -239 -129 46 -341 29
2865B9j77q4K15k59J03K17K03n06K46k33O44K60k76l25K69o50p3M79m27K78Ml28
$$ 29 -148 -232 -17 -276 -173 44 247 -259 -13 -246 398 658 382 57 326 -324 -397 82 -345 -67 -63 -391
2887c91L26M40l18J8m2l57j85N58o29M19N53k97J70J36l68j21N18o88L01J02m21
$$ -391 -65 375 57 75 33 -324 -509 49 -580 -161 392 95 265 401 33 -88 430 -258 43 145 -276
2908b76M17K7o01L90j54k48O79l77l52N98k82l89J273n19l45Q36n37k00O29n81
$$ -276 141 168 -433 -43 -197 -445 234 -143 -495 103 -179 -568 705 186 -159 677 140 -60 569 -12
2928a2N7L51n24k5N50n09n40P06m83J23L49k91P36J03m34k42K18k78J22O19q69
$$ -12 45 396 -128 -153 397 -112 -652 54 -429 -306 43 -248 488 591 157 -85 133 -145 -23 596 -273
2949b73N62k68j59K47p6n84N44O6j53K49k00KK10k07q0K81j70k19O38m19m2M90
$$ -273 289 21 -138 109 33 -551 -7 59 -94 155 -45 -43 167 -40 -120 161 -9 -228 410 -9 -51 439
2971D39n53J0M71m90N4k18j99q9O11l18j58N35l30L59J14k50p3O97k96n03Q62
$$ 439 -114 -104 367 -123 -69 -287 -486 -575 36 -282 -440 95 -235 124 238 -12 -85 612 316 -187 675
2992F75p51J69N20j263J062k25p84J80O20n24M79J12q49O93k61J36J51R9k98L67
$$ 675 -76 93 613 -650 412 187 -597 -417 203 -321 158 270 -579 114 -147 -11 140 239 -59 308
3012C08j02l01M16m76n16J218q86j28N86m74l34Q05j49m1J12k72N5M76l73r2Q46
$$ 308 206 -95 321 -155 -671 547 -339 -467 119 -355 -689 116 -33 -74 38 -234 -179 297 -76 -168 678
3033F78r85N08J16m87L17j29j19k00J53K63j24N7m92L16k90K58J21L89m62M93
$$ 678 -307 201 317 -170 147 18 -101 -301 -148 115 -9 48 -444 -128 -418 -160 -39 350 -112 381
3053C81K30o74N71j56l22J09j36j30L50l17n02M22O9L27j22k83J95J37L12q24
$$ 381 611 -63 508 352 30 139 3 -127 223 -94 -596 -174 -105 222 100 -183 12 149 461 -363
3073c63J62p9J56M25j92m7R1o8j11N44o81M12M5j33m13K30m27L73j81k99M49N20
$$ -363 -201 -280 -124 301 109 62 153 85 -26 518 -163 249 294 161 -252 -22 -449 -76 -257 -556 -107 413
3095D13o18L63l9k09O44n10m23R59N5j255R74j65p98Q79k06q1j17n56O90L56M3
$$ 413 -205 158 119 -90 554 44 -379 580 635 -620 354 189 -609 270 64 -17 -134 -690 0 356 399
3116C99k31K41l6L3l06L51n47R95p53j96Q32q68J55K67l82l21M70m15k98M98n78
$$ 399 168 409 373 406 100 451 -96 899 146 -50 782 -86 69 336 -46 -367 103 -312 -610 -112 -690
3137f90L32Q00j04j74K13k15K1J62o39K8N22m32n1L69q9j4R9m14L91j91p60O04
$$ -690 -358 442 338 164 377 162 183 345 -294 -266 256 -176 -227 142 53 39 138 -276 115 -76 -836 -232
3159b32L05l70M74k88l46R11k59o42R66N5m60K35p52L99k88J06Q1L59p06J23O59
$$ -232 73 -297 177 -111 -457 454 195 -447 519 574 114 349 -403 -4 -292 -186 -105 254 -452 -329 330
3180C30n87J53M65n52J41J068r22k57N22m2m8j54Nl30L18l85l71Q29n61K35O71
$$ 330 -257 -104 361 -191 -50 1018 96 -161 361 319 271 117 122 -208 110 -275 -646 183 -378 -143 528
3201E28o45k86L21m58P95L99n90K77r5k92Q00l98m55N82m93k96N29Lq01Q19k9
$$ 528 -117 -403 -82 -540 255 654 64 341 246 -46 754 356 -99 483 -10 -306 223 226 -575 244 215
3222B15l35j42n3J48O24l66l02M12j00k13Q70q16J88l6j95J06k2m18J75L72m61
$$ 215 -120 -262 -315 -167 457 91 -211 201 101 -112 758 -58 130 94 -101 5 -17 -435 -260 112 -349
3243c49J21N28r79N61p8k42O20j15j54L74k64k59M3J91k34J070p42m67K48j59
$$ -349 -228 300 -679 -118 -196 -438 182 67 -87 287 23 -236 -193 -2 -236 834 92 -375 -127 -286
3263b86j78N48j87j29M91n62j44Q65k29m0O13j181kJ033n83J45k7o10K83J019
$$ -286 -464 84 -103 -232 259 -303 -447 418 189 149 762 -419 -421 612 29 174 147 -463 -180 839
3283H39j013j25M29n14M98L50n50m9J40m82L98L86j85K97k3o11J122o41n66N73
$$ 839 -174 -299 130 -384 114 464 -86 -135 5 -477 -79 307 122 419 396 -215 907 266 -300 273
3303B73m97L09J25k39l10R3L34m84L58l37M40j66m77J18J081o49R0K80j30k73
$$ 273 -224 85 210 -29 -339 -246 88 -396 -38 -375 65 -101 -578 -460 621 -28 62 342 212 -61
3323f1K75n54M42P63j105J57M79n39j56J05K04k95K94k61j9J210j048n06Q17n55
$$ -61 214 -340 102 865 -240 -83 396 -143 -299 -194 10 -285 9 -252 -271 939 -109 -615 202 -353
3343c53N36M13n08J71N90q86K99N3o30J97N53j011N22r2j09K03L93o21K63M63
$$ -353 183 596 88 259 849 -37 262 315 -315 -118 435 -576 -54 -146 -255 -52 341 -280 -17 446
3363D46m16R7P2k73O10k27m72Q05j108J86M99J21q71J000p34j83Q61p92J80Q23
$$ 446 30 127 199 -74 536 309 -163 642 -466 -280 219 340 -531 469 -265 -448 413 -379 -199 624
3383F24r39qR07n99M56m00J96j91L47m67k55M00l88J34J07m71M05J63k74N6K8
$$ 624 -315 -323 584 -15 441 41 237 46 393 -74 -329 71 -317 -183 -76 -547 -142 21 -253 -197 -169
3404a69K1L88l97L54l1k0o44P13O0l97K17k80J01p8l6k86P15k35m24P70o39J05
$$ -169 -148 240 -157 197 166 146 -498 215 275 -122 95 -185 -84 -162 -198 -484 231 -4 -428 342 -297 -192
3426a92J00q8m99J866r73l43N58m71k07Q09o85o3O60o91J68K5m40M77K8n17O31
$$ -192 -92 -180 -679 1187 214 -129 429 -42 -249 560 -125 -188 472 -219 -51 -26 -466 11 39 -478 153
3447A53K2r0n01P81n06k5L73o43N28J95m54M93j7o56M13j98l37Q44o22J50j77
$$ 153 175 85 -416 365 -141 -166 207 -436 92 287 -167 326 309 -347 66 -132 -469 375 -247 -97 -274
3468b74l17M92K27K2r1K77k49j15j3k56K89N82r99K34N54l63j91N26j017M55L97
$$ -274 -591 -99 128 150 59 336 87 -28 -41 -297 -8 574 -425 -191 363 0 -191 335 -682 -227 170
3489A70j62k04N40p05K42N90j129Q12M03j65J2k70o6J21n50j73N44q9l35L22J81
$$ 170 8 -196 344 -361 -119 471 -658 154 557 392 404 134 68 189 -361 -534 10 -79 -414 -92 89
3510H9m69L11L01j1o7O43q98J19K4L51M2l74m25M35m09O27n03k28M58r5l64M85
$$ 89 -380 -69 232 221 154 797 -101 18 42 393 435 61 -364 71 -338 289 -214 -442 16 -79 -443 42
3532D2N94p23p8J26j50J17K54n45L72n5l36P35J72l81J20l71k23K80O65p62N10
$$ 42 636 -87 -165 -39 -189 -72 182 -363 9 -46 -382 353 525 144 264 -107 -330 -50 615 -147 363
3553C63n98j92K08K23j40L10l5l73Q84m94k72L82k26n12R45L7r81J052q03n3J71
$$ 363 -235 -427 -219 4 -136 174 139 -234 650 156 -116 266 40 -472 473 510 -471 581 -222 -275 -104
3574a04LK07L9J70j007J164r27N85L96k39m44R76p25m5O96q42k83R71p67o0O40
$$ -104 -101 106 145 315 -692 472 -455 130 526 287 -157 819 94 49 745 -97 -380 591 -176 -236 404
3595D04r16M98m1l79P37On46N51j17k48J33K59p22Q14k26k25N98p55K38O51j036
$$ 404 -512 -14 -55 -434 303 309 -237 314 197 -51 82 341 -381 433 207 -18 580 -175 63 714 -322
3616c22M56K97m53k54P80l55n02K4O28k57r5L88m8j64o39P20L98m97j82J18l80
$$ -322 134 431 -22 -276 504 149 -353 -329 299 42 -53 335 287 123 -516 204 602 105 -77 41 -339
3637c39Q59n81l11P8N43o65M05L60n93R1O6J71k46J55M8l58K55L00L9k21L58r50
$$ -339 520 -61 -372 -294 249 -416 -11 349 -244 -153 -87 84 -162 -7 41 -317 -62 238 277 56 414 -536
3659e36P05q10L83j90P1R09m00l54O65j39m54N57q47J05N93l77J24M86l40k3L72
$$ -536 169 -641 -258 -448 -377 532 132 -222 443 304 -150 407 -440 -335 258 -119 5 491 151 128 500
3680E00m63n5O31p07J16J12l00K64l11L81r1Q74j297K91L01j66K16k43j78K31
$$ 500 37 -18 613 -94 22 134 -166 98 -213 168 77 951 -346 -55 246 80 296 53 -125 106
3700A06k37p9P2M53j14k0p6l01M25Q7k03j10L45n29K92L44r42L42j63K8N53m37
$$ 106 -131 -210 -138 315 201 181 105 -196 229 316 113 3 348 -181 111 455 -487 -145 -308 -280 273 -164
3722a64m6M89k9k81k7j80J82M14q49M45L22k87n40O32J47k31N49k72m14l4M19
$$ -164 -210 279 250 -31 -58 -238 -56 358 -491 -46 276 -11 -551 81 228 -3 546 274 -140 -174 245
3743B45j5M52j098R62k16j174J270r9l50J78k57j31J40P31j504J365j97o68M72
$$ 245 230 682 -416 546 330 -844 426 327 -23 155 -102 -233 -93 638 -866 499 302 -366 106
3762A06K29l84M0K60j090J183Pn99L13l96K61K71m82M4K03L79m34O53r26M70J12
$$ 106 335 -49 -9 251 -839 344 351 -248 65 -331 -70 201 -281 -237 -34 345 -89 564 -362 108 220
3783B20k09J54M20r65L40M40n66m02Q03n18k1N33n22P1L18L21n90O90n21J7j38
$$ 220 11 165 585 -380 -40 400 -166 -568 235 -283 -304 229 -293 -222 96 417 -173 517 -4 13 -125
3804a25j05M69m43m03M93P33r3l40q8L09m46K12l08J10P1j88O71r67M64O4mo48
$$ -125 -230 239 -204 -607 -114 619 526 186 98 407 -39 173 -135 -25 46 -142 529 -438 26 90 86 -562
3826e62O53K98n58P24r59M33N20n83k07O87p42J05R57r52J42M64l32k38J20m0
$$ -562 91 389 -169 555 -404 29 549 -34 -241 446 -296 -191 766 -186 -44 420 88 -150 -30 -70
3846g0K46K06o85K53P56j075K54L91m76P90k72p73N27k64J6K74k74j80O39l94
$$ -70 176 382 -303 -50 706 -369 -115 276 -200 590 318 -455 72 -192 -176 98 -176 -356 283 -111
3866a11l73N10l66N8K48j64J59K82k98m83P50l67L51j48l48m3M08Q7r2K25l63
$$ -111 -484 26 -340 -282 -34 -198 -39 243 -55 -538 212 -155 196 48 -300 -343 65 152 60 285 -78
3887g8j35P05o50l13P10m02M63m41j34l07L46m88Q28J74k70j61N65p97L87P61
$$ -78 -213 492 -158 -471 239 -163 300 -141 -275 -582 -236 -724 104 278 8 -153 412 -385 2 763
3907G63q71L20Rq86N79K23p32R79m28n45J015p99j11M87m61M72P34q84k64P12
$$ 763 -108 212 221 -665 -86 137 -595 384 -44 -589 426 -373 -484 3 -458 14 748 -136 -400 312
3927C12l07m96Q21l63k55N88o57L93k3k58p5J55o0K62L19n63O28m2n2l76N45o86
$$ 312 5 -491 330 -33 -288 300 -357 36 13 -245 -320 -165 -225 37 356 -207 421 379 327 -49 496 -190
3949a90J00M19m20j36L76p91Q55O4o73O26k3l52M32L9l92N3l62M74k72k0L6M39
$$ -190 -90 329 -91 -227 149 -642 213 277 -396 230 207 -145 287 326 -66 -13 -375 99 -173 -193 -157 282
3971B82j34l46M11j45j69J32J78k7M58o14k86O01o97K65L06j90k49M73o91O88
$$ 282 148 -198 213 68 -101 31 209 182 640 26 -260 341 -356 -91 215 25 -224 249 -442 246
3991B46ko04N56O9k33N14r5l65k59N69l79L51L7r70J011l43q08J031l49k21N79
$$ 246 244 -360 196 265 32 546 451 86 -173 396 17 368 405 -565 446 103 -705 326 -23 -244 335
4012C35m76j06K00K83o11N26N0J66r0j32J83K27j136N30M18q01Q61k77m72J51
$$ 335 -141 -247 -47 236 -375 151 201 367 277 145 328 555 -581 -51 367 -434 427 150 -322 -171
4032a71K99l63K81M34n72l4N75m93m56K71K05K83n1k29M81n3o14K00k20k01O37
$$ -171 128 -235 46 480 -92 -126 449 -44 -500 -229 -24 259 208 -21 460 407 -207 -7 -227 -428 209
4053B09k82n06N73L39j70P1rm98L02l5j32M2k31M14N75m32l98J83j20j29L60m80
$$ 209 -73 -579 -6 333 163 234 225 -273 29 -6 -138 -96 -327 87 662 230 -168 15 -105 -234 126 -354
4075c54K01M46j60k95K91J78j43K14j052M09R62q93P47L94p65n44P26m57J36K31
$$ -354 -153 293 133 -162 129 307 164 378 -674 -265 697 -196 551 945 180 -364 362 -95 41 272
4095B72l96L85l45o18O90N8M9N3J38p32M40N72n71O97o75j69O73p03L31L9k58
$$ 272 -124 261 -84 -702 -12 46 95 148 286 -446 -6 566 -5 692 17 -152 521 -182 149 188 -70
4116g0j91N55m51k75Q93j7p48M94k99k28M23j84K37J30r9m15N56r79N65J47l04
$$ -70 -261 294 -157 -432 461 444 -304 190 -109 -337 86 -98 139 269 170 -245 311 -668 -103 44 -260
4137b60P6O22o57L81L49o26L41m25K85O8N40q45L09L42r34M88K45n06N34L6m49
$$ -260 -184 438 -219 162 511 -115 226 -199 86 154 694 -151 158 500 -434 54 299 -207 327 363 -86
4158h6J04j31l00J08K17j02M40J68j344J507l36p76N47k56J64L6K04l77M49K28
$$ -86 18 -113 -413 -305 -88 -190 250 418 -926 581 245 -531 16 -240 -76 -40 164 -213 236 464
4178D64l65K59p05M4K73N9j97K56p60Q91j85n16P73K06p41K28M99q44N79L81p21
$$ 464 99 358 -347 -303 -30 29 -168 88 -672 219 34 -482 291 497 -244 -16 483 -361 218 599 -122
4199a22P55n69n03L94J65q2L28k3n19j1Q1o58Q56L3l81O96l49l1L44n56M4J63
$$ -122 633 64 -439 -45 120 38 366 343 -176 -187 -106 -764 92 125 -256 440 91 60 404 -152 -108 55
4221E5l28J49L17k95k57P93r28J77N82n98M83O1m80J78N36k44j45J95n58L8L78
$$ 55 -273 -124 193 -102 -359 434 -494 -317 265 -333 150 211 -269 -91 445 201 56 251 -307 -269 109
4242A09k97M20j99J48q3r7m74K96M95q36J18O65q17N03R3m9K87j51k42L61l01
$$ 109 -188 232 33 181 98 1 -473 -177 318 -518 -400 265 -552 -49 44 -5 282 131 -111 250 -51
4263e1L6m92P23m05l2q3O23k73n82L03L64l65L4M08k90j09L30k35M6J49n89O91
$$ -51 -15 -507 216 -189 -221 -304 319 46 -536 -233 131 -234 -200 208 -82 -191 139 -96 -50 99 -490 201
4285B01P1l95k95P85n36j07M21n67O54k08l29N22J10n57L59K03o45M39o8o0KP1
$$ 201 272 -123 -418 367 -169 -276 145 -422 232 24 -305 217 327 -230 129 332 -313 126 58 -2 0 71
4307G1J37J67j40l43M24j12m33p6M56l04J67m0j44P57m81r84J151n65O47L98o68
$$ 71 208 375 235 -108 316 204 -229 -305 151 -153 14 -26 -170 587 106 -878 273 -292 355 753 85
4328H5k15N18o18L29N7k8n81P78n11k61Q92o64m1M72k99L21j24m63L00M25m80
$$ 85 -130 388 -230 99 156 128 -453 325 -186 -447 445 -219 -260 212 -87 234 110 -353 -53 372 -108
4349a08M42l69j45L31J58o09j90J63K68L48l98k19N43n89n9O14j31j49j17j8o9
$$ -108 334 -35 -180 151 309 -300 -490 -327 -59 289 -109 -328 215 -374 -433 181 50 -99 -216 -234 -303
4370c03J93K48M8L56n95o0O00m90n8N03q22J34M96m83L09M55k61p36P78j67q1
$$ -303 -110 138 186 542 -53 -113 487 -3 -61 442 -380 -246 250 -233 76 531 270 -466 312 145 64
4391F4k96L47j26L33j74k99K64p38J072k17q10Q56n84K0M28J66l98M09J21j019
$$ 64 -232 115 -11 322 148 -151 113 -625 447 230 -580 276 -308 -288 140 306 -92 317 438 -581
4411e81L50o5j96Q49J5o40M04o59L68L28k96l0L20l40P6L69n86m32J326j044P1
$$ -581 -231 -296 -492 357 372 -268 136 -523 -155 173 -123 -153 167 -173 -97 272 -314 -746 580 -464 -393
4432c93O85k01J63J15k30l59N61l91PL66p10J018M33j833L25N09l31K17j57n2
$$ -393 292 91 254 369 139 -220 341 -50 -43 323 -387 631 1064 -769 -444 65 -266 -49 -206 -258
4452b58K05q1K2K0k49L31L12r1J32L10n36j83N50n22Q3q5l40L66K8j04l17R79
$$ -258 -53 -134 -112 -92 -341 -10 302 211 343 653 117 -66 484 -38 45 -40 -380 -14 14 -90 -407 572
4474E72p33r4L99l83j94K59K00k72P02l18q7J02l95L48M24j139O64k79k99P61
$$ 572 -161 -255 144 -239 -433 -174 26 -246 456 138 51 153 -242 106 530 -609 55 -224 -523 238
4494B38J57l98j83J6k81J59P8k83N64K1m32L82l0j86L24l44M3L67m78N06K46l59
$$ 238 395 -3 -186 -170 -451 -292 -214 -497 67 88 -344 38 8 -178 146 -198 -155 212 -266 240 486 127
4516A27n38R45j46p84M83j67J10L7J82m11L41l48L15J24l06J65J67p5Pj69j45
$$ 127 -411 534 388 -396 87 -80 30 67 249 -162 179 -169 146 270 -36 129 296 221 228 59 -86
4537h6J15L04q99M94K85l95K22J37p58M43L8n27R77l51n31J029o42K74K64o15
$$ -86 29 333 -566 -72 213 -182 40 177 -581 -138 -100 -627 350 -1 -532 497 -145 129 393 -222
4557b22n9K08kp48J363j084j35N81J87k10M17l5k90M15l22n4N03m79k9K38o28
$$ -222 -281 -73 -75 -823 540 -544 -679 -98 89 -121 296 261 -29 386 64 10 513 34 5 243 -385
4578c85J48K77R1L5o24l9M72L83m46j7k09J53O2J89j27Q8P30q97Q0M8J35N8q4
$$ -385 -237 40 131 166 -458 -497 -25 358 -88 -105 -314 -161 -99 90 -37 51 781 -116 -36 12 147 205 121
4601A21k99L79j74j71M93k01m16L28L62q55N93J20l17P30m67l26K23k51n52J141
$$ 121 -178 201 27 -144 349 148 -268 60 422 -433 160 280 -37 693 226 -100 123 -128 -680 461
4621D61l33k77J01m77O8R43o7q84K81L61o34M88l5k76Q4K31j61O90j008L75P12
$$ 461 128 -149 -48 -525 -457 486 419 -465 -184 177 -457 31 -4 -280 -196 35 -126 564 -444 -69 643
4642F43j027M75j07p3M02o7l72N27Np60K15M10n78L80r7o71P89l03Q3M13m90K48
$$ 643 -384 91 -16 -89 313 246 -126 401 406 -354 -139 271 -307 73 -24 -695 94 -209 -126 287 -203 45
4664D5n3R9n05L60R3k46K85M0q08J055o55j58L53r2N37o0o36j92O45n5R1K29n20
$$ 45 -8 91 -414 -54 39 -207 78 118 -690 365 -290 -448 -95 -187 350 290 -346 -538 107 52 143 372 -148
4687a48J3J66jJ72j34J84m90O92p32K2L61k12PK27m93J40M15n72P42J87o67j30
$$ -148 -135 31 30 202 68 252 -238 454 -278 -256 105 -107 -100 127 -366 -226 189 -383 359 546 -121 -251
4709b51K38m50J022r84K47L82j02m48L60L71p98N33k29j89M35o50O67j49k26J15
$$ -251 -13 -463 559 -425 -178 204 102 -346 14 385 -413 120 -109 -298 137 -513 154 5 -221 -106
4729a06K04o17O41j5n42L87O28m34k45N15n15j21M87j211Q20M45l93N07l97O0
$$ -106 98 -519 122 107 -435 -48 580 146 -99 416 -99 -220 267 -944 -124 321 -72 435 38 98
4749I8rLm87M82l02k95Q29k2o82O09k58q7L82m26m81J186m58n48M27Rn9L57n11
$$ 98 89 92 -395 87 -215 -510 319 297 -385 224 -34 -121 261 -165 -646 540 82 -466 -39 -30 -89 268 -243
4772b43k79R27j53m22K69j13k72N17n07j06P17n26K33q7Q6m17O87m11L42o1q34
$$ -243 -522 405 252 -170 99 -14 -286 231 -276 -382 335 -191 42 -45 41 -376 311 -100 242 181 -653
4793f53Q17L18q71K47L70l59K6K79m56J4N23m00K5M10m32K27L81q01K88J19j92
$$ -653 164 482 -389 -142 228 -131 -105 174 -282 -268 255 -145 -120 290 -142 85 466 -335 -47 72 -120
4814a20L54j32j50R9m07K93q2m8K8N62m18o19O24p7K53j17k64k99R37q05l9J025
$$ -120 234 102 -48 51 -356 -63 -145 -193 -165 397 -21 -640 -16 -93 160 43 -221 -520 417 -388 -427 598
4836E98j017N4N57n30j09M62K51m06p5l55J035o59L46m59N97k38k4J13n97Q20
$$ 598 -419 -365 192 -338 -447 15 266 -140 -215 -570 465 -194 152 -307 290 52 28 141 -456 364
4856C64q8r47J154k92j1k80K6J44J95l1o68J066q84k50O58l51l23J029r62j0R02
$$ 364 276 -671 483 191 180 -100 -74 70 265 234 -434 632 -252 -502 156 -195 -518 511 -451 -461 441
4877D41n05j93P18r08LR15p59j17Q76p59Q4L99j30J9o6p3p8P89r98j01N28rk52
$$ 441 -64 -257 461 -447 -444 471 -288 -405 471 -288 -204 195 65 84 18 -55 -133 656 -342 -443 85 76 -176
4900a76L95j214N01P41l67q4M35m54O62q57L35N4l24K30J50J07n41Q47n70K6J15
$$ -176 219 -995 -494 247 -120 -204 231 -223 439 -418 -83 -29 -353 -123 27 134 -407 440 -130 -104 11
4921A1j07n43J401q59J01Pk09l19M49K5o92O34j5q9J41k24K04r0J20J49N52j488
$$ 11 -96 -639 762 -97 4 11 -198 -517 -68 -43 -735 -101 -116 -205 -64 -288 -84 -174 -54 95 647 -841
4943h41Q99J73p83n6P52l97P18o00k88M32l75K59J67k50j56L82K6p5J17L75m49
$$ -841 58 231 -552 -608 144 -253 465 -135 -423 9 -366 -107 60 -190 -346 36 62 -13 104 479 30
4964C0k73L55m20O70%q65M65M5JN8J58o35M75K47k81K40Q1m20K86o8m02L44o09
$$ 30 -243 112 -308 362 362 -503 -38 7 8 66 224 -411 64 311 30 270 351 -69 217 149 -253 91 -518
4987e18J94N58m15k65N45m91P67l60k2j34M08m80J42n1j30O04q0l62J45J38l93
$$ -518 -324 234 -181 -446 99 -392 375 15 -7 -141 267 -213 -71 -122 -252 352 272 -90 55 193 -200
5008b00K90k57j76N54r8k26N60q00J15J042l76p25L99L69l65J44K99l66L2p1j72
$$ -200 90 -167 -343 211 113 -113 447 -353 -238 804 428 -297 102 471 106 250 549 183 215 144 -28
5029b8L75l04k85Q06o97P0L50o50L31J23K20m71L35q03P74K6k48K70k7m05Q09
$$ -28 347 43 -242 564 -133 -63 287 -363 -32 91 311 -160 175 -628 146 172 -76 194 167 -238 571
5050E71n16m68N23k91l78K78N90r68J054l86l33K51J04l04O37n43J74Q06r87J37
$$ 571 55 -413 110 -181 -559 -281 309 -659 395 9 -324 -73 31 -273 364 -179 -5 801 -186 -49
5070d9Q41q56m61N81j03k74O83m34r9N41l14j83L98o52K39J88p8m4K69o06L87
$$ -49 792 -64 -525 56 -47 -321 362 -72 -171 370 56 -127 271 -381 -142 46 -32 -76 193 -413 -26
5091b6J56k30o5L60j73MM3k72P23o42j96K80K10m10L23K2j02k36J81m94R69l00
$$ -26 130 -100 -165 195 22 26 69 -203 520 -122 -318 -38 172 -238 85 107 5 -231 -50 -544 425 125
5113A25l83N30J36o88M47L66j081M09K19l5J90k69k87O45o06J48N00j50m3K21
$$ 125 -258 272 408 -280 167 533 -548 -139 80 45 235 -34 -321 324 -282 -134 366 216 173 394
5133C94l04p7N72q39R08l04m77L39L81j012M89O1k59K75N08j063M29K99o02K49
$$ 394 90 13 585 -254 654 350 -127 212 593 -419 70 131 -128 147 655 -408 21 320 -282 -33
5153c3N02q14P92j29n49J51J73m43N33l41P7J95Rk64P3N72j079O87Q7l16K33J06
$$ -33 469 -345 447 318 -231 -80 93 -350 183 -158 -81 114 123 -141 -68 504 -575 112 199 -117 116 222
5175B22l45P14n17k22J84p6j5N89r00L18J06k12L73J04n94J86L20n67N73J84o14
$$ 222 -123 591 74 -148 36 -40 -55 534 -366 -48 58 -154 219 323 -271 -85 235 -332 241 425 -189
5196a89N0K56m09M02O01o47L20m04l9K11k24Q4l24N59r06Q35j30l44M34k91k82
$$ -189 -139 117 -292 110 711 64 384 -20 -59 152 -72 12 -312 247 -659 176 46 -298 136 -155 -437
5217d37O70j52m48N66j53r1K18l70j17Q62o83J12K87m59KR50q64M89j45p75k0
$$ -437 233 81 -367 199 46 -45 173 -197 -314 548 -135 -23 264 -195 -193 757 -107 382 237 -538 -558
5238e58R72r49M35K32n04j9P15k88M43m14k92J84j5k63J37o0n8P42k59j80j45
$$ -558 414 -535 -100 132 -372 -391 324 36 479 65 -227 -43 -58 -321 -184 -244 -302 440 181 1 -144
5259a44K52q07P28j9k22M42n9p47O52k03K32L59k01m57L21k13r5J98j49o5O11
$$ -144 108 -699 29 10 -212 230 171 -576 76 -127 105 464 263 -194 127 -86 -181 17 -132 -197 414
5280D14n58k72O77o78J20P44p22K17J46L9j33K80m74P07K8j225P53j44m85Q33
$$ 414 -144 -416 261 -417 -297 447 -275 -58 88 127 -6 274 -200 507 535 -690 63 -81 -566 267
5300B67N26j003j93L27k91M55J05l28N19j00j044J252q47J60j0M60p05M89J43
$$ 267 793 -210 -403 -76 -367 88 193 -135 384 284 -760 492 -355 -195 -205 255 -450 39 182
5319A82m58N47k26K78l88J7J47j02k93L2O65j061M97L64k36Q1j15L97j17K45o67
$$ 182 -276 271 45 323 -65 -48 99 -3 -296 -264 401 -660 -163 201 -35 46 -69 328 211 456 -211
5340b11N21M8n79N08M2r07L41M31n50K35m3J63J02o71K65M91J23k55L42j78m68
$$ -211 310 358 -221 287 329 -578 -237 194 -356 -121 -164 -1 101 -570 -305 186 309 54 396 218 -250
5361b50M08L4l76N08j14n64Q84k76n85K1J38J67L11l72j35M21p33M88M72l19j02
$$ -250 158 192 -184 324 210 -354 530 254 -331 -310 -172 -5 306 -66 -201 220 -513 -25 447 128 26
5382B6P10j091M45K67n12k31P87o74k99O91j14j16L42p85O32L2m71O02k15j32
$$ 26 736 -355 90 357 -155 -386 401 -273 -572 119 5 -111 231 -554 78 110 -361 241 26 -106
5402a06Q44r71J25N24j04o03N62m02l92J153r48m1P78k36m07N61p4l26N92n90
$$ -106 738 -233 -108 416 312 -291 271 -131 -523 630 -318 -359 419 183 -224 337 263 -63 529 -61
5422f1K53j33R9m98O50m81O7L48r16L58P47o80L65K74m45K1J17K4m07O63j31L06
$$ -61 192 59 158 -340 310 -171 -104 244 -672 -314 433 -247 118 392 -53 -32 85 109 -298 365 234 540
5444E40j30l32jJ87M0j83j49O2K9K24n10K59K66k11K44o26k74P36J0m70K41j12
$$ 540 410 78 77 264 304 121 -28 34 63 287 -223 36 302 91 335 -291 -565 171 181 -289 -48 -160
5466a60QK37J31k71N38j59N5j22m51J77J57n27m1O84o68N92K40q71LN87m46K67
$$ -160 -152 85 216 -55 483 324 379 257 -194 -17 140 -387 -428 256 -412 180 420 -451 -448 139 -307 -40
5488d0M72q67L28J20L03m29M88j252R52K97o02M22Q5o23N08L20j197J265m99m05
$$ -40 432 -435 -107 13 316 -113 375 -877 75 372 -230 192 277 -346 162 482 -715 550 51 -354
5508c54K30R7O6J15j71k40R64p20m71J069n55j15K08l47N61pl23k95M78r34K78
$$ -354 -124 -27 39 154 -17 -257 707 -13 -484 585 30 -85 123 -224 337 330 7 -288 190 -744 -466
5529d66M81k80p8Q03p43N65r7l62R2N55k82l58M65n93m3L82l60L24K42p02R37
$$ -466 15 -265 -343 460 -283 282 185 -177 -85 470 188 -170 295 -298 -341 41 -319 5 247 -455 482
5550D82l59j53l34J039j148P37j58p88P19l6o38O94o2n92Q00k13k03M55l50m73
$$ 482 123 -30 -364 675 -473 264 106 -682 37 1 -637 57 -5 -597 203 -10 -213 242 -108 -581
5570e81P05K12n16M68l13J14K91o07M74L28q08O6L89n72J09L37L5j76J86l57j1
$$ -581 124 336 -180 288 -25 89 380 -227 247 575 -233 -167 222 -350 -241 96 131 -45 141 -216 -227
5591b27Rq4K15L97n48K01M17l95M74k39j11L51L21q97N73n90j00J49L83m05L16
$$ -227 -218 -302 -87 310 -238 -37 380 -15 459 220 109 460 781 -116 457 -133 -233 -84 299 -106 210
5612B10r9o13P57n47j98P84k22m01P29n90M5N83k4j54L67p27j19M15j58j47Kl91
$$ 210 111 -502 255 -292 -490 294 72 -329 400 -190 -145 438 414 260 627 -100 -219 196 38 -109 -107 -498
5634d98P3R11n38l47Q34p47k8P28o31N67j64j56j14K86m31K81j31l29L46mm71
$$ -498 -425 486 -52 -399 435 -312 -340 388 -243 324 160 4 -110 176 -255 26 -105 -434 -88 -92 -563
5655e63Q95j08p32N31J63q24M92J99m42J123n13k88L08kj90k3j28k94N60k42l29
$$ -563 332 224 -508 23 186 -638 -146 53 -389 734 221 -67 241 239 49 26 -102 -396 164 -78 -407
5676d07K61rK03L08p27n4K28j9L2L01j75R8J91j80J48l3l27k04J9K74P7M72o69
$$ -407 -146 -155 48 356 -371 -425 -197 -216 -184 117 -58 40 231 51 199 166 -161 -365 -346 -72 5 477 -192
5699a92K4O26l01j6m95J17K94j97N4j45O06o10Q31n67n10Q48l05J53j54J21o53
$$ -192 -168 458 157 141 -354 -237 57 -140 -86 -231 375 -235 596 29 -481 367 62 215 61 182 -471
5720d71R19m47j86N11m94o5L76q24Q38J48p03L05K87k59k25O39p36M01K71k57
$$ -471 448 1 -185 326 -168 -233 143 -681 157 305 -398 -93 194 -65 -290 349 -387 14 285 28
5740B8m5J74k17K04K61j51k30j6j50M43m13j53L41m4l41L57K56o98M05%l51K90
$$ 28 -17 157 -60 144 405 254 24 8 -142 301 -112 -265 76 32 -309 48 304 -394 11 11 -340 -50
5762e0J31j64K40k57k05L98M18p17L03K21n92K43p4l9N62o53L73K43r61O33M39
$$ -50 81 -83 157 -100 -305 93 511 -206 97 318 -274 -31 -105 -144 418 -235 138 381 -580 53 492
5783D92k69l37O66n87K9L60l26k05M86p87L47M04r55Q95r0m17O10K16q26P57j87
$$ 492 223 -114 552 -35 -6 354 28 -177 309 -478 -131 273 -682 213 123 -294 316 532 -294 463 276
5804B76n06M53j73N1K98j63k02N02p27R1L47n93k06J056q77q2P96n16n64J106
$$ 276 -230 223 50 101 399 236 34 536 -191 -100 247 -346 -552 504 -373 -455 341 -175 -739 367
5824C67o60k09P92j96O7j33j45n01R54k85l3P6k46L62J95r70O25K08j71l40K95
$$ 367 -293 -502 290 94 161 28 -117 -618 336 51 18 94 -152 210 405 -565 60 268 97 -243 52
5845E2k41L19n96M60m8O1k41M31K04q71N81RJ57k39J23k32J95K41k04J43J27j67
$$ 52 -189 130 -466 -6 -54 7 -234 197 401 -470 111 120 277 38 161 -71 124 365 161 304 431 264
5867B64j97J82o69M10M75l56r7l21j90O05k14l32P09j20l49L32m03K44M24m98
$$ 264 67 249 -420 -10 465 109 12 -309 -499 106 -108 -440 269 149 -200 132 -271 -27 397 -101
5887a01L31p0k17n51M67j06O45l00m79N73K09o40o4O93l65p6L98n19L92j81O0
$$ -101 230 160 -57 -608 -141 -247 398 98 -381 192 401 -239 -303 390 25 -51 347 -172 220 39 99
5908I9M44k44o48K33M3l8J34K36j235N47M24p55J008p6j21M51q18L57k24Q5J55
$$ 99 543 299 -349 -116 -73 -111 23 259 -976 -429 -5 -760 248 172 51 502 -316 41 -183 -98 57
5929E7N81o60r5K3q6k12O78r75P73K70r5j24P17r55M0J71j35L07L04j096P68k81
$$ 57 638 -22 -117 -94 -180 -392 286 -689 84 354 259 135 852 -103 -63 108 -27 280 584 -512 256 -25
5951b5k85P78l63j41N14l68l32O61r78P63k05L17k55O9k0J9N28j023K42P93q15
$$ -25 -310 468 105 -36 478 110 -222 439 -539 224 19 336 81 150 130 149 677 -346 -104 689 -126
5972a26m02N50J69n55O62l17j94K94rm51M35k37L47Kl68N56j58n31P27J31j192
$$ -126 -528 22 191 -364 298 -19 -213 81 72 -379 56 -181 166 168 -200 356 198 -333 394 525 -667
5993f67O89p21L37L31Q12o51J49m90lO20k39n11N20j53p44J099m48l50L30N07
$$ -667 22 -699 -362 -31 781 130 279 -211 -214 406 167 -344 176 23 -721 378 -70 -420 -90 417
6013D17m95K44J40q96J75N45j94N62m36j035R22M13j53K14n43J2L82q90K71P82
$$ 417 -78 166 306 -590 -415 130 -64 498 62 -973 -51 362 209 423 -120 -108 274 -616 -345 437
6033D37n73O2J41k4J05n7o83P60k03j71L51P68j075K82j5K1k47J02R7j48%n11
$$ 437 -136 -74 67 43 148 91 -592 168 -35 -206 145 913 -162 120 105 126 -121 -19 78 -70 -70 -581
$$ [...]
16383C24
##END NTUPLES=NMR FID
##END=
