##TITLE=31Pdec_LR-740-02a
 CDCl3, 24 sc
 26.10.2021
##JCAMPDX= 6.0         $$ Bruker NMR JCAMP-DX V2.0
##DATA TYPE= NMR FID
##DATA CLASS= NTUPLES
##ORIGIN= UXNMR, Bruker Analytische Messtechnik GmbH
##OWNER= root
$$ XWIN-NMR		Version 3.5
$$ Tue Oct 26 09:53:21 2021 Russian Standard Time (UT+4h)  she@DPX200
##.OBSERVE FREQUENCY= 81.013821
##.OBSERVE NUCLEUS= ^31P
##.DELAY= (6, 6)
##.ACQUISITION MODE= SIMULTANEOUS
##.ACQUISITION SCHEME= undefined
##.AVERAGES= 24
##.DIGITISER RES= 16
##SPECTROMETER/DATA SYSTEM= spect
##.PULSE SEQUENCE= zgpg30
##.SOLVENT NAME= CDCl3
##.SHIFT REFERENCE= (INTERNAL, CDCl3, 0, 243.863)
##AUDIT TRAIL= $$ (NUMBER, WHEN, WHO, WHERE, WHAT)
$$ ##TITLE= Audit trail, XWIN-NMR		Version 3.5
$$ ##JCAMPDX= 5.01
$$ ##ORIGIN= Bruker BioSpin GmbH
$$ ##OWNER= she
$$ F:/spectra/data/she/nmr/P31/1/audita.txt
$$ ##AUDIT TRAIL=  $$ (NUMBER, WHEN, WHO, WHERE, WHAT)
(   1,<2021-10-26 09:52:24.46 +0400>,<she>,<DPX200>,
      <created by zg, POWCHK disabled, PULCHK disabled
       configuration hash MD5:
       00 E9 B6 7A A2 85 ED C7 34 08 36 98 17 FE 4E 26
       data hash MD5: 32K
       65 3E 7B 9D DE 7C C6 3E 7B 40 14 F7 8F 4D D9 68>)
$$ ##END=
$$ 
$$ hash MD5
$$ 36 15 49 78 F0 6C 18 25 1D D6 02 C2 CB 4E 4A 26
##$RELAX= 
##$RELAX= 
##$RELAX= 
##$RELAX= 
##$RELAX= 
##$RELAX= 
##$RELAX= 
##$RELAX= 
$$ Bruker specific parameters
$$ --------------------------
##$DU= <F:/spectra>
##$EXPNO= 1
##$NAME= <P31>
##$PROCNO= 1
##$TYPE= <nmr>
##$USER= <she>
##$AMP= (0..31)
100 100 100 100 100 100 100 100 100 100 100 100 100 100 100 100 100 100 
100 100 100 100 100 100 100 100 100 100 100 100 100 100 
##$AQSEQ= 0
##$AQ_mod= 1
##$AUNM= <au_zg>
##$AUTOPOS= <>
##$BF1= 81.014009
##$BF2= 200.13
##$BF3= 200.13
##$BF4= 200.13
##$BF5= 200.13
##$BF6= 200.13
##$BF7= 200.13
##$BF8= 200.13
##$BYTORDA= 1
##$CFDGTYP= 0
##$CFRGTYP= 5
##$CHEMSTR= <none>
##$CNST= (0..31)
1 1 145 1 1 1 1 1 1 1 1 1 1 1 1 1 1 1 1 1 1 1 1 1 1 1 1 1 1 1 1 1 
##$CPDPRG= <waltz16>
##$CPDPRG1= <>
##$CPDPRG2= <waltz16>
##$CPDPRG3= <>
##$CPDPRG4= <mlev>
##$CPDPRG5= <mlev>
##$CPDPRG6= <mlev>
##$CPDPRG7= <mlev>
##$CPDPRG8= <mlev>
##$CPDPRGB= <>
##$CPDPRGT= <>
##$D= (0..31)
0 1 0 0 0 0 0 0 0 0 0 0.03 2e-05 3e-06 0 0 0 0 0 0 0 0 0 0 0 0 0 0 0 0 
0 0 
##$DATE= 1635227543
##$DBL= (0..7)
120 120 120 11 120 120 24 19 
##$DBP= (0..7)
150 150 150 150 150 150 150 150 
##$DBP07= 0
##$DBPNAM0= <>
##$DBPNAM1= <>
##$DBPNAM2= <>
##$DBPNAM3= <>
##$DBPNAM4= <>
##$DBPNAM5= <>
##$DBPNAM6= <>
##$DBPNAM7= <>
##$DBPOAL= (0..7)
0.5 0.5 0.5 0.5 0.5 0.5 0.5 0.5 
##$DBPOFFS= (0..7)
0 0 0 0 0 0 0 0 
##$DE= 6
##$DECBNUC= <off>
##$DECIM= 3
##$DECNUC= <off>
##$DECSTAT= 4
##$DIGMOD= 1
##$DIGTYP= 9
##$DL= (0..7)
0 0 52 120 120 21 21 25 
##$DP= (0..7)
150 150 150 150 150 150 150 150 
##$DP07= 0
##$DPNAME0= <>
##$DPNAME1= <>
##$DPNAME2= <>
##$DPNAME3= <>
##$DPNAME4= <>
##$DPNAME5= <>
##$DPNAME6= <>
##$DPNAME7= <>
##$DPOAL= (0..7)
0.5 0.5 0.5 0.5 0.5 0.5 0.5 0.5 
##$DPOFFS= (0..7)
0 0 0 0 0 0 0 0 
##$DQDMODE= 0
##$DR= 16
##$DS= 0
$$ [...]
##$SUBNAM1= <"">
##$SUBNAM2= <"">
##$SUBNAM3= <"">
##$SUBNAM4= <"">
##$SUBNAM5= <"">
##$SUBNAM6= <"">
##$SUBNAM7= <"">
##$SUBNAM8= <"">
##$SUBNAM9= <"">
##$SW= 501.771253377433
##$SWIBOX= (0..15)
0 1 3 0 0 0 0 0 0 0 0 0 0 0 0 0 
##$SW_h= 40650.406504065
##$TD= 32768
##$TD0= 1
##$TE= 0
##$TE2= 300
##$TE3= 300
##$TEG= 300
##$TL= (0..7)
0 120 53 12 22 120 120 120 
##$TP= (0..7)
150 150 150 150 150 150 150 150 
##$TP07= 0
##$TPNAME0= <>
##$TPNAME1= <>
##$TPNAME2= <>
##$TPNAME3= <>
##$TPNAME4= <>
##$TPNAME5= <>
##$TPNAME6= <>
##$TPNAME7= <>
##$TPOAL= (0..7)
0.5 0.5 0.5 0.5 0.5 0.5 0.5 0.5 
##$TPOFFS= (0..7)
0 0 0 0 0 0 0 0 
##$TUNHIN= 0
##$TUNHOUT= 0
##$TUNXOUT= 0
##$USERA1= <user>
##$USERA2= <user>
##$USERA3= <user>
##$USERA4= <user>
##$USERA5= <user>
##$V9= 5
##$VALIST= <valist>
##$VCLIST= <CCCCCCCCCCCCCCC>
##$VD= 0
##$VDLIST= <DDDDDDDDDDDDDDD>
##$VPLIST= <PPPPPPPPPPPPPPP>
##$VTLIST= <TTTTTTTTTTTTTTT>
##$WBST= 1024
##$WBSW= 4
##$XGAIN= (0..3)
0 0 0 0 
##$XL= 0
##$YL= 0
##$YMAX_a= 4002
##$YMIN_a= -1623
##$ZGOPTNS= <>
##$ZL1= 120
##$ZL2= 120
##$ZL3= 120
##$ZL4= 120
##$ABSF1= 60
##$ABSF2= -190
##$ABSG= 5
##$ABSL= 3
##$ALPHA= 0
##$AQORDER= 0
##$ASSFAC= 0
##$ASSFACI= 0
##$ASSFACX= 0
##$ASSWID= 0
##$AUNMP= <proc_1d>
##$AZFE= 0.1
##$AZFW= 0.5
##$BCFW= 1
##$BC_mod= 2
##$BYTORDP= 1
##$COROFFS= 0
##$CY= 9.86611175537109
##$DATMOD= 1
##$DC= 1
##$DFILT= <>
##$DTYPP= 0
##$F1P= 248.564497384935
##$F2P= -679.521563365616
##$FCOR= 0.5
##$FTSIZE= 0
##$FT_mod= 0
##$GAMMA= 1
##$GB= 0
##$INTBC= 1
##$INTSCL= 1
##$ISEN= 30
##$LB= 1
##$LEV0= 0
##$LPBIN= 0
##$MAXI= 11.51145
##$MC2= 0
##$MEAN= 0
##$ME_mod= 0
##$MI= 1.244541
##$NCOEF= 0
##$NC_proc= 0
##$NLEV= 6
##$NOISF1= 0
##$NOISF2= 0
##$NSP= 1
##$NTH_PI= 0
##$NZP= 1
##$OFFSET= 243.8632
##$PC= 1.4
##$PHC0= -8747.123
##$PHC1= -87.53109
##$PH_mod= 0
##$PKNL= yes
##$PPARMOD= 0
##$PSCAL= 0
##$PSIGN= 0
##$REVERSE= no
##$SF= 81.0140731611343
##$SI= 65536
##$SIGF1= 0
##$SIGF2= 0
##$SINO= 80
##$SIOLD= 65536
##$SREGLST= <31P.CDCl3>
##$SSB= 0
##$STSI= 0
##$STSR= 0
##$SW_p= 25641.0256410257
##$SYMM= 0
##$S_DEV= 0
##$TDeff= 0
##$TDoff= 0
##$TI= <>
##$TILT= no
##$TM1= 0
##$TM2= 0
##$TOPLEV= 0
##$USERP1= <user>
##$USERP2= <user>
##$USERP3= <user>
##$USERP4= <user>
##$USERP5= <user>
##$WDW= 1
##$XDIM= 64
##$YMAX_p= 0
##$YMIN_p= 0
$$ End of Bruker specific parameters
$$ ---------------------------------
##NTUPLES= NMR FID
##VAR_NAME=  TIME,          FID/REAL,        FID/IMAG
##SYMBOL=    X,             R,               I
##VAR_TYPE=  INDEPENDENT,   DEPENDENT,       DEPENDENT
##VAR_FORM=  AFFN,          ASDF,            ASDF
##VAR_DIM=   16384,         16384,           16384
##UNITS=     SECONDS,       ARBITRARY UNITS, ARBITRARY UNITS
##FACTOR=    2.46e-05,      1,               1
##FIRST=     0,             0,               0
##LAST=      0.4030218,     0,               0
##MIN=       0,             -1623,           0
##MAX=       0.4030218,     4002,            0
$$ Real data points
##PAGE= N=1
##DATA TABLE= (X++(R..R)), XYDATA
0@%%%%%%%%%kMoQqQpOmJnJ2j4J4j4J5j4J3j8K6l3M5o8J30j205k62j19M32l0J50
39i45P08M73J12N97JM52l82p36L80K18r85k8j87r22M6M9m34J044M50j18O83N91
61A067n0M38m72j79j87M2o69qn69m67J13k35o1M86J50k28P77O08k55J82M66k51
83F98L60o89k88K74q34J32R1q62m81J237k61j35M82M90m8L59J47M19P5l83K70
104A053n67o39l30J7n27j00O44o34M57N62L7J43L89K20j04N20n01K36o63k35Q4
125F2o17p25M79R3k57J67K10L62J71N06j31Q03o50L94j36k41ql58p17M2K58l14
147f07k4k0Q1J00P17r35R42m0k21N18j15K26j28j92R1o87mj11R1q69N46J71k84
170g54K04P03m6L71P28p67k36j0K70p14L58O5r77L61Q3j0J97m88P3L68L35k08
$$ plain form
0 0 0 0 0 0 0 0 0 0 0 -2 2 -4 4 -4 4 -3 3 -1 0 -5 7 -7 7 -7 8 -6 7 -11 15 -18 27 -41 89 -1116 -1378 -1497 -1065 -1095 -945
39 -945 -237 236 348 945 946 1398 1016 280 660 878 -107 -135 -322 -1244 -1198 -1149 -1583 -539 -89 -207 476 1067
61 1067 1017 1455 983 804 617 659 -10 -18 -587 -1054 -941 -1176 -1237 -751 -601 -829 -52 556 301 483 949 698
83 698 1058 369 81 355 -479 -347 -256 -1118 -1599 -362 -623 -758 -276 214 166 525 672 1091 1166 783 1053
104 1053 486 -153 -483 -466 -993 -1093 -449 -1083 -626 -64 -27 116 505 725 621 1141 640 876 213 -22 62
125 62 -555 -1280 -801 -708 -965 -798 -588 -226 -55 451 320 1123 473 867 731 490 482 124 -593 -551 -293 -607
147 -607 -631 -651 -570 -470 247 -688 254 214 -7 511 396 622 494 302 393 -294 -298 -409 -318 -1187 -641 -470 -754
170 -754 -550 153 107 478 1206 439 203 193 463 -251 107 172 -805 -444 -361 -371 -174 -662 -589 -221 114 -94
192i4P04M95n31J86n61n90M89J47m27l23n21Q12m02J99J03L30k68k31Q02k80L96
213D35O19q17N98q2p08L84r52n14M82P35o15m5N30j77QK58J43L00k99Q8K28r3
235E06j90k83n1q67L83J54o14M66J93p4Q11n82L72Q28p25K05l0j43k20J89k25
256A03k57N2m73J44J98l43j38R90m66M1M05j81M32J71o18K81M96q74K54k98n56
277f37J045o20q2j37K47r32R83m2j89J128l85j67N97p95L70j90o89m5J075p53
297b18n90N14J4lJ33K02p5o1N94m39K79m98Q6R89r58K81l00r4l23K59l60L89J79
320@m31O75n20K79P77n29r6K24K6n02L76k62l16J24j42o46R64j94J5M92n36J84
342c8M16j99n06O85k81j13L29p45K05N68o92k02O4M27L21l88r7M94M60q50P46
$$ plain form
192 -94 610 1105 574 760 199 -391 98 245 -182 -505 -1026 -214 -616 -417 -314 16 -252 -483 319 39 435
213 435 1054 237 835 753 45 429 -523 -1037 -555 180 -435 -480 50 -127 -119 139 282 582 283 371 599 506
235 506 316 33 -18 -885 -502 -348 -962 -496 -303 -377 434 -148 224 1052 327 532 502 359 139 328 103
256 103 -154 -102 -575 -431 -233 -576 -714 276 -190 -149 256 75 507 678 60 341 837 -37 217 -81 -637
277 -637 408 -212 -294 -431 -184 -1116 -133 -175 -364 764 379 212 809 14 384 194 -495 -540 535 -218
297 -218 -808 -294 -280 -283 -150 52 -23 -84 510 71 350 -148 -62 927 -31 250 -50 -144 -467 -208 -568 -179 0
320 0 -431 244 -276 3 780 251 155 379 405 -97 279 17 -299 -175 -317 -963 1 -193 -178 314 -222 -38
342 -38 378 179 -327 358 77 -36 293 -452 -247 321 -371 -573 -509 -82 239 -149 -246 248 708 -142 604
363F04j25n09O4N57q01J26J12m73K21j44J18N30l62n06P36j39P7L7J01l77P18
384E65l60p81R77m80l44M98p54M16n3m3K62L66j25L80n45l97O39J45k35j91L51
405B91k34j59K0M9j16L11l86q1jP0M9N61K2j57K03k36n10K4k38M64m7k9N6M17
429C43o47N77Qn30P18o48K83M28m32j16j52J31M67o11j93L20K64l16r7M81j66
450A12k37O57o34L43K61o11M18j02J35k54o35K6K6O7k9P1M86k95N90k9o06J13
472a27Q57n70k09L22q77Q12j87n76K43L96l03L99j89m69P18q90O66M45l69l51
492b59Q89q56r3N49l29l12L11j53J96L63O2k08M18m92R2L77o17j04O66l42J10
513B68L7p03O68m87j83j29P25m53L22J17k81J72O30p74O46n90l51O91m30j78r6
$$ plain form
363 604 479 -30 34 591 -210 -84 28 -445 -224 -368 -250 280 -82 -588 148 9 86 123 224 -153 565
384 565 205 -576 401 -79 -423 75 -679 -263 -316 -359 -97 269 144 524 -21 -418 221 366 131 -60 291
405 291 57 -102 -82 -33 -149 162 -224 -305 -306 -236 -187 374 396 239 442 206 -304 -280 -518 -54 -101 -130 -74 343
429 343 -304 273 281 -249 469 -179 104 532 100 -16 -168 -37 430 -181 -374 -54 210 -106 -203 278 112
450 112 -125 532 -102 241 502 -109 309 207 342 88 -547 -521 -495 -428 -457 -386 100 -195 395 366 -240 -127
472 -127 730 160 -49 273 -604 208 21 -555 -312 84 -219 180 -9 -478 240 -650 16 461 92 -259
492 -259 630 -226 -319 230 -99 -411 -100 -253 -57 306 368 160 578 86 178 555 -62 -166 500 158 268
513 268 305 -398 270 -217 -400 -529 196 -257 65 182 -99 73 703 -71 575 -15 -366 325 -105 -283 -379
534c79K94J81k74M33l81L80m68J06N33j63m73M65n4l09j98k3K08J36l38j76N84
555H4n87Q65l5j066O19N83l18j47N0J78r7l20K35M2O9l36lj10M71ml19J76J60
578A90R6l90N17l41J84l5k59l57K29K46o69J167o59O7M42l97j28n5L80j33P2m66
600b99N44O1j51k68K77o35M26J5n50L57M73n75N46o60O54K38k28l15L57l7k36
621fN6k66p8k77N01j39J24k9l28M58k79K24J81j36J77K41o22m8J79j51k0M17o19
644d40JM93m2m40N21n67M16M85l95J89L32j36l75j36m1k09M27rj77j12k31R12
666D66p83J60J43J86o16Q03k91K46m45L72n21L66j32o19P35p3q2L05m64J88K75
687B19J52p10J057o58l21R19o17r1k4K62j55j49R8p2O9j79J62l72J1O21J81k23
$$ plain form
534 -379 -85 96 -178 255 -126 254 -214 -108 425 262 -211 254 200 -109 -307 -330 -122 14 -324 -500 84
555 84 -503 362 327 -739 -120 463 145 -2 48 226 129 -191 44 86 155 -181 -184 -294 177 173 -146 30 190
578 190 286 -104 413 72 256 221 -38 -395 -166 80 -589 578 -81 -14 428 31 -97 -152 228 95 167 -299
600 -299 245 306 155 -113 164 -471 -45 -30 -580 -223 250 -325 221 -439 215 453 225 -90 267 230 -6
621 -6 50 -216 -294 -571 -70 -209 -85 -114 -442 16 -263 -39 142 6 183 424 -198 -246 -67 -218 -238 179 -440
644 -440 -439 54 12 -428 93 -474 -58 427 32 221 553 417 42 -94 -135 -344 83 74 -103 -215 -446 466
666 466 -317 -157 -14 172 -444 359 68 314 -131 241 -280 86 -46 -665 70 -3 -85 220 -244 -56 219
687 219 371 -339 718 60 -261 658 41 -50 -74 188 33 -116 -18 -90 -21 -200 -38 -410 -399 222 403 180
709A80k19K10n85N22K96m28J52m97K15r2K71n5K39n6R6L7j67k52Q30p36J78k20
731h1n1j04K14J46o72O83m12k8N31n41L49K76J39j94j04L46m55L92o69M84k91
752d2L6j10l43j9Q5J99J57m20Q42PJ02K9q75P26N08n57j98K23r68R64k82p09N42
775a03K44o64N53K20q32R65l13k03M19k6k25J44j99j32L58k04p29Q17k23L1j63
796b65KK00n1R8l01M84L43l12O9k13j61P6K06n80L16l40J83K38m53L69o8l09O89
819B20K57m41J84M87r82L55m0k04N15n52n07O73K43n14O03l6o58O68m25J33M58
840D37j9p5O4m77j93M27m39J24j48P0j9M38k15j90M15J40l0P0n69P14Q1j112N97
863I1J63j80k25p8l70q0O00k04J94r3QN09l92N36J04n87K44L13n05n9k1j33m66
$$ plain form
709 180 -39 171 -414 108 404 -24 128 -369 -154 -246 25 -30 209 153 249 286 119 -133 697 -39 139 -81
731 -81 -132 -236 -22 124 -548 135 -277 -305 226 -315 34 310 449 255 151 497 42 434 -235 249 -42
752 -42 -6 -116 -459 -478 -393 -194 -37 -457 385 392 494 523 -352 374 882 325 127 350 -618 346 64 -645 -103
775 -103 141 -523 30 250 -582 383 70 -133 286 260 35 179 -20 -152 206 2 -727 90 -133 -102 -265
796 -265 -263 -63 -114 -16 -317 167 510 198 267 54 -107 -31 175 -405 -89 -429 -246 -8 -461 -92 -160 -469 220
819 220 477 36 220 707 -275 80 40 -164 351 -201 -708 -35 208 -306 297 261 -397 271 -154 -21 437
840 437 418 343 407 -70 -263 164 -275 -151 -299 -229 -248 190 -25 -215 200 340 310 380 -189 525 606 -506 91
863 91 254 74 -151 -229 -599 -679 -79 -283 -89 -182 -174 335 -57 479 583 -4 240 553 48 -11 -32 -165 -631
886f31P45n5n55L26pl87N79qN13m5k04N10m30l41L17l36l65k23J62L4M07N3n17
909d58K02l4O95k44K40q35J234k40j79m59J64m42L62m84k43N54j21m9K71J73j41
930c4j87K93K46k3J31l71J99l74n2J32l33j40M29j79k31M53J64k11M08O4j74M37
952F47l60m24Q93j367Q29m46p12R23l84p7J2J28Q3L40p6K11L29n32K70J39J55
973E81n09M49m64k55O7J04n10M16j50m9M60n36P12j15J75k78K53j24l75K32j06
994b2j2K51r11K83L00N0k65M63p00O24M04l58J38J70k94p1K07l59O10l68m36l
1016b99N19n28K21j90N12k56N90m15M03n06K32J44n11N59m68J0n86K39l0j89N43
1037fn69J02P23k23L2J73k49j58P79k40k61j11R2l16jo89L25M05j92L41n3j30
$$ plain form
886 -631 114 59 -496 -170 -177 -564 15 7 520 475 271 781 351 10 327 -9 -374 -597 -435 -401 6 59 -458
909 -458 -256 -290 405 161 401 -434 800 560 381 -78 86 -356 6 -478 -721 -167 -288 -337 -66 107 -34
930 -34 -221 72 318 295 426 55 254 -120 -172 -40 -373 -513 -84 -263 -494 -41 123 -88 320 384 210 647
952 647 287 -137 756 -611 218 -228 -940 -17 -401 -478 -466 -338 -255 85 9 220 549 17 287 426 581
973 581 72 521 57 -198 -131 -27 -537 -121 -271 -320 140 -396 316 201 376 98 351 227 -148 84 -22
994 -22 -34 217 -694 -411 -111 -61 -326 137 -563 61 465 107 245 415 121 50 257 -102 508 140 -296 -299
1016 -299 220 -308 -87 -277 235 -21 569 154 557 51 283 427 -84 475 7 17 -569 -330 -360 -549 -6
1037 -6 -575 -473 250 27 59 232 -17 -175 604 364 103 -8 84 -232 -233 -922 -597 -192 -384 -43 -96 -226
1059b26J09N76o9j0J66o45M73l16K0l10J60q43P05m7k60M78n66O59j30L74j03
1080A95L13o6k07O11p19j80L02n39K03L29o82k41M80l98L64J79k9K78QL53o76
1101a22N91l08J01n03j42K29J33m47K30m0k36R99j32q59K62L10J99j32O93l77
1121D49l61K27o28R87j060n6K0J47j68J78L04l51Q6N26k51L28j63lN57q07k8l23
1143c90N62p04P13m02k99O98m66L09L37m86K37K48n75N86j42j18Lk01P7K55l03
1164f1l85J83Q0l95M17N01k11M14K26q49J63N8n48R35o65m08N13l85k66P99l67
1185b51N4j43Q27n78L18k31K07L41n51j19P34p53J63M79o62j1L34r75N65N81l31
1206bn19R35p17R14n98m04R58J19o12K66k40j95K0j42m25L72J86k40K89q5k17
$$ plain form
1059 -226 -117 459 390 380 546 -99 374 58 78 -232 -72 -915 -210 -257 -517 -39 -605 54 -76 298 195
1080 195 508 442 235 846 127 -53 249 -290 -87 242 -440 -681 -201 -599 -235 -56 -85 193 201 554 -122
1101 -122 469 161 262 -241 -383 -154 -21 -468 -238 -278 -514 485 353 -506 -244 66 265 133 826 449
1121 449 88 315 -313 674 -386 -442 -422 -275 -443 -265 39 -312 -226 300 49 377 214 211 768 -39 -67 -390
1143 -390 172 -532 181 -221 -520 178 -288 21 358 -128 109 357 -218 368 226 108 111 -90 -13 242 -61
1164 -61 -446 -263 -183 -578 -161 340 129 543 769 -80 83 141 -407 528 -137 -545 -32 -417 -683 116 -251
1185 -251 -197 -340 487 -91 227 -4 203 544 -7 -126 608 -145 18 497 -165 -176 158 -817 -252 329 -2
1206 -2 -521 414 -303 611 13 -391 567 686 74 340 100 -95 -75 -217 -642 -270 -84 -324 -35 -120 -337
1227c37N54l10K6P24l95K25j06n37O52r5j52l00m23N75r16Q92m92M14O06k59k25
1248A21K60l71K3L27k42L26j50m07J43j71m32L99O7j68k33M61K59j77K45o52j1
1269c83L38J04R4o5J51l76j46o5R0J57L01l71M09m82K19K47j86L30J4q14M48J8
1291C2q3N40p43J29r9P1n51J030o83k5O50l19J48L19l68L52J48m21O6j88m87M95
1313A3o9o95L25O68n76k9Q5K36O65k94r4K73k18l96M59j16l25L74n22l64O75n39
1335d64j09O14L75n56L02p0o4L89K1m91L37k83l41P89m59J20m1R6k72Q6p10N91
1357a40N15m98L67N8p33N77k92L86o0R6o24k76O24l10K15M5n74M10K06k57K15
1378e0M74l29K13m60L98J55p4o65N18q32K86O28m60l91L59J47j48P97n51K9k10
$$ plain form
1227 -337 217 -93 -67 657 262 487 381 -156 496 401 249 -51 -474 101 -815 77 -415 -1 605 346 121
1248 121 381 10 33 360 118 444 294 -113 30 -141 -573 -174 -107 -275 -508 -47 212 35 280 -372 -383
1269 -383 -45 59 153 88 239 -137 -283 -348 -258 -101 200 -171 238 -244 -25 222 36 366 380 -434 14 32
1291 32 -51 489 -254 -125 -224 -153 -704 326 -357 -382 268 -51 97 416 48 400 548 127 193 5 -482 13
1313 13 -56 -751 -426 242 -334 -363 -278 -42 623 329 235 508 290 -106 353 237 -88 286 -236 -600 75 -464
1335 -464 -573 41 416 -140 162 92 28 417 438 -53 284 1 -340 449 -10 110 69 165 -107 -21 -731 -140
1357 -140 375 -123 244 302 -431 146 -146 240 180 276 -348 -624 0 -310 -95 -50 -624 -214 -8 -265 -50
1378 -50 424 95 308 -152 246 401 327 -338 180 -652 -366 262 -198 -589 -230 -83 -231 566 15 44 -166
1399a66M91l30P8J1K18n35L%K23o25O74m3m94j08L87m08K90N78l68M38Pk13K32
1422C40j84n33P81l54k29K76p77J99M43J06l68N79j92k35N23o39J87K42m41Q2
1442a94j43J93P2O52j021O44J74m10K15J14k83j73J70O3N55n78R2j80J86n0j65
1463f7O5m07j4K69o33N16J93j76O29o3n69Q45q50l06O39j89j32Q89m26m65J32
1484a20K04j19K14j08J47J3nk44L71n66j04N75l87j8P32n55m69L93j28l58M19
1505a13j50N90K4o72K66J5m27M61M07o21J85k42L67l33L06r35J108j90k52K86
1525H0J42j69M47p15j3N87l79j4K25k74j78K96n49L5O86j90n08L38OK35p8J20
1547A30l10J49k38K89j27L73m20q4N2O23p25j01P52n97K8J38L03o28R97m60n20
$$ plain form
1399 -166 325 -5 73 84 302 -233 -230 -230 -7 -632 42 -1 -495 -603 -216 -624 -334 244 -124 314 321 108 340
1422 340 156 -377 404 50 -179 97 -680 -481 -38 68 -300 279 87 -148 375 -264 -77 165 -276 -194
1442 -194 -337 -144 -72 580 -441 203 377 -33 182 296 13 -160 10 73 628 50 142 -38 148 98 -67
1463 -67 -2 -409 -423 -154 -787 -271 -78 -254 375 312 -257 588 -262 -568 71 -118 -250 639 213 -252 -120
1484 -120 84 -35 179 71 218 231 226 -18 353 -213 -317 258 -129 -147 585 30 -439 -46 -174 -532 -113
1505 -113 -263 327 351 -321 -55 -40 -467 -6 401 -220 -35 -277 90 -243 63 -872 236 46 -206 80
1525 80 222 53 500 -215 -228 359 -20 -34 191 -83 -261 35 -514 -479 207 17 -491 -153 -147 88 10 130
1547 130 -180 -31 -269 20 -107 266 -154 -238 -186 437 -288 -389 363 -234 -206 -68 235 -393 604 144 -376
1568c76J95J12j3N1J2m52O47m98K97N30o60j55K84k8J45o3l56k34R04l25n94Q26
1590B49n27M25N29n11n46O52Q2p57K67k22m85R64k83j68N95k19k23J76o60P15
1610E3L16o59J3O78o54L53k81K50q4M8j34K77k70m14P17j15n39M92O1m44N44J66
1632C74n15K16O3l26M41n10Q53p15J01L24k05m18N20r5L51j72K72q00l7L48o83
1653f13N16k2N53l98P6n89J09R31q19M42q08j01J152l51k70N9L34l54O57k51n57
1674c04K37J36l53N07l19j13K03J61n61R61n63m64P39K84q54M68K87q60P01n85
1694b92N65J86l14m21N02n82L51j39L19n00Q95r44K87p7j30m1K54l01J80J86J49
1715A33l55KK33K64m03k83J72L43l06M3J95Q7L6j42j46M47kn32L17p2n40Q11j57
$$ plain form
1568 -376 -181 -69 -82 -31 -19 -471 176 -322 -25 505 -155 -310 -26 -54 91 28 -328 -562 342 17 -577 249
1590 249 -278 147 676 165 -381 271 353 -404 -137 -359 -844 120 -163 -331 264 45 -178 -2 -662 53
1610 53 369 -290 -277 401 -253 100 -181 69 -15 33 -101 176 -94 -508 209 94 -445 47 108 -336 208 374
1632 374 -141 75 138 -188 253 -257 596 -119 -18 306 101 -317 203 108 459 287 559 -241 -278 70 -613
1653 -613 -97 -119 434 36 112 -477 -368 563 -256 186 -622 -723 429 78 -192 -133 201 -153 504 253 -304
1674 -304 -67 69 -284 223 -96 -209 -6 155 -406 555 -8 -472 267 551 -303 165 452 -408 293 -292
1694 -292 273 459 145 -276 226 -356 -5 -144 175 -325 570 -374 -87 -164 -294 -335 -81 -382 -202 -16 133
1715 133 -222 -220 13 277 -126 -409 -237 106 -200 -157 38 125 161 19 -127 320 318 -214 103 31 -509 302 145
1738A45K56m3r22K98O64k86R7k51K22J03J45n06L02j86l55n90J046k32k2K26o24
1759e13O47K05k60k94L34k44J9J92M8l29j8j40O81k91m34L58R7J56l65K51o61
1780e61R79k94J80L22l75l2J69m40P1J27J82l50J81k72j13O10n41p2O35n92M4
1801a42L05J14m04M57n34M96k07k19J78K81k82Ql48j38M99N26p12J6K95o42R74
1822E21l88K86k98l10m1M72n00l71P40J1n32K66j19MN31m16l63N68M0k74O03m00
1844C0l46L01N9m45M64l08K29j09j59O63l78q8k0R5j76J98K56p00K57L45k48k1
1866a01r9j17L97k8o21N15L08M32n01r1j41N32n05m01J0P7Q5L30m05J16J56m31
1888d83L47L4K7l31J79j1O17k09N4m55P18o87j12K06l41K27L93r32P33o5O8K4
$$ plain form
1738 145 401 358 -564 -266 398 112 209 -42 180 283 428 -78 224 38 -317 -907 139 -93 -115 111 -513
1759 -513 134 339 79 -215 119 -125 -106 86 134 -195 -213 -353 328 37 -397 -39 58 214 -151 100 -561
1780 -561 418 124 304 626 251 219 388 -52 19 146 328 -22 159 -113 -226 384 -157 -229 406 -186 -142
1801 -142 163 277 -127 330 -204 292 85 -134 44 325 43 51 -297 -435 64 590 -122 -106 189 -453 521
1822 521 133 419 121 -189 -230 242 -258 -629 111 122 -410 -144 -263 -259 272 -144 -507 61 101 -173 430 30
1844 30 -316 -15 44 -401 63 -245 -16 -125 -284 379 1 -87 -107 -12 -188 10 266 -434 -177 168 -80 -101
1866 -101 -200 -317 80 52 -569 -54 254 686 185 94 -47 485 -20 -421 -411 -334 -249 81 -324 -208 -52 -483
1888 -483 -136 -102 -75 -406 -227 -238 379 170 224 -231 487 -200 -312 -106 -447 -220 173 -759 -26 -91 -23 1
1910AM34r54M12M64k02k97K67k54L69m39j99L99j01l33O49m51P8M73n91K43L60
1931C28o18K66N21o23K51J72J79l14j71k75j15O94m51q2l0K06r4K62K73l29K43
1952B93j39J03J82o94M54jm24J73k86L00k85J35O7J6M32k74k17M79r99Q76J52
1973C43l79L36l91j39KK58j61j33K57l2j84j95P4J002o65K14m2M13k67k56j87
1994a32j69M93l29j6L78m52j97J89K2O82J34q56M82L45l39J08J05q49O64r6o51
2015d84J18L16k28l96O51l90P35l44J86R0K54o61o8M65k13N21kj212O25m95M17
2036a15j21j32M61kK14l75P76o99o7Q93n41o27K72L5o0j7k72L23J46m21j8R7J70
2059h0J51J87l53J64K02o13L94K13m77j25Q26p24K82k12k08K30K84p90Q30Q6j40
$$ plain form
1910 1 435 -519 -107 357 155 -142 125 -129 240 -199 -398 1 -100 -433 216 -235 -157 316 -275 -32 328
1931 328 -290 -24 497 -126 125 297 476 162 -9 -284 -399 295 -156 -238 -268 -62 -156 106 379 50 293
1952 293 154 257 439 -255 199 198 -226 -53 -339 -39 -324 -189 -122 -106 326 52 -165 314 -685 191 343
1973 343 -36 300 -91 -230 -228 30 -131 -264 -7 -39 -223 -418 -344 658 -7 207 165 578 311 55 -132
1994 -132 -301 192 -137 -153 225 -227 -424 -235 -213 469 603 -253 229 574 235 343 448 -401 263 167 -484
2015 -484 -366 -50 -278 -674 -23 -413 322 -22 164 254 508 -153 -221 244 31 552 550 -662 -37 -532 -115
2036 -115 -236 -368 93 91 305 -70 706 7 -60 833 292 -335 -63 -28 -88 -105 -377 -54 92 -329 -347 -250 -80
2059 -80 71 258 -95 69 271 -342 52 265 -212 -337 489 -235 47 -165 -373 -143 141 -649 181 267 127
2080A27q1L37l41K89J32k62k58J5K04j57Kn73O40n2n98P43k68j4O9M3o9J64k01
2103a09N15l15P0J07l37LN00q2l14l95M36k63l3L27o13O65k6j30j55O41p82L33
2125D3l56J0P57l53m07K46n18Q9P40j98J71K14o72R9k21L43N45m23n46J38L38
2146C9l44M01k73J47k52M28k68N97j77l98K16J99k75L15M0o85M59m12J25k37J61
2167a94K1J91K21j58Rn00K5J196j81p28N26l67j45M50n60l48P71k73n07K24MJ9
2189c04M92k45Q8O79q45M24k79P6l7Q2q03O09L79j008M74L23o15K85k78M83j94
2210b14N54r35O16M04m73L73k5n54J50K72q1k92L29l17K43j08m43O42j36L57l32
2231C0L24J47l1r54L78K30n33J47M21l30n1L02j51m95O18M5l29O46o46L2L74n62
$$ plain form
2080 127 46 383 42 331 463 201 -57 -42 162 5 7 -566 74 22 -576 167 -101 -115 -46 -3 -72 92 -109
2103 -109 406 91 161 268 -69 -66 434 352 38 -357 79 -184 -217 110 -503 162 136 6 -149 492 -290 43
2125 43 -313 -303 454 101 -306 -60 -578 -489 251 53 224 438 -234 -135 -356 -13 532 109 -437 -299 39
2146 39 -305 96 -177 -30 -282 146 -122 475 298 -100 116 315 40 355 395 -290 169 -243 -118 -355 -194
2167 -194 -173 18 239 81 90 -410 -385 811 630 -98 428 61 -84 366 -194 -542 229 -44 -551 -327 -323 -304
2189 -304 188 -57 31 710 -135 289 10 86 49 131 -672 -63 316 -692 -218 105 -510 -225 -503 -20 -214
2210 -214 340 -595 21 425 -48 325 300 -254 -104 168 87 -205 124 -193 50 -58 -501 141 5 362 30
2231 30 354 501 470 -484 -106 124 -409 -262 159 -171 -222 80 -71 -566 52 97 -232 414 -232 -200 174 -388
2253c88L60j32l50M30k67K18n4lj49M4L84o11M81M09l71L66j46l47M28k49L85
2274D38r6m14Q1J63l98N41k62k42o2P9L83k7L53p78L2K50p3K26n05K30K49k85
2296a17o22N03P64o57L16j30l76M22j73J06R3L71n71J04L39l13O1k19k15kJ99
2317a17l03P84p5n19K77l40K75j91L78m19N40k08m33P84j17o45M39n69k75L58
2337c76L71k28M08o7k51M34J1j0L60r29L24J11l79K8N14p44J84K89M0k58J30k63
2359c01L01K79o43L64K24n87Q91q49l2M12k71k09M13j27k60K27N77q21N76j14
2379E0m88K30J60J82L43l58q72N65r3n0N86k92l40L07j93L6N20n93k25M51j04
2400a78k57O85l40J97K4l28k61Q89r50J63P83n07J55J32nL1m41J79M51Jk34j15
$$ plain form
2253 -388 -28 -160 -510 -80 -347 -129 -183 -186 -335 -291 93 -518 -37 372 1 367 221 -126 302 53 438
2274 438 342 -72 9 172 -226 315 53 -189 -251 -172 211 184 537 -241 -209 41 -32 194 -311 -81 168 -117
2296 -117 -739 -236 528 -129 187 57 -319 103 -70 36 129 500 -71 33 372 59 120 -99 -314 -316 -117
2317 -117 -420 364 289 -230 47 -293 -18 -209 169 -250 290 82 -351 433 316 -329 110 -459 -734 -376
2337 -376 -5 -233 175 108 -143 291 302 292 652 -277 47 158 -221 -193 321 -423 -239 50 90 -168 -38 -301
2359 -301 0 279 -364 0 224 -363 528 -321 -353 59 -212 -421 -8 -135 -395 -168 409 -412 164 50
2379 50 -438 -208 -48 134 477 119 -753 -188 -281 -331 255 -37 -377 -70 -263 -227 293 -300 -525 -74 -178
2400 -178 -435 250 -90 107 131 -197 -458 431 -519 -356 427 -80 75 207 202 233 -208 -29 422 423 189 74
2422G4J21k16J34J5k20M43n48Q9p6j87N27m62J67O8L44J42j029Q80j77n77L84
2443a04K58m5J2K5m11L04N4j84K76p6J59K0l70r5QQ3l47R23p97J48M02j52j2K49
2467C28k89L72q17M18K65k05k68L42K30j22j7m86K65K32n80M78l96RK05L31l69
2488g4k07O85L1o79L68j23j88Q47o68K4R7r68P01R1l36L67l1j67O8N2L94m61M1
2511a36p0J61k13M1j29j78k7P93P2p83P86n68L75j29k40N98k78J20k89L51l62
2532a05J28M45k37p36O82j30j91K29j91Q5L93l17m74L31J90k82J67J48m57N97
2552B75k56K96k82m6j44n8K21J49K98m57j00j34O7j4K58l09N70o91K12M81l69
2573c3l82N66k1r38R34O2j23O4Q1j73M01p77o7P35n02P19m64k30J78M17j014M44
$$ plain form
2422 74 195 -21 113 128 -92 351 -197 -108 -184 -371 156 -306 -139 -71 273 415 -614 266 89 -488 -104
2443 -104 154 109 121 146 -265 39 93 -91 185 109 268 288 -82 -177 -169 -86 -433 490 -307 -159 243 91 79 328
2467 328 39 411 -406 12 277 72 -196 146 376 254 237 -249 16 248 -332 146 -250 -241 -36 295 -74
2488 -74 -281 404 435 -244 124 1 -187 660 -8 16 113 -855 -154 -63 -399 -32 -63 -230 -162 -110 284 -177 -136
2511 -136 -206 -45 -258 -217 -346 -524 -551 242 314 -469 317 -251 124 -5 -245 353 75 195 -94 257 -105
2532 -105 23 468 231 -505 177 47 -144 85 -106 -21 372 55 -419 -88 102 -180 -13 135 -322 275
2552 275 19 315 33 -13 -157 -215 6 155 453 -4 -104 -238 -171 -185 73 -236 334 -357 -145 336 -33
2573 -33 -415 151 130 -808 126 188 65 129 210 37 438 -339 -406 329 -173 546 82 -148 30 447 -567 -123
2595a23L73o62L04N9K06O39o92j41l20N77m42K02N37o17l11K40K31o9Q7m65L09
2616g8N55n45k52O52o84L3L72m32L36M7l91L09M91p68M80k01n58O84j36j80N51
2637B85l61LM79n0p64N10k58k5N73m17J62q1k28M77k83k69K45K99n96J60K20n10
2659d29m7O48n49L92O52p37JJ78r2r2o0n40Q61K8k43K07k38j12p7O66r65M83l65
2682d30K1Q52j60r05R31m94J75M84m78J8rJ64l7M25p63K6O31l46M52r0q36L00
2704f9L82m7k61J00J31o53K71Q6j24M39j37j28k4p2K48J88n33L27k20p9O01m23
2726CJ68k6M0m63J58L22k91K88k09m85O05l17K86J28m07J99L42J74p61O40n76
2747a82M1N15m62j1N65o85O9O48p30j57P53k19p44P34k95L29j47j67M10j35l93
$$ plain form
2595 -123 250 -412 -108 -49 157 796 104 -37 -357 220 -222 -20 517 -100 -411 -171 60 -9 78 -387 -78
2616 -78 477 -68 -320 332 -352 -319 53 -379 -43 4 -387 -78 413 -355 125 -76 -634 50 -86 -266 285
2637 285 -76 -73 406 356 -408 102 -156 -181 392 -25 137 56 -172 305 22 -247 -2 297 -299 -139 81 -429
2659 -429 -476 172 -377 15 667 -70 -69 109 17 -75 -135 -675 186 214 -29 178 -60 -172 -249 417 -548 -65 -430
2682 -430 -409 443 283 -622 309 -185 -10 474 -4 14 5 169 132 557 -206 -180 451 105 557 467 -369 -69
2704 -69 313 266 5 105 236 -417 -146 -60 -184 255 118 -10 -34 -106 142 330 -203 124 -96 -175 426 3
2726 3 171 145 185 -278 -120 202 -89 199 -10 -495 110 -207 79 207 -200 -1 341 515 -246 394 -182
2747 -182 -141 374 -88 -99 466 -219 -150 498 -232 -389 364 145 -599 135 -160 169 22 -145 265 130 -263
2768b63N94k97k06O14m01oK81n28m6K95kk02O49m39L25l36j81K87O25q38R1L14
2790C30l85L04k41m50J37K34J19m63L15q6q2N28l19L25j11l35qo2m39L33L58j00
2812i8M95p01M07P4j87%mp5q3L07J65o92L94j6k22P79l30n49Q45n81q3J59K40
2835B44m26J61j39MP02j98q33N91j40J06l00J35k21N26m09m0P18q25J87J73k05
2856a89M08j09p5L07N6n27J69M18o80N07j01n66m8J24k57P20O4k02J15m2k94L78
2878A76n34N49j70N00n30k06K79j69N09m63j35J46L80m38N77N3r56P36k71N7L04
2899C94o45J43J73l49j47M31n26J52P79r77R45R7j73m61Q50q52Q14n87m05K93
2919e1N6j10K9%l13N67j26j22J36Nn57M82K87m34M24P3o42O14n0p02M81n45N40
$$ plain form
2768 -263 331 34 -172 442 41 35 316 -212 -258 37 35 -167 482 43 368 32 -149 138 763 -75 16 330
2790 330 -55 249 8 -442 -305 -71 48 -415 -100 -186 -268 260 -59 266 155 -180 -188 -250 -689 -356 2 -98
2812 -98 397 -304 103 177 -10 -10 -14 -89 -172 135 300 -392 2 -14 -236 543 213 -336 509 -72 -155 4 244
2835 244 -182 -21 -160 -156 546 348 -485 106 -34 72 -228 -93 -314 212 -197 -237 481 -344 -157 16 -189
2856 -189 219 110 35 342 398 -129 40 458 -222 285 184 -382 -430 -306 -563 157 221 19 134 92 -202 176
2878 176 -358 191 21 521 -9 -215 64 -105 404 -59 -194 -48 332 -106 471 524 -432 304 33 90 394
2899 394 -251 -108 65 -284 -431 0 -526 -374 405 -572 373 470 297 -164 686 -166 648 61 -344 -51
2919 -51 5 -105 -76 -76 -389 178 52 -70 66 71 -486 -4 283 -151 273 346 -296 318 268 -434 47 -498 42
2942D2j73K22n60K28M20l13L49Lr3Mk37R8O44q00L36K3m83l87M96o6L10l99m20
2965g56R58m15M50l71N76o37J62Kl3%J20q4k36K13m50Q93k06k61M52l94k65O45
2987C63k58o4M44Jn10O23q09L23P0o46j6P62p95N27N2k57p6J23K67j95L88o41
3009c24J88L53j09K13l88J38p9k25L16r1k8n41P47j66m7O05n68j98O50m64L1j12
3031i9j16L35o0j82N2K72k48L29o85L85K23Q6l73J08M33j65j18K30m43K2Q9q59
3053g84P51L55r68J71Q46p19J43P65n65M01l20l64L35J29m73M02J67p5k04m68
3073d75O85o9m33j08J70ML98P8p2j24R8p1J1oK78k20j83J11k46O69p48j16M83
3096A14l46P54m01o00M81J62j01O9j84k88oM33o17N00J90k69L7k10RL55j71M14
$$ plain form
2942 42 -131 91 -469 -241 179 -134 215 218 125 129 -108 -10 634 -166 170 193 -290 -677 -181 -247 63 -336 -756
2965 -756 202 -213 237 -134 442 -195 -33 -31 -64 -64 56 -28 -264 -51 -501 392 186 -75 377 -17 -282 363
2987 363 105 41 485 486 -24 599 -210 113 183 -463 -479 283 -512 15 67 -190 -266 -143 124 -71 317 -324
3009 -324 -136 217 108 321 -67 71 -8 -233 83 -8 -36 -577 170 4 -43 562 -6 -204 446 -18 13 -99
3031 -99 -215 120 60 -122 -70 202 -46 283 -402 -17 206 292 -81 27 460 295 177 407 -36 -14 75 -784
3053 -784 -33 322 -646 -475 371 -348 -205 560 -5 396 76 -288 47 176 -297 105 272 197 -7 -475
3073 -475 210 141 -292 -400 -230 -226 172 250 178 54 152 81 92 86 364 144 -39 72 -174 495 -253 -369 114
3096 114 -232 522 121 -479 2 164 63 132 -52 -340 -346 87 -530 -30 160 -109 -72 -282 -273 82 -89 325
3118C25l82L54J9%R1p85M94j63j36M1L42j49J0L8j76K57n93l08P70k74R6J93k67
3141b03N11j21n7N4k83P5j18M66n72M03O0l64r3M68k4J02m02l5L37K1N7l93L02
3164A91l39l3N62l40M4k35K71K91o79J90j89P31q05P17k70l1j41J83l14O03n84
3185a77K70q7r2n2l5M06n32L31j28r5J79j03j9L62n21nN86k5l30M2m19Q58j2p41
3209c39K20K47l72L40K37p05L4J55j00L12ml96L72K1l26O12p27J89K83L96p02
3230b53M01l80k61J089k26n40O20n10m93Q99l87K1L80k11j62K64k17M0J00l15
3250a41K74L41o48K20J42o93N89o5m33J13j18M15J41J41Q4k09K68m29J41J38J5
3271B86L66n58o5J15m62j47P21J1n14Q93o15K11j61q0l8L3k32K53M59m77r64J242
$$ plain form
3118 325 -57 297 316 316 407 -378 116 -47 -183 -142 200 51 61 99 -77 180 -413 -721 49 -225 -129 64 -203
3141 -203 308 187 130 184 -99 -24 -142 324 -248 155 215 -149 -242 226 202 304 -98 -133 204 225 282 -111 191
3164 191 -148 -181 381 41 85 -150 121 412 -267 -77 -266 465 -340 377 107 76 -65 118 -196 407 -177
3185 -177 93 6 -86 -138 -173 233 -299 32 -96 -191 -12 -115 -134 228 -293 -298 288 263 -67 -25 -444 414 402 -339
3209 -339 -119 128 -244 96 333 -372 -338 -183 -283 29 25 -371 1 22 -304 308 -419 -230 53 449 -253
3230 -253 148 -232 -493 596 370 -170 450 -60 -553 346 -41 -20 360 149 -13 251 34 74 174 -141
3250 -141 133 474 -174 46 188 -505 84 19 -414 -301 -419 -4 137 278 362 153 421 -8 133 271 286
3271 286 652 94 29 144 -318 -465 256 267 -247 646 31 242 81 1 -37 -4 -236 17 476 -1 -965 277
3293B77l05k74M27m72M76J02p71Q15L4k79J82Qj86k28K22n62N80K57o12N36k90
3314f3j84K04j87L16j70J51l68O0P52m83q4K89J7k60M71o34o0K27p9P7jk06O55
3337D40j89o12Q61j69m80K44m36O4N03m59j22K06J36J18M6j54r0L62l78m82N46
3358d5N5p1K8k8J73M2m72L38l37J75M18r1l29L91j82K56P5p4l23K96l76L74Ll34
3382c8j02K11j5k49kJ16j63P07k84o74N82j21p91R03J00j68L40n25n44R39k03
3403A9k26M0K7K15J3k7M2J63n20J54O4n59P41L13o73J002m22o22M70l1k42M6j75
3426a88k32M73O9o00N57n15J19L63m26p8Q57n69m27J072k85m14N52o33Q7K50m1
3447iK31l42m11K41M20n94J86O52o19M87j04j04l20J32j95K55N61p96J21N22m98
$$ plain form
3293 277 -28 -302 125 -347 129 231 -540 275 309 30 212 220 34 -194 28 -534 46 303 -309 227 -63
3314 -63 -247 -43 -230 86 -84 67 -301 -241 511 28 -56 233 250 -10 461 -173 -233 -6 -85 -8 -9 -215 440
3337 440 251 -361 500 331 -149 95 -341 -277 226 -233 -355 -149 -13 105 151 -3 -93 269 -109 -591 -45
3358 -45 10 -61 -33 -61 112 154 -318 20 -317 -142 276 185 -144 247 65 321 396 322 -1 295 -81 293 296 -38
3382 -38 -140 71 56 -193 -195 -79 -242 465 181 -493 89 -32 -823 80 180 12 352 -173 -717 222 19
3403 19 -207 -167 -140 75 88 61 103 266 -254 -100 -36 -595 146 459 -214 788 366 -256 214 183 -59 -13 -188
3426 -188 -420 53 122 -478 79 -436 -317 46 -380 -458 399 -170 -597 475 190 -224 328 -305 -218 32 -9
3447 -9 222 -120 -531 -290 130 -464 -278 374 -245 242 138 34 -286 -154 -349 -94 467 -329 -208 314 -184
3468a84K54J24l60O06j28m06O2P7l53K46R3n70Q57k61k02M39k15m13K53N9j73
3489a95r1J53J96k98M43j62R5k27r4N84l90N8j3k15M25j10j48j82M01m38M71m78
3511b15J24j41K46k70L05K51r10M55O69n23M3j7l04J184j163K89J55n48M13M2
3531H5P49q89P13o24L61m8n92J07Q02r94p6L50j72k68Q12k40l12P19l34n8J74
3552B65n53L91j29K29j08K00q77P51K73p62L59J52l58M12n87J10K43K83q0J23
3572C37k22l0J43l21j24L19J47q73P99j04L1J06N3r2Lp4m57K77K19k75L02M7j27
3595H4l25J7QK61j75O1N34p38J59Q24q92K9N00q0k22J10j86lN9N9L1Jn26R4L32
3620A6m11K43l1J18k31J19k22J32Q50q71N58n52K76K51k08r2M60n88K77K89n74
$$ plain form
3468 -184 70 194 -166 440 312 -94 -32 45 -308 -62 31 -539 318 57 -145 294 79 -334 -81 -22 -195
3489 -195 -286 -133 63 -235 208 46 141 -86 -180 404 14 72 59 -156 269 159 11 -171 230 -208 263 -215
3511 -215 -91 -232 14 -256 49 300 -610 -155 514 -9 34 17 -287 897 -266 23 178 -370 43 85
3531 85 834 -55 658 34 395 347 -245 -138 664 -330 -406 -56 -228 -496 316 76 -236 483 149 91 265
3552 265 -288 103 -26 203 95 295 -582 169 442 -320 39 191 -167 245 -342 -232 11 294 214 337
3572 337 115 85 228 -93 -217 102 249 -624 175 71 102 208 261 169 172 98 -359 -82 137 -138 164 211 84
3595 84 -241 -224 -216 45 -130 -69 465 -273 -114 710 -182 -153 347 267 45 155 -31 -34 25 84 115 116 -410 -316 16
3620 16 -395 -152 -183 -65 -296 -177 -399 -267 583 -288 270 -282 -6 245 37 -55 405 -183 94 383 -191
3641a91K2K11j82k56O20njk22n05N13K78o09J35J51m79L18L99m14O7M76j63K22
3663C85l05m34L91J31q25M29N93m08P4J46k54J41J34L3q5J84n28L82m12k13K72
3684a69L32l4j57k03K69lOl15L99n70M44k45j47J83M61n59L58q0q8l5M50m37J59
3707A9l1j09m52L55p4P7J77r9M3N59j072J041Mk63o5j34p7O2P25o69r1K6K44J87
3731C83n43J57L3j92l19P84k90oJ10m42K74n6J19m6K24o78M23N13o54O27m5j03
3753B73n79N72n77K45J28m89L20L73n49N05J56n10j98Q00n78K60j07n92M70M93
3773D16m36j45K75l2K32l31j46l48P99n44J60l74j74J010o05L52M67l67l28L40
3793B21m12lK59m70N18J62p29O06M12k16k04j27m90L57J30J84R0q6m79M37k17
$$ plain form
3641 -191 -169 42 -140 -396 224 219 218 -4 -509 4 282 -327 -192 -41 -520 -202 197 -217 -150 326 163 385
3663 385 80 -354 37 168 -657 -228 365 -43 31 177 -77 64 198 231 146 330 -198 184 -228 -441 -169
3684 -169 163 129 -28 -231 38 35 41 -274 125 -445 -1 -246 -393 -210 251 -308 50 -30 -118 -153 297 -140 19
3707 19 -12 -121 -573 -218 -292 -215 -38 -137 -94 465 -607 434 438 175 110 -24 -101 -39 686 17 -74 -48 196 383
3731 383 -160 -3 30 -162 -481 303 13 7 117 -325 -51 -107 12 -34 190 -488 -65 448 -206 421 376 273
3753 273 -306 266 -311 -66 62 -427 -107 266 -283 222 378 -132 -330 470 -108 152 45 -547 -77 416
3773 416 -20 -165 110 78 310 -21 -167 -515 284 -260 -100 -474 -648 362 -243 109 576 209 -119 221
3793 221 -191 -194 65 -405 113 275 -454 152 564 348 144 17 -473 -116 14 198 288 202 -277 160 -57
3814e7p9n9n0N96j23k66j11O65m14l66L27K54n7k52P5p84P11L75n34L41j46m48
3836d02N39K92p95O13j03m46N87k11l12O96j71l51M66l45L5k4o92N61O18j131
3856e76R24P3p36L1P32n31j23P26n96J90m6m46O01q7L0m68N00p72M75M81r03K32
3878b89N84k04j77M1k26j38J33J35Q4o93M74M17o49J77L92l29J79J81l97L87r6
3899a4lO2J74k13k4M0N3j58J78l49K40K1k47L86K31m89L52N4n99K08K98j00j52
3922e1j57J49K35ll51K67J15n64R27j88r14K84m3L72k59J54m95R07n30n6N50p85
3944d36m35J275l33j61j54K54L0K6m85J04O38q96P9M03m9R9M02j72k75K96k32
3965b2J77k81l51M90K96n32K2N86j34n59L24J72n72K58l31O51m74j30R93n43k69
$$ plain form
3814 -57 -136 -195 -245 351 228 -38 -149 516 102 -264 63 317 260 8 83 -701 10 385 -149 192 46 -402
3836 -402 137 429 -366 247 144 -302 285 74 -238 458 287 -64 402 57 92 68 -624 -63 555 -576
3856 -576 348 421 -315 -284 448 -83 -206 520 -76 114 68 -378 223 136 166 -302 198 -574 -99 382 -521 -289
3878 -289 295 91 -86 -45 -271 -409 -276 -141 -57 -750 -276 141 -508 -331 61 -268 -89 92 -305 82 -14
3899 -14 -17 45 219 6 -18 22 75 -83 95 -254 -14 7 -240 146 377 -112 240 294 -305 -97 201 101 -51
3922 -51 -208 -59 176 173 -178 89 204 -360 567 379 -535 -251 -294 78 -181 -27 -522 385 -145 -201 349 -436
3944 -436 -871 404 71 -90 -244 10 40 66 -419 -315 323 -573 -494 -91 -140 -41 361 189 -86 210 -22
3965 -22 155 -126 -477 13 309 -223 -201 385 251 -308 16 188 -384 -126 -457 194 -280 -410 583 40 -229
3986b29K77M37n87M28o15P6J03k31l9K29L82l13L05m36J15K23q10K95P50q10L72
4007g8k4R0L12l97P07l7o69k36J87K57l25J46j54L28l6l33K38K5L40o57P97k77
4029B04k67M8K79l74N87l07p63R32p10K06K63l77K35k35N09k47L0j53O05j13o63
4050c11M25J84o15NK63j32R6o6l8K33M7m68M81J21j88P6K68p62M12K07Kk76J46
4073A10l08p9O15l64R2n29NP65l03k42J99J15n71L32q6R9O77n19m2K17J56m93
4095a54M73l92L9l72J60O13l27j20j37L10m30K69K39k61J25j58pK68j67l32j5
4116c76m0j03J048p5o83J34N40j96l2j45k71N46l96J42J25l75j99O57l46l66Q52
4137D41o96j46N32J77p37Q71j98o48L28K93l38o0L43l30O91r50N45O5j48M7k9
$$ plain form
3986 -229 48 485 -102 326 -289 -213 -110 -341 -380 -151 231 -82 223 -213 -98 125 -685 -390 360 -450 -78
4007 -78 -102 -12 300 -97 610 573 -96 -332 -145 112 -213 -67 -221 107 71 -262 -24 1 341 -316 481 204
4029 204 -63 -15 264 -110 477 170 -593 339 -371 -165 98 -279 -44 -279 230 -17 13 -140 465 352 -311
4050 -311 114 298 -317 -312 -49 -181 -85 -151 -189 44 91 -377 104 225 37 113 381 -381 31 238 240 -36 110
4073 110 -198 -277 338 -26 66 -463 -458 307 4 -238 -39 76 -495 -163 -249 -150 527 8 -34 183 339 -154
4095 -154 319 -73 -34 -406 -246 367 40 -80 -217 93 -337 -68 171 -90 35 -123 -130 138 -29 -361 -376
4116 -376 -416 -519 529 454 -229 -95 445 249 217 72 -199 347 -49 93 218 -157 -356 301 -45 -411 441
4137 441 -255 -401 131 308 -429 442 244 -404 -76 217 -121 -181 162 -168 523 -427 118 183 35 82 53
4158E3k52K52K44J42j00k15n01J89N68n04J90L53n73L5L45n62L70k87J91N70n30
4179b2j37M90%o11K78j32n51J221m44l54nK43M56l56q1O8K70n61r6K96o8k39M75
4202A40m41J35K34j91K30k00m76P78k06K05l14Q57j104M2R78j304J229n00m29
4221c37R9L58k98j56N83j49j28L49l59K2k64K60K3J71k91P1k65j76O64l16M12
4242B73M2j06l27k94P06l31O70j019K73M78J93m63K14l37k20R1k44J58k30J66
4262c07M61J12l70J84K55p80N34r5l61J86M43k31M27r94L02K15N6L30m20j15j59
4283c27K71L31l24O90q48j8K83q1J46p3n42M47N07p09M40K68m09J01K3l56J18
4304f2K86o65Q4L74j01J20N24q36P75n46Mm22K65J4K38K27k11j20L4l1J34m7o6
$$ plain form
4158 53 -199 53 297 439 339 124 -377 -188 380 -124 66 419 -154 -119 226 -336 34 -253 -62 508 -22
4179 -22 -159 331 331 -280 -2 -134 -685 536 92 -262 -267 -24 432 76 -5 63 333 -228 -324 -28 -96 -335 140
4202 140 -301 -166 68 -123 107 -93 -569 209 3 208 -106 751 -353 -311 667 -637 592 92 -337
4221 -337 -238 120 -178 -334 249 100 -28 321 -38 -16 -280 -20 3 174 -117 -46 -311 -487 177 -139 273
4242 273 315 209 -118 -412 294 -37 633 -386 -113 365 558 95 309 -28 -248 -157 -401 -243 -473 -307
4262 -307 154 266 -104 80 335 -445 89 -6 -367 -181 262 31 458 -536 -234 -19 37 367 -53 -168 -327
4283 -327 -56 275 -49 641 -207 -225 58 -23 123 50 -492 -45 462 -247 193 461 52 153 176 -180 -62
4304 -62 224 -441 -357 17 -84 36 560 -276 499 -47 -43 -465 -200 -186 52 279 68 -52 -18 -49 85 38 -28
4327b8q2o8K19L19m02m43N36l74K19K93l02j65P89l65j55M07r83M75P39q47J8
4348b00K06k48O7M95o90q6O22n36o5R99o21k3Q16r71M89k76Q1j11j8k05N00p5
4370A50n69P74j20m5n65K69j88O7N94l36NK87R3M0o72j96K30o5j9O60p03L68k09
4393a50r5M55j54l28k12M38J96n11M71l84K73K52L21n75O97q19P5o8p5j88K81
4414a00L58J41m81k35K52K98n64L25J5l45R62k34n50J08L00q55M16J78m28L83
4434e6K15l87P26o82m8O88o52K77l60l5K97M47n21m20O32k70J55O2j43P5O29j391
4456g62J044l30j8K96r3m92N53P3o54N92r5K00R3l39n64L40M59l85K33l57r2N93
4478B95j09l52Q3J48k11O55q69K48J28J56l45M31O1r7K22k41k2J34k94n37P86
$$ plain form
4327 -28 -110 -178 41 360 -42 -485 51 -323 -104 189 -113 -278 511 146 -9 398 -585 -110 629 -218 -200
4348 -200 6 -242 -175 320 -370 -456 166 -370 -435 564 -57 -80 736 -235 254 -22 59 -52 -70 -275 225 150
4370 150 -419 355 235 190 -375 -106 -294 -227 367 31 36 323 416 456 -216 -412 -182 -247 -266 394 -309 59 -150
4393 -150 -245 210 56 -272 -484 -46 150 -361 110 -274 -1 251 572 -3 694 -125 -50 -118 -193 -381 -100
4414 -100 258 399 -82 -317 -65 233 -331 -6 9 -336 626 392 -158 -50 250 -605 -189 -11 -439 -56
4434 -56 159 -228 498 -184 -232 456 -196 81 -279 -314 -17 430 -91 -511 121 -149 6 68 -75 0 629 -762
4456 -762 282 -48 -66 230 137 -355 198 271 -383 209 114 314 407 68 -496 -156 303 -82 151 -206 -298 295
4478 295 186 -166 -83 65 -146 509 -360 -112 16 172 -173 258 319 222 444 203 181 315 21 -516 270
4499B70o28M08K2n92N07l9J24l42J036j032rj48m38M25N05q08R41j25q3N93m38
4520A49n46M51P2m19J76N2k24L22k2j33J43K01M2M48n46k65O88j030L09L64n19
4541b87j43P10m36k76M14k41r7P62k50j89k39M1N08l69l39Q9L56J28j03J77m93
4562b77j02N55n83L71N79j352J014N49m83m39J2l56J083m26p41P50M04n71j00
4581a13K80j53K44jj58K16r12m8KJ170r36O52n57K15M59p02L08O8KJk18K71k73
4604a83M20m13K87M67q46L6P05k45k12M5p5J98n1l91N61k30M4K7M21m78K05k1
4626B71o67Q60p25l83P94j62J5O3k9q2J0L67o56N94L1K5j86j39k91Q06p71K7K53
4649B5o3k66L22l40K14L99m42L02J68j34m50j22N09p1j63j8J35K80o18J05M6J77
$$ plain form
4499 270 -358 50 72 -520 -13 -52 72 -270 766 -266 -275 -423 -861 -436 69 -739 202 77 -6 587 149
4520 149 -397 54 126 -293 -117 -65 -289 33 11 -122 21 222 264 712 166 -99 589 -441 -132 232 -287
4541 -287 -430 280 -156 -432 -18 -259 -356 406 156 -33 -272 -231 277 -92 -431 -342 14 142 39 216 -277
4562 -277 -379 176 -407 -36 543 -809 205 754 271 -168 -156 -512 571 145 -596 154 558 -13 -113
4581 -113 167 14 258 257 99 315 -597 -645 -643 527 -409 243 -314 -99 360 -342 -34 34 36 37 -181 90 -183
4604 -183 237 -176 111 578 -268 -232 473 228 16 61 -14 184 133 -258 303 73 117 144 565 87 292 271
4626 271 -396 464 -261 -644 150 -12 3 66 37 -45 -35 332 -324 270 301 326 140 1 -290 516 -255 -228 25
4649 25 -38 -304 18 -322 -108 291 -151 151 319 185 -265 -387 122 51 -112 -130 5 285 -333 -228 -182 -5
4671eN53l06r05R35J1k20O1k74r0J69J76l10r7n5L45R4l04l36K93K75k60N46k63
4694C3k72K17R6l59O14ml92P5j96k68O26l29L03K45o34M98M18q81L63j80k5L0
4716b2L91o85P83j14m38Nl24P9O69l47k18J30O57q36P51r5o48J79l09K81L67k22
4738C4k91M89q5k01N0k13k13P85j58R4k22l38J76J83j30L5J60k41M4P8j49K63
4760A50K39m97k83N17o8J94Qo69M54J15m67P46m20k39J40K86k10O17o29j04J14
4781fk31K44k9Q2k25K79n3n7l7L3R4q8m40L26J09l26J51L59m52J64k99M38J53
4804A89J31o86N09o5n96M56K94m01J00J81n85K37k8K22l0j66O44n7K7k59k15k51
4826c49O27l07j38r9K51k67K64N1k95k12J84L40J20L77q72M19J15l86L08M07p32
$$ plain form
4671 -5 548 242 -663 272 283 63 124 -150 -240 -71 105 -205 -302 -357 -12 82 -222 -558 -265 10 -250 296 33
4694 33 -239 -22 74 -285 329 325 -67 8 -188 -456 170 -159 144 389 -245 253 671 -210 153 -27 -52 -22
4716 -22 369 -316 467 353 -85 -80 -404 -325 344 -3 -221 -91 566 -270 481 386 -262 -83 -392 -111 256 34
4738 34 -257 232 147 -54 -4 -217 -430 355 197 291 69 -269 -93 90 -40 -5 155 -86 -42 36 -113 150
4760 150 389 -108 -391 126 58 252 260 -409 45 160 -307 439 19 -220 -80 206 -4 613 -16 -120 -6
4781 -6 -237 7 -22 60 -165 114 61 4 -33 0 94 6 -434 -108 1 -325 -174 185 -267 -103 -402 36 189
4804 189 320 -366 143 78 -518 -62 232 -169 -69 112 -473 -236 -264 -42 -72 -238 406 349 376 117 -98 -349
4826 -349 278 -29 -167 -266 -15 -282 -18 33 -262 -474 -290 50 170 547 -325 94 209 -177 131 538 -194
4847a94n6J83R6j41O48o23j81J82k59O82l78L92n73L18m66K22J94n21R3N68n50
4868c64N43m13K73k72J53q5k18M01n9J54k49J83k22K88p62J64N26o42M24L39n07
4889c45K60j97m6P49o42J77M75q05J54O27k46q1L4m7l1M0j95p6M92n47J29M37
4911C16n65K79K22k46K5J07k12O9N05m51J42K44l76k40k10J20K39L04m10J68j04
4932g4l39K52j58L51L04j76r5K8o30L25q4K90k47K93p3k48N52n95K10n7K56k65
4954a80P18p56K43L05o69L45L67q30N69k26J48N92o84J26J77m9l47M74n67M49
4974B05L63j93l09k0Mj2K71q94L96J38l00J22L88j32n10L93L93l54lL50P4j72
4996A98k57o6N06k56o25J309j141J92M28o97M78K50m01m29P83o35K49K43k19P6
$$ plain form
4847 -194 -250 -67 29 -112 536 -87 -268 -86 -345 337 -41 351 -222 96 -370 -148 46 -475 -382 186 -364
4868 -364 179 -234 39 -233 -80 -165 -383 18 -41 113 -136 47 -175 113 -649 -485 41 -601 -177 162 -345
4889 -345 -85 -282 -328 421 -221 -44 431 -374 -220 407 161 80 114 67 36 76 -119 -195 297 -250 -121 316
4911 316 -249 30 252 6 31 138 -74 -5 500 49 191 435 59 -181 -391 -271 -32 272 -138 30 -74
4932 -74 -413 -161 -319 32 336 160 65 93 -537 -212 -296 -6 -253 40 -33 -281 271 -324 -114 -171 85 -180
4954 -180 538 -218 25 330 -339 6 373 -457 112 -114 34 626 -58 68 245 196 -151 323 -244 205
4974 205 568 375 66 46 50 38 309 -585 -189 -51 -351 -229 159 27 -483 -90 303 -51 -54 296 370 198
4996 198 -59 -125 381 125 -500 809 -332 -140 288 -409 69 319 -82 -511 272 -363 -114 129 -90 -14
5016a4J44l98J81K73j41J89J87o39M06L65m27J03k4qn43O58j22p0j37k2L30k44
5038D7j93L37m49K01M05o30o9Q58p00j53J050p67k99K54M18m48O38p06K67o3j35
5059a37O9o6P2K16j31k52L67K41m05l8j62o3N09n36K24J59k16k38M31j39j06N40
5081C39o39Q8O48n44J04L58l1m12N1l8k76O75j88n96P49q46J06Q36k71k87L54
5102A80m10%L84n19L34J15j93R1r7J62k18K71m57K22n8Q5j17L43R1Q14j208K71
5124H6N5P6N4k99J30n11Q99n30j92j02j61K5N81l2o7O76q14J60L97l94m05P23
5146C55n18M48J15n89K11j75O5K99Q5o37K78J75n86N87J98m85K05j01l90L95M69
5167D04n25M62n66P8L64l55R2l04K40j82O94q46j09O90j53m47P02n30N7R39m78
$$ plain form
5016 -14 130 -268 -87 186 45 234 421 -218 188 553 126 229 205 197 -346 312 190 120 -17 -39 291 47
5038 47 -146 191 -258 -57 348 -282 -351 507 -193 -346 704 -63 -362 -108 310 -138 500 -206 61 -2 -137
5059 -137 -68 -134 -62 154 23 -229 138 379 -26 -64 -226 -289 220 -316 -92 67 -149 -387 44 -95 -201 339
5081 339 -300 -212 436 -108 -4 354 323 -89 -38 -76 -352 323 135 -461 288 -558 -452 384 113 -174 180
5102 180 -230 -230 154 -365 -31 84 -109 -18 -115 47 -171 100 -357 -135 -193 -108 -225 118 209 1023 -185 86
5124 86 141 217 271 -28 102 -409 490 -40 -232 -334 -495 -470 111 79 12 688 -126 34 431 37 -368 355
5146 355 -163 285 400 -189 22 -153 -88 211 296 -341 -63 112 -474 113 311 -174 31 -70 -460 -65 404
5167 404 -121 341 -225 -147 217 -138 -46 -350 -110 -292 402 -444 -553 137 -16 -463 239 -291 -234 705 227
5188B27k97N02k96j01M14n21k99J132j039m6M92k49j50J78k58K02L61n93L59J6
5208C4P9l18O61j031N48R2r4l9M84j76Kj95k49J99q4M1M7n6L50j30J0n6M20k97
5232B42l17J27M37p67K48l07J67J89n48K32K93L67Q2lp43M72m8l08L76pl48j02
5254b66L50l46M07j85j86K03k3L3R0J01k45M76M3m89j13J65j20J21r7j45Q9K07
5276G0l90O53j48J14j08l1p32N76l08R1M84n35J64N60l70l35O39k67k59L24J84
5297C76k55K47m31n8M89o11Q2N14p10P76m5p02J59M72n62O12k80k13N37k61m24
5318b88K42O6j38M63k62l37J0O09l95M38l45l92j47O12o97K36O6l68J010k42k92
5339a51M50K41l61j60j47J89j96J41nR8l0k02k15M48l21M21o17M85r4k30J82J24
$$ plain form
5188 227 -70 432 136 35 449 -72 -371 761 -278 -324 168 -81 -231 -53 -311 -109 252 -341 18 34
5208 34 113 -205 456 -575 -27 65 -29 -68 416 240 242 47 -202 -3 -87 -46 1 -55 295 165 175 119 539 242
5232 242 -75 52 489 -278 -30 -337 -170 19 -529 -297 -4 363 445 442 -301 171 123 -185 191 184 -164 -266
5254 -266 84 -262 145 -40 -226 -23 -46 -13 77 178 -67 409 452 -37 -150 15 -105 16 -81 -226 -137 70
5276 70 -320 333 185 299 191 160 -572 4 -304 -213 271 -264 -100 460 90 -245 394 127 -132 192 376
5297 376 121 368 -63 -121 368 -243 -161 353 -357 419 374 -328 -169 303 -259 353 73 -140 397 136 -288
5318 -288 -46 20 -118 345 83 -254 -244 365 -30 408 63 -329 -476 136 -561 -325 -259 -627 383 141 -151
5339 -151 299 540 179 19 -128 61 -135 6 1 99 69 -133 -348 100 -221 200 -417 68 -26 -256 -74 50
5361E0l76M87L74m12M22n48k48K64K24n37R92n92l35Q51m30p62N89j43m37Q15
5381B48j26q39Q55L9j48k38J62l23M67j34K44L70n19K16k76J3Q1k2m81J13N00
5402B02l31K64k29K00j17J63m64K26o2J02j10K81n17K47K34k85J17N70p97P51
5422D45n84k66Q07l89l13M61L3p32J204k55r18L20R8q7K37k60k4M11l93l5M94
5443B54l02k51L83J35m80K17J42j97Q47r70J31L68l99n2K79j04Q1N3k2L74p80
5464b93K06J09j43nL84j74n49L96K55n16O28r3l21M20J03l00k55j27J57K05Q9
5485A76j2k92k22Q6L46K16r19N84M41m55K27l56k31P92j33o43M96N2K7k00K34
5506B14n46L09j07J51J87m2j24m7N72k46k63m45P56l54m90L46m1l95R81k82l21
$$ plain form
5361 50 -326 161 535 123 545 -3 -251 13 237 -300 692 100 -235 616 186 -576 13 -130 -567 248
5381 248 122 -717 138 177 29 -209 -47 -370 97 -37 207 577 58 274 -2 11 92 70 -411 -298 202
5402 202 -129 135 -94 106 -11 152 -312 -86 -148 -46 -156 125 -392 -145 89 -196 -79 491 -306 445
5422 445 -139 -405 402 13 -300 161 194 -538 666 411 -507 -187 -89 -176 61 -199 -223 188 -205 -240 254
5443 254 -48 -299 84 219 -261 -44 98 -99 748 -222 -91 277 -122 -174 105 1 82 135 113 487 -293
5464 -293 -87 22 -121 -126 258 84 -465 -69 186 -330 298 205 -116 304 407 107 -148 -275 -118 87 176
5485 176 164 -128 -350 -264 82 298 -621 -37 404 -51 176 -180 -411 381 248 -395 101 153 180 -20 214
5506 214 -332 -23 -130 21 208 166 42 -5 567 321 58 -387 369 15 -475 -129 -170 -565 416 134 -187
5527a87J30O49o91l7kJ4L89j0K4j5l32J51K72q18J23N55o48K46K19k63j7J45j48
5550b51K99L98n52J31N72j076L60M74n24k07N47l40L90K73q18M36K2l50j17K43
5570i0k42M07M15n76J58k16K31J85Q6l98L66j06q55R16n01k53L78J0L27k38N2
5591E6k83J7J17K07K75q59M38M31o30M73r4j50K42j28k30n3J82k86n3O48m07J71
5613H4L15j121L62K26l9P2J12p11J070k36k22K26O4q06O24J48l46K36k31l66O28
5634H9L22q14Q23j93n72M23J3j09K45q8l97L06j17J04J95p91P09L30m41J9O7Q1
5656B04m64N09o14J69J84J73k50K38k95R2N39q04LK72k46M37p9o40K85N94n46
5677b39K33L23p01O08n63M14J37l66l77O97Pl74L17P6k17M00m68K5N62o41L20
$$ plain form
5527 -187 -57 592 -99 -136 -138 -124 265 255 279 264 -68 83 355 -463 -340 215 -433 -187 32 -231 -248 -103 -251
5550 -251 48 446 -106 25 597 -479 -119 355 -169 -376 171 -169 221 494 -324 112 134 -216 -333 -90
5570 -90 -332 75 490 -86 72 -144 87 272 358 -40 326 220 -635 281 -220 -473 -95 -85 242 4 56
5591 56 -227 -210 -93 114 389 -470 -32 399 -231 242 148 -2 240 112 -118 -171 11 -275 -328 320 -87 84
5613 84 399 -722 -360 -134 -173 -101 11 -700 370 134 -88 138 202 -604 20 168 -178 58 -173 -539 89
5634 89 411 -403 420 227 -345 78 91 -18 227 139 -258 48 -69 35 230 -561 148 478 37 56 123 204
5656 204 -260 249 -365 -196 -12 161 -89 149 -146 -54 485 -319 -316 -44 -290 147 68 -572 -287 307 -239
5677 -239 -6 317 -384 224 -339 75 212 -154 -531 166 173 -201 116 192 -25 375 -93 -68 494 -147 173
5698A73k69j5m44L79j9n6J11j74J1Q05p29N00m75j5M17%l80L13Ol15J88K80k16
5721G6n8k78LN77o12pR64o35K28n23l98K48J82r7K66j04K00j51j37M61j17O78
5743G66o26j45P21r23r3O91K7n91M82l37k93M80kl10O57m39l70J04j3J45K31m17
5765b55L52J62k20L6n23K85K20K20j78k61O79q50J099p14o68M30j11O08k74k37
5785b00K85M60k08l90L31l77k5N85n17k12L20k46L10M04k18m88R2K67j73J30j34
5806dq7O79j044N04or2k40K43J91l31N27m70J10K05l48K30K84q85O72M74q38J26
5828a00L9j69M57J10l42p5P0P6j02l3J63r6L38q81O15R4l25M20m26m12O57L57
5850D35m68L24j106Q90K4n10O73j40N6m13J66j46P49l4r46Q11J82r04N98k85l19
$$ plain form
5698 173 -96 -111 -555 -176 -195 -251 -140 -314 -303 502 -227 273 -202 -217 200 200 -180 133 139 -176 12 292 76
5721 76 18 -260 -257 320 -292 -299 665 30 258 -265 -663 -415 -233 -330 -64 -168 32 -119 -256 205 88 766
5743 766 140 -5 716 -207 -300 391 418 -173 309 -28 -321 159 157 -153 504 65 -305 -201 -214 -69 162 -255
5765 -255 97 259 39 75 -448 -163 57 277 99 -162 517 -333 766 52 -616 -186 -297 311 37 -200
5785 -200 85 545 337 -53 278 -99 -124 461 -56 -268 52 -194 116 520 302 -186 -94 173 0 130 -4
5806 -4 -91 588 -456 48 42 -50 -290 -47 144 -187 340 -130 -20 185 -163 67 351 -534 138 612 -226 -100
5828 -100 -61 -230 227 337 -5 -80 -10 66 -36 -69 94 -2 336 -545 70 164 -161 259 -167 -579 78 435
5850 435 -33 291 -815 75 99 -411 262 122 178 -235 -69 -215 534 500 -446 365 547 -357 241 -44 -363
5871c63Q47k07o72N71K34n17M12n65K01l0Ql83N9M54R1K75k01j97L0l26K64K36
5893B21k53k80L78m03J78L27l08k33N16r9L18m67J18m00M25Q6k06N46o74K92L9
5914A21m04P84n65k1N9J3O7N8J54m40K98M46n92K69o07K2L96k68l9L17M67q71
5936c36P9M7M20k50k2k23N19n68K22M41n35P40l30p5l23N57l72k13K07K10m21
5957b26N70j62k37L86l74O85m3l08o68N69o60N37k32k20k9Q42o52M2j61j19J101
5978F41n56j89k06M31n29O03M68q58L86k42j90M07p43K97P94q28K14J93k16l25
5998d48O56m18L39j9j7j79N17n60m31P40LQ0m9p5j41L03m10l3o2J31M92n32j25
6021b38L19N43j088K44N82k41K04l35J92m26K47l12N78l09J73J36l24j66K75k62
$$ plain form
5871 -363 484 277 -395 176 410 -107 305 -260 -59 -89 -81 -464 -405 49 140 415 214 17 47 -279 -15 221
5893 221 -32 -312 66 -337 -159 168 -140 -373 143 44 362 -105 13 -387 38 124 -82 464 -210 82 121
5914 121 -283 501 -64 -85 -26 -13 54 112 266 -174 124 570 -22 247 -360 -338 58 -210 -249 68 535 -336
5936 -336 -257 -210 210 -40 -62 -285 234 -334 -112 329 -206 534 204 129 -194 363 -9 -222 -15 195 -226
5957 -226 344 182 -55 331 -43 642 599 291 -377 192 -468 69 -163 -383 -412 430 -222 -180 -341 -460 641
5978 641 85 -104 -310 121 -408 195 663 -195 191 -51 -241 166 -577 -280 514 -314 -100 93 -123 -448
5998 -448 208 -210 129 110 93 -86 431 -129 -560 180 183 263 214 139 -2 301 -109 -142 -204 -73 419 -113 -238
6021 -238 81 624 -464 -220 362 121 325 -10 182 -244 3 -309 269 -40 133 269 -55 -221 54 -208
6041b08j43K07K32j72K92r1K71k71o6j20K12l46l11O69l74J24K93J93q11Q50K21
6062F51k67q17L24J22M3k44J96j96L7m8L6L68M4m26k11K93J27l8J82J52o38N57
6084B47o91R8O26k98J48n11L31L25N6p34J16P72q35M70m5j4l2K77q6j08q9N6j9
6107F0M88p27J06K74n52Q51m21o1j11J96j80J53M94m09M56n65l0k30N2P3N6m0
6129f7p0K00O4l19J85K31l97O20n48m59Q09n45J26K89j61r6J81l24l9M09m58M84
6151A15j11n7j04J15K19l89R39o74J31n15k50J41O33k66N7K10m82P6o1K93J85
6172B05r2l02K77l21L30N5l75K10O8M98l42L3l75j97P42p60L89N37l69o56N52
6193A07k71M13j02k61n86R90k26L2M6l48j46O79o18O31q0k62l37J094j205K67
$$ plain form
6041 -208 -351 -144 88 -84 208 117 388 117 51 -69 143 -203 -514 155 -219 -95 198 391 -420 430 651
6062 651 384 -433 -109 13 56 -188 8 -188 -151 -199 -163 205 249 -177 -388 -95 32 -6 176 328 -310 247
6084 247 -444 -346 280 -18 130 -381 -50 275 331 -403 -287 485 -350 120 75 61 29 306 220 112 23 79 60
6107 60 548 -179 -73 201 -351 500 79 18 -93 103 -77 76 570 161 617 52 22 -208 -156 -83 -27 -67
6129 -67 -137 63 127 -192 -7 224 -173 447 -101 -560 249 -296 -170 119 -42 -138 43 -281 -320 89 -369 115
6151 115 4 -53 -157 -42 177 -212 727 53 184 -331 -581 -440 193 -73 -16 194 -288 -212 -273 20 205
6172 205 113 -189 88 -233 97 152 -223 -13 55 553 211 244 -131 -328 414 -346 43 580 211 -445 107
6193 107 -164 249 147 -114 -700 290 64 96 142 -206 -352 327 -291 340 260 -2 -339 755 -450 -183
6213a83L38o84P58m22K57k30M36n20P30k21p43J43j2p9L59J90m46N57j07j69r
6234e7J86R0j21p0k68Q38o97j03O12n22j89m6L68m34N29o1j71J56k35m7N35n02
6256b09J45o8O4K38j80L6J11j24J46j90K75o16M29L1k10J98L05q54L60N28l64
6277E1L34m61k80L01k9k41M80M7lK44l59j63M78m9n00K50J42l50k94L76k64O98
6299D08k89R8o2l49l9P99p82R3K60o21M46L14m31j42M21k12q0N87p26Q02l76%
6321A19k49L20k64J67l12M86J09m20q1K27q7j40L98n3P1m99K98l71K41J64o5N13
6343E72o50K7J66l78l07N05k5L94j88m14K33N9K87p2j53l38L02j26j24J34O32
6364E36r87K31M35m69Q67q66J27N38m19l37J03K60K34J48m69K13l50J00m47N4
$$ plain form
6213 -183 155 -529 229 -193 64 -166 270 -250 480 259 -484 -341 -353 -432 -73 117 -329 228 121 -48 -57
6234 -57 129 219 98 28 -240 598 -99 -202 410 -112 -301 -347 21 -413 116 55 -116 40 -195 -242 293 -209
6256 -209 -64 -132 -68 170 -10 26 137 13 159 -31 244 -372 57 88 -122 76 381 -473 -113 415 51
6277 51 385 -76 -356 -55 -84 -325 155 202 199 443 84 -79 399 350 -150 100 242 -108 -402 -26 -290 408
6299 408 119 217 155 -194 -233 566 -216 -123 137 -484 -38 276 -155 -297 124 -88 -168 419 -307 495 119 119
6321 119 -130 190 -74 93 -219 267 376 -44 -125 102 15 -125 273 220 291 -208 90 -281 -40 124 59 572
6343 572 -78 -51 115 -263 -570 -65 -90 304 116 -298 -65 -6 281 209 56 -282 20 -106 -230 -96 536
6364 536 -451 -220 215 -254 613 -253 -126 412 -7 -344 -241 19 253 401 -68 145 -205 -105 -552 -498
6384d98O33l42M76k73q06P06R4k21M02m98l05P18M5l06P02l22j33N30p52J44L75
6405C69q84K09P20n95J19J77K08k79R5n93P57l84Pk9M96l91j67M70o78M25M97
6426E49q01K58l58J17L57l8J46o16K22j23O2O0k9N70j22j85O17o44K79k83n57
6447e19R26k89Ql10L73l63J79Pl4P9n2k25K99K27r6m76K05N50p34N1J82p8J76
6470H6J15j04K67n48L16j62m19M06kJ15k89Q7J71K63m95P5M1M3J10O3o84M35j78
6493b88k18M60L7M24o87K15m8n6N83j078N63p1k68M84q5k0j92N49j032J027q1
6514B18l75J24L5j35L86k77k65K82r9j22N45n94l77J499r87J28J62k88o1R10n70
6535A39J8J9l01k84O76l27J09K01n27K20J28o4J72k55k25N95j06n09M51j79m6
$$ plain form
6384 -498 135 -207 269 -4 -810 -104 -10 -231 171 -327 -632 86 131 -175 527 205 72 602 -150 -6 369
6405 369 -515 -306 414 -181 -62 115 323 44 139 -454 303 -81 -74 -103 393 2 -165 305 -373 52 549
6426 549 -252 6 -352 -235 122 84 230 -386 -164 -287 -225 -165 -194 376 254 69 686 42 321 38 -519
6447 -519 407 118 126 -184 189 -174 5 12 -22 57 5 -220 79 306 210 -266 -61 489 -245 -194 -12 -90 86
6470 86 201 97 364 -184 132 -30 -449 -43 -45 70 -219 -132 39 302 -193 -118 -77 -34 76 139 -545 -110 -288
6493 -288 -506 -46 -9 415 -272 -57 -105 -161 422 -656 -93 -164 -432 52 -33 -53 -245 304 -728 299 218
6514 218 -157 -33 2 -133 253 -24 -289 -7 -106 -228 317 -277 -654 845 -142 -14 148 -140 -201 709 139
6535 139 157 176 -125 -409 267 -60 49 250 -277 -57 71 7 179 -76 -301 294 188 -321 130 -49 -95
6556i5J85K47k63j88L06l00N11P6o74K99j22m58O34k12l17N01P5l15L07j13M0
6577A24J00l90n6J67M11o21K85p3K8J84l93q1O83q61k3M85l09K61J59k21l2N07
6599C34l41k89l1N08k66P00m73l27k7p9L7L45L40m74qK93J43l75Q2R8R9l69N4
6622b6K87j76k90K45l3k46j65O8L10L1p0j3l60N50K47n38J24O09p08M50k36o7
6644gr28P83n5k62L12J2J85J51j016J383r91J90N50j33o61N03Q2m0J48m03K56
6665E9l04L62K65j59k54P7Kj87k6K1M81n78P1L25o7L85o47j4M73l30N3j11K48
6688A45P4l56N6j14L65m31J83L57j03q8J29q16L10O44m39j62M48n40j55J29J40
6709b24L20M8o20L76P5l77L93l5o4j51M66l40K99k00l10K89K80j88K48m88J25
$$ plain form
6556 -95 90 337 74 -114 192 -108 403 479 -195 104 -18 -476 158 -54 -371 130 205 -110 197 84 124
6577 124 224 -166 -222 -55 356 -265 20 -53 -25 159 -234 -315 368 -493 -516 -31 -340 -79 80 -141 -173 334
6599 334 -7 -296 -327 181 -85 615 142 -185 -212 -291 -254 91 431 -43 -51 242 385 10 92 190 289 -80 -26
6622 -26 261 85 -205 40 7 -239 -404 -336 -26 5 -65 -78 -438 112 359 -179 -55 554 -154 296 60 -7
6644 -7 -935 -152 -207 -469 -157 -145 40 191 -825 558 -433 -243 307 174 -487 16 98 58 206 -197 59
6665 59 -245 117 382 223 -31 46 48 -139 -165 -144 337 -241 -170 155 88 473 -174 -188 285 -45 8 -103 145
6688 145 219 -137 -81 -195 170 -261 -78 279 176 88 217 -599 -289 355 -84 -246 202 -338 -493 -364 -224
6709 -224 96 144 -476 -100 -25 -402 -9 -44 -108 -259 207 -133 166 -34 -344 -55 225 37 285 -203 -78
6730g8L38l59L7j48J98o7O39k92o28P32m35j01K75k5l93N77q22P27n3l27N64j2
6752C47m56K8J32K39l38k57K58j30K16m38k8P12l52K20K01q42M83N35p75J43L68
6773B66l07K36L4k69k70J23L03J03k33P9L03q58K65K98M32r65N46K63o18J82o4
6794a51K13M3k90k16Q56o73L59L50m75l70O67l25n19L51k37N81n9n59P7R10j023
6815d90J102q29J62L89l7o59N86K95q28O22l81m65L11L36n08R03n10j66M67n11
6835b11k94P81n14L64K58l65p81J018m0n40O01l1J56P1p66L4N05k03k8J85p76
6856e76N02K33r22Q36M0k11K84Q6o45P45o70j24L54j5J28L84k72n75O4N27J27
6877C00n03J49k87J61L16l82K25j04j54P10p63L17j04M67j89O2m60J86P14p87
$$ plain form
6730 -78 260 -99 -62 -210 -12 -79 560 268 -360 372 -63 -164 111 86 -307 270 -552 175 122 -205 359 347
6752 347 -109 -81 51 290 -48 -305 -47 -177 39 -399 -427 285 -67 153 354 -488 -5 530 -245 -102 266
6773 266 -41 195 229 -40 -310 -187 116 219 -14 65 368 -490 -225 73 505 -460 86 349 -269 -87 -151
6794 -151 62 105 -185 -401 455 -218 141 491 16 -354 313 -12 -531 -180 -417 164 105 -454 -377 533 -490
6815 -490 612 -217 -55 334 297 -362 224 519 -309 313 -68 -533 -222 114 -394 509 -1 -167 300 -211
6835 -211 -505 276 -238 126 384 19 -762 256 216 -324 277 246 402 473 -293 -259 246 43 15 200 -576
6856 -576 -74 159 -763 73 113 -98 186 272 -373 372 -298 -422 -68 -83 45 429 157 -418 -354 173 300
6877 300 -203 -54 -341 -180 136 -246 -21 -125 -279 431 -332 -15 -119 348 159 221 -239 -53 661 -126
6897a26K39O9r5l16J85k44k5L47l40MN28r44O74M90k51j29K21l30N18j46n80j0
6919b61P78n60n5J86RJ93j77l50J56j36J96K37o05K67J48K50r01P78n43J93N40
6940C43l85l02M75l47K66J00l71R4J27J81n86K13L43j98j16K22k22J9m5L06j55
6961c8m66N99K52o50L02M82k44n3R8m57M48J86q89J075m08j94O79r14p8L26J06
6982A62j82L65k78J86l02ll04J43K37jj79L65m15O93o08n03J041p15J46K08l19
7003b63K74J90o0k7K22n89L71K22m44k41N13n04N72K31m87j29J50j13O68o81n04
7024f29J085m63m22M91j30m8N91k80j90j25P01o65L26Ql52J11n08P43l8K4k73
7045d3J63m07J6L99k08J06J94p17N28K34n39L2K09j5j06J88j13P5K64l39p6J62
$$ plain form
6897 -126 113 182 87 -229 -44 -288 -313 34 -306 -302 226 -718 -44 446 195 66 287 -43 475 329 -251 -261
6919 -261 517 -43 -98 88 97 290 113 -237 -81 -217 -21 216 -389 -122 26 276 -625 153 -390 -197 343
6940 343 -42 -344 131 -216 50 150 -221 -127 0 181 -405 -192 151 -47 -163 59 -163 -144 -189 117 -38
6961 -38 -504 95 347 -303 -1 481 237 184 282 -175 273 459 -430 645 237 43 722 -192 -270 56 162
6982 162 -20 345 67 253 -49 -52 -356 -213 24 23 -156 209 -206 487 -121 -624 417 -298 -152 56 -263
7003 -263 11 201 141 114 336 -253 118 340 -104 -345 168 -336 236 467 -20 -149 1 -112 556 -125 -629
7024 -629 456 -7 -429 62 -68 -116 475 195 5 -120 581 -84 242 250 -102 9 -499 244 206 230 -43
7045 -43 120 -287 -271 128 -80 26 220 -497 31 265 -274 -242 -33 -48 -154 34 -79 -4 260 -79 -155 7
7067Gj25L46q6o52J025n22j19O78p14J84J41j96K2O95r15Q6N83p25P7O22m29m4
7089f1K00l23N0M48j56k22M34l20j10J77q4J95L50j039J64L05P2k70O04m58%L71
7111C27l11J74L80j217R9L89l26L35L11l31J41m9r6M01p9l00M56Q7m79P34m28
7132B18k62L9J41j82L17j17r2j81L95o60O44p31k82J388j464N71K66K44m33L50
7152A69l84j8L49m12K46K58k45l20L0K03P8L15l84n8N64l06L86j89m03L90k02
7173F7oJ79J87r47O67k82m23J099m00l10JK96k40O12m87m81R39p97r5L95j05k8
7195a59p9n9Oj17M14n0L84j60m00R93j818Q78M15l33r7M2M32m73M8J46m1M27p62
7218c63K81j56k96P66k17J80J23k38l50N35l5m76M93l15m29P55o15k01J057o98
$$ plain form
7067 7 -118 228 142 -510 515 -7 -126 552 -162 22 163 -33 -11 684 -231 -145 438 -287 -210 412 -17 -61
7089 -61 139 -184 -134 314 158 -64 370 50 -60 117 33 228 578 -461 -297 8 80 -190 414 -44 -44 327
7111 327 16 190 570 -647 -548 -159 -485 -150 161 -170 -29 -78 -174 227 148 -152 304 391 -88 646 218
7132 218 -44 -5 136 -46 271 154 62 -119 276 -384 260 -471 -753 635 -829 -258 8 252 -181 169
7152 169 -215 -233 116 -296 -50 208 -37 -357 -327 -124 -46 269 -115 -173 391 85 471 282 -121 269 67
7173 67 61 240 427 -520 147 -135 -558 541 141 -169 -168 128 -112 500 13 -468 471 -326 -421 -26 -131 -159
7195 -159 -238 -297 -291 -408 6 -44 340 180 -220 773 -1045 -167 248 -85 -182 -140 292 -181 -133 13 -28 399 -363
7218 -363 -82 -238 -534 232 15 195 318 80 -270 265 230 -246 247 -68 -497 258 -357 -558 499 -199
7238a99n10J203o67K72L99m89j44L84l60J16J85o81K36O29o97J49J91pj11K49
7258A48n82N97M25q93K56M99o75M90k78J74j09m19O2K1K4O0P70o03j1O9J5K88
7280C28j62m11K92M32p15k4M84n91pN49P1j09j73m08K12N44o34k05J076m91J41
7301A99k81m19K76M13k09j98k42l01J046J00l26l88M85j46m29O41k95j7N32o11
7321a70M4Q4l08O52k23o5L24m87M9O2K98o55M31j7K1M76o24k55P36m17n4J99m2
7344E9K19n65p8M18N36r57j65P58m33J0P40o00J84J6l00k07O91r78L68P70n48
7365f2k57P32m56J70j77l33Q12p28M78L97n65l59O38j21j98J0K39k64m0j14M7
7386a51N35n90l74M54j31k08L84K52m25N68m66r4N59L60n31J77j22k34N78m13
$$ plain form
7238 -199 -709 494 -173 99 498 9 -135 249 -111 5 190 -491 -255 374 -323 -174 17 10 -101 148
7258 148 -434 163 588 -305 -49 450 -225 265 -13 161 52 -367 -305 -284 -260 -200 570 -33 -44 25 40 328
7280 328 166 -245 47 479 -236 -260 224 -367 -374 175 246 137 -36 -444 -232 312 -322 -527 549 58 199
7301 199 -82 -501 -225 188 -21 -219 -461 -762 284 384 58 -330 155 9 -420 221 -74 -91 441 -170
7321 -170 -126 -42 -350 302 79 14 338 -149 -100 -38 260 -395 36 19 40 516 -108 -363 373 -44 -98 101 59
7344 59 278 -287 -365 53 589 -368 -533 225 -208 -198 542 -58 126 142 -158 -365 326 -652 -284 486 -62
7365 -62 -319 413 -43 127 -50 -383 429 -299 179 576 11 -348 290 169 -29 -19 220 -44 -84 -198 -151
7386 -151 384 -206 -580 -126 -257 -465 -81 171 -254 314 -152 -246 313 673 142 319 197 -37 541 128
7406A28l91N30l62K09K8k51J71l55L42k50J25k35N50q0n15N63k4k58K48J41l19
7427el61M94n26R30m41j77M2M63p69J56N7J16K78j20l04L23J05m36L77k81L33
7448B54J19k5m33J56k83K83PJ3L10j83o15N05J16n79J79K90l46L83j73j74K81
7469H5m6n78P99n08n42R69L7p44M01J80J83N3n11L50L59m14j75J75j04J35Rq1
7491C2K2R4P9l93M01k89K6L66n67L51J41m26J10J16j44m23R34o30L51o8l96N04
7513A91J90j034O68K19Kk34r9n7P34m34l09P42q58N25j7j15m06M64k15j82J045
7534H20q70m9j38L69l70L54n01J83N68l71n38N30j67J22L22k70n30Q63r38R26
7554C15q1m23l45N13R1k76p0K86m67N19L95m45M4j21J97k65L15l62O04q73Q29
$$ plain form
7406 128 -263 267 -95 114 142 -109 62 -293 49 -201 -76 -311 239 159 -356 207 183 -75 173 314 -5
7427 -5 -366 128 -398 532 91 -86 -44 419 -350 -194 -137 -21 257 137 -167 156 261 -175 202 -79 254
7448 254 373 348 -85 71 -212 71 78 91 401 218 -397 108 224 -355 -176 114 -232 151 -22 -196 85
7469 85 39 -539 260 -248 -790 179 216 -528 -127 53 236 289 -222 128 487 73 -102 73 -31 104 113 32
7491 32 54 148 227 -166 235 -54 -28 338 -229 122 263 -163 -53 63 -81 -504 430 -200 151 83 -313 191
7513 191 381 -653 15 234 236 2 -97 -154 580 146 -163 579 -279 246 229 114 -292 172 -43 -225 820
7534 820 -50 -99 -237 132 -238 116 -385 -202 366 -5 -543 -13 -180 -58 264 -6 -536 327 -611 315
7554 315 234 -189 -534 -21 70 -206 -276 10 -457 62 457 12 56 -65 132 -133 182 -180 424 -449 380
7575C80j45l84P39p11L3K57k43r5O24m03k77M41q6l79Q12q42j36M41n02M44l8
7596g0K66o62O29o5p16P37j06p2L37l97K26m03k4J19M88l49k3J2O0j02N16l39
7618F2nJ61p05N37Q4j49M44l96K44j07j89k72L27j76L88m59M45l90K42K42n80
7639b52O75k11n34M20L05o01O70r15K50M30k8k78P31o22p0J16p04P89K18o24l50
7660e85Q78k13K6j60p9M01J75j47J14P2m65j60J29m3o4j24J53J61j09l28O49l50
7682f9j65L84K03p89M40M82o57k43K80K62L23l56l85Q38r03K80M61n73n6P34q52
7703c61L68L17p11k86R90p0p96P09m48K66M38q70J10P76r7k59K46q34P13J07p85
7724d77N49O25q58J51K12l93L13K6q4J13m92j92Q71Pj48l61K09RL24m29k37L60
$$ plain form
7575 380 235 -149 590 -121 -88 169 -74 -169 455 52 -225 216 130 -249 563 -279 -415 26 -476 -32 -70
7596 -70 196 -466 163 98 -618 119 13 -59 278 -119 107 -296 -320 -201 287 -62 -85 -73 -13 -115 401 62
7618 62 57 218 -487 50 134 -15 429 33 277 170 -19 -291 36 -140 248 -211 234 -156 86 328 -252
7639 -252 423 212 -322 98 403 -198 472 -443 -193 237 209 -69 662 40 -30 86 -618 171 389 -235 -585
7660 -585 293 80 106 -54 -133 268 443 296 410 482 17 -143 -14 -57 -121 -245 -92 69 -40 -368 281 -69
7682 -69 -234 150 353 -436 4 486 -171 -414 -134 128 451 95 -290 548 -355 -75 386 -187 -243 491 -361
7703 -361 7 324 -387 -673 317 247 -549 160 -288 -22 416 -454 -344 432 335 76 322 -512 201 308 -477
7724 -477 72 697 -161 -10 202 -191 122 148 64 177 -315 -507 364 371 223 -138 71 80 404 -25 -262 98
7746I8K0k43Q38m42p03N19l52O88k08k06l29l96J311m58n6r3r8J59l27K31j62
7767b09K36J84o18L65L34n15rR3n3j68L29j11K7j69Q19r68O53l68k20M50p5l6
7789b9J75l70j31Q82o80M2l1o8J29Mj0J76J26k82m6K82m46L5K49j16n6K43K2j25
7813b5N93n87M63j68o80P82J20l98l24L42k45M53k15m93O94p96N89j2k6n6k15
7834b04M95m04J20m17M46O23p03N9M05m93L80k33N5k48K92k69l9N78l44k32L85
7855B52l83K24K27l62M0L66q63M96k25j13O41m42k45M14J82l14J99j96m8K36K14
7876C00m75j95j28K84N48k73j39L37K0m01M25n03K77j8k57j46K38K60l72O41q52
7897d29J7R55o60N2l63j2J82M88n13L74p5o05M72nj37O89l7m99M02m12K5L48k14
$$ plain form
7746 98 118 -125 713 271 -432 87 -265 423 215 9 -320 -716 595 137 81 -12 -110 49 -278 -47 -209
7767 -209 27 211 -407 -42 292 -223 -232 -139 -192 -360 -31 -142 -115 -284 535 -433 220 -148 -368 82 7 -29
7789 -29 146 -224 -355 527 -153 -111 -142 -210 -81 -77 -87 89 215 -67 -113 169 -277 -242 7 -109 -165 78 100 -25
7813 -25 568 -19 444 276 -404 378 498 100 -224 118 -127 326 111 -382 312 -484 105 93 67 11 -204
7834 -204 291 -113 7 -410 36 659 -44 15 420 -73 307 74 129 -119 173 -96 -135 443 99 -133 252
7855 252 -131 93 320 -42 -2 364 -499 -3 -228 -341 300 -142 -387 27 209 -105 94 -102 -150 86 300
7876 300 -175 -370 -498 -214 334 61 -78 259 279 -122 303 -200 77 59 -198 -344 -106 154 -218 423 -429
7897 -429 -412 543 -117 -65 -428 -440 -258 230 -283 91 16 -589 -117 -122 -259 430 393 -106 296 -116 -91 257 43
7920D3m59L33M72n30N21n31K70K50k54m94N73k70n05J098o60J49P56o10m06M61
7940B07j73r0M79m25m10J064j160L52R7J61k21L44m07R6K46k89kP12j170L67M49
7961B27j03P0L21j194Q38L25q71L43N16o32M12P6l78J77l76K23k52J28l4L19k80
7982a45q9N21K45p94N36p24K09J38m70O24P3o5k82M21l19J83Q81j267M08J75j57
8003A02j62K61M7j88R8p56N92J17j7OQ6m15J35L76n09K69M23q71M55J38q28P30
8025H9p8J86L4p02N46J28n04l61Q66p86R09m03N38r07M99J14l36K92J37m48L57
8046A70l23L21M3k73m0P23n64n23O23j81K9L13m44J70j36o60Q78km2N7J44l07
8068b4M0q0M1J41K17j038J168l04o45O59J2p78N18j01K70k35O7k3O3O9mO5j90
$$ plain form
7920 43 -416 -83 389 -141 380 -151 119 369 115 -379 194 -76 -581 517 -143 6 762 152 -254 207
7940 207 34 -56 423 -2 -412 652 -508 -156 -59 102 -119 225 -182 -86 160 -129 -131 581 -589 -222 227
7961 227 124 194 515 -679 159 484 -387 -44 472 -160 252 328 -50 127 -249 -26 -278 -150 -184 135 -145
7982 -145 -234 287 532 -262 274 -450 -241 -103 -573 51 124 59 -223 198 -121 62 943 -324 84 259 102
8003 102 -60 201 248 60 158 -598 -6 111 94 100 186 -229 -94 282 -227 42 465 -406 49 187 -641 89
8025 89 11 197 231 -471 75 203 -301 -662 204 -582 327 -76 462 -445 54 168 -168 124 261 -187 170
8046 170 -153 168 211 -62 -102 621 57 -466 157 -24 5 318 -126 44 -92 -752 126 124 82 139 283 -24
8068 -24 16 -64 -23 118 335 -703 465 161 -484 175 187 -591 -73 -174 96 -139 -72 -95 -32 37 33 98 -92
8091i2N7M66l45n62P18l18k29L30K0p2M69m05m73M12K0Q2K03j22k33J49l25L38
8113H8P2n82O41m6n15N68m4l95L39L1m15L57L8J24j74K67l90PN41p17L62r4j14
8136e1J40k13l69M65jj2N80n15J52L56o22L97j29L8k12J27l07N83q6%q17J037
8158E41q39O1O31n15J0N14r30Q38L93r66K24L1K25j50J63R5l86J14p22M05L12
8179D9n72P16j27k44K90j76m74M27k06j29K93K33J43K42k49j43q2l54m1O45l59
8200a18j71J56r1k05K74k10J72K19k84L82L10j20p6R4p06L64K95l64K53N1p30
8221e05N71J78m73N03n90qQ09r3j92k58J52k87M66k23m03L06M1j25J10m5k72N96
8243B58N2m45L86K02M9l89o25K18M23m44J97N84p33L8O4k45L58J76j91K8O9m5
$$ plain form
8091 -92 -35 431 86 -476 242 -76 -305 25 45 -27 442 37 -436 -24 -4 78 281 159 -74 75 -250 88
8113 88 160 -422 219 173 -342 226 182 -213 126 157 -258 99 137 261 87 354 -36 -29 512 -205 157 63 -51
8136 -51 89 -124 -493 -28 -29 -41 539 24 176 532 -90 307 178 216 4 131 -176 407 321 321 -496 541
8158 541 -298 -237 394 -121 -111 403 -527 311 704 -262 -38 -7 218 68 231 326 -60 54 -668 -263 49
8179 49 -523 193 66 -178 112 -64 -538 -111 -317 -446 -153 80 223 465 216 73 -9 -363 -404 241 -118
8200 -118 -289 -133 -224 -429 -155 -365 -193 26 -258 124 434 314 238 332 -374 -10 285 -79 174 225 -505
8221 -505 66 244 -229 274 -316 -324 485 392 200 -58 94 -193 273 50 -353 -47 -6 -131 -21 -66 -338 258
8243 258 310 -135 251 453 502 113 -512 -294 129 -315 -118 466 -267 -229 -165 -410 -52 124 -67 -39 30 -15
8265a5q1J76k09k14M84K65k50L49j127R08m4o55K48O40n25KK3n05P31o27J86J17
8287a23Q6k4N45j48r5r4n10J35O23k59k90M79o20L45K71k94k37J79J9J09L04j43
8309B58n33Q2l93Q40j64n07K56M76r47L61R63r53L93J89o78N12m2m97K70Q3j43
8330a74K51m26K38M10m48L43M15m29r7m3k21J60L07o27J57K87l55K17M61m86L93
8351C33k49n87N12J74o02O20Q2j63NM81o01RK9j89L52K90m90l85N37l98J79k61
8373c22k54Q04L25q73N93l17k01Q22n55n0N5j16k04M09k08l96M70RL02L5m57l4
8395a63M51n07K77J19j62J8L05J77n40K52o4m6k3m59K13N77p62M25m09P8J68M55
8417C80l08l76P20n51k77O99q45O15M8k77J96L06n41M35q4m75J080r25K46K82
$$ plain form
8265 -15 -96 80 -129 -343 141 406 156 505 -622 286 242 -413 -165 475 -50 -48 -25 -530 201 -426 -240 -123
8287 -123 -37 -61 484 336 241 147 -363 -228 395 136 -154 325 -295 50 321 27 -210 -31 -12 97 401 258
8309 258 -275 -193 -586 254 90 -417 -161 315 -632 -271 692 -261 132 321 -357 155 113 -384 -114 -31 -174
8330 -174 77 -349 -111 299 -149 194 609 180 83 40 -181 -21 286 -341 -184 103 -252 -35 426 -60 333
8351 333 84 -503 9 183 -419 201 283 120 125 606 5 14 43 -146 206 496 6 -379 158 -240 -61 -322
8373 -322 -576 228 553 -320 273 -44 -245 577 22 -28 27 -89 -293 116 -92 -488 -18 -9 293 328 -129 -163
8395 -163 288 -219 58 177 15 33 338 515 -25 227 163 117 94 -365 -152 425 -337 88 -321 -243 -75 380
8417 380 72 -304 416 -135 -412 287 -558 57 105 -172 24 330 -211 224 140 -335 745 -180 66 348
8437C48j30l36J84K07m98K89l01J37j6M7J78q0l64J60M55j71J42l16k18M08j99
8458g4L1N0K80k85K96r2j82m15N92m76L8Q67q11L40j37j45M87L7o96L91k57J19
8480d2L80k90m66Q10j0o21L12P1m77P90q7m77N46m59J5jr7L16J74m22m0Q8L7K84
8504C34P5j042L41J72o69R58k78j76K59M24j09K57m70k4k89M36L80o99K02q41
8524g59R75N0l93L99R0m11Q5j83k42K80R3k69K38J2m09L99O1n47J31J29m44M42
8546b73K57n15O48m89N8J95kL00n3n56K62K50j84K10P4p96N25qJ17m07P35o56
8568c08L13K17r41P92K90m96K02m84K14M54Nk80K78k26p18O73L8j69L30k38j7
8589g1O17m12M38n39j24P2K38k64k89N14k19l5N20n84N5K41j58n47N83m82M79
$$ plain form
8437 348 218 -118 66 273 -225 64 -237 -100 -116 -69 109 29 -335 -175 280 109 251 -65 -283 125 -74
8458 -74 -43 7 287 2 298 206 24 -391 201 -275 -237 630 -181 159 22 -123 364 401 -295 96 -161 -42
8480 -42 338 48 -418 392 382 -239 73 144 -333 457 370 -107 439 -20 -5 -6 -103 213 387 -35 -75 13 50 334
8504 334 409 -633 -292 -120 -789 169 -109 -285 -26 398 289 546 76 52 -237 199 579 -120 82 -759
8524 -759 216 266 -127 272 362 -49 36 -147 -389 -109 -16 -285 -47 -35 -444 -45 16 -531 -400 -271 -715 -273
8546 -273 -16 -531 117 -372 -314 -119 -121 179 126 -430 -168 82 -102 108 182 -614 -89 -97 20 -387 348 -308
8568 -308 5 222 -719 73 363 -133 69 -415 -201 253 258 -22 256 30 -688 -15 23 -146 184 -54 -71
8589 -71 546 134 572 33 -91 -19 219 -45 -334 180 -39 -74 446 -138 -83 158 0 -547 36 -446 33
8610C3N72p81L5K1j21J17N90p83L06L35Kn47M13k82K48K17n45K27K3j47j24J09
8632h2J97M52m92o99L62L17k7M55n10m98O84k80m09O57%K32M4k73Mk06K37p25
8654e60Q74k93m93N89Q1l96J81j93L94K33n61p6M82m30k68O16k36L99q1m62N22
8675C22k27j99L56k57j91J43k6P4l64N55j85K5K63n67L81k33j81P87m10m52M31
8696D5j86j71L95J58m39L31j58q8K65j05m89K95M26k12L9m86M37M98p45J94Mj25
8718a17m9J28j99N69r2K38o28J40m00J70K97m2M22l74l02O01n65J74r2m01M21
8739a01k54K78l73P04L40q47N39k23m24K40L8L24N15j229J13J107o52j8M26p30
8759b27L61q7k20Q7K9m63P15J45o32O20m87Q7m8L39j09k71r7L69k56j12O8Q46
$$ plain form
8610 33 605 -176 -141 -120 -241 -124 466 -317 -11 324 326 -221 192 -90 158 375 -170 57 80 -67 -191 -82
8632 -82 115 567 75 -624 -262 55 28 483 -27 -525 159 -121 -530 127 127 359 403 130 134 -72 165 -560
8654 -560 314 21 -472 117 198 -198 -17 -210 184 417 -144 -220 262 -168 -436 180 -56 343 262 -200 322
8675 322 95 -104 252 -5 -196 -53 -79 -5 -369 186 1 26 289 -278 103 -130 -311 476 66 -386 45
8696 45 -141 -312 83 241 -198 133 -25 -113 152 47 -442 -147 279 67 106 -380 57 555 -190 4 8 -117
8718 -117 -166 -38 -237 332 240 478 -150 -10 -410 -240 57 15 437 63 -239 362 -203 -29 -121 -522 -101
8739 -101 -355 -77 -450 254 594 -253 286 63 -361 -121 -83 241 756 -473 -360 747 95 77 503 -227
8759 -227 134 47 -173 -86 -57 -520 195 340 -292 328 -159 -72 -120 219 110 -161 -258 111 -145 -257 -189 657
8781F57q73k91L79M19n35L51j06m4M78m38k01J31m5K51J61m03j04P2L27m77M13
8802A22j34lM77m26k80P37p84J01M75l30J92J0j46k73m4r4O03J53j85r3J95n57
8824b84j59M03p6l7M44m29P17k39m40J73k37K06q9k40l6L63n0k87K59j60M15O4
8846B81m43Q4J79m06K30R6j79j7j41Q4M62L03q78K17K25n56L61M84m59L17k70
8867b6l20N91l94K38K17k4k80K06k17k02Q39r55j80K66P1j79K12K62k78p1K82
8888E8K04k63J72l29J58l72M40k3k70J2j21J53Q9P86j067L67M21o87J00L85n76
8909c63O26m63j88L68q8l9Q0J59l21N51J69q61J25L21k62L09j03j22k12m72P98
8930A2M94m65M4R0n17R2Q16m61m21O10n97K4L32K34l79N01k20l92L88J75q07O27
$$ plain form
8781 657 -216 -507 -128 291 -244 107 1 -43 435 -3 -204 -73 -118 133 294 -109 -213 -141 186 -291 122
8802 122 -12 -15 462 36 -244 493 -291 -190 285 -45 147 157 11 -262 -306 -400 203 356 171 78 273 -284
8824 -284 -443 -40 -116 -153 291 -138 579 340 -100 73 -164 42 -47 -287 -323 40 -10 -297 -38 -198 217 281
8846 281 -162 -78 101 -305 -75 21 -158 -175 -316 -232 230 533 -345 -128 97 -459 -98 386 -73 244 -26
8867 -26 -346 245 -149 89 306 282 2 208 -9 -211 628 -327 -507 -241 -170 -349 -137 125 -153 -224 58
8888 58 262 -1 171 -158 0 -372 68 45 -225 -213 -334 -181 -92 694 -373 -6 415 -272 -172 213 -363
8909 -363 263 -200 -388 -20 -108 -147 -67 92 -229 322 491 -370 -245 76 -186 123 20 -102 -314 -786 12
8930 12 506 41 85 175 -342 -250 566 105 -316 294 -303 -279 53 287 -92 409 189 -203 185 360 -447 180
8952A80l76L5J013j227M29N0l01k33L20j88N06p7k81L18j39l42J09M74l85L84
8972B69k25k70O24r2m48L59k04k42M02K56q25R49r19J48N27n07N81m05j5l36Q99
8993E26j027P2O51k39k01M68q9m5k58J10l36P10j98L73l0p18N27j54l03M5J06
9014a0L77m62K59M8j04l55K19j26O07m93L15J90m66N36m47k34N31k34l57N36k60
9035G0k09L94j47j45K04Q6l95L40q9k98L69l76K1K74k56j19P45n75l5L90l89M6
9057i4K50K16Oj89l17O7K46kk7J80l28o0L55o82O17l03j28N63r5k05J87l66K30
9080A21J29J16n56K40m03m15P77l12l03J173j195N71L38j57l40K33m6n51N46j72
9100b06q8L35l23M75j92J94m77L69k75q7Q6j83J05O86m87o0Q5l92N21k82K59m0
$$ plain form
8952 180 -196 -161 852 -375 54 104 -197 -430 -110 -298 208 131 -150 168 29 -313 -204 270 -115 269
8972 269 44 -226 398 306 -142 217 13 -229 173 429 -396 553 -366 -218 309 -198 383 -22 -37 -373 526
8993 526 -501 -429 222 -17 -218 250 161 116 -142 -32 -368 342 144 517 487 -231 296 142 -161 -116 -10
9014 -10 367 -95 164 212 108 -247 -28 -154 453 -40 275 465 -1 535 88 -146 385 151 -206 330 70
9035 70 -139 255 108 -37 167 253 -142 198 109 -189 180 -196 -175 99 -157 -276 469 -106 -141 249 -140 -94
9057 -94 156 372 378 189 -128 -61 185 183 156 336 8 -52 303 -379 238 -65 -193 370 275 70 257 -109 121
9080 121 250 366 -190 50 -353 -768 9 -303 -606 567 -628 -57 281 124 -216 17 -29 -580 -34 -206
9100 -206 -294 41 -282 193 1 195 -282 87 -188 -275 -189 -372 -267 419 -68 -128 -43 -435 86 -196 63 23
9122B3N40q05N26m17k50K96N52o58L42o9o02O32J45n82J46J39k84M11m1m4K31
9143B31j95K75m09M5j70O50j45o76K73j67L71J17l93J24Q45o64l33O31q64J59
9163b95N75n89M52j68k17N62k12l96M74j13o36N34j65N63k79l42P0J31k9N06k08
9184B18q4l30O29m40K35L02o17M13n49J98k75J55P4p5M04m16K79P2o3k88M17k97
9206c8L74q7p33o5J037p70J8M29p15L26O87p76K21L26l36K08M83p94L66J18o59
9227c80J61K70j11O6M4k88O10l91rP80o99m92P74n24m27J117q51O45M1k48j30
9248d2M28n71M41Km28j93L46j68N97P0r31J85lj32P57n9q84K28Q78o81J78K52
9270B70n95J062p62k27j84M25K47l17M42r55J048o37n4N84l50k07J92k17j50R97
$$ plain form
9122 23 563 -242 284 -133 -383 -87 465 -193 149 80 -522 110 255 -327 -181 -42 -326 85 44 0 231
9143 231 36 311 -98 -53 -223 427 282 -394 -121 -288 83 200 -193 -69 776 112 -221 410 -454 -295
9163 -295 280 -309 143 -25 -242 320 108 -288 186 73 -563 -29 -194 369 90 -252 -182 -51 -80 426 218
9184 218 134 -196 433 -7 228 530 -87 326 -223 -25 -300 -145 -71 -146 258 -158 121 193 130 -158 259 -38
9206 -38 336 249 -484 -549 488 -282 -264 165 -550 -224 463 -313 -92 234 -102 106 589 -205 161 279 -380
9227 -380 -219 51 -60 6 50 -238 372 -19 -28 752 53 -439 335 -189 -616 501 -350 295 336 88 -42
9248 -42 386 -185 256 258 -170 -363 -17 -185 412 482 -449 -264 -267 -399 358 299 -585 -357 521 -160 18 270
9270 270 -325 737 -25 -252 -436 -11 236 -81 361 -594 454 -183 -237 347 -3 -210 -18 -235 -385 612
9290F12p90L74k47J24n43P45k06R2K18q22K76J142j229J66O43n56R0r7l30M05
9310F7P7n73J80L56k72L45J6o14M86J63n40K09N95r36J110n46m89M00K60k39m1
9331A4O7k25K64j25j98L67O4j40K35j38n92M63m44N05K69n28k28N4L14l17O96
9352C77p6m86J17L46j22J48q98J132n67k5j45K95k19J33K63n68L23K8L29l16K95
9373C64q38M77m02J30N40j43j45L43N9n05QN7K09M52o20k10K67m39L27L40k37
9394C4k41j38N13m71M98l92L53J45o64L72J03l24L09K54o54L17J76k02L08k25
9414G1k98L40l0j72L15rl43M53j91k78J4M69m62J0N31n23K50l34p4P68l09q39
9436f41J037l63J18m6J96o44O24J8l65L98n02m57J098oj053N05RJ06J63k3ko9
$$ plain form
9290 612 -178 196 -51 73 -470 275 69 161 379 -443 -167 975 -254 -88 555 -1 89 -8 -338 67
9310 67 144 -429 -249 107 -165 180 196 -418 68 231 -309 -100 495 -441 669 123 -366 34 294 55 14
9331 14 81 -144 120 -5 -203 164 228 88 323 185 -407 56 -388 117 386 -142 -370 -316 -2 -319 377
9352 377 301 -185 -68 278 156 304 -594 538 -29 -54 -199 96 -123 10 273 -295 28 56 385 69 364
9373 364 -474 3 -399 -269 271 128 -17 326 385 -120 -112 -55 154 606 -14 -224 43 -396 -69 271 34
9394 34 -207 -345 168 -303 195 -197 156 301 -363 9 112 -212 97 351 -303 14 190 -12 296 71
9414 71 -227 113 83 -89 226 217 -126 327 136 -142 -128 341 -121 -111 420 -103 147 -187 -261 507 198 -641
9436 -641 396 33 151 105 301 -343 281 299 -66 332 -170 -627 471 465 -588 -83 -74 32 195 172 170 101
9458A01k53J04k1M64p26J66J91J0M0L5n82Q57q38M37J18j08Q8M2j86M0K86j00
9480A65J81r8j59j85o9J86K49p38L76j15M25m46N49j40o83O16k59j34J61K13k24
9501a29L07j64L74o30o5l20P94Jj89J35m61O91M5j47J97l20J4j56J09k30M45j44
9523A57m98J53N34q34O53L6k38Q20m91M6k90j07m1J16n0j76K83k12j31R2n9j3
9545b50L21K8o14Q05l41K43r3k31j80L00OJ61J88l75j36J90J84o31O18m48K90
9566C5j79q7J26j69N61j41P1k96J9M3n09N01L98n62M74J15r52P64k96k57O93m62
9588a10k76O83l67r6N39p12K53M57m74j50%K30L0J50l24J68Q55q66K36R9l08J28
9610A45j3m26R53p36r3M28j08k19N32j93l67J51L11m33nN31o99L40N4p67O46M14
$$ plain form
9458 101 -152 -48 -69 395 -331 -165 26 36 76 111 -471 386 -452 -15 103 -5 83 125 -61 -21 265 165
9480 165 346 248 89 -96 -165 21 270 -468 -92 -207 218 -228 321 181 -502 114 -145 -279 -118 95 -129
9501 -129 178 14 388 -242 -307 -627 167 168 -21 114 -347 344 389 242 439 119 133 -23 86 -144 301 157
9523 157 -341 -188 346 -488 165 201 -37 783 292 338 48 -59 -100 16 -34 -210 73 -139 -270 -178 -237 -250
9545 -250 71 99 -515 290 -51 192 99 -132 -312 -12 -6 155 343 -32 -168 22 206 -425 193 -255 35
9566 35 -144 -231 -105 -274 287 146 217 -79 -60 -17 -526 -25 373 -189 285 400 -552 212 -84 -341 352 -110
9588 -110 -386 297 -70 -166 373 -339 -86 371 -103 -253 -253 -23 7 157 -167 1 856 -10 226 325 17 145
9610 145 132 -294 659 -77 -170 258 150 -69 463 270 -97 54 365 -68 -73 458 -241 99 153 -614 32 446
9632D46n87M23P2m08K41q6o54R68n63j20M10l75P1K8j08m46M91k98M05K18J00
9653B28k29K97j63k94J47n53L37J97J68n8J66m64k16O35j86j39q2K02J08M41n10
9674C2j07l7k0M28l23K3L39m04J43rj02K15j39J38j61M18j95l95L51l92k43L86
9696e4K88j87J20k34l74J310q10j64O0L0K48k16l39L83l5O65l10k54k16K8O3k09
9718b07K93M01r33L3M94j76N79l29n48J065n62o98K14j95O01M24n00J64J35J19
9738C74n66L87k90n77R11k47J77qn09J05L81j4j88J29k97J91M87n05K07j59k96
9759c07L10K78m63L04l76M46J0M55q99M39n0m36P38n67q2N32j71j37q8M40n58
9780a82L92j84J37J21m25o4K09l03R6J39j85J68l4l45K16P46m4p55N80N6m46l0
$$ plain form
9632 446 -141 282 354 -54 187 101 -553 415 -148 -268 142 -233 -162 -134 -242 -688 -197 -495 -90 128 228
9653 228 -1 296 133 -161 -14 -567 -230 -33 135 77 243 -221 -437 198 12 -127 -209 -7 101 542 32
9674 32 -75 -112 -132 296 -27 -4 335 -69 74 65 -37 178 39 177 16 434 239 -156 195 -197 -440 -54
9696 -54 234 47 167 -67 -441 869 59 -105 -45 -15 233 17 -322 61 26 691 381 127 -89 -61 2 -207
9718 -207 86 487 -446 -413 81 -95 484 155 -393 672 110 -588 -374 -569 32 456 -44 120 255 374
9738 374 -192 195 -95 -672 239 -8 169 161 -348 -243 138 124 -64 65 -232 -41 446 -59 148 -11 -307
9759 -307 3 281 -182 122 -254 192 202 657 -242 197 147 -289 449 -118 -200 332 161 24 -64 376 -182
9780 -182 210 26 163 284 -141 -205 4 -299 -203 -64 -249 -81 -115 -460 -244 502 458 -297 283 339 -107 -137
9802a37Jr2J67m13K56N25p77K66N76j012L48M54l69j28N75k85K49j10R2k35K27
9823A78o17Q39p91j65P09r6j60M1j38k05Q89o49K16N85j022N43k78n05N28P01
9843F03j060J42J017q16L95j79j59l92P20k51k43N68n00k38J40K25l03N25o83
9862d89P10j06l21K12q1l10P02K96q28L29n8l18P87l84m1R6L86k87j9q2m89Q27
9884E32n35k99L31l29K23K87k71j57K30K08m97K63o7l31O33l1n35Q39j097M92
9904a11M06n2Plk30l05O08p78o6R65o63K54P81o94J40k97l62O14p1k9j4K0k89
9927a69N0J23k75L1N98p15O48n29j87l3j51O83L07p7m59Q23o97j88J97l34k20
9948e74Q39n83K26%M13m02K09J65n09P99r01K93j00R1J89k65j00L88n4J04n29
$$ plain form
9802 -137 -136 -228 -61 -474 -218 307 -470 -204 372 -640 -292 162 -207 -335 240 -45 204 94 186 -49 178
9823 178 -439 400 -391 -556 153 57 -103 -62 -200 -405 484 -165 51 636 -386 157 -121 -626 -98 603
9843 603 -457 -315 702 -114 281 102 -57 -449 271 20 -223 345 -155 -393 -253 -28 -331 194 -489
9862 -489 221 115 -206 6 -75 -385 317 613 -215 114 56 -262 525 141 100 196 582 295 276 194 -295 532
9884 532 -3 -302 29 -300 -77 210 -61 -218 12 220 -277 -14 -81 -412 221 190 -345 494 -603 -111
9904 -111 295 243 250 247 17 -288 320 -458 -524 441 -222 32 813 119 259 -38 -400 214 143 114 100 120 -169
9927 -169 -119 4 -271 -240 358 -357 291 -238 -425 -458 -609 74 381 304 -155 668 -29 -217 -20 -354 -574
9948 -574 265 -318 -92 -92 321 -81 128 293 -216 583 -318 -25 -125 -34 155 -110 -210 178 124 228 -301
9969c01N55l31k9L28j71j19L64p47M99J97j012Q60Q3k14j43K80ko8j8l99N24m96
9991c60M36q7j44J35k1j41l24J077o22O0L51q2l49M40l87K98j57m65L58L69p80
10012c95j80J000p05M18Jj90J95j3o88L81M31n39N19l98k19K74l46NR05k26r32
10033g02Q50J2j64j2K31k43P44n93k61M27n76K74J96P8l05L22l06q7M36M3k95
10054F9k15K27k2J51m69M83o8o79P3O40m23r7M75m13M59J02l95P21k32n91L71
10075A67k94L47l1l95K25l1m84j31P93L45q44N93j73j19J14n39M4L19K04j24K99
10096B85J52o41L57K79l96K03rl24P45l35n11K52l68N24l02J57j69k30j17N92
10116A44O5o03P33N6m90K91J37p09P49k46m6J00k8p88J82L89m31P91j73l73K06
$$ plain form
9969 -301 254 -77 -106 222 51 -68 296 -451 48 245 -767 93 176 -38 -181 99 97 29 11 -388 136 -360
9991 -360 76 -11 -155 -20 -41 -182 -506 571 -51 9 360 278 -71 369 -18 280 123 -342 16 385 -395
10012 -395 -575 425 -280 138 139 -51 144 131 -557 -176 255 -284 235 -163 -382 -108 -454 -449 456 230 -702
10033 -702 148 160 -4 -16 215 -28 716 123 -138 289 -287 -13 183 261 -44 278 -28 -115 321 364 69
10054 69 -146 81 59 210 -259 224 156 -523 -450 190 -233 -330 145 -268 191 293 -102 619 387 -204 167
10075 167 -127 220 189 -206 19 -12 -496 -627 166 511 -333 260 87 -32 82 -457 -413 -94 110 -14 285
10096 285 437 -204 153 432 36 239 230 -94 651 316 -195 57 -311 213 -89 68 -101 -331 -448 144
10116 144 209 -394 339 395 -95 196 333 -376 373 127 81 181 153 -635 -453 -64 -495 296 123 -250 -44
10137d4r6L6QJ51j58L93k89J20L70j162P18m69K12mL49l05n23J356n22j08L52
10158C85l42K70l79K89n0M6m29R2O65q96o3O38o11L88K40j97k4j11q2M7N06o36
10180b54J96J15k02K15k05KM7M8n66Q80j16l83M41l31R9M19l50l70M43k60L65
10201B33l79k36M27J55m49j08O82l92J49M0k87N4L05M2J42l39q5k61J60k5N01
10222C29p02k16J213m20p22N86O06j191N31l49j6P02l57o2N2j8k97K60K44o45
10242d72O40j43m02M14j34O4k16K70m27K90r8J22R4J52N09J44q72J87K33n33L01
10263A23K36m98L37o9l79J87P2j63L06J2p63Q55K97q79M47k93j09K70J06k43N70
10284D22m36k11R1k45N63L10l90l59K73k69J84K41R7q94J046o96N78R6no18M17
$$ plain form
10137 -44 -140 -104 -96 55 -103 290 1 121 491 -671 47 -422 -210 -214 135 -170 -693 663 141 33 385
10158 385 43 313 -66 223 173 219 -210 -118 547 -349 -412 226 -385 3 243 46 22 -89 -171 -124 382 -254
10180 -254 -58 57 -145 70 -135 -133 -86 -38 -604 276 160 -223 218 -113 -14 405 55 -315 128 -132 233
10201 233 -146 -382 45 200 -249 -357 325 -67 82 122 -165 -111 194 236 378 39 -46 -307 -147 -172 329
10222 329 -373 -589 624 204 -518 68 674 -517 14 -335 -351 351 -6 -68 -16 -34 -331 -71 173 -472
10242 -472 168 25 -377 37 -97 -33 -249 21 -406 -116 -214 -92 2 154 663 807 -65 122 355 -178 123
10263 123 359 -139 198 129 -250 -63 9 -154 152 164 -599 256 553 -326 121 -172 -281 -11 95 -148 422
10284 422 -14 -225 -134 -379 184 494 104 -255 18 -251 -67 174 271 -623 423 -273 305 401 396 -222 195
10305A95j18L1q9L8j52j87K5M69k5l05J84J05N7p7P0o13O40k29n19N81K08n95
10327c06o8L09k51O74j57j58L88n98o4J85O23j210R08l97r4M87m95J41M84l29
10347G2Q1M79p25k00M38n43M66K20o75J09O89l42J88L4j86k86O55p66L36j52j76
10368b84N89J07m73K78k70n32P20L58j0l34l07j49JO69m62L14l26P8L40k64J14
10389A57P1l62K6J30j43J42J66m51R6M59l21K50k40j68L74J08p49K95K25R4K04
10410C63q7n89K09k2M09j34j86M6k83M15n10Q03n47LK48k81J4J99L12n14r6K32
10432Dl18O23l25r87J496p08N1M31j34l30M9O2q5J64J80k10o9k27L0J07q1K02
10454g5O7J64n50L70j27O26m09o00M69P36p40J86Q4k35k6J14J88k98M8m45O91
$$ plain form
10305 195 77 108 19 57 -95 -282 -257 212 187 -118 66 171 228 151 221 -392 248 19 -500 81 289 -306
10327 -306 -374 -65 -316 358 201 43 431 -167 -231 -46 577 -633 275 -122 -216 271 -224 -83 401 72
10347 72 153 632 -93 -293 145 -398 68 288 -387 -278 411 69 257 291 105 -181 474 -292 44 -108 -284
10368 -284 305 412 -61 217 -53 -585 135 493 483 149 -158 -307 -306 363 -99 215 -111 -33 307 43 157
10389 157 228 -134 -108 22 -121 21 187 -264 -168 291 -30 220 -20 -188 186 294 -455 -160 65 159 363
10410 363 276 -313 -104 -126 283 149 -37 9 -274 141 -369 434 -113 -110 138 -143 -129 70 382 -132 -228 4
10432 4 -314 309 -16 -1003 493 -215 -164 267 133 -197 -148 -86 -171 -7 173 -37 -106 -333 -303 -196 -277 -75
10454 -75 -8 156 -394 -24 -151 475 66 -534 -65 671 -69 117 201 -34 -60 54 242 -56 -8 -453 238
10475B38m16K39K62j85j06K27o8k80M00k72m78N44K2q71P93j33l90Q22n07L10
10495A51K61q43M7N47p0j63K32QK8k97k74J56J83k50M8m2L89oM09r9k97J56j66
10518A08P1j90m35N75m98L7M05L4k80M88m48r3N44o29M63m00Q9L6J84L08m70L06
10540B05l36J2M07l11qL89l23j81O00p51J82L01J51o2O3q26J80M52m08O8L51r7
10562E8P4j20M52p12L72l42K22P0l99Q26l78j44m30N21m08M59O2m22M65j28m6
10583E2L97m91K57J76m70K01K40j85l62N82l28K11j10J83o39J23K98j46K79l87
10603a19K9L77j42j88Om00M01J16P2km63K25L8M57j111L32M13n65P02l35N0L01
10625A94j12l55M89k15J48j51k63j39P78m17l59L40m54K93M68j22n91Q82m59l03
$$ plain form
10475 238 -178 61 323 138 32 259 191 -89 311 39 -439 105 127 -744 49 -84 -474 348 -159 151
10495 151 412 -431 -384 163 93 -70 162 170 198 -99 -373 -217 -34 -284 -236 -278 111 105 514 415 118 274 108
10518 108 179 -11 -446 129 -369 -332 73 107 -173 315 -133 -226 318 -311 152 -248 -159 -123 61 369 -101 205
10540 205 -131 -119 288 -23 -31 358 35 -146 454 -297 -115 186 337 275 338 -488 -308 144 -264 -196 155 58
10562 58 132 12 464 -248 124 -218 4 74 -325 501 123 -21 -451 70 -338 121 183 -239 226 98 52
10583 52 449 -42 215 391 -79 122 362 177 -185 397 69 280 170 353 -286 -163 135 -11 268 -119
10603 -119 -90 287 145 -43 -37 -437 -36 80 152 150 -313 -88 -50 407 -704 -372 41 -524 178 -157 -107 194
10625 194 82 -273 216 1 149 -2 -265 -404 374 -43 -402 -62 -516 -223 245 123 -468 414 -45 -348
10645c48K00K0J22N79r94K11P38o59P5j43N6J64k09q0j14N04p0m16P12n28K89
10666A09M4l58J60K90l09K65R8k25r9L76n37N32k43l66Q18m39j52j8J3l36L90
10687A3O45q26L95K87m70j15K52j24q6k85N51J56j46j28K20m87J50M3r3j26j00
10708b74K04k4J6R3J21n00j27O34K76o63M49J62n03L14K28q17P01l4n96N57Mq67
10730f46O06m64P4P84l58M1n15M87n54P95l64K53P8m47L59J44m27j79L16j28k57
10751d02P40J53l83j49m55L03L60m17K26R4l46K70K22q10L96K86l01L0K25K9N5
10772A26j25n76N54j84k37N17j01k61K35L6j9n5Q5n33R23o61k35M97Q1k74J78
10793b9n12L56O88l53j28J99o76N37L99m97k12M63p9rj95l16L23m7k32K78L35
$$ plain form
10645 -348 -148 -128 -6 573 -421 -210 528 -131 -56 -199 -143 21 -188 -268 -382 122 52 -364 348 -180 109
10666 109 153 -205 -45 245 -64 201 299 74 -25 351 -186 346 103 -263 555 116 -36 -54 -41 -377 13
10687 13 658 -168 227 514 44 -71 181 57 -29 -314 237 393 247 119 339 -148 2 45 -48 -174 -274
10708 -274 -70 -94 -78 15 136 -364 -491 143 419 -244 205 367 -136 178 406 -411 290 256 -340 217 221 -646
10730 -646 -40 -504 -430 354 -4 37 -478 9 -545 250 -114 139 217 -230 129 273 -154 -333 -17 -145 -402
10751 -402 338 491 108 -41 -496 -193 167 -250 -24 70 -276 -6 216 -594 -198 88 -213 -183 42 71 126
10772 126 1 -575 -21 -205 -442 75 -26 -287 -52 -16 -35 -90 -5 -538 385 -276 -511 -14 67 -207 -29
10793 -29 -541 -185 503 150 22 221 -455 82 481 -16 -228 235 156 147 -48 -364 -41 -88 -320 -42 293
10814B93r9J48q8n2k30L00K7j8P6p69P88j91j01J5j57l61O08J50n56Q6Q8j07O13
10837D63l67M10k44n20J27K51K99r18P88m04j2J32KN3L60p13R2M77l71n5M78n79
10859b51K89K3J3l96P29n92K50K89k78m97O16k71j99M03o53O37k36J59L59Q9o91
10880b08M87k67m20N92o94J85N46K90r11L48m72N82J04l71K17M2m91M12K42l51
10900a38J41j86j53j58R64p60J50L60j82j48L78l65Lml17N12j12j16M14k5n32
10921b74K65J84k31j32m2K50j02K36Q2J43k33l94K48J49p88P43k14k7j3J3N99
10942D62p07M26o7l62QM67k97k10p9N44n4l29J57M4j50N33l91j04N07j59l74R5
10964d0n21P88j54k15M88L18n77l5n7k59L00l54J4K0M55n18M29l42n16R21K52
$$ plain form
10814 293 194 342 254 202 -28 272 299 281 357 -412 376 185 84 99 -58 -419 189 339 -217 -131 -43 -150 463
10837 463 96 506 262 -258 -131 120 419 -499 289 -115 -127 5 7 60 420 -293 -201 276 -95 -150 328 -251
10859 -251 38 61 74 -322 407 -185 65 354 76 -421 195 -76 -275 128 -525 112 -124 35 394 483 -208
10880 -208 279 12 -408 184 -510 -325 221 511 -400 -52 -524 58 162 -209 8 50 -441 -29 213 -138
10900 -138 3 -183 -336 -494 470 -290 -140 220 38 -110 268 -97 -94 -98 -415 97 -15 -131 283 258 -274
10921 -274 -9 175 -56 -188 -230 20 -82 154 236 379 146 -248 0 149 -639 104 -110 -137 -150 -137 462
10942 462 -245 181 114 -248 -240 227 -70 -280 -359 185 131 -198 -41 3 -147 386 -5 -109 398 239 -135 -40
10964 -40 -561 227 73 -142 346 664 87 52 -5 -264 36 -318 -304 -284 171 -347 82 -260 -776 145 397
10985C97m31L17l44l36L41K79j60M03o68M28n3m11M75Q9o53K14M78n90K81L03
11005C59m17M34j81k53K84k39j32j68J84K84m8K4p00Q67n49j29M73j3l43N23Q8
11026C48n72L05j90j10O55p30M19Ml62J89N65j30p40N26k29q9K54k70J01j4M44
11047C74m92N06n48l33M02j3K70nn06M18K11n38L7R8k96L89J21l19M40j41l80
11068c05M58k46j56N12O0o58M41L06r75M83M3n3N66p48K01Q22m58k06R0j02r86
11089i11J207k13m10L08j02l95P89m57M24Q5m61J95j28k6J50N5q8k15M74m14M32
11110B99k61K0jK95r3j90L8q24O94J22k68J26p9o1P62l98j07J4L5l34J02j78j92
11133d79K16o0L98j42k16M2J64J0o5M23l89k20Q90o18K33J04o0m80R84r02J09
$$ plain form
10985 397 -34 283 -61 -397 -56 223 63 466 -202 226 173 -238 237 326 -327 -113 365 -225 56 359
11005 359 -58 376 195 -58 226 -13 -145 -313 -129 155 107 131 -569 298 -251 -380 93 80 -263 260 348
11026 348 -224 81 -109 -219 436 -294 125 129 -233 -44 521 391 -349 177 -52 -141 113 -157 -56 -70 374
11047 374 -118 388 -160 -493 -91 -104 166 161 -345 73 284 -254 -217 -119 -415 -26 95 -224 216 75 -305
11068 -305 153 -93 -249 263 323 -335 106 412 -563 -80 -37 -90 476 -272 -71 751 293 87 177 75 -911
11089 -911 296 83 -327 -19 -121 -516 273 -184 240 325 -136 59 -69 -95 55 110 22 -193 281 -133 299
11110 299 38 58 57 352 259 69 107 -717 -23 99 -169 -43 -122 -183 579 181 74 88 123 -211 -109 -287 -479
11133 -479 -263 -323 75 -67 -283 -241 -77 -67 -132 291 -98 -318 572 -46 187 291 231 -249 735 -167 -58
11154e8P51r53k2J51L60Q3J29n44J77K16j46n0J90l50K31J57p46J86K12J72K0
11175A66j19R8K19m41m29M58M38p85Q75l27m82N23n83N08J0J97j235P79N40p34
11195c24K77k15m2P01o42P9Q63q87L54L4l95J08L11n15K10M19o60j14R98p02L46
11216B04j15j72J08l71M06N4l82o4M62j11l69L78K13l34j19J13K27L39m48k9j53
11237a63O42l14l05J61j64L26n48K95K06j91O4K55m4N4Jl70j8L99o74N92N9l17
11259e4%r5k9K02N4l06pL11m12K91L50m78J20Kj19L3M61p39J40K04k9K61J37o70
11283c72K38P15n04p9r2l34N29l44J13j12k22K29N53l22l17M38n14J77P83o10
11303d7J84K24k23M4K83l52k9L58k69l25M05m68N03N6l09k01K74j48K70J15q02
$$ plain form
11154 -58 693 -260 -282 -131 229 312 441 -103 74 290 144 94 284 -66 165 322 -424 -238 -26 146 166
11175 166 47 145 364 -77 -506 -48 390 -395 480 153 -329 194 -389 119 129 326 -909 -130 410 -324
11195 -324 -47 -262 -304 397 -245 -166 697 -190 164 198 -197 -89 222 -293 -83 336 -324 -438 560 -142 204
11216 204 89 -83 25 -346 60 114 -268 -332 130 19 -350 28 241 -93 -212 -99 128 467 19 -10 -163
11237 -163 479 165 -140 21 -143 183 -365 -70 136 -55 9 264 220 274 275 -95 -113 286 -388 204 263 -54
11259 -54 -54 -149 -178 24 78 -228 -235 76 -336 -45 305 -173 -53 -51 -170 -137 324 -415 -275 -71 -100 161 298 -372
11283 -372 -134 581 77 -2 -94 -428 101 -243 -130 -242 -464 -235 318 -4 -321 117 -397 -220 563 -47
11303 -47 137 361 138 182 465 113 84 442 173 -152 253 -215 288 344 35 -166 108 -40 230 345 -457
11324d57L66L9m6J12l25M81K42k04m99L05M34n15J7K8j49J98M25m68N39n64l99
11345d40Q02o44p4L46j9k80M89j24l59L64k23L40j01j36j32O54p25N79M06r23
11365b00J00K36j46l9J62o37P76m81p7J51L46l14L34n9p08O11l60k30M86L0m94
11386e13O80l10J89J64J31J57m92l3j39O47r43K87K84K33m13N14n85m0Q05o42
11406a9k91R22o25J59R3k49J3J55m69P53j79o25M13L25l12Np3r8L01l94k23P41
11428C23l71k39N77l02L14k46k74K99r6J35l70R36q10k02P95o16j07M42n57N67
11448A98j91l48N06M7k24J17Q3n22Q03k63q18O43J08l59J88j32L0j57L83j39J17
11469G0o5l82M72j47j49K53Ml1M7J57n00K42K85n46M59m5j56L95n78k03Q61m06
$$ plain form
11324 -457 -91 -52 -98 14 -311 170 412 208 -291 14 448 -67 -50 -22 -171 27 452 -16 523 -41 -440
11345 -440 362 -282 -356 -10 -29 -309 180 56 -303 61 -162 178 77 -59 -191 463 -262 317 723 -200
11365 -200 -100 136 -10 -49 113 -524 252 -229 -306 -155 191 -123 211 152 -556 55 -305 -535 -49 -19 -513
11386 -513 167 -143 46 210 341 498 6 -27 -166 481 -462 -175 109 342 -71 443 -142 -182 623 -19
11406 -19 -310 612 -13 146 239 -10 3 158 -311 442 263 -362 51 376 64 69 -4 -102 199 -195 -418 323
11428 323 -48 -287 290 -12 302 56 -218 81 -15 120 -250 686 -124 -326 469 -147 -254 188 -369 198
11448 198 7 -341 165 212 -12 105 188 -334 469 206 -612 31 139 -220 -32 -164 -134 -291 92 -47 70
11469 70 5 -377 95 -52 -201 52 56 25 72 229 -271 -29 256 -290 169 124 -32 363 -215 -418 443 37
11491C7p19P04p4L93J24m96p1K75l92K07l3o1k69L50j67N2K32j40n2L33l76L22
11513A79K34n84l55R61j066N33M90r41Q41L76q56L17J95r68Q21l21pK89Q2n82
11533c62P74k11r9k87J33k52L52j99J05K57n04L01K01p30O44k15j17j01R57p27
11553h0R8O4l30k34Q12k87l24N62k61R7j02l89K67N75l46J60J57o41K1O39p75
11574c17N87n11N40Pm78j30N01J34m57M78m22m33L43k65R2L07L6m3L54r3m18P54
11596E66p76M51m0m98L57L34m26n4J99L0j83J98j68n5J14m5N1k41M63l6q5j02
11618E4m12N85o33M2K40l93N96j74k20J96L02k26k9K22o40P99o7m57K73k09M53
11639C02k38j30m0J81N7l54L14p6M8j29k33L46Q8q6K05P2m93L95K33o62p1O92
$$ plain form
11491 37 -682 22 -52 341 465 -31 -102 173 -219 -12 -45 -106 -375 -25 -192 -140 92 -48 -100 233 -143 179
11513 179 413 -171 -526 435 -631 -98 392 -549 292 668 -188 129 324 -644 177 -144 -151 138 220 -362
11533 -362 412 201 102 -185 -52 -304 48 -151 -46 211 -293 8 209 -521 123 -92 -209 -310 647 -80
11553 -80 18 82 -248 -482 330 43 -281 281 20 117 15 -374 -107 468 122 282 439 -202 -181 458 -317
11574 -317 270 -241 299 306 -172 -302 199 333 -124 354 -68 -501 -158 -423 -331 -24 12 -31 323 230 -188 566
11596 566 -210 241 201 -297 60 394 -32 -86 113 143 -40 158 -10 -65 49 4 55 -186 277 241 156 54
11618 54 -358 227 -406 -364 -124 -517 79 -95 -315 -119 183 -43 -72 150 -490 309 242 -215 58 -151 302
11639 302 64 -66 -106 75 132 -222 92 16 64 -65 -298 48 136 50 255 327 -166 229 462 -200 -271 421
11661D21Q9p30L48l73l8L41J7J66K3n07j38P30o91L06K54l51L26M33o51J35J89
11682B99j83j61k03k48J063o5q18L41J7l39N77m97L06l70J05j2J59N61m69m10
11702c47J52Q7L78j34m89Q01j009J4R21n65M74k01l76O08L3m61j47L56m79N90
11722B06k48l16O27j42q1m5j68k84L81L52m77K12J11k35M18m40j27K90p2nK07
11743A64l1o14P85j34j24L92M5n09O22j039m0Q41j014M28L63p16O08L62o41M1
11763b11P33o63L45J74n68K28j20m71M67P0l63M33L43j49l31R7n10O24K2p39R0
11784d99P72k14K77o26j1L50j13k49R01n93L22J31p58K07N11o98k67N96n24P03
11804B18J53n60l10O12k83L63L18q30K73M41o49L76J74l32R8J82n01O98j44m07
$$ plain form
11661 421 510 -220 128 -245 -283 58 75 241 264 -243 -381 349 -342 -36 218 -133 193 626 -25 110 299
11682 299 116 -45 -248 -496 567 502 -316 25 42 -297 280 -217 89 -281 -176 -188 -29 532 63 -347
11702 -347 -195 -108 270 136 -353 448 -561 -547 374 -191 283 82 -294 314 347 -114 -261 95 -384 206
11722 206 -42 -358 269 127 46 1 -167 -451 -70 282 -195 17 128 -107 311 -129 -256 34 -38 -43 164
11743 164 133 -481 304 170 46 438 483 -26 596 -443 -483 358 -656 -228 135 -581 27 389 -252 -211
11763 -211 522 -141 204 378 -190 38 -82 -553 -86 -16 -379 54 397 248 -83 14 -496 128 150 -589 -499
11784 -499 273 59 336 -290 -301 49 -64 -313 588 -5 317 448 -310 -103 408 -290 -557 39 -485 218
11804 218 371 -189 -499 113 -170 193 511 -319 -46 395 -254 122 296 -36 62 244 -257 441 297 -110
11824a10L53M35q16N93o12J7M70k90k48J27k9R4K64Pk65N43p50L21L2N00q14J77
11846aM58l05l02m7N9P65j029K38J29l66O62m65j88P87m26m56M55J06j31K10p2
11867H1k47J70o3m51P44l31m98N68J58k86L59L22k14l95Q6o65J111k66k01K80
11887B62J5m39O69n84J48L15m54j8k05j5M85L4l02j05M81m56K89P7j17j14NK7
11909bj06M72n73k60O23k28J71k47j8J16j91N32j36M0l77K57L05r54N92r9l07
11930c90R91q34P7N93p70J57l6K44l20O31k22l55O38q52Q7J32O80o09K85q8J19
11951A58J24l34M6M0J44l76M92p62P84R7n99N24n86J44N54j6m76K33q9l28L15
11972H9J64l17L75j05k59L45o4o99P49k84p12O13P9l7N42m54k05O90p31J34L57
$$ plain form
11824 -110 243 678 -138 455 -157 -140 330 40 -208 -81 -110 -16 248 255 -10 533 -217 104 136 636 -178 -1
11846 -1 457 152 -150 -197 -138 627 -402 -164 -35 -401 261 -204 -392 395 -31 -487 -32 74 -57 153 81
11867 81 -166 4 -59 -510 234 -97 -595 -27 131 -155 204 526 312 -83 3 -662 449 183 -18 262
11887 262 277 -162 507 -77 71 386 -68 -86 -291 -306 179 213 -89 -194 287 -169 120 197 80 -34 -29 -2
11909 -2 -108 364 -209 -469 154 -74 97 -150 -168 -52 -243 289 153 193 -184 73 378 -576 16 -83 -390
11930 -390 601 -233 -156 437 -333 -176 -212 32 -288 343 121 -234 404 -448 -361 -229 451 -158 127 39 158
11951 158 282 -52 -6 34 178 -198 294 -468 316 413 -186 338 -248 -104 450 434 -42 191 102 -226 89
11972 89 253 -64 311 206 -53 292 228 -471 278 -6 -718 -105 -26 -63 479 25 -180 510 -221 -87 270
11993B70n19L48K55l67Q3j59J37M8R9q52M83L37n16J83K57m05j52M61J37l5j40
12014d7j38N03O4l57L44j72n37N52L43m91p8R6J17n5Q3n29J34K35m0j5J51k39
$$ plain form
11993 270 -249 99 354 -13 70 -89 48 96 195 -657 -174 163 -353 -170 87 -318 -470 -9 128 93 -47
12014 -47 -185 318 382 25 369 197 -340 212 555 64 -14 82 199 144 227 -302 -168 67 27 12 163 -76
$$ [...]
16383F49
##END NTUPLES=NMR FID
##END=
