##TITLE=31Pdec_LR-739-B2
 D2O, 124 sc
 19.10.2021
##JCAMPDX= 6.0         $$ Bruker NMR JCAMP-DX V2.0
##DATA TYPE= NMR FID
##DATA CLASS= NTUPLES
##ORIGIN= UXNMR, Bruker Analytische Messtechnik GmbH
##OWNER= root
$$ XWIN-NMR		Version 3.5
$$ Tue Oct 19 15:28:05 2021 Russian Standard Time (UT+4h)  she@DPX200
##.OBSERVE FREQUENCY= 81.013821
##.OBSERVE NUCLEUS= ^31P
##.DELAY= (6, 6)
##.ACQUISITION MODE= SIMULTANEOUS
##.ACQUISITION SCHEME= undefined
##.AVERAGES= 24
##.DIGITISER RES= 16
##SPECTROMETER/DATA SYSTEM= spect
##.PULSE SEQUENCE= zgpg30
##.SOLVENT NAME= DMSO
##.SHIFT REFERENCE= (INTERNAL, DMSO, 0, 243.863)
##AUDIT TRAIL= $$ (NUMBER, WHEN, WHO, WHERE, WHAT)
$$ ##TITLE= Audit trail, XWIN-NMR		Version 3.5
$$ ##JCAMPDX= 5.01
$$ ##ORIGIN= Bruker BioSpin GmbH
$$ ##OWNER= she
$$ F:/spectra/data/she/nmr/P31/1/audita.txt
$$ ##AUDIT TRAIL=  $$ (NUMBER, WHEN, WHO, WHERE, WHAT)
(   1,<2021-10-19 15:26:47.82 +0400>,<she>,<DPX200>,
      <created by zg, POWCHK disabled, PULCHK disabled
       configuration hash MD5:
       00 E9 B6 7A A2 85 ED C7 34 08 36 98 17 FE 4E 26
       data hash MD5: 32K
       AC ED 39 48 D5 EA 78 11 DD DF 10 0C 1F F5 53 25>)
$$ ##END=
$$ 
$$ hash MD5
$$ AF 86 6A BA 57 BF 08 97 0A 30 1A EB C9 08 3D 66
##$RELAX= 
##$RELAX= 
##$RELAX= 
##$RELAX= 
##$RELAX= 
##$RELAX= 
##$RELAX= 
##$RELAX= 
$$ Bruker specific parameters
$$ --------------------------
##$DU= <F:/spectra>
##$EXPNO= 1
##$NAME= <P31>
##$PROCNO= 1
##$TYPE= <nmr>
##$USER= <she>
##$AMP= (0..31)
100 100 100 100 100 100 100 100 100 100 100 100 100 100 100 100 100 100 
100 100 100 100 100 100 100 100 100 100 100 100 100 100 
##$AQSEQ= 0
##$AQ_mod= 1
##$AUNM= <au_zg>
##$AUTOPOS= <>
##$BF1= 81.014009
##$BF2= 200.13
##$BF3= 200.13
##$BF4= 200.13
##$BF5= 200.13
##$BF6= 200.13
##$BF7= 200.13
##$BF8= 200.13
##$BYTORDA= 1
##$CFDGTYP= 0
##$CFRGTYP= 5
##$CHEMSTR= <none>
##$CNST= (0..31)
1 1 145 1 1 1 1 1 1 1 1 1 1 1 1 1 1 1 1 1 1 1 1 1 1 1 1 1 1 1 1 1 
##$CPDPRG= <waltz16>
##$CPDPRG1= <>
##$CPDPRG2= <waltz16>
##$CPDPRG3= <>
##$CPDPRG4= <mlev>
##$CPDPRG5= <mlev>
##$CPDPRG6= <mlev>
##$CPDPRG7= <mlev>
##$CPDPRG8= <mlev>
##$CPDPRGB= <>
##$CPDPRGT= <>
##$D= (0..31)
0 1 0 0 0 0 0 0 0 0 0 0.03 2e-05 3e-06 0 0 0 0 0 0 0 0 0 0 0 0 0 0 0 0 
0 0 
##$DATE= 1634642807
##$DBL= (0..7)
120 120 120 11 120 120 24 19 
##$DBP= (0..7)
150 150 150 150 150 150 150 150 
##$DBP07= 0
##$DBPNAM0= <>
##$DBPNAM1= <>
##$DBPNAM2= <>
##$DBPNAM3= <>
##$DBPNAM4= <>
##$DBPNAM5= <>
##$DBPNAM6= <>
##$DBPNAM7= <>
##$DBPOAL= (0..7)
0.5 0.5 0.5 0.5 0.5 0.5 0.5 0.5 
##$DBPOFFS= (0..7)
0 0 0 0 0 0 0 0 
##$DE= 6
##$DECBNUC= <off>
##$DECIM= 3
##$DECNUC= <off>
##$DECSTAT= 4
##$DIGMOD= 1
##$DIGTYP= 9
##$DL= (0..7)
0 0 52 120 120 21 21 25 
##$DP= (0..7)
150 150 150 150 150 150 150 150 
##$DP07= 0
##$DPNAME0= <>
##$DPNAME1= <>
##$DPNAME2= <>
##$DPNAME3= <>
##$DPNAME4= <>
##$DPNAME5= <>
##$DPNAME6= <>
##$DPNAME7= <>
##$DPOAL= (0..7)
0.5 0.5 0.5 0.5 0.5 0.5 0.5 0.5 
##$DPOFFS= (0..7)
0 0 0 0 0 0 0 0 
##$DQDMODE= 0
##$DR= 16
##$DS= 0
$$ [...]
##$SUBNAM1= <"">
##$SUBNAM2= <"">
##$SUBNAM3= <"">
##$SUBNAM4= <"">
##$SUBNAM5= <"">
##$SUBNAM6= <"">
##$SUBNAM7= <"">
##$SUBNAM8= <"">
##$SUBNAM9= <"">
##$SW= 501.771253377433
##$SWIBOX= (0..15)
0 1 3 0 0 0 0 0 0 0 0 0 0 0 0 0 
##$SW_h= 40650.406504065
##$TD= 32768
##$TD0= 1
##$TE= 0
##$TE2= 300
##$TE3= 300
##$TEG= 300
##$TL= (0..7)
0 120 53 12 22 120 120 120 
##$TP= (0..7)
150 150 150 150 150 150 150 150 
##$TP07= 0
##$TPNAME0= <>
##$TPNAME1= <>
##$TPNAME2= <>
##$TPNAME3= <>
##$TPNAME4= <>
##$TPNAME5= <>
##$TPNAME6= <>
##$TPNAME7= <>
##$TPOAL= (0..7)
0.5 0.5 0.5 0.5 0.5 0.5 0.5 0.5 
##$TPOFFS= (0..7)
0 0 0 0 0 0 0 0 
##$TUNHIN= 0
##$TUNHOUT= 0
##$TUNXOUT= 0
##$USERA1= <user>
##$USERA2= <user>
##$USERA3= <user>
##$USERA4= <user>
##$USERA5= <user>
##$V9= 5
##$VALIST= <valist>
##$VCLIST= <CCCCCCCCCCCCCCC>
##$VD= 0
##$VDLIST= <DDDDDDDDDDDDDDD>
##$VPLIST= <PPPPPPPPPPPPPPP>
##$VTLIST= <TTTTTTTTTTTTTTT>
##$WBST= 1024
##$WBSW= 4
##$XGAIN= (0..3)
0 0 0 0 
##$XL= 0
##$YL= 0
##$YMAX_a= 2548
##$YMIN_a= -2587
##$ZGOPTNS= <>
##$ZL1= 120
##$ZL2= 120
##$ZL3= 120
##$ZL4= 120
##$ABSF1= 60
##$ABSF2= -190
##$ABSG= 5
##$ABSL= 3
##$ALPHA= 0
##$AQORDER= 0
##$ASSFAC= 0
##$ASSFACI= 0
##$ASSFACX= 0
##$ASSWID= 0
##$AUNMP= <proc_1d>
##$AZFE= 0.1
##$AZFW= 0.5
##$BCFW= 1
##$BC_mod= 2
##$BYTORDP= 1
##$COROFFS= 0
##$CY= 9.86611175537109
##$DATMOD= 1
##$DC= 1
##$DFILT= <>
##$DTYPP= 0
##$F1P= 248.564497384935
##$F2P= -679.521563365616
##$FCOR= 0.5
##$FTSIZE= 0
##$FT_mod= 0
##$GAMMA= 1
##$GB= 0
##$INTBC= 1
##$INTSCL= 1
##$ISEN= 30
##$LB= 1
##$LEV0= 0
##$LPBIN= 0
##$MAXI= 11.51145
##$MC2= 0
##$MEAN= 0
##$ME_mod= 0
##$MI= 1.244541
##$NCOEF= 0
##$NC_proc= 0
##$NLEV= 6
##$NOISF1= 0
##$NOISF2= 0
##$NSP= 1
##$NTH_PI= 0
##$NZP= 1
##$OFFSET= 243.8632
##$PC= 1.4
##$PHC0= -8992.118
##$PHC1= 417.069
##$PH_mod= 0
##$PKNL= yes
##$PPARMOD= 0
##$PSCAL= 0
##$PSIGN= 0
##$REVERSE= no
##$SF= 81.0140731611343
##$SI= 65536
##$SIGF1= 0
##$SIGF2= 0
##$SINO= 80
##$SIOLD= 65536
##$SREGLST= <31P.CDCl3>
##$SSB= 0
##$STSI= 0
##$STSR= 0
##$SW_p= 25641.0256410257
##$SYMM= 0
##$S_DEV= 0
##$TDeff= 0
##$TDoff= 0
##$TI= <>
##$TILT= no
##$TM1= 0
##$TM2= 0
##$TOPLEV= 0
##$USERP1= <user>
##$USERP2= <user>
##$USERP3= <user>
##$USERP4= <user>
##$USERP5= <user>
##$WDW= 1
##$XDIM= 64
##$YMAX_p= 0
##$YMIN_p= 0
$$ End of Bruker specific parameters
$$ ---------------------------------
##NTUPLES= NMR FID
##VAR_NAME=  TIME,          FID/REAL,        FID/IMAG
##SYMBOL=    X,             R,               I
##VAR_TYPE=  INDEPENDENT,   DEPENDENT,       DEPENDENT
##VAR_FORM=  AFFN,          ASDF,            ASDF
##VAR_DIM=   16384,         16384,           16384
##UNITS=     SECONDS,       ARBITRARY UNITS, ARBITRARY UNITS
##FACTOR=    2.46e-05,      1,               1
##FIRST=     0,             0,               0
##LAST=      0.4030218,     0,               0
##MIN=       0,             -2587,           0
##MAX=       0.4030218,     2548,            0
$$ Real data points
##PAGE= N=1
##DATA TABLE= (X++(R..R)), XYDATA
$$ [...]
10680A86n9j70K0l62J75L92m58J7L76n13M9R38p45L7O53j559J110L83n03P7m6
10701bk61P57o91j86Q74q01k29M97J44l45P00m60p31J012k77m65O87m79j6O58
10721C86o29n41P41J65m12P93k69o36P42o91M74K13N7l20K67l02P6j06m16Q20
10741D12p6r07N67L86k84k33j14J70P02m60k08L60m3o88K06N32k25J99k81m2L00
10762B73k85J2L99q08N47O5k13j8K18k71j85L88j12j76L67j0k01M71n61k87O09
10783B22m71K83N14n97L8J49j28k54M54l52k70O52K11n64K62j62K95K37q00N83
10803C02J25q38L48M53p70J022r19P02l08l37J07L89n56K57L23j66j78K40k43
10822d7j14N61q08K8O29k80k59L39n37M58N17m82m8R3l54L74p3p44Q20r4k8J68
$$ y = [186, 127, -43, -23, -385, -210, 182, -276, -259, 117, -396, -347, 591, -154, -117, 536, -1023, 87, 470, -33, 44, -2, -263, 494, -197, -383, 491, -310, -539, -42, 102, -243, 457, -3, -734, 278, 1, -464, 223, -256, -272, 386, -243, -784, -43, 122, -290, 503, 234, -402, 340, -351, 123, 336, 393, 73, 340, 38, 114, 8, -408, 412, 336, -571, -4, 382, 98, -135, -249, -79, 623, 163, -45, 315, 272, -416, -210, 322, 97, 296, 15, -27, 273, -12, 0, 399, -409, 138, 203, -10, -28, 190, -81, -266, 122, 10, -166, 201, 191, -10, 461, -100, -387, 222, -249, 34, 548, -49, -11, 138, 10, -244, 210, -142, -412, 240, 451, -113, 149, -13, 282, 519, -281, 302, 427, -411, -63, 390, -380, 642, -277, 425, 117, -220, -113, 276, -280, -23, 300, 134, -44, 196, -47, -161, 400, -408, -380, 249, -31, -290, 49, -488, -30, 487, 5, -43, 50, -304, 70, -3, -747, 73, -21, -49, 119]
10844A19J27p94O30K37p17N49J58n85M59n49M34M1K5j05J71J59o05K68L58l28
10864E2K88l57J9j45j79M33M38o64l13K61rl90J002n57k74P32r50O38Q8l98n9
10885c44N38m75l54J099k47l68J84o36P64J36j28j02L64p12J98j86K22q9K01j89
10905a24qL09n84P93k78m13N67l83j69O39l94p8O89p57RN93n21q5K66n43j27J111
10927E12k33o36Q91q84L94N97r85N04M57j056Q26J84o37j43O11p19N4M69R3l3
10947B66l10j48N16l71o6K90K5q4J89r0r16P56L46o84j0J39m7N11m90k78P00n59
10969c15J50J63k10M82j72n90N51r1J17k37K76o4k05N04l70K73k05O3L91l45j102
10990i36J437K23q59r0j1K80K69k91j37j39L74m13M24m7m39O33l21J91%M07q72
$$ y = [119, 246, -548, 82, 319, -398, 151, 309, -276, 183, -366, 68, 109, 134, 29, 200, 359, -246, 22, 380, 52, 340, -17, 2, -143, -322, 111, 549, -115, -428, -167, -176, -566, 436, -121, -395, 337, -613, 25, 113, -285, -344, 194, -281, -635, 464, 217, -151, 33, -603, 161, 297, 169, 67, 431, -281, -83, -269, -47, -136, 65, -124, -132, 177, -407, 386, 108, -305, 262, -121, -290, 349, -45, -123, 566, -191, -182, 411, -110, -195, 71, -472, -599, 512, 279, -357, 534, -350, 44, 641, -344, 160, 617, -439, 387, 571, -66, -209, 402, -317, -263, 206, 299, 266, -44, -192, 324, -47, -113, 177, 202, 118, 307, 217, -699, 57, 403, -281, -291, -152, -199, 312, -178, -456, 244, -315, -165, -2, -212, 270, 98, -492, 59, -32, 85, -152, 124, 60, -145, 359, -11, 262, 57, 120, 511, 166, -936, 501, 724, -135, -225, -236, 44, 313, 22, -115, -254, 120, -293, 131, 84, -355, 278, -43, 148, 148, 555, -317]
11011c17L37q5M52J17n7l47l97N9m9N87k68L1l81N8k3L71l72J62M77p20K87j27
11033b05p4L90J44n85Q10m14l63L69J23o03J87L46r32J038p8j18K2j34j02Q9K90
11054B00q04P62J66p65N17L47j96l63K33k71M96m26k8O59r33K14N40m88j87J018
11074F91q61k98M00k71P64O3l89n6P71j006J5O02r75L94N07p41P73m29j19K11
11094D6M46p88N36l04k79J82J6j08L15j70l37O22l13j56O70p44J37N59n32J99
11114cL96q92M30M99p47K90j6j47l04O62k67L08o9q2l67N22p7r27J240o55N3O87
11136E34p81L63M0n18l73J069o64L98qk81J02L64k95l0K24m05J67J96j24L48l88
11157f2M2L9n34K74P25o39k96O55p62N8J038J7j131M02L86n47O77q10O18N31n01
$$ y = [-317, 20, -65, 387, 504, 447, 100, -297, -238, -287, 300, 32, 63, -318, -260, -283, 88, -284, -122, 355, -365, -78, -205, -279, 111, 255, -330, 480, 66, -297, 72, 195, -408, -221, 125, -807, 231, 153, 35, 57, -77, -179, -90, 200, -604, 158, 324, -441, 76, 423, 227, -136, 97, -174, 322, -104, -132, 527, -406, -192, 348, -140, -327, 691, -170, -468, -68, -339, 425, 488, 99, 43, 814, -192, -177, 425, -550, -156, 351, -390, 383, -46, -165, 46, 492, -296, 240, -64, -343, -161, -145, -253, 62, -108, -445, 177, -136, -292, 378, -366, -229, 330, -202, -3, 393, -499, -69, 430, -317, -27, -43, -190, -494, 168, -99, 209, 140, 58, -309, 213, 136, -791, 449, -206, -153, 534, -247, 116, 156, -362, -735, 334, -330, 68, 60, -221, -119, 245, -50, -80, 144, -261, -94, 102, -22, 326, -62, -20, 19, -515, -241, 484, -155, -451, 204, -558, -500, 538, 555, -576, -174, 212, -335, 342, -468, 150, 681, 180]
11178A80l47J49n8J93l21J10K06o9n95N32L95o84J90P1k46N29j33l14N02k42m93
11199d45O19j02L24l8j39j5j20j03j082J296k21nj4J03l87K78j9l4N45m42q11
11220h12J122r7o47J172j239M13M80q9l35L66j40k19K61k64Q6K7q0k42N26n13
11240b24o1P83r90N57L28q36N99J4m00K26L46o39R7J67l01O20m36r8L80l06K50
11261G6r2l34J78L79m25K89J64l91k5K00L1k45J18m33L64O06r58M22J083j914
11281i07Q53R14p19k24M84l45l21N24o66Q50j71n13K74L41p63M00j70J59J04k09
11301a05l66N43K15m93N74N1o75O82k92n67O01j2r13P72J9j03J20J7n09P29o39
11322c51N79Nk79k08L34j22n58N23n7l25O26l67k26N14N4p58J100l22m01N15r94
$$ y = [180, -167, -18, -76, 117, -204, -94, 112, 43, -552, -20, 375, -309, -119, -48, -294, 235, 102, -212, 290, 48, -445, 174, 72, 396, 358, 219, 204, 84, -19, -1101, 195, -26, -31, -45, 58, -329, -51, -70, -104, 441, -1, -812, 310, 213, -434, 738, -501, -88, 392, 303, -32, 334, 194, -25, 236, -28, 58, 85, 5, -237, 289, -224, -285, 498, -492, 65, 393, -443, 156, 170, -230, -4, 342, -297, -200, -33, -334, 286, -150, -248, 132, -174, 76, -16, -350, -172, 207, -218, 71, 235, -156, -181, 19, 50, -195, -77, -510, -146, 460, -498, -76, 1007, -907, -54, 860, 141, -83, 401, 56, -265, 259, -407, 443, 272, -241, 33, 374, -389, 11, -159, 0, 104, -105, -471, 72, 287, -206, 368, 419, -256, 426, 134, -433, 168, 156, -757, 15, 34, -69, 51, 68, -441, 288, -351, 228, 233, -46, -254, 80, -42, -600, -77, -134, -459, 167, -200, -426, 88, 142, -616, 484, 162, -239, 276, -718]
11343g18N77M84o76K88L70p90M82j99j56N28L6l31j17M81n62N60n3k70K82l42
11363a26J73P8j08m94J170j077M86k9l36J24L39k09J73j56k42L21K23l94L21o6
11383A71p95R17n9k74J07L8l98P42L69j604P59N21j305M19M41j16J11J26q3l10
11403b23L98l19M76l53K34O48p70n33P24k46l12O59m16n79N47l17M77K82q39L73
11423h9M59n8j15j24m41K34J46n21K38M81k51J75j0r4n17N45k56k1P82r66M74
11444G1n1n2j17N08o59L74N64r47R35m43l90L2J66k94J002p72l92N99m9n99K76
11465b38N28k87j1k67n9N12k69j13O22q56J79M63l2N0j55o01L33J237j342M77
11485A71M24p25j32Q76o82J75r9l44L08O48j168O19J32q28Q12j07j53M66n7k43
$$ y = [-718, -141, 343, -333, -45, 325, -465, 17, -182, -338, 190, 226, -105, -222, 259, -303, 257, 204, -66, 216, -126, 47, 125, 17, -477, 693, -384, 102, 73, -263, -139, 200, -9, 164, 8, -234, 87, 310, -84, 237, 171, -624, 293, 234, -40, 67, 105, -293, 449, 818, -786, -27, 494, -811, -392, 49, -67, 44, 170, 87, -223, 175, -144, 332, -21, 213, 861, 91, -442, 282, 36, -276, 383, -33, -612, -65, -382, 95, 377, -462, -89, 370, 312, 197, 73, -368, -134, 12, -509, -271, 210, -41, 134, 124, 30, -487, 58, -198, -219, 563, -403, 71, 20, -32, -149, 359, -300, 74, 638, -309, 626, 183, -207, -175, -9, -303, 699, -73, -465, 134, 85, -514, -238, 290, 3, -8, -275, -334, 178, -91, -204, 418, -438, -259, 204, 172, 222, 67, -534, -201, 1036, -306, 171, 595, -130, -262, 614, -68, 107, 8, -336, -28, 620, -548, 71, 203, -625, 187, 80, -73, 393, 336, 93]
11505I3J4J34m60K03J79j60K25l58P5J62l0l50O4j17J01Q18q41p7O49o35r8Q39
11527D30m72j90J33K31j4k41j89M20R4k75L80N8r15L82j7k06R26j29q84R51k39
11548B34k35J42R1m57m3K60k58K23j08L5L56k13k34O06r51N22J36l4l80M79nj84
11570a8K20m54J86K83l67m92J282j098K82M79j36j88L96n63J49J19o79M00L32
11589A33m40M90K76o57L55j85m17Q60J80o57M29o83K97K34o25J90K16M75n99M63
11609C35j44k21N07k31o41M20j03n43M23l59O15j99J00O20k88m55J14L04n47L30
11629C7L31q14k92Q93k15Q9R7l32j18L16j0N08k67n16J43j19J27r1O38j134O89
11650d0L67n68L42l76j16O78n24j05Q16l02n47N02Jo42J025m64l71Q25n34m08
$$ y = [93, 107, 241, -219, -16, 163, 3, 228, -130, -55, 107, 77, -273, -209, -326, -225, 593, -248, -325, 324, -311, -409, 430, -42, -232, -99, 132, 118, -123, -312, 108, 202, -73, 307, 365, -550, -168, -185, -391, 535, 406, -478, 473, 234, -1, 141, 232, -225, -268, -8, -266, -43, -151, -116, 240, 27, -207, 399, -552, -30, 106, 72, -308, 171, 166, -18, 202, -252, -66, 217, -150, -642, 640, -458, -176, 303, 167, -21, 375, -188, -39, 80, -599, -199, 133, -307, 183, 459, -198, 157, -28, -445, 415, 595, -62, 367, -316, -19, 215, -410, -220, -4, 471, -128, 335, 191, -30, 477, 246, -395, 25, -78, -621, -198, -557, 58, -141, -41, 579, 291, -164, -50, 254, -293, 37, 368, -446, -738, 155, -60, 29, 126, -206, -324, -8, -18, 490, 223, -293, -150, -269, -142, -233, 405, -729, -40, 327, -241, 101, -275, -391, 287, -237, -342, 474, 172, -375, 127, 128, -514, 511, 47, -324, 501, -33, -441]
11670d41P55k17J27k22L47p50Q33l64n68P40j74K68p31m40O93J95l03M01l40L23
11690A32J12Q4m16J45L6k82O7J08q74R44rn07Q01l02n2M8L46l27L92q15L50M10
11712C91o75l17J006l06j72P2j09j23M98k82n37L76l2L07J94o17J05P96o55J00
11732B0J28k18l0L64m11N42K27r63j0M24l26N06M5o88J12L06j110R22j13K65R2
11753H4j67%j72J62L3M20m47m60P74J87l20L45n72R1l72K0R6O78o23J50N95p06
11775b04O0L62N4n16P9j70M59M07q70L19L63r17L84R09j439N77N29k29k66n9K44
11796G6j34O8l43N02l28N5L46o09j84L06O20p37L25j35j94Q35n03K09J0k52j47
11817b14L4J1l7Q78p49N1K50o55J3O50m56M95j28n64O37j97l80O28o3n45L60r4
$$ y = [-441, 314, 97, 224, 2, 349, -401, 432, 68, -500, 240, 66, 334, -397, -837, -144, 51, -252, 149, -191, 132, 244, 328, -88, 57, 93, -189, -122, -14, -888, 56, 47, -460, 341, 39, -13, 35, 381, 54, 446, -369, -19, 391, -284, -601, 405, 99, -73, -1, -110, -233, 265, -17, -554, -178, -210, 97, 291, -326, -221, 575, -80, 20, 148, -70, -100, 264, -147, 395, 622, -341, -351, 73, -253, 253, 298, -390, -278, 28, -1082, -160, -273, -8, 84, -83, -83, -255, -93, -60, 360, -87, -547, 227, 414, 94, 439, -133, -42, -414, -394, -298, 380, -243, -93, 502, -204, -144, 218, 272, -244, -165, -335, 124, 531, -339, -20, 343, -574, -190, 719, -720, -143, 386, 157, -109, -168, 76, -58, 10, -333, 169, -159, -104, 242, -367, -551, -245, 375, -362, -37, -172, -366, 469, -34, 175, 185, -67, -214, -180, -169, -206, 672, -77, -26, 224, -431, -418, 232, -224, 271, 143, -421, 216, 19, -361, 267, 204, -341, 19, -75]
11839g5J09P5R8m15J45n83O00J18n7m78M93K55o18N28l29M0j06M59n89M14M9p33
11861f00J033m06m90Q02n09m99O35j81n59J051o28J55N97o51K62L60m0k04L42
11880D70n01L01j17j90j03P57r36K74J73o53L97M58n39k57L32l43O89p1r25J031
11900B47K18o56M55j96n5n7j09jK84j44J0M45n24l41O81j57n45N52J55n74M62
11921A50l54j39O00o18O10J73m81J2L40LK60n19n85N93L65n42N94Mq02K6N98p46
11943d58O55K05p32L85J75l36M4k10J24L13q7K82J5j70m44OMl08O93j90j28j42
11965c04M66m58O96l47o72L25R0L77p4k97L76L94r80K38K10j35k41N85m74q4K04
11986a05n55Q42K01o02j58K41K84k01K24l63N14J57o95L06j78J9L84p15O71o30
$$ y = [-75, 34, 109, 207, -208, -63, -646, -46, 72, 15, -463, 30, 285, -333, 195, -134, -94, -200, 259, -330, 84, 133, -600, 433, 27, -463, 339, -170, -669, -34, -215, -774, 277, -351, -196, 401, -250, 12, 372, 332, 128, 470, -31, 270, 153, -37, -140, 617, -319, -45, 128, -525, -128, 330, -209, -466, -134, -477, 212, 141, -784, 247, 465, -191, 264, 68, 13, -44, -153, -154, 130, -14, -4, 441, -83, -424, 257, 100, -445, 107, 262, -312, 150, -204, -343, 257, -361, 249, 422, -59, -47, 293, 296, 556, 37, -548, 45, 410, -132, 462, 466, -336, -310, 288, -458, 197, 402, -330, 55, 230, -106, -62, -272, -148, 165, 78, 360, 375, 205, -239, -233, -229, -537, 156, -34, -162, -304, 162, -296, 400, 53, -619, -294, -204, 173, 99, -198, 178, 572, -408, -170, 40, -95, -336, 249, -225, -309, -105, -660, 182, 383, -219, -377, -136, 148, -53, 171, -192, 322, 479, -216, 90, -88, -69, 315, -400, 271, -359]
12006c59L40m84Q63l65l58L77m19K11L54j17j71J56o6K05K97n09J5Q14q07j06
12026a29Q43m65k61O2j00l6N30m26m66O92p64M72N2k70J38M16q31L93J90m9m86
12047d95P13n16O44l26j99L87k54j39K94K88q46J32N72p32N57k26k36J311j131
12066b02p0P79l64j82K14Q1p29Q06J40q93R75p29p7J220j405RO72o07K73N34k45
12087B00k58L87o43J55O22p64j65R32r21M69P6k24jK0k6M90p62L7R92o96K6J07
12109E3J2k36L89l11j84R97r08J67R2L02j080P91j49m44P28J13r85R73o30L41
12129C1O09r55J71M33o75K25p8j04P91m38j01JL36l65M92j3j57j3L32r9l63Q2
12151A42m77L70R2r09P62j8J30L42j75o68M52L18o68M29m10J08L06m79P8K53J02
$$ y = [-359, -19, -503, 360, -5, -363, 14, -405, -194, 160, 43, -128, 28, -38, 167, 464, -45, -30, 784, -23, -129, 714, 249, -12, 50, -50, -86, 444, 18, -448, 244, -520, -48, 4, -266, -128, 288, -543, -150, 40, -9, -495, 218, -298, 346, 20, -179, 208, -46, -185, 109, 397, -449, -317, 255, -477, 80, -146, -382, 929, -202, -272, 507, 143, -39, 175, 256, -473, 333, 473, -420, 555, -174, -251, 969, -436, -427, 245, -362, -89, 445, 200, -58, 329, -314, -159, 463, -301, -466, 466, -455, 14, 90, -134, -135, -115, -141, 349, -413, -376, 616, -80, -54, 53, 65, -171, 218, -93, -277, 720, -188, -21, 71, 373, -707, 84, -65, -509, 219, 332, -653, 320, -310, 31, 640, -315, -144, 289, -386, -161, -239, -343, 448, 10, -91, -90, 246, -119, 373, 360, 203, 190, 522, 423, 60, 142, -335, 35, 127, -782, -20, -38, 92, 434, 259, -409, 43, 361, -307, 122, -288, -180, 126, -353, -275, -22, 80]
12172H0K99o7m12j31O7l16l3J155q94q0K77K12k97M44m05k83N19l37L91P3n43
12193b81K75J19n2J7M1m56N10n9n22m9M31l53R27m40m58N20k0q17Q64L47q10P92
12215E26k58n36M38L9m01O78o46p4L29k35P3P28p38J54k23j19j6P32n01L87l02
12236C5l99J59L25J8q4M56r28O51q4j0k14N17n38L62N47r78P2j24Q9O00l37k36
12258a01M3L20m57L69K20p76N18m6j3M15o03L8J93l51M99L00q23l86J078l10k23
12279i6L49k92j03P55j209K67J043r26K50O36j375O11N45r45O23k05K07j89P0
12298A6o35O74K00o64P47o48l69P85R6Kn0O6m07K37q6L0J66n23J12P17m51n56
12320e41J354p76p6O20n91o4O39j148M57M28n00j45J53R7L85j69k62J98J1m05
$$ y = [80, 379, 312, -100, -231, -164, -480, -513, 642, -252, -332, -55, 157, -140, 304, -101, -384, 135, -202, 189, 262, -281, -6, 113, 61, 78, 119, -337, 173, 114, -408, -457, -26, -379, 548, 108, -350, 170, 150, -667, 197, 544, -266, 526, 268, -268, 170, 209, -192, 486, -160, -234, 95, -140, -67, 661, -77, 77, -146, -265, -281, 451, -50, 337, 35, -364, -205, 120, 138, 54, 510, -418, 233, 149, 139, -75, 442, -96, 266, 813, -165, -93, -217, -128, 472, 135, -101, -58, 262, -195, 174, 394, -382, 136, 90, 77, 492, -111, -73, 120, -231, 268, 568, -255, -641, 437, 127, -96, 253, -39, -142, 613, -596, -329, 714, -212, 38, 674, -701, -90, 455, -490, 133, -72, 135, -54, 16, -619, 55, 255, -409, 338, -310, -679, 106, 202, 204, 154, 220, -187, 50, -36, -6, 160, -363, -251, 466, 15, -541, 813, 37, -39, 581, -10, -74, 565, -583, -126, 302, -198, -343, -190, -93, 292, 123, -139, 59, 70, -335]
12340c35M27J33l78J2P6J22Q7j31l09O01k50o1K45m22J59L40m66m26J051m85l96
12361d06P76p76j13R41o47K27M28r6n51O26p61R3O10k34k11JK23m98Q82o22rK55
12383A38J76o69Q68q04L8J69m0J17L88n36M65%l96o3M19l75O21m10J50j04M2q02
12405f08R45n41L0M05k89n97M73N8M3K9L14j159J470p85P9M61o29r4P57l8q61
12426e37Q79m04j77M56k94J82K63o08L94L80r57N30K09N5o89N10j1j37l06JR04
12447F43m24r03N67j4j01L95m32l0N47m64O3J24j89q9M89n03K41O07p24J51L6
12468a0l9J82k21l01N82j99q4r3K39j78n11J239n65j81P53n89o65Q89o27M93j6
12489I8o55O36k38k27L21K59p62Q28l46n50O74R4p73P85K49m73K90J37p10M02
$$ y = [-335, 92, 225, -153, -141, -65, 57, 144, 13, -296, 305, 55, -6, 239, -183, -24, 316, -150, -576, 475, -10, -406, 370, -406, -519, 422, -225, 2, 430, 334, -217, 409, -352, -259, 351, 117, -94, -93, 130, -368, 514, -108, -117, 138, 314, -355, 513, -291, -253, -84, -124, -7, 381, -155, 310, 310, -86, -149, 270, -105, 516, 106, 256, 152, 194, -608, 337, -204, -174, 231, -58, -655, -182, -124, -81, -52, 262, -897, 573, -212, -133, 328, -301, -395, 362, 324, -537, 342, -62, -239, 217, -77, 105, 368, -240, 154, 534, -423, 107, 316, 371, -318, 192, 181, 44, -262, -261, 643, 219, -684, -117, -131, -232, 163, -269, -299, 248, -216, -153, -29, -218, -307, 182, -321, -80, 527, -197, -46, -10, -49, 133, -88, -389, 193, -6, -90, -183, 56, -122, -633, 606, 41, -140, 613, 24, -641, 248, -379, 114, 98, -557, 79, -159, -386, -65, 194, -568, 260, -86, -636, 38, 132, -641, 144, 393, -80, 210, 347, -363, 39]
12509C9k86J07R9k00J20O78n56O3k12op1K14k85j33M85k2r3K80m89K40N44j289
12531g73M92O59p06J66J49p02J08J028l64j38L85j09K01m56j52L31J87o55K45
12550a04M90o94J44K05l33J90l8j89J96M90p08P27m47k23N33k81J10NL19m15L02
12571B79o47L64K55j78J43L15p26n8K37oP47j81p86R1O43n22j13MJ75q5K0L0R4
12594I5M4k98M32o13K48N45p62K45L25K07n39L38J72q03L97L84r28P30o46M17
12614a0L18o9l34M05m63j73M24k0m23L92o5o80N54L86j01L79o52N29L11o18l28
12635b38Q67j183O36L50k11m59O04p71L71j84r7O82L7o52K27l18l74R50k44m64
12655d71P80Kl48M09n07p6M32l08oK15K3k94J56J69o55P15l58p9N55k18M5k85
$$ y = [39, -247, -140, -41, -241, -121, 557, 1, 64, -148, -154, -225, -11, -296, -429, 56, 34, -59, 221, -268, -28, 516, -773, -281, 378, -328, -162, -13, -715, -607, 421, 57, -81, 304, 195, 396, -60, -212, 119, 306, -349, -104, 386, -308, -164, 41, -292, -102, -140, -329, -133, 357, -351, 376, -71, -294, 239, -42, 68, 73, 392, -23, 279, -368, -4, 251, 73, 216, 531, -195, -253, -16, -22, 725, 544, -242, -151, 492, -30, -143, -139, 36, -49, -29, 1, 95, 139, -159, 273, -340, -92, 453, -309, -64, 261, 468, -71, 267, 439, -364, 33, 417, -511, 219, -427, -10, 308, 239, -95, 310, -153, -326, 98, 78, -345, 47, -18, -698, -144, 242, 141, 520, -132, 397, 708, 90, -238, 629, -554, 82, 432, 221, -238, 366, -405, -34, -218, -315, 367, 404, -248, -21, -339, -713, 237, -7, -471, 309, 311, -37, 372, -135, -211, 221, -87, -93, 122, 145, -149, 7, 176, -479, 236, -122, -201, 354, 136, 181, -104]
12677a04J94q5L26k27j47J13q14J078N3n29M8N25n14K00K6l21N31J54o45K00K57
12698C19n51M02j14l64l40J186m00l61K01k06P4j96Q2J82M5l47Q75j95k11M70
12718E51n66m57J007m39J5L33m20o69O45l43L58J65k91L79N8o61M08N9l27M02
12738B07K33o98R5L60p19N01M53o01N90k84k09K86j95j24J02l5l23N00O5j88K06
12759B22L44o46P21m43o74N97m98j36P15l80m49J366j004O3O8o6j71M31L8J25
12779B23N7m11k56P35p50O38j08m49P77l82p72N80O9j40K41K53j3j08M16j170
12799e70N43J59o22M00P57p96J25J51m52O91n92j69P88l56p33Q67m11K54O21n26
12819A29K87l54k03m3L87m80k33Q56n28J14m7l82O55L16k51o72J203q33o96J073
$$ y = [-104, 90, 5, 331, 104, -43, 70, -744, 334, 387, -142, -94, 431, -83, 117, 143, -178, 353, 507, -138, 62, 319, -232, 170, 56, -308, -648, 538, 138, -223, -22, -228, -154, -350, -268, -86, -41, -388, 487, 292, 81, 551, -15, -472, 535, 96, 111, 444, 24, -645, 0, -343, 15, 180, -111, 268, 326, -335, 73, 132, -195, 207, 440, -258, -163, 197, -522, -21, 432, -169, 421, 137, -72, 214, 19, -105, -3, -38, -361, 139, 204, 16, 222, 566, -80, 641, 198, -476, 121, -377, -513, 202, -178, -627, 739, -265, -202, -134, -200, -371, 60, 98, 223, 280, -131, -387, 348, -402, 236, 128, -321, 456, 74, -698, -118, -49, -189, 52, 305, 292, 184, 600, -570, -27, 132, -490, -90, 667, -129, -4, 147, -305, 386, -206, -375, 413, 57, -676, 191, -220, 34, 655, 129, 416, 62, -141, -184, 203, -277, -510, 346, -182, -68, -115, -497, 158, 474, 223, -449, 754, -79, -775, 298]
12839B98o21M56n3l05K84J20o74R47m20k99J52J68l81O47m24J82j63L37q00P14
12859A65L30l66Q5m53R3J91M71j352R41l04K48J37m17k1K93j12J71K81p30O5L62
12880G8l82N96M74j083L37K83o98P5N85o85P55j84j38J7k03j03R66k57q95J29
12900c33N39n33O18N8l71K92K41p35M30j11j33N27l98j38L15m04j9L18n67rN28
12921A15LL48l28L2n95P42l14K51L60o57J23O81j127K00J92m44L56L73p44P89
12941C56k12m96Q0O67o63O44k76l8o1J77p14Q26k16j01K49j71o58R59J72r84P65
12962C05m89m6N13k35m98P18o54K95M39j16j20L08m04j38N69l53m06O59l91k82
12982c26L85j52j07M04o03K5P75p11N81N9m33K28K32o67O31J18n62K23J3p00L39
$$ y = [298, -323, 133, 80, -225, 59, 179, -495, 452, 32, -267, -115, 53, -328, 319, -105, 77, -86, 251, -549, 165, 495, 129, 214, -239, -146, 45, 516, -836, 105, -199, 49, 186, -231, -252, 41, -71, 100, 381, -349, -284, 78, -304, 292, 766, -317, 20, 303, -395, -320, 265, -420, 335, 151, 13, 30, -173, -276, 690, 433, -462, -333, 206, -327, 291, 349, -22, 270, 511, -224, 206, 95, -38, 489, 91, -47, 268, -136, -155, 163, -404, -413, 115, 118, 466, 138, 170, -425, 317, 3, 254, 614, -43, 80, 761, -366, -166, 26, -418, -62, 311, -433, 356, 144, -352, -272, 395, -268, 376, 100, 62, 1, 178, -536, 290, 74, -27, 222, 51, -607, 352, 524, -460, 305, -184, -230, 283, 48, -450, 268, -386, -91, 348, 232, 112, 420, 16, -122, 447, 94, -312, 347, -44, -326, 59, -93, -200, 204, -399, -374, 401, -310, 271, 330, -103, 125, 357, -310, 321, 439, -123, 100, 113, -587, -248]
13003b48O12o61K95j3o22P67n52K78L71k17m42N80k13r3K36Mn10Q31j31m03K85
13024A54k93j07J70k12M76J12m28R5l84N77Q8j0m26M53J24l31j90L61o32M62M79
13045E38p40rL60l79O35p05r9L90p9j80K95M61r77R02J50q39L17j52P7Q63j052
13066b23m10Q79J61k55L75j044Q03Jq59P12P61r59n58J226q30J88K16o18M22K81
13086B69L0m29M58o12Q9P43o71n9J8N0J70M94q13Q23J85r53J07K69n87Q15n66
13107a70O1L14K43l87M10n70l92Q65o52J60J98n06N22K26j75j63J5m24K20M50
13127B45l62L87J59m89J49N4K5o36M75K36nk76j57M47J29j043O31K24l8K91k33
13148B13k60p5N43r48L13P04o17k00K96j52O55j54n79k0O92r58Q21m85m6L68l43
$$ y = [-248, 364, -297, -2, -15, -637, 130, -422, -144, 227, 10, -432, 148, -65, -158, 78, 82, -428, 403, 272, -131, 154, -139, -246, -76, -288, 188, 300, -128, -33, -417, 160, 248, 238, -188, 265, 389, 58, -132, 229, -403, 59, 538, -202, -211, 149, -230, 405, -300, -399, -9, -88, -268, 27, 488, -489, 413, 563, -276, 41, -111, -34, 829, -223, -633, 246, 407, 152, 527, -517, 286, 287, -572, 140, 901, -58, -616, 610, -220, -32, 184, -434, -12, 269, 299, -130, 328, -284, -195, 548, -123, -182, -164, -114, 56, 550, -263, 560, 745, -208, -101, 168, -419, 396, -170, -109, 205, 448, 61, 471, -99, -491, 374, -278, -118, 80, -426, 96, 322, 147, -16, -1, -425, -205, 245, -117, 270, 429, -60, 89, 143, 168, -468, 7, 243, 238, -38, -195, 252, 381, -662, -31, 193, 155, 446, 213, -47, -122, 421, -527, -214, 490, -127, -327, -31, -183, 472, 318, -261, -281, 411, -547, 274, -211, -257, 111, -232]
13169b32Q4M95o77l3Q10n60J37J92j26k45N19o73N17r4n86N12K99l12k00M97r21
13190e97N12J61k36q5K47R4m6J71j52j88M44n64M96op70Q84n56n7P83J16j147
13211d96J046o34j4O55q02N48o7k89m17O93k95j9L09l50J60K34k90k6M3n43O81
13232A27k23M3J7M08o65O86m76p1K90J70l23j29L22l31L54n0m93Q26l70m63O35
13253B84k65m42M09l21N8L54l86k66R07o12L3R26l22o90O04l14J12K55n94L38
13273F8L00p20R4J235q59m07O00r57N14J86k81L2Q16o40k06M82r70J118n0n87
13293b32j10P48r16Q42o9o51J071l30r55P15J4m58R27m89q23J215o13l04L75J40
13313I7M41l26l17LN88m70k73N79p64L24L61j98K38k48N22p73L39m71P18m3L11
$$ y = [-232, -148, 347, -330, -363, 447, -113, 24, 216, 90, -155, 364, -309, 208, 114, -472, 40, 339, 27, -173, 324, -597, -85, 76, -160, -245, 2, 96, 50, 221, 69, -119, 325, -239, 257, 251, -519, 365, -191, -248, 535, 651, -496, 550, -84, -98, 557, -245, 303, 236, -53, -470, 223, -72, -91, 218, -132, 28, 262, -28, -54, -11, -554, 127, -96, -53, -36, 372, -293, 393, -83, -154, 136, 306, -17, -146, 176, -155, 199, 149, -344, 482, 112, -351, 284, 19, -423, -14, -335, -277, 77, -309, -575, 332, -280, -247, 679, 357, -333, 271, -43, 69, 324, -270, 68, 368, -352, -258, 977, 118, -289, 311, -646, -132, 54, -227, -195, 621, -19, -225, 257, -713, 405, 355, -232, -342, 406, -510, 332, 263, -388, 683, 353, -602, 113, 127, -331, 596, 107, -716, 499, -114, -418, -43, 97, 538, 212, -105, -102, 486, 16, -257, 322, -442, -118, 243, 45, 283, 35, 557, -216, 123, -348, 370, 327, 638]
13334F38n25N77j398N97L49n34O4p9K73j2N61j037Q67n91R4J49m60M22N3k31l72
13355e95Q87n61n7P74p7o66P61n04n05O94Q8n51P50o46J25J2K97n7J40l68l64
13376d23Q55o06J96J71r7o42J064m22J16k56o79N12P36j043P38J09l38m65O65
13395A91q0M3j89m33K78N13p25L61K75m08N55k41n83P13J73r04Q50n46k68J044
13415F19p53N7M07j3r04N27k33R2L96p12M30L32l45r3N7l12L80J38k26j48O98
13436C94l85J09l33J41k46P64j05m69K15m55K5R21j138P05j13l20L53J98q06J03
13456d42Q96m77K88k83J44J58k90l76N64m15l09R22o13j78M96K6k72P30r57K29
13476a59P39j013L09M46m02O2P16q63OL96o51K83L24k06k66O18l44j66N83p51
$$ y = [638, 113, 690, -708, -111, 238, -296, -232, -311, -38, -50, 511, -526, 341, -250, -156, -7, -467, -45, 8, -223, -595, 292, -269, -326, 448, 371, -295, 466, -38, -543, 151, 239, -312, 438, -208, -83, -71, 226, 169, 309, -59, -423, 432, -174, 22, 193, 96, -546, 518, 96, 212, -44, -723, -211, 525, -518, 220, 329, -9, -474, 191, 111, 154, -35, -468, -190, 323, -402, -41, 234, -174, 381, 140, -443, 270, 443, -461, 389, -157, -425, 619, -134, -77, 330, 317, -587, -60, -293, -201, 195, -517, -87, 245, -100, -193, -136, -448, -68, 70, -156, -304, 394, 9, 118, -215, -74, -320, 444, 339, -130, 85, -370, -345, 576, -562, 143, 30, -290, 63, 261, -545, -442, 454, -23, 265, -18, 126, 284, -6, -382, 182, -233, -542, 380, -233, -411, 85, 111, -161, 569, -388, -159, 580, -433, -124, 322, -80, -18, 698, -165, -159, 237, -414, -131, 193, -13, -279, 339, -5, -171, 412, -339]
13496c39M37k7m06Q67k27p31O25m63K28mj26k42M41J42l20K56K71j089R17K15
13516D25n37J38k84J29O77n13k12O05n44K9P79j117M83K94p01L08L31m3m43O71
13536D75n97M4K84p7j2M33r53O15K03p54P71k77l17j96P05j53m97k24N45j49J94
13557F3l88K06J35l23M50j32j92JK28k01J84Mk33N11n20l2K11r8M8L54m86J6J56
13580c8l51j93J061j078O68O2k51LJ23k05P67%o82L02M6n54O18j27p75P29J34
13601B59m29P84k82p61L97l3k62L11j63j38M91l60j76K21J1k62O05K80q36R71
13621F28r00J45O70q37J8N79n18o4L33K29r9o9l96N7M93o18M52k61m75R90n47
13642a90J00N11l16p16O22j94m21P98k4Q0K78k10q86N92k14l34Q07K89o04L8o5
$$ y = [-339, 98, 71, -335, 532, 305, -426, 199, -264, -36, -40, -166, -408, 33, 175, -145, 111, 382, -707, 210, 425, -112, 26, -258, -129, 548, 35, -177, 428, -116, -87, 692, -425, 58, 352, -349, -41, 290, 247, -196, 475, -122, -78, 206, 129, 117, 550, -403, 212, 415, -339, 432, 155, -162, -358, 347, 194, -303, -527, 18, -131, 63, -325, -119, 16, -307, 143, 11, -181, -180, 48, -153, 31, 35, -198, 313, -207, -239, -28, -126, -78, 276, -210, -194, -38, -389, -582, 479, -599, 69, 131, -120, -117, 6, -199, 568, 568, -114, 188, 234, -320, 298, 171, -604, 125, 259, -170, 614, 332, -429, -32, -65, -327, -16, -179, -317, 174, -186, -362, -141, -130, -392, 213, 493, -343, 628, -272, -127, 543, -294, -276, 303, -215, -279, 54, 283, 184, 115, -281, -224, 269, -349, 103, -158, -633, 357, -190, -90, 421, 105, -611, 11, -183, -604, 194, 170, 250, 528, 318, -568, 24, -190, -524, 283, 572, -32, 6, -59]
13663e9j61M98j84o56P45j67p0L78p40N99m5m32j95O54L85n46J75l98J0P95k90
13684B96j98k47j28L91N6r24P49J85l21J28K81j000M75P71n51m6O16q29k4M57
13704A37l54M02k9l93M06k77l50Q11n21m17Q30l42k56P06n18q8O52n34l31L50
13724a16j77R1Q57q14L47k29k15L85J99l73L68k44n67L56L34m12K99r7o1J86k00
13745h3o1O25j54r08R45k53l05N68j42j062J317k16l6k51j5m63Q15m71K9N80m98
13766c9l30M37K02l16O11o33j73k1q6j00O84p4k70J6J76l2J27n21m55J216p54
13787c35k3K51l6j06L33m94O46l33l58Q65j94k43l18Q83p88O49J36p49N32l73
13807e5JL40K09l26K66n5q96R46j000k0J205p44L33j29n6l98O04J60n21L3n0l02
$$ y = [-59, -220, 278, 94, -562, 183, 16, -54, 324, -416, 183, 138, -294, -489, 165, 550, 4, 179, -219, -209, 586, 296, 98, -149, -277, 114, 170, -754, -5, 180, -141, -13, 268, -732, -257, 514, -37, -83, 533, -296, -320, 137, -217, 185, 156, -237, 169, -108, -458, 353, -168, -585, 245, -97, -353, 353, -165, -253, 399, -135, -466, -116, -293, -202, 655, -159, 188, -41, -256, 129, 328, -45, 323, 79, -488, -132, 202, -210, 89, -8, -69, 117, -83, -144, 481, 327, -581, 364, 111, -194, 374, 232, -830, 487, 271, 235, -16, -31, -494, 321, -150, -121, 459, -39, -369, 68, 270, -46, 565, -68, -241, -262, -348, -448, 236, 162, -108, -92, 84, 52, 179, -342, -797, 419, -335, -358, -107, -143, -249, 84, -410, 236, -97, -455, 410, 216, -27, -345, 538, -250, 399, 535, -214, 318, -55, -54, 286, 495, 169, 435, 380, -516, 430, -570, -590, 615, -129, 204, 75, 19, -379, 225, 385, -136, -103, -153, -455]
13829d55P54l18l41O87n78l76J118j059P75Kp30O69J16m23j40M76l02L05N62q73
13849a31M59j88l12M28n2m61O36r9m91M47l1l52J31K41k68k38J61J6L85p32N28
13870G7L24l97K40m3o29O42P8o42q6J054m73m23P71p70m4L56JR0K83n20N2j2K75
13893B04k10K19j95J20K99j79J45r21M15K0L62l22N55l94m0k49J64o13J058k24
13913B14n15O94m15l82J47J28k49P42l81l64K34M6l52O17l49n4P53q42K46M20
13933C38p36O2O16o26K36J69l09J26L45l37r4K28l64M01j35L40m38L68r82J290
13953D98m47l32P25q17J8K56K52p47Q19j44o19Q44o26L00J74k32k52P59n86J29
13973b8L29m15O8K35n05J9K67rk23L70PQ7j03k18J59NOl2O2oK19j93lr4M8m24
$$ y = [-455, 299, -19, -360, 327, -251, -627, 491, -568, 207, 209, -521, 148, 264, -159, -299, 177, -125, 180, 742, -131, 328, 140, -172, 256, 204, -257, 379, 280, -211, 236, 205, -147, -16, 225, -43, -281, -120, -104, 281, -451, 77, 401, 4, 244, 201, -428, 214, 292, -350, -436, 618, 145, -278, 493, -277, -321, 35, 36, 126, 409, -111, -59, -71, 204, -6, 213, 18, 138, 437, 258, 403, -518, -103, -83, 279, -43, 512, 118, 78, -171, -7, -620, 438, 214, -301, 393, -22, -404, -257, -129, -378, 364, -17, -381, -147, -101, -453, 164, -185, -239, 514, -328, -82, 338, -398, -336, 280, -346, -110, 59, -250, -124, 221, -116, -210, 18, -346, 55, -80, 260, -178, 190, -792, 498, 51, -281, 444, -373, -355, -99, 153, -594, 225, 81, -538, 306, -320, -20, 154, -78, -330, 429, -157, -28, 301, -114, -46, 189, -316, -297, -30, -39, -262, 108, 115, 202, 99, -119, 40, 45, 51, 19, 81, 75, 294, 101, 98, 4, 52, -372]
13999c72Q2M18p65J035k7n68M79j35o64N58p06O01L79l07j58P91p09l68M91J69
14019B24k9j45k09J22Q55q59m11Q46p32L58J14M4K8L80n84m55R88p62L10K94o71
14040b94L71K28m61N37m00l51N31J51r16R32J03q14P77q8j085J252l46n19L21
14059g1K02l06L44K52j049P17j26j68J82J48j51L66n07P4P06p34K88J94m05K16
14079A72r9n11P5N13k71n01J027m76j28Kk1M38l65j66N50J51l09m13K00k93M72
14100D7L50p21L97M67n84M63L8o90N04l93j25K84J01k30M81l64n19O45k3n29J054
14121F53n34Q7j39l44J45Q06j188N03O2k58N8P38r41M86J66n27LQ78j103q0M88
14142d1O4K52k6j44j68r2k70P37n18L06J04m5l16K80k3m8j01r1q67J341k44l72
$$ y = [-372, -290, 128, -637, 398, 371, -197, 282, 147, -517, 41, -665, -64, 315, 8, -150, 641, -68, -436, 55, 224, 195, 50, -159, -37, 818, -41, -452, 394, -338, 20, 134, 178, 206, 586, 2, -453, 535, -227, 83, 377, -294, 77, 305, -156, 381, -19, -370, 161, 312, -604, 328, 431, -383, 394, 306, -779, 473, 127, -392, -71, 131, -175, 169, 421, -628, 89, -37, -205, -23, 125, -26, 340, -167, -93, 613, -121, 167, 361, -44, 172, 73, -438, -363, 150, -121, -622, 405, -71, -199, -197, -218, 220, -145, -311, 239, 390, 81, -332, -132, -425, 47, 397, -324, 73, 540, -44, 419, 457, -233, 271, -122, -247, 37, 138, -92, 389, 25, -494, 151, 128, -401, 653, 119, 206, 67, -277, -132, 674, -514, -11, 51, -207, -149, 589, -352, 134, 300, -227, -224, 654, -449, -529, -41, 23, 275, 249, 105, -63, -155, -425, 312, -206, 100, 204, 159, -157, 123, 100, 52, -49, -140, -1007, 334, 90, -282]
14164b82P41o40J79N35n24q5M52n13N72n8m90l82Q56m91J2L1k48N01J84l83RN47
14186E23l92l43K49k27J58M69n71J73K27K12n26k72M62j06L60o94L09k8m77K21
14206b73j18K93K80L51q13Q16m54m52Q81r36M91J01j29p08R63l05l13Q24m79P6
14226I6N80j164K74N17n10mM27j97j56K58n90K36L22k16m13Q60l39P8k1m50P58
14247C46m04o50J109J7n33J64j80Q0K14J89m12J76ro53Q29m52p9J77J33K54K89
14268F05r03j8P31j20k67J60p03NR67q23M52J27m33J17O16m52j00K18l87M98k13
14289G7l23K82M62p63K98L60r72O44K84p4o82K55P8j25M29m04N1J35K03j19L87
14310D83p31K79K51m55O11n18q0O17r49J06R91q94k69N80l65M3J92oK0M72j042
$$ y = [-282, 459, -181, -2, 533, 9, -76, 376, -137, 435, 377, -113, -495, 361, -130, -118, -87, -335, 166, 350, -33, -24, 523, 131, -212, 37, -190, -32, 437, -134, 39, 266, 478, -48, -320, 142, 36, 396, -298, 11, -17, -494, -273, -391, -98, 182, 533, -280, 536, 82, -370, 511, -425, 66, 167, 38, -670, 293, -12, -325, 499, 20, 96, 676, -488, -214, 303, -207, -211, 216, 19, -137, 121, -469, -233, 89, -127, -540, 320, -19, 59, 38, -412, 346, -58, -708, 401, 418, -115, 49, -131, -51, 163, 352, -60, 116, 107, -546, 283, -169, -248, -71, 62, 316, 605, -298, -316, 415, 295, 28, 188, -515, -510, 457, -366, 86, 213, -220, -103, 513, 61, -39, 179, -208, 290, 77, -246, 36, 498, -265, 33, 393, -579, 65, 349, 275, -407, -152, -74, -199, 230, -174, -123, 12, 215, 96, 483, -248, 31, 282, -173, 438, -80, -160, 457, -492, -386, 605, -289, -558, 22, -343, -300, -108, -114, -94, 378, -664]
14331f64O24J90k89M00J0o84L35L67qn55P90r05M01R7p23N3O83m60O19K57q31
14352b93N95j85j42L94r27j82R71J62o96M69j53m6L42l44j13L90m80L33J64m5
14372B14k06J61m07M82j48o92O47O09o93k52K48k89L76J85j66M53m67k60K52L11
14392C58r59Q25l55KM14l69l75N00j48j56K18j13j94O93o6r48J032m41oO82p99
14413b05q5M39m0k95L46J5o91M37k9L70kl46m42J245p18J55R3m63J16K39j76M3
14435Fk9j83L10L9k33Q8N20r09K61M44p98M98J82m40j0R0M53qj09n27P24k71m80
14458c82M95l8j48L42k15j08j27l21N38K89j59k37L78m22r0R20o75o50Q96n45
14478b59L21J87r98L34P90n62m8N51j06K29k90l03K36M83k71m02L05m27J77L19
$$ y = [-664, -40, 150, -139, 261, 271, -413, -78, 289, 281, -274, 516, -389, 12, 109, -614, -561, 122, -338, 281, 538, -293, 302, 117, -25, 369, -558, -740, 231, 393, -303, 166, 13, -33, 309, -35, -148, 242, -238, 95, 259, 214, 8, 169, -238, 244, 96, -596, 51, 660, -33, -285, -37, -326, 50, 235, 69, 522, 55, -205, 47, 358, -601, 224, -131, -129, 285, -84, -459, 41, -107, -263, -45, -158, -352, 341, 275, -673, 359, -82, -88, 594, -205, -290, 149, 109, -186, 160, 175, -516, -79, -108, 262, 260, -86, -528, 717, -1, 154, 247, -216, -100, 139, -37, 6, -23, -206, 104, 143, -90, -2, 518, -391, -130, 314, -484, 14, 196, -244, -254, -164, 289, 281, 172, -355, 369, 98, -382, 113, 75, -73, 269, 54, -54, -181, -502, 36, 325, 166, -71, 307, -115, -205, 715, 40, -610, 286, -259, 62, 249, -749, -415, 375, -187, -235, 316, 210, 439, 149, -154, 82, 565, 294, -108, 197, -230, -53, 266]
14498B66m30N31j3j225J143M3k33J54n8o95M34P9k79O39l90k57J39J0k28R35j130
14519e65N76J62l76nO67k59l52L6L87k57p5j75j00P64n51j27M70r77J036K97n84
14540hK6J53%o02N87k28R0M21o67N36j78j82K75o14L07M8M91j073P20K53q55R00
14562D00m72m05L04j54P1Q89m29n95P61J53j177J410r34N9P94j064l93J459n12
14581A65j06K85n93L91K12l45l10L38m67k9N16m06O87j21j85N0n0l1M3L40p94
14602d10J232j056j35K29J40l14N26m65rN17J9m51J92O1k44K03l40l74R59Mp73
14623d89P84l90l0K46l91n4O90l27j57L75k57K18J36j90j14N93j250L05N44j29
14643A13q9K3j76J76P8n68N02k55J05j90Q57r40L53k44p3P54k42p40O45l56M50
$$ y = [266, -164, 367, 354, -871, 272, 315, 82, 236, 178, -517, -83, -4, -283, 356, -34, -291, -152, -142, -370, 565, -565, 11, 173, -203, -208, 459, 200, -152, -116, 271, 14, -61, -236, -336, 428, -123, -250, 220, -757, 279, 576, -8, 18, 171, 171, -431, 156, -72, 18, 439, -228, 308, 130, -52, 223, -391, -84, -36, 455, -618, 102, 355, -500, 400, -72, -477, -173, -327, -256, 633, 204, -391, 370, 523, -654, 756, -178, -119, 675, -389, -782, 677, 165, 59, 344, -249, 142, 354, 9, -301, 37, -430, -459, 57, -349, 338, 217, 32, 82, 32, 1, 44, 384, -410, 822, -234, -369, -140, 0, -314, 212, -253, -262, 255, 274, -177, 15, 76, -168, 35, -305, -679, 280, 284, -489, 295, -95, -125, 121, -270, -324, 366, 39, -118, 257, 0, 218, 354, 164, 50, 643, -607, -302, 242, 113, 24, 47, -129, 47, 125, -443, 59, -196, -91, -281, 576, -364, -11, -255, -328, 426, 184, -556, 89, -267, 183]
14664A83j69m94L26L09n6o75N06l95r0J030o87j64Q46j001J18M64o32L91L03o3
14684E0N15o55j19J64O28j009N35J89p03N24p6n88M28Rp01J356o25L9q3Ok8O77
14706E33q20k19N79o55j39J044k27N0M16p96L08k00O61l10K4m33m6N44m49k2K40
14727H3l19J32L19k97k17P7J57n01Q37k81J69L0l46j23N98o67K32N34Rr71Q5L37
14749a23K52J85n41M93l7m01P1J38M57J9q2n07N26k23o22P16r14M29j75K20k47
14770c66O87p27lP08n81K15O29j030K48R62j281K47N76p83Q93l28n20P54j24j49
14790B7J90j52p0m09O09m76O41n26n3P38m64m01O90m33q36J512o25n03R60k79
14810A40k68L03j36p1N16r90L75L12m34M35O12j330M90M04n75K05J09j12L20r2
$$ y = [183, 14, -480, -154, 155, 99, -576, -70, -465, -555, 475, -212, -376, 470, -531, -413, 51, -581, -190, 113, 50, 565, -90, -209, -45, 583, -426, 109, 298, -405, 119, 43, -545, -117, -108, -809, 547, -78, -39, -122, -116, -144, 533, -287, -506, 73, -582, -721, 323, 96, 146, 562, -234, 74, -126, 535, 225, 249, -184, -230, 314, -135, -157, 83, -236, -104, 215, -82, -299, -222, -65, -566, 271, -10, 159, 189, -157, -280, 318, -349, -117, 417, 426, -545, -460, -123, 129, 314, -227, 266, 229, -172, -101, 37, 494, 513, 431, -76, 450, 227, -395, 321, -593, -164, -339, -119, -366, 321, -406, -409, 299, -282, -67, 562, -468, -220, 742, -539, -292, 284, -499, 394, 66, -454, 300, 176, 27, 217, 65, -5, -414, 195, -281, 360, -166, -219, 519, 55, -346, 344, -89, -925, 587, -38, -541, 419, 140, -128, 175, 39, -32, 484, -506, -131, 181, -253, 182, 794, -536, -46, 358, -217, -12, 97, -15, 305, 213]
14830B13k71l95M87l77M43N0j63K96P5j17L2j44m41l33M81O4l16Q34o61J3N81
14851C51p04j32O03m25J69j16j9K71L78p18O07P4n59L08j10n94J001J42p17O28
14871D38n72o13O26rm07O00k6n6P43p38K51K48n93j19N41q20M05M47m52M03M1
14892C38l73J04K9l15K65j85L66j73l84J02M85q8m78J08J00k78L47j45k32N68
14912A61k01o9J67r7n17L45M63k07l8l23M77Rm9J10l7p65P6J768j056r5L66q67
14934c79O64J44n57J40K05l53L01k37n36Q39J73j013O36L45o96L72k39k6K45j42
14954a14l14P17j26o02P89K19r92L85L35n03K68K97o26L49J2PK30k94o0m11K84
14975a50k95R17k11j77J82m97q3O52q41N36J33l80O14K78o53L98n8o39J25J94
$$ y = [213, -58, -453, 34, -343, 100, 150, -13, 283, 358, 241, 273, 129, -312, -645, -164, -100, -416, 418, -243, -230, 351, -353, -485, 118, -307, -138, -254, -273, -2, 376, -342, 265, 339, -220, 88, -22, -616, 385, 527, -190, 438, -134, -747, -121, -130, -537, 63, 37, -19, 724, -14, 237, 485, -108, -227, 314, -506, -101, 346, -106, 297, 338, -35, 69, 98, -217, 48, -137, 229, 56, -328, -226, 259, 171, -307, -199, -99, -377, -30, -175, -407, 161, -40, -109, 58, -39, -556, -211, 252, 45, 7, -316, 161, 170, 121, 231, 194, -571, -495, 1273, 217, 122, 488, -379, 285, 429, -128, 12, 217, -136, 165, -72, -608, 231, 404, -609, 27, 372, -324, 48, -191, -217, 28, -114, -428, 289, 163, -439, 350, 569, -423, -38, 297, -206, 62, 359, -267, 82, 94, 101, 331, 37, -23, -434, -150, -445, 472, 261, 84, 266, -231, -314, 338, -503, 33, 166, -214, 400, 678, 25, 423, 365, -274, -149, 45]
14995D5r4J02L24n29J24M49m00L73m86j57L19j62K24N1j72K9M98n87l61P52m73
15016a31K07L0J29k07L01l46j01J58j44L84k42N8m12Q08n92j63N99n06L98K24
15036D52m24K1L36n20QR1j19L77q3r1N8L30p43M17j74K73j44N79q21N31k42m16
15058c04M84j67n37R22n16k24M86P4l76L08n09K08N77r93K28O32n52k33M01L7
15078e4k40Q26r08L85J87m92P74J1o74j36J57k14K24L89m16L0K45m17L73L38r57
15099e69Q45J8p64J173r31j27O90k24k5j60n4m11Q29N5p65N79k37K17O0k49q3
15120a33M09l08J43O9j74Q2j18m59N83k0K36n38J71J7J5L02o01K89R9K08n57P40
15142D55m51J73M7l67M6N00n81L05O4l43N69l45n67Q73m58k94O75k21p53O27k02
$$ y = [45, -49, 53, 377, -152, -28, 421, 21, 394, -92, -249, 70, -92, 132, 183, 11, 40, 538, -49, -410, 342, -131, 76, 106, 235, 28, 329, -17, -118, 40, -104, 280, 38, 96, -316, 492, -100, -263, 336, -170, 228, 452, 28, 49, 385, -135, -127, -36, -155, 222, 139, 48, 106, 436, -307, 110, -64, 209, 65, 644, -177, 354, 112, -304, 180, 13, -524, 398, -118, -342, 144, 218, -158, 150, -359, -151, 426, -567, -339, 293, -259, -492, -91, -54, -294, 532, -376, 9, 196, -296, 478, 489, -185, -321, -164, -378, -154, 235, -181, -151, 94, -323, 50, 388, -569, 276, 294, -470, 703, -228, -355, 335, 111, 86, -74, -128, -539, 290, 345, -420, 159, -78, 139, 199, -50, -133, 276, -32, 111, 180, 6, 88, -30, -489, 94, 74, 310, -228, -57, -40, -25, 277, -324, -35, 64, 272, -285, 455, 4, 177, 224, -143, -97, 403, -178, 127, 191, -152, 417, 72, -495, 378, -80, -374, 301, 80, -673, -46, -248]
15163b48O4Qm5j16N67m46k3L42l21K61L02j75k30M11l03k12R88j018j19M35l28
15184b06o4N00k71j5J81n58O8N80M00O7k77j16P7k34m99J0P85p44J75J29j02L08
15206A94l80m04O75j83k12L08K72j13q2rl79L81k18k52O51l84j58M20o11K16l4
15227c02k09K65M35m08J56O10q80K61P45r62m48P41j55J35L30k0L1j33k83N94
15247E03p58l24N90L40m67N54l69n21M13Q7m04L74N46r06R78k39q64N22l0N27
15267E52l97Jn43Q16n45K43M48o97MJ93K93m39K43m97K68O24o89J05L70j330Q04
15288a73J71l21K14K33k15j69N78o00m1L65k29n7M27p70Q98n12l31Q81l94k18
15308b63Q5p4q8K88M74n22L76q81O18M12n10j23M19o5r0n3j49l38L91M67l25J1
$$ y = [-248, -184, -176, -221, -337, 230, -216, -239, 103, -218, 43, 345, 170, -60, 351, 48, -164, 824, -194, -313, 122, -206, -270, 230, -41, -56, 125, -433, -365, 215, 615, 682, 405, 289, 366, 132, -367, -357, 428, -316, -141, -12, -114, 194, -186, -590, 85, -98, -310, -2, 270, 157, 75, 66, -313, 68, -150, -402, 249, -135, -293, 127, -484, -268, -302, -511, -246, 189, -219, -63, 547, -333, -72, 673, -289, -737, 4, -151, -16, 314, 294, 325, 192, -91, 503, -255, -579, 11, 351, -116, 438, 69, -452, -39, 48, -356, 18, 564, -342, 636, 397, -467, 55, 25, 552, 155, 156, -387, 429, -116, 127, 575, -122, -118, 75, 368, -71, 172, -325, -57, 567, -122, -17, 353, -977, -173, -2, -323, -109, 124, -91, -260, 318, -282, -323, 42, -187, -244, 183, -587, 311, -201, -532, 349, -45, -263, -178, -252, -340, -52, 422, -100, 276, -605, 13, 425, -85, -208, 211, 146, 56, 3, -146, -484, -93, 374, 49, 60]
15330F0J03k50L55m85K20Q8m44M36j48l1q0L04k92K66j96m52Q88Kq35N36K39o13
15352c29O10K26n58K71J03n53L34m6m01K87J68j58L05k68j39N21K21p91L00Qr1
15373B0K37m83k9L27k47K31k5l45P88j18n08L86k1n70J23M72N6n76Q3mM89J99
15395D85r84N07P1n31P00m9o75P32j84m21P05l58k50L39P4l73P78n22k13N25m78
15416a22k72J079m78r17Q89j83l63Q20m29l28Q18o24N59L99j359Q61l10l27M45
15435A58M2k82J04P4n58P27J75p82K05N50n58N20l69k08j49M30r8l31L18J20L0
15456A18K03k76J56k37l73O62k46J1N58o56j38K12O9m66M59j83K27J07m86m1P67
15477D47l44m64Q33m92K83k8l58K94J99n59m25J056r38L64L24n27K42L69m29j06
$$ y = [60, 163, -87, 268, -217, 3, 91, -353, 83, -65, -96, -176, 128, -164, 102, -94, -546, 342, 344, -491, 45, 284, -329, 281, 507, -51, 220, 323, -230, 104, 58, -343, -56, 112, -46, 259, -9, -148, 373, 594, -197, 103, 111, 20, 257, -226, -255, 72, -175, 56, 31, -314, 474, 356, -152, 234, 213, -357, -234, 238, 294, -282, -199, -203, 286, 485, -499, 8, 79, -452, 248, 199, -476, 256, 72, -349, 356, -2, -252, 87, 161, -212, 566, 44, -169, 356, -122, -394, 685, 207, -710, 179, -4, -367, 453, 24, -304, 514, -110, 449, 848, -511, 350, 40, -287, 158, 200, -82, 22, 96, -462, 265, 440, -342, -137, 413, -145, 375, 6, -202, -351, 79, -19, -350, -32, 88, 118, 321, 45, 201, -36, -409, 253, 7, 18, 576, -80, -218, -6, 63, -403, 56, -127, 100, 207, -279, -320, 447, 103, -361, 472, -20, 263, 235, -123, 171, 370, -189, -614, 442, -496, -132, 192, -335, -93, 276, -153, -259]
15497b59N06o58O68Qo28J34J15j78Q87j07n99P40m09n13N30l15L5J66M2l37Q85
15518G13o88k87P42m30OJ90m54J93M11j31n70L99n18J36P17p58N06P52j532N06
15538i7J94l61K52K44m93O70l27k07JK90o29N60Pl92L71q3j86O9J85j2L46j46
15560B56p51O94O6o04R6R3P6J56m57k8N00k58l3P69l95L31o85K59j88o8J73k41
15582b39K51q3j5M54p20M78M7r3J27rJ34m28O1K25P9K09p18M86n76k50O02p6o4
15605a18K04L32o28M32K0k78L79m10k56N93J49o81L83k6m90R94m29n77N33n62
15625d36L91M46o94O68J66q00N40p4l64K56K41l82O10J1q33j70M92q2n82O09l98
15646c85O91m43N34o43L3K73l8m3k32M57l74J06N51p45j52N27Q3k03M30r25L15
$$ y = [-259, 247, -411, 257, 265, -363, -229, -114, -292, 595, 488, -111, 629, 220, -293, 237, -78, -43, 123, 165, -172, 713, 25, -262, 480, 50, 56, 246, -208, -15, 396, 265, -305, 94, -424, -288, 429, -329, 177, 929, -603, -97, 97, -264, -12, 232, -261, 409, 82, -125, -124, 166, -463, 97, 104, -288, 83, 0, -186, -117, 68, 56, 402, 256, -495, 199, 265, -339, -243, -150, -74, 82, -375, -403, 97, -161, -194, 575, 180, 511, -174, 85, -103, -171, 2, -239, 12, -71, -86, 368, -352, 126, 173, 80, 207, 198, 332, -96, -35, 190, 269, 478, -240, 246, -330, -580, 22, -54, -118, 86, 418, -210, 222, 242, -36, 343, -67, -323, 270, 419, -262, 121, 95, -395, 599, 170, -407, 126, -436, -45, 401, -293, 375, 541, -259, 281, 207, -157, 99, 340, -42, 568, 579, -254, -424, 68, -14, -596, 13, -385, 306, -137, 397, -246, -213, 60, 22, -21, -253, 204, -170, -64, 487, -258, -410, 117, 200, -3, 427, -498, -183]
15667a83O05l00l55O80o72j79M94r8j28M00N3k9j22l53j03M53m98O73k93M66o24
15688a13K73n02R5O53p19L79J81q83N54P6m76J044n84j83J2P02j010L29K9M7K98
15709B02R8n54P72m02l03J90K52k6o1o7k24J75k05k16P90q75L95O35l33j76O7
15730A34o75K67L04j02l24P82o57J89J04K31r0J80q43K19L88m18K20M95k52j90
15750c8N6m02L16O8p21R45l80O30k35J73q96Q86k26n48L54J80j18L20l14mK06
15771B52k68L0k5J23j29O33r11O6R53n93p59R11k44K54j57j265R73N43q68K06
15791b75L39l08J70K97n26J26L66n69Q8K62J83P6Q8n23L9M58l30K17k01p2L46
15812B51J51l72j19N32n05N92n14o2j02K14%M59o77L03J15k14m3K78p0J12M1l43
$$ y = [-183, 422, 122, -233, 447, -225, -404, 90, -8, -136, 264, 317, 288, 166, -187, -290, 163, -335, 338, 45, 511, -113, 160, -342, -247, 406, -313, 66, 247, -636, -82, -6, -482, 562, -22, -205, -193, 509, -501, -172, -143, -96, 202, 300, -254, 518, 116, -187, 3, 255, 229, 168, 101, -123, 52, -153, -369, 421, -454, -59, 576, 243, 67, 134, -541, -274, 30, -72, -396, 386, -271, -82, 22, 253, 163, 343, -500, -281, 107, -311, -91, 404, 152, -38, 18, -384, -68, 0, -721, 224, -156, 474, 239, 412, -484, 402, 176, -372, -18, 162, 44, 364, 50, 46, 252, -16, 14, -11, 112, -17, 616, -295, -229, 724, 131, -628, 283, 39, 293, 136, -1129, -156, 387, -481, -275, 64, -244, -74, 223, -303, -177, 189, -380, -292, -30, 153, 229, 317, -206, -167, 291, -39, 178, -23, -95, 251, 402, 30, -89, 443, -62, 530, 16, -46, -148, 66, 66, 525, -152, 151, 266, 52, 9, 287, 217, 329, 370, 27]
15834B7k99O25q29Q6J238j115L28M03q29K91J36p30Q23l21k68N30K48m22m5J83
15854F0m50R00k26p95Q86j09l89K28J54o47P46n31J9J72p2r6J36r5o0Q44j002
15875c27K96O66r33M81L1L25n03P10r15M9N31n56L60k72QJ00J05n00jQ39m43K70
15897C21J23n16N90l37j57j91N56o26J29M45o43M09k73J99L0n58j28N78L27m59
15917a81L95m41Q2L33n55L31j19K32k92M04J0m86K68q0K98J24m36m54Q20p27O3
15938d11Q12n04m9J77n5J29M85o71K83M8p98J103m60r7K59On55K09L64j65q1K4
15960E3r97J286k69j81k62L97m64O61k58k95R12o38K55M33o98K12j10l29N00K4
15980B32k40k93M54m90k69R62m94N83j45m64k5j11k05P14k97j05J49M52j195N98
$$ y = [27, -272, 353, -476, -390, 848, -267, 61, 464, -365, -74, 62, -668, 155, -166, -434, 96, 344, -78, -123, 60, -390, 510, 284, -511, 375, 266, -123, 105, 259, -388, 358, -173, -154, 18, -54, -150, -14, -109, -169, 675, -327, -31, 635, -298, 183, 214, 539, 36, 746, -169, -120, 411, -145, 215, -57, -49, 51, 156, -344, -345, 494, 51, 321, 444, -72, 518, 181, 24, -167, 389, -237, -108, 337, -306, 103, -170, 29, 59, -499, -627, -49, 278, -181, 214, -227, -145, 188, -367, -36, -155, 77, -215, 189, 199, -287, -19, -99, 199, 323, -113, -567, 253, -474, -411, 401, -103, -152, 25, -30, 99, 584, -87, 196, 244, -554, 549, 89, -8, 251, 257, -298, -89, 275, 110, 29, 53, -944, 342, 73, -108, -370, 27, -437, 224, -34, -329, 583, -55, 200, 633, -65, 147, 37, -292, 208, 232, -8, -301, 153, -337, -606, 356, -138, 445, 300, -164, -189, -300, -505, 209, -88, -193, -44, 408, -787, -189]
16000a89M41p10K32O40n90j49K13l92M94k01J00O21k01m13M90O8l92M24q54K26
16020a42O00m39m07O63m81J96K61l54J08K5l68K34M82n96l79R22m71j65K27o7
16040a51l7M73n38O08k8o16M79l67L9k00K87j93K32J51m70J31M57l60m2K09p72
16061g08J138j09m71K53k70o8J062j037k57O90k01m37P05n16K18M66j69k12l2
16080D5m02M12K72p72O09K29p50N10J16o15J83l38K16J61O23l91J17kp96N27L01
16101B55n77P36M0n64K70k06k36J74J92m29M39j96J28P7O4o88N53j94j67N90q
16122B53m04L51n39pN78p00K67K36j7m54K20n11Q78M03r80M37K96q28M69O6l34
16143c20O37n73O3k09L98m27P96L6p37O08m7k67n6L81r59R27m08j70Q08j72q69
$$ y = [-189, 252, -458, -226, 414, -176, -325, -112, -504, -10, -211, -111, 510, 309, -104, 386, 454, 62, 486, -368, -142, 458, 19, -388, 275, -206, -10, 251, -103, 5, 30, -338, -104, 378, -218, -597, 325, -146, -311, -84, -151, -188, 285, -253, 355, 327, -289, 190, -177, -138, -338, -51, -244, -12, 139, -331, -200, 257, -103, -145, 64, -708, 430, 321, -150, 103, -167, -235, 827, -210, -467, 223, 22, -415, 290, -226, -8, 458, 289, 77, 45, -357, 55, 327, -445, 164, 393, -357, 153, 269, -346, -163, -501, -285, -124, 499, 108, 225, 223, -573, -46, 255, -322, 414, 454, -110, 160, -46, -282, -108, 84, -345, 94, -102, 26, 103, 167, -521, 32, -162, -329, 261, 253, -151, 200, -339, -346, 232, -468, -201, 35, 18, -436, -216, -727, 151, 554, -426, 11, 307, -521, -52, 14, -320, 317, -256, -193, -402, -4, -431, 365, 401, -336, 272, 225, -42, -98, 283, -676, 251, -157, -327, 481, 309, -560]
16164e60J059r95L06K58j87J06K06k45J24J62k02j70M31l60m59R38p88M87j46
16183c5N12o15O8j47J42j7l37O37k94j78N46l54m4j74L94m68M24L31m49K14l20
16204a64L6R04r87J90J32r3n98Q49J6k30Pj83j5K28J3J35n3K8j87N6l64L23J43
16227A86j21o04O34k46jQ00o67k29N76j79o4L75q41K69O1j69k03M91n56O57r1
16248G8o70O96P7j31O84p83m41P00n6n11M58m63l2L54l51k40J62J63J2R61n09
16269A58l28M06m38n5L8K70j31L24l14o3O4j60l82J322j113L22M68l74J07J79
16289C00o14j20O41n40k40J323j128M63J84n40R32j70o35M79q3j18P7j66n11M78
16309A2J57n61P44n65j06M24j92o7O83o87J92N5l93k6P26l26k89K55l21J82j32
$$ y = [-560, 499, -496, -190, 68, -119, -13, 193, -52, 72, 234, 32, -138, 293, -67, -526, 412, -376, 111, -35, 477, -138, -70, -217, -75, -92, -429, 208, -86, -264, 282, -72, -116, -290, 104, -364, 60, 391, -58, 156, -164, -128, 776, -211, -21, 111, 18, -580, 269, 285, 55, 62, -121, -136, 92, 105, 240, 187, 215, 28, 84, -280, 43, 186, 65, -539, 95, -151, -152, 648, -19, -248, 328, 149, 85, 460, -381, -112, -51, -220, -423, 68, -488, 169, 78, -592, 104, 181, 50, 734, -49, -490, 210, 154, -357, 101, -362, -394, -40, -391, -631, -469, -306, -294, 667, 158, -170, 236, -202, -257, -219, 51, -80, 244, -70, -133, -69, -229, -611, 711, -402, -80, 388, 14, 121, 300, -314, -434, 207, -333, -573, 750, -378, 85, 269, -271, 661, 491, -144, 335, 252, 134, 211, 45, -466, 12, 169, -392, 352, -213, -319, 105, -87, -154, 529, -158, 34, 89, -304, -330, 396, 70, -219, 36, -285, -103, -235]
16330b35l1L81K4k5j36N37o04J6J4l38L62K55K0l21L49l23M73k79o35P61l02k0
16352e7J84J21j48l4N6j07K24J2m00K00R5l72P01l70k20N70l05n72L24J99m28
16373c27J172q70l17R17o80O11r9l60n94O38
$$ y = [-235, -266, 115, 139, 114, -22, 515, -89, -73, -59, -397, -35, 220, 240, -81, 268, -55, 418, 139, -496, 265, -37, -57, 127, 248, 100, 66, 122, 15, 239, 251, -149, 51, 146, -226, 475, 105, -115, 455, 150, -422, -98, 101, -327, 845, -25, -342, 575, -105, 506, 407, 47, -547, 91]
16383I1
$$ Imaginary data points
##PAGE= N=2
##DATA TABLE= (X++(I..I)), XYDATA
0@%%%%%%%JlMnOqJ4k0K4k5K6l1L7m3M7n5O6p6Q6r8J14j36J67k13K86m41K824q38
35A710j220l01j34j280N23r19j03K33m74O71n3Q26n89J356P17K1M49M28n0k00
55A611M8m17N1m41r28k54k66p76j41j08m61Q14j34L35J068Q8k03J175J40J90P88
76B179n33l26J91q28P9l94r78n33J18m81k4o1n79P90P51q97P95J085L02P05L41
97A702j31M79j62l94o37j38m84n7J4j684P48p09l71P62n51O80J5M80N03N95l8
118F22L54l2Q57q25O13o92n27M41r06o53K50j104j93N44k4k21M88j39J229N62
138F44k78M94J044n43J3L47q06K60j31j118L30k14j203L04k09m27L97Q5n47J203
158c55J59m8O40P27m16J076m34l04N57p05j039O70k97j059O94j079m33Q08k29
$$ y = [0, 0, 0, 0, 0, 0, 0, 0, 1, -2, 2, -3, 3, -5, 9, -11, 13, -12, 14, -17, 20, -23, 24, -31, 35, -41, 45, -53, 61, -75, 92, -121, 165, -276, 2548, 1710, 490, 189, 55, -1225, -702, -1621, -1724, -1491, -1965, -1294, -1347, -521, -1110, 246, 963, 984, 1433, 1861, 1811, 1611, 1659, 1242, 1293, 852, -76, -330, -596, -1372, -1513, -1621, -2082, -1268, -1402, -1067, 1, 89, -114, 1061, 1201, 1391, 2179, 1646, 1320, 1511, 683, 762, 368, -610, -1143, -1025, -1506, -1530, -1591, -2170, -1380, -629, -1526, -731, 354, 656, 1361, 1702, 1571, 2050, 1888, 1494, 857, 719, 235, 178, 192, -1492, -744, -1453, -1824, -1062, -1613, -933, -918, -438, 65, 660, 622, 976, 944, 1801, 976, 1589, 897, 370, 811, -95, -748, -498, -1602, -1795, -1251, -1275, -1496, -1008, -1147, 82, 644, 366, 860, 1904, 1361, 1374, 1721, 915, 1175, 1044, -74, 256, 42, -1161, -857, -1066, -1493, -1096, -1011, -1558, -355, -196, -244, 396, 1123, 707, 1783, 1349, 1045, 1602, 897, -142, 528, 231, -828, -134, -1213, -1646, -838, -1067]
177a067Q9J48p83R99J096j98q7P59J65J10j59l14O7P1p19j90J19j011kj7p01K39
199a386N92m29O91K22j10O20q7K37K86R40r34O33m02l79J55n82k26j79k75o74
219a287J46q5m77J185J21lQ81l57M26N41l3k39P37r24%k34m35N4J04k40m53Jm58
242a029Q8l87P3P72K20p65J111j14J6J327j16J77m48K86n86j99ol8o12K56r65
263i39L66k09o72R39o93P53L57J94K16O72r04P14K97p43M23L46j073J00m07k30
283d93l83N43o42L46l63j63M58R11p05O9R07m91M90L99m98L17o2l46K64r23J05
304b60J06p7o46K88J02n77K75M29q9M77j12J17M31L56m42N44l93k83M21n95j85
325a13k74m36P09o72L54l32j0Q22j81k76K87K05R00p44l14O19k06J64Jn45m8N08
$$ y = [-1067, -978, -830, -1613, -614, 482, 284, 197, 956, 1121, 1231, 1072, 758, 825, 896, 177, -13, 106, -905, -907, -924, -1625, -1386, -794, -1223, -532, -310, -420, 200, 113, 350, 636, 1576, 642, 1275, 873, 494, 649, 67, -159, -338, -613, -1287, -1141, -1226, -1703, -518, -397, -400, 481, 124, 550, 1091, 1058, 819, 1556, 632, 632, 398, -37, 17, 121, -119, -572, -571, -1029, -941, -1328, -1255, -483, -263, -1028, 83, -31, -15, 1312, 1196, 1373, 925, 1211, 625, 426, 420, 382, -230, 26, -939, -573, -782, -1454, -515, -1208, -455, -98, 96, 312, 984, 80, 794, 1091, 348, 771, 1117, 44, 144, -263, -493, -876, -333, -975, -629, -992, -1155, -697, 214, -491, -422, 485, -6, 484, 883, 385, 702, 640, 294, 558, -365, -260, -154, -231, -877, -589, -487, -1064, -789, -360, -449, 28, -84, 33, 464, 820, 378, 922, 529, 246, 667, 72, -113, -387, -823, -114, -786, -432, -764, -774, 48, -133, -409, -122, 83, 983, 239, -75, 544, 338, 502, 503, -42, -90, 418]
347D18n66J16k68o02M67L25l54l7k19o4K67P92m63N93K90o80N24J73n02R0j24
368A76j30K94p39j89J95m0J43k1j70k13Q63n63l15J073n6k50J23j13N06L7o12
389aK48n30K09J5n8J92l04j73o45R17J53l70J92L55l95O97J6o56P34J74n59j38
411G3k25K38n5l29l44Q70m09n59NN23P3L85j01p08J361p89N81m4n40J65J52k89
433C4n05J006q58R7L31n13j16J64L28m45O33o39K36O62n2J27q8o77K95L45r70
454f05M58L33l29jn27J37L86K55o71L33K89p1M96j24l53p5L62n1J17j77k95K11
476I8l52J14K06o75K98L20n01K98J63J17M07K27r39J58P90n06J06J54l23l89Q20
497E91j044k46P74l32J02P8m9M50j40l86R5M65q4J93M7p98O41K78j04N5p13m90
$$ y = [418, -148, -32, -300, -902, -435, -110, -464, -501, -720, -784, -517, 275, -188, 405, 695, 15, 539, 712, 210, 300, 176, 46, 340, -399, -588, -393, -433, -290, -311, -481, -694, 169, -394, -709, 364, 308, 58, 181, 68, 574, 611, -1, 247, -283, -74, -59, -117, 75, -229, -402, -1047, -130, 23, -347, -155, 200, -195, 502, 518, -138, 596, 770, 211, 73, -152, 86, 31, -298, -642, 228, -181, -740, -735, -212, -139, 246, 145, -563, 798, 9, 590, 546, 6, 171, 323, 34, -471, 535, -323, -226, 105, -408, -524, -360, -32, -477, 156, -483, -247, 415, 363, 490, 402, -275, 20, 365, -605, -147, 186, -143, -144, -671, -534, -148, 107, -564, -231, 58, -13, 483, 359, 6, -69, 293, 242, 359, 182, -113, 98, -254, -140, 66, -609, -311, 9, -492, -194, -31, 86, 493, 720, -219, -61, 729, 223, 329, 483, 160, -229, 591, -453, -699, 75, -257, -155, -77, -126, 324, 184, -202, -107, 358, 274, 467, 514, -284, 357, 635, 531, 586, -127, -617]
519f17L50J28o66R04l00m59L25K1j91O99P4m08N12m93O4N83k95J55N4J35o33O09
541E51p53k23M52p47N11k64m0M12Ml64Q80K99q05N43m5k38L87k36p22Q82m19m48
563c83O91p09pJ06j86l1L40n9n21J27O98Q9L55j29k45J038r41K88J27n76j85O58
585E45j491J34P39o51j06N24n75M09K24J55L18N8l86M88L43n45R42n38l8n71J63
606A41m15J96l55m76JK17l54R99l86j78P39q6J3Q33l03l10J190j096r2K83j74
627C87p25M21m34Lr3m20M12r2l04N26P39o15m9P26m25Q68p3k00k47P02j494O83
649B96M7m10q2k24l63J34Q1k49N98m95J99O24j08r4N49L35l01M05l53l04M22M1
671G48j111N08o25m52R2J94k32N90j93j22M15K23j20N63k93O6R35q04K47K06l0
$$ y = [-617, -267, -139, -805, 99, -201, -660, -335, -314, -505, 194, 268, -140, 372, -121, -57, 526, 231, 386, 440, 575, -58, 551, -202, -425, 27, -720, -209, -473, -513, -101, -97, -461, 419, 718, -87, 456, 411, 173, 560, 324, -398, 484, 65, -383, 308, -401, -408, -302, -488, -519, -179, -238, -759, -632, 66, 155, 510, 381, 136, 1174, 233, 521, 648, 72, -113, 545, -946, -812, -73, -724, -830, -306, -881, -472, -248, -93, 225, 283, -103, 385, 728, 183, 1125, 587, 549, -22, 141, -274, -78, -433, -909, -908, -691, -1045, -46, -432, -610, 129, 43, 56, 889, 586, 276, 1466, 370, 278, 561, 387, -338, 83, -351, -348, -441, -861, -449, -541, -845, -319, 420, -195, -244, 482, 57, 925, 852, 652, 405, 1107, -387, 296, 343, -67, -149, -373, -736, -602, -521, -770, -172, -667, -468, 156, 48, -46, 503, 838, 537, 942, 589, 285, 707, 748, -363, 145, -480, -932, -840, -646, -878, -288, -481, -603, -188, 35, -85, 478, 185, 251, 1186, 382, 629, 835, 805]
692H05l46k19l92n98Q39j255N20k14K87L0L56m52J37Q55l81Q59R3p24J219m71
712I48p19R60p45p33J89K38q02N39r50L5K15o12N34Q68l64L90R7l47Q70O85j24
733A172l76L92o76k45j18k13k27j62l5L39l6m92K94n1q6N84J75j76J53K91o3K82
755G26r9q0P35o34j196J090o70m08K16k44o35R23m62j55N09K77l3P16p3k94N67
776G76o6K94m42k2l50P95r41l22J59q30J60L17q59N18J68q7O07K26l92O44R22
797A275m94j43K21j09J97p25k01Q08q87n75j28J30o59L94K72n19R15k32N23K54
817C17J77L6K27J1q4M30m55l67M40r59k19L42m60o01P97n44J42Q2K34j0O37l4
839A39J46N75n22L50P45p25J7L3m64k61J59q52M71k1p17N44l5q72N58O04M84k94
$$ y = [805, 459, 240, -152, -750, 89, -1166, -646, -860, -573, -543, -187, -639, -502, 353, -28, 831, 924, 200, 1419, 948, 229, 1189, 444, -289, -100, 138, -664, -125, -1075, -1040, -825, -1437, -903, -35, -399, -9, 88, -259, 611, 1296, 1172, 796, 1188, 512, 267, 149, -64, -291, -453, -488, -149, -185, -677, -383, -434, -520, 64, 239, 63, 216, 507, 444, 726, 627, 547, 1282, 648, -548, 542, -128, -536, -320, -564, -1199, -276, -738, -893, -384, -107, -140, 576, 503, 209, 776, 710, 1004, 562, 540, 190, 985, 44, -278, -119, -949, -789, -472, -1331, -813, -645, -732, -125, 101, -291, 353, 1275, 781, 638, 859, 750, 947, 222, 21, 829, -58, -633, -761, -631, -1290, -896, -624, -1143, -228, -460, 63, 317, 494, 530, 757, 768, 684, 1114, 659, 292, 732, -227, -446, -104, -564, -1165, -368, -912, -770, -688, -454, -464, 173, 139, 285, 860, 338, 688, 1433, 708, 725, 758, 294, 33, 192, -660, -189, -210, -927, -383, -418, -1290, -732, -128, 356, 62]
861F2L97q0M42k3j94L79K2m91P6j85r93M72j83p02N64k29k64QK58jN56Q4J17J61
885B53M94j70N20l47m33L5j12l00K18o51J4J74l39M60k38n18Q32K85r6n3K72J90
907D90l37M57K2N03m72m28Q95q86n21N49j073J34N3l04L90K91R9o46M77N55l18
928g0P45N0k99N89l61n01Q95j014K39L32r73l1j37k56K61l5o02Q18M57o45P30
949A92K20j48L33Q9k60J41M10n80N32l64r56N59m85j41k35M71l28L46n40j97Q29
970a12j55J94L32P17p69J039o20k12M76o62k47N44p24l85L85l41m83K46l62L80
990g59N84n13O93M66n38L99Q2j6M12M21r60M94j79j256L55J76o83J56O92q14K52
1011e36%n7M50k2n7L21N53j41m54L08q7o0n0N2L68r31j45L93l50l49O14m78j51
$$ y = [62, 459, 379, 821, 798, 604, 983, 1005, 514, 590, 405, -588, -116, -299, -1001, -437, -666, -930, -922, -664, -665, -109, -25, 92, 253, 747, 577, 1097, 750, 317, 352, 240, -60, 158, -493, -479, -305, -644, -184, -422, -940, -108, 177, 81, 28, 300, 490, 153, 610, 632, 1135, 663, 235, 1130, 244, -277, 272, -801, -667, -614, -918, -528, -237, -138, -784, -307, 248, -70, 675, 725, 426, 1015, 654, 153, 1048, 34, 273, 605, -368, -399, -536, -792, -531, -566, -1168, -350, 107, -538, 192, 412, 264, 597, 686, 426, 567, 977, 397, 929, 565, -391, 168, -317, -458, -693, -222, -550, -204, -744, -941, -112, -267, -73, 259, 976, 207, 1246, 626, 414, 890, 228, -19, 525, -199, -584, -199, -540, -1023, -777, -1139, -759, -175, -688, 5, 471, -67, 332, 414, 398, 810, 1231, 271, 765, 586, -670, -315, -139, -822, -666, 26, -788, -536, -536, -593, -143, -165, -222, 99, 652, 511, 57, 365, 278, 218, 168, 220, 588, -343, -488, -95, -445, -794, -180, -658, -809]
1034h09Q15l24P25l06k88P33L69q65k07P32j09n9M33r87L79l94m66R57j098m68
1054a237N79M03p5K11K73o78N97P42j191J605q33Q0M22k33p46L49k19n25j71O4
1074e83l30O69n65jP25K36q24P72k52K65L18l33L34k72J41k64L74o24k48J99l8
1095c01K01q6k11o9J60l13O1M78J68J16O66o77N99m39n6N12n47k55M50n6r59N45
1117a3m00k60R10l40n93M34N1n5L74j99K69L82j40m79O60m52k68N94n27m1K84
1138A91n07K6j38M09n28K44K5N56o4n94J99N12q2j02N38o80N51o86k44O88J28
1159D42q02K05j82l55K49m38M74L15M04j075O58M69k99K19M28n28L31n46j57N53
1179C65l27l11O53n58l88K51K27l62L49J37j62O51p45r5P93n43K39K00j38J52
$$ y = [-809, 6, -318, 407, 101, -187, 546, 915, 50, -157, 575, 466, 407, 840, -147, 232, -162, -628, 329, -769, -1237, -658, -255, -330, -119, 154, -524, 73, 815, -376, 1229, 396, 476, 898, 665, -81, 268, 49, -476, -647, -583, -913, -244, -809, -810, -85, 151, -673, 99, -153, 112, 430, 97, 431, 159, 300, 36, 410, -214, -462, -263, -301, -100, -186, -397, -466, -306, -619, -558, -80, 88, 204, 870, 193, 792, 353, 297, 809, 262, 7, 457, 401, -558, -13, -413, -673, 237, -103, -696, -262, -211, -266, 108, -91, 178, 560, 420, -59, 601, 149, -119, 475, -52, -93, 191, -316, -290, -428, -19, -547, -303, -278, 278, 214, -380, -181, 331, 249, 147, 685, 5, 556, -130, -374, 314, 442, -360, -155, -337, -692, -443, -881, -407, -92, 312, -763, -105, 364, 65, 284, 712, 184, 515, -31, -188, 365, 38, -273, 380, -178, -566, -315, -88, -450, -101, 36, -126, 525, -220, -315, 478, -65, 174, 374, 236, 388]
1199C88N3k5m08r5r9M28j36q16P54m49k3L86K36m62L44o3L03j14j25l44P3O95
1221E01n48N90k89n14M66k87k22M37n01j9L35n04M69N75n76K29J14m43M86N16
1241H15j494P54M54m72k19j4k50R1J04J97K87l37m84N20L63p37J011k37k35J11
1261B28M59n56L20j84m14j7K7j2P06o76j34L57q7n82O23k98k15Q13n21L01P73
1282I11r55o1P07o49N2J66m21J94N16m03j7J28p17M46J52l88K32O78p73P3P33
1303F04q58M77O0l30oR8m71P48p54k71O52j70k1K02l8l05N31Q9k15l7K69k66K86
1326B74m00M0Q14j253N20M8n99K90K89j72r1P8n39P12Q3k57N79j11n49K73M73
1347E02k63l11O75r68R76q47J32J72K07p12M67kn65L76N4l99P10J36l20P23m44
$$ y = [388, 441, 416, 8, -87, -186, 242, 106, -710, 44, -405, -428, -42, 194, -268, 76, 13, 316, 202, 77, -267, -194, 501, -47, 543, 254, -260, 206, -81, -303, 134, -367, -386, -51, -555, -86, 489, -87, 142, 256, -187, 299, 815, -679, 75, 529, 57, -162, -176, -426, -335, -231, -34, 253, -84, -568, -48, 315, -422, 589, 352, 117, 228, 687, 131, 451, 267, -147, -164, -137, -149, 557, -119, -253, 104, 17, -565, 58, -240, -455, 358, -163, 138, 911, -44, -105, 602, -47, 5, 171, -250, -56, 460, 57, 40, 168, -549, -103, 49, -339, -107, 571, -202, -129, 604, -254, 223, 283, -47, -53, 45, -426, 322, -432, -703, -51, -221, -242, -40, -78, -383, 148, 237, 22, -15, 254, -12, 274, -126, -86, 728, -525, -5, 43, -556, -266, 23, -149, -240, -162, -701, 11, 94, -163, 416, 305, -244, 29, 502, 239, -72, 603, -365, 611, -236, -104, 68, 275, -437, 30, 28, -537, -161, -107, -506, 204, 340, 20, 743, 299]
1368B99j39N95m93m28O91n24k85K85n94K33L51j82j70K3n2k31P20k01r5N38j51
1389A90p9O30r16N13M38p59l22N47o69R79p27p50Q65j24k39M64k03J49K6P0l27
1410b44L20J41n69R22K1p20N94n05j41j8l08K95l80L63m39Q09m83k47P50k75K13
1431I9M28m72j70N88m23J61J0j88p6j30m36L27J68k1k65K39m55M08L11r8L00M3
1453C48l28J57K3j26M61k26n00M78q1q53M06k00l00P83n66j77O22k06n1M35K50
1474C49l30J73L6K80m03J20K9L56o93p2J1n1j02l52k03J11N42k95j83R20l81M94
1496C56L99j095Q29m7L6K25l47j13O7m75j92o4J81j08P98j053K73M9L03Ll16L68
1518G7r9O5N58l62N67m69k54Q99q75n73P27k01p30L31p2l6O18m90q5K88J15J50
$$ y = [299, 160, 755, 262, -166, 525, 1, -284, 1, -593, -360, -9, -191, -361, -338, -390, -621, 99, -102, -197, 341, 190, 111, 741, -175, 338, 776, 17, -305, 242, -427, 552, -175, -925, -60, -184, -423, 41, -162, -13, 13, 83, -244, 76, 217, -352, 570, 591, -129, 465, -40, -181, -199, -507, -212, -592, -229, -668, 141, -342, -589, 161, -114, 99, 527, 55, -115, 473, 50, 211, 221, 33, -43, -173, -609, -282, -114, -135, -400, -161, -616, -208, 103, 5, 305, 348, 20, 177, 200, 74, 535, 309, -191, 287, 206, -647, -241, -441, -741, 42, -524, -701, -79, -285, -336, 99, 349, 19, 192, 228, 508, 105, 225, 254, 610, -83, -155, -144, -195, -297, -649, -852, -741, -199, -494, -677, 243, -138, 356, 755, -340, 489, 442, 478, 703, 356, 243, 310, -165, -357, -421, -240, -348, 450, -603, -330, -281, 22, 25, -291, 77, -22, 43, 601, 239, 806, 337, 83, 982, 107, -466, 261, 60, -670, -339, -411, -447, 171, -319, -404, -116, -1, 149]
1540A49M03j9k22K94K85o50L41n66M85l40j052J237m08q22O63l54m90O02J80k58
1560e42N81j3oP16p19K55M07l42k87L88l99j61L15m40l70J010q81Q9P35q31r4
1581e89L48J7k09N53O6N18l58K54m3k64k55j09M11k56J95m83q32O52J93m50J92
1602d49Po5L42O06q91P92L0J73k88N44m53m7J30k78J90m40l77M31j55k20n05L
1624i20J47P52J85o39P78j93m64N35J28k14O09m16j79Q0o14M35k03o01L11N69
1644H6o15J29L38J5J77k04r2J045l40l45K45J6n22J76K54o81Q30o58m20O04o38
1665f00L0L10r8J28K74l23N09N80p27K56K47p1o69Q53j69j94P6n47J02k04m64
1686g01M69K29m10J86J58o96M69K18k26N38R2m66N87J76n01L52j26J00j88M44
$$ y = [149, 552, 533, 311, 605, 890, 240, 581, 15, 500, 160, -892, 345, -63, -885, -222, -576, -1066, -464, -284, -542, 39, 26, 20, 736, 17, 272, 679, 337, 50, 438, 39, -122, 193, -247, -617, 393, -488, -399, 336, -495, -589, -241, -224, -433, 120, 186, 704, 346, 600, 557, 293, 38, -71, 340, 84, 279, -204, -1036, -384, -191, -641, -449, -442, -507, -165, 441, -450, 342, 372, 545, 257, 801, 348, 301, 431, 153, 343, -97, -474, -43, -198, -418, -923, -920, -773, -21, 164, -475, 303, 110, -354, 181, 309, 95, 704, 288, 109, 189, -425, 10, -193, -794, -483, 86, -529, -400, -62, -47, 130, -74, -166, 879, 539, 194, 439, 455, -67, 109, 363, -318, 512, -146, -566, 38, -600, -570, -260, -358, -230, 44, -279, 230, 810, 83, 339, 586, 515, -154, 699, 530, 336, 412, -135, -33, -237, -701, -232, -3, -413, -227, -69, -765, -296, -78, -304, 234, 326, -140, 447, 623, 122, 474, 348, 448, 260, 704]
1706G04q74n3N29q34K27n20RM97K78k57P30j66l13R66k53l83L62k95k02j20p10
1727f78K56J2K15l21J03l50M19q0P3J15K19m47N26J089j086K00o4L77m33N83j062
1748c34Q67p02l95O54j19m57o9N70j40n60P91j42L46l74L74M31J99r71R89n60
1768C98m27M38l24p04P08l19m0N63q67M1N92l38p3K82O8J1M33o03j8R44m85J49
1790D29J4n25qM99o29K22j68j30N01q3r94O13L84j37M3K32l46L49m5l51P91n09
1812A52m9J73l68M2j19J58q35M90j1r1P54m76QP9j21K52Q7M3k65M78j47N03l17
1835D20l64j90N12l12j0l08k85J46j19M68m14K10j00N20J33m34L87K92m4J58m81
1856A85P2O22m97n12M48j11o83J24O85r97K75N09j58J6l45L95L14n24M86J78l26
$$ y = [704, -170, -223, 306, -528, -301, -821, -812, -315, -37, -294, 436, 270, -43, 923, 670, 287, 649, 354, 152, 32, -678, -422, -410, -195, -516, -413, -763, -344, -424, -351, -236, -17, -464, 62, 1151, 65, 265, 201, 578, 145, 728, -334, 533, -169, -564, 90, -29, -486, -555, 15, -125, -685, 106, -36, 310, -64, 310, 741, 940, -31, 958, 398, -29, 409, 85, -619, 89, -230, -270, 293, -574, -533, 59, -279, -352, -70, -2, 9, 442, -161, -179, 765, 280, 429, 443, -82, -90, 409, -220, 2, -166, -296, 205, 122, -872, -259, 125, -12, 31, 263, -83, 266, 221, -130, 661, 152, 103, 276, -92, -50, -169, -11, -846, -356, -367, -458, 296, -180, -172, -93, -214, 38, 125, 168, -97, 381, 234, 737, 420, 56, -134, 378, 66, 56, -252, -537, -391, -510, -42, -456, -246, -346, 174, 307, -127, 260, 552, 508, 666, 185, 257, 879, 382, -130, 318, 207, -476, -352, 333, -664, -389, 120, -38, -22, -367, 28, 342, -182, 304, 482, 156]
1877A56l6N07R0q61N29o38j98K69n92P02L31l84j29Q39j171L31R27j153O76L93
1897E88q98O88M36o74K19l25l84K74M6l13L74n47k30M08j17j84O25J02n88R33
1917D33l30J53j78J2Q6M60o02O8N6J23q83K32J99n5M03m10L6K83k21q1M47n99
1939c68N39K50k44q5K29r4k1M00n58n6L63j120K34P93q37K33O23m71K81J4J3J39
1961B57J54m14K97m01K0L71K01l83J36k32O4n5j55L34m71j15M86L79o03k45K50
1982a25Q3K26J48j16k93O24p84L72o1p57R47k23l70J40j3L50p13N65k8K1L47m80
2004a40K43L39o47Q11m87q57P95J79o17L74L22o34Q79m12n63K94j78pM52j87q47
2025h88R24m63O45j35J54M7j16n29N46j71m26O28k93k87J12O21n81J32L05m63
$$ y = [156, 120, 627, 717, -144, 385, -253, -451, -182, -774, -72, 259, -125, -254, 585, -586, -255, 672, -481, 195, 588, -310, 378, 814, 140, 359, 34, -350, -76, -30, -343, 31, -516, -746, -338, -455, -639, -14, 88, -500, 433, 103, 256, 78, 90, 176, 636, 34, 102, 158, 281, -602, -370, -171, -226, 177, -233, -197, 86, -135, -216, 231, -368, 171, 421, 177, 92, 321, 227, 206, 606, 48, -8, 355, -765, -531, 262, -575, -342, 281, -190, 91, 105, 118, 257, 411, -3, 294, -107, -87, 284, 485, 102, 238, 6, 70, 15, -140, 194, -277, -392, 94, 473, -130, -375, -125, -42, 184, 332, 216, -77, 547, -237, 135, 74, -683, 264, 41, -329, -189, -202, 148, -565, 0, -28, -7, 340, -140, 103, 442, -205, 606, 119, -738, 57, 236, -381, -7, 315, -319, 560, 148, -415, -121, -299, -306, 146, -41, -888, 36, -427, 218, 83, 237, 284, 168, -361, 185, 14, -412, 216, -77, -364, -252, 369, -212, -80, 225, -238]
2045b38O81j35o51O63L09r13O99k88m08M30j1l36K43O2m82K89K13p79L12L14k0
2066d6M9J16q17J233j008N94N35o27r7O4J62p09O01j63k14M5K00J04K89r00J87
2087d02P23n69M79l48j98M90K39l91r6M29o53J72M22o5m85K70k54K85p23L72O17
2108C14j66n04R95l95q65R98l29J03K81n98k78Q58o75m6L16O7j69L27p22Q0R01
2129D93j096M22L23J29k0k34k01n7q8Q86o29J10o7O83l50k27p7J54n00Q7n4m1
2151c54K7J173q02m44L49K27j25L5L88K0o55j08M72j88k82O3n73N16N49j32k64
2172a08j20N72p12J014m24j00J89o55K90N1K34k95O59p51k26P96q45O3N6j27K49
2193a90O96p12O1M45j34l15M96n24K80N32q16O15o4m07K62j31l93n8L55j08L60
$$ y = [-238, 443, 308, -343, 320, 629, -284, 415, 127, -281, 149, 138, -198, 45, 107, -375, -86, 127, -652, -340, -26, -46, 3, 119, -698, 535, -473, 121, 656, 29, -68, -4, 158, -551, 50, -113, -327, -282, -82, 22, 311, -589, -402, 321, -248, 231, -117, -315, 175, 414, 23, -73, 356, -297, -125, 297, 232, -253, 17, -237, 48, -675, -303, 314, 148, -356, 639, 244, -621, 377, 48, 151, 432, -166, -444, 414, -261, -307, 9, 76, -93, 234, -488, -408, 493, -603, -181, 142, 271, 251, 17, -184, -241, -329, 557, -72, 38, -29, 654, 304, 77, 0, 154, -346, -259, -313, -354, -327, 846, 44, -400, -51, 176, 51, 86, 474, 494, -161, -269, 203, 15, -267, -204, -777, -261, 288, 156, -108, -228, 344, -368, 646, 222, 122, 311, -344, -54, -3, 231, -64, 595, -156, -382, 414, -431, -368, -312, -439, -190, 506, -206, -145, 300, 166, -149, 347, -177, 103, 635, -181, 434, 370, -37, 225, 94, -299, -357, -2, -110, 250]
2214B50j17j94K70l73K03L61o3l36K79o03N73K28o90J85L00n59K50L71n82k7O3
2235b11L7L6K09l16Q7M59m30K32J85l54L19k9L08l57j88J66K12r1n84J54Q3l19
2257c92J29Q8n54Q59l21j16Q84o64M03j17k10j1RN81o31k71p9J1O22n63j09J61
2279b91J52Pj3j52L90r7j09J74L72m89O29l88j73J21M77n51O02l71p22K12M03
2300A83n91K64J50J4l91K68N6M91J56q66O80j10n69N60j44r5N60l30j58r9J64
2321A93o56Q21l39j43N99n03L01O1p7o36J019o92r5N78m43j52M30k88K78J55r67
2342e56J80O88o77J11M70p15O28l72J01M32JK40m03k34J59K00j37j30J39l01l46
2363e22L69M71n03Jj56L22m58O86m20K78J09m20R64m33N6j58j47K9M36o62J64
$$ y = [250, 133, -61, 209, -164, 39, 400, 337, 1, 280, -323, 250, 478, -212, -27, 273, -286, -36, 335, -247, -274, -211, -174, -138, 71, -245, -158, 301, -129, 103, 288, -66, 253, 224, 532, 175, -13, 153, 365, 274, -310, -156, -73, -392, -263, -175, -729, 130, -191, -307, 577, -87, 316, 199, -11, -22, -13, 568, -63, -334, -413, -402, 220, -343, -452, -291, -139, -132, -145, -297, 93, -4, -113, 61, 433, -56, 573, 185, 12, 133, 610, 59, 661, 290, -432, -220, 183, -408, -144, 6, 20, -371, -103, -47, 444, 600, -266, 414, 304, -265, 295, 151, 56, 616, 286, 128, 29, 193, -463, 358, 19, -124, 475, -28, 273, 334, 257, -379, 640, -52, -147, 431, -12, -164, 266, -22, 256, 411, -556, -376, 312, -365, -254, 216, -499, 129, -243, -142, 290, 291, 531, 128, -106, 53, 253, 116, -14, 125, -176, -522, -153, 318, -185, -184, -340, -18, -476, 210, -210, 68, 177, -243, 721, 288, 344, 186, 39, 68, 504, -158, 6]
2384FK33n62M48j81l49J5O90l21m94Q50o56M04k5k93L02N23j115O74O31q38P27
2405F69j54q48J27J90l99L89m45K01K25M99o87J01j89N3J078n00j89L99o18p6
2425a74N82j95l02O21m59l94K48m38L77l5n53N1L89m9M04N32l47l00L49r7J77
2446C87J50m92q9J74m15J49M30p32N17k60n02O35J08m11R79l88l52K67J0j96O61
2467F30l45m73O12k52l00P43q16LK05r5l41M48l69L99K70l81K17L29q28L42J23
2488A21l01M86J88q29O98l43k22n6K30k14l00O15r63O62r8Q1J04K46k6K78j04
2509B53n82M94L54l68M20l98p08P72j82l54L65m7o22L29M25n99Q64k20m72N01
2529B25ok69L99J71m09N79q38P8L23q75R04m33R0m3O43p67j98Q35n80qQ16n46
$$ y = [6, 239, -323, 125, -56, -405, -390, 300, -21, -515, 335, -321, 83, 58, -235, 67, 590, -525, 149, 780, -58, 669, 515, -333, -206, -16, -415, -26, -471, -270, -45, 454, -233, -132, -321, -268, 810, 310, 121, 520, -98, -174, 408, 213, -89, 532, 73, -321, -73, -511, -134, -169, -722, -671, -282, -331, 73, 605, 258, -42, 307, 210, 387, 537, 45, -44, 130, -285, -136, 294, -438, 79, -181, -683, -48, 60, -351, 628, 240, -112, 155, 165, -31, 630, 285, -188, 424, 172, -128, 615, -201, -198, 7, -88, -429, 19, -350, 49, 319, -62, 155, 484, -344, -2, 121, -180, 306, 494, -335, 363, 20, -202, -258, -28, -242, -542, 73, -890, -228, -326, -245, -141, 105, 79, 357, 253, -329, 165, 519, 151, 571, 173, -535, 237, 55, -299, 66, 19, -603, -274, 151, -448, 416, 196, -276, 225, 219, -50, 349, 520, 111, 690, -148, -70, 253, -622, 282, -151, -61, -104, 539, -228, -426, 409, -171, -179, 637, 91]
2551I1qJ17m69N74k50M3k1L13k62j15L84m69k54L79l31K10J63l47M64j35l94M20
2573A03m78O10L14k12m5O22j394J42P49k53l99L67k27l89Q93j192M06L90k89J71
2593a11J22KL62M13p28Q2j05q8N32l66k69j46P94p19J19K6l00K29J01m83M13K11
2615I1n26O64j03p0O03l72l45J93N84o46L02n95m5M86q25rQ74o32l68J005p19
2636d53M06N44p43O05j08j9J63j79k94L41q8l34k2M60k64l72M86l92m10O05k8
2657i6k65K82k41K01L96m88l4J190p52Q7K4j46p3l30N13k79j23l49Oo7L69q5L04
2680D4j03q0j01J64O10j87O1r6m43K10M97o50L15l24M4j89K70l46O5J53l6L45
2702B23k90K23K89k93l56J73J99q7N2m2R9O6K28j91r3n33j52R20l63j88oj1o39
$$ y = [91, 83, 200, -269, 305, 55, 98, 77, 390, 128, 13, 397, -72, -326, 53, -278, -68, 95, -252, 212, 77, -317, 103, -375, 235, 549, 337, 292, 914, -480, -338, 411, 158, -241, 126, -101, -490, 403, -789, -383, 7, -282, -111, 11, 13, 375, 788, 60, 142, 37, -51, 481, 115, -154, -300, 494, -225, -106, -80, -380, -151, -50, -533, -120, 91, -435, 229, 126, 56, 659, 287, -58, 135, 719, 73, 375, -220, -265, 221, -604, -613, 261, -371, -739, 266, -453, -47, 497, -246, 359, 251, 232, 395, 216, -78, 263, 175, -159, -181, 279, 15, -357, 129, -263, -673, -68, -96, -361, -79, -320, -119, 277, -211, -245, 945, 193, 280, 304, 158, 85, -245, 268, -11, -134, -483, -477, -544, -175, -260, 44, -59, -139, -240, -76, 534, 347, 408, 312, -131, 79, 576, -74, 241, -83, -39, -228, 42, -304, -239, -86, -122, 223, -67, 156, 445, 152, -204, -31, 168, 81, 133, 91, 190, 256, 484, 293, 200, -333, -485, 435, 72, -116, -122, -133, -772]
2725g72J115m01m12M46K7m32Q21l16L19K1q04N96r7m82Q7O82j005L81O00o43M5
2746b24N42k73K20J7o45M24M77j91j66J82n92N84p00j46O20R2l04K6OK93j33k16
2768a07k90N54J69m18O52l02o10O36k47M9j29k51K52K30k49q6K46pl03N39n4m87
2790b13L59n38J18L80j80k35J072o19K1M22n34m27P77p92O69j18k67j74l1J00
2810b10L12J90r19N79J1K26K27p36N33J13J1o49j7K84k17O76j10m14j00M22p07
2831d95M67k22O0Q76p36J44M17o40m0j7L62l41R2k8Q5O57p63k15J16o16N53N79
2853B95m34n8M44k22j74K42l20O92k48m30P23l13m86L81J08l61N89q24N96N29
2873G29q08j70J84M28p36M85J61q5P7l44j59L60l80J42O99j666J008N68o05K87
$$ y = [-772, 343, -58, -470, -24, 3, -429, 392, 76, 395, 416, -388, 208, 111, -371, -284, 398, -607, -226, 374, -269, -224, 318, 45, 265, 282, -363, 61, 538, 347, 181, 363, -229, 355, -345, -491, 129, 221, -83, -57, -51, 242, 109, -107, -397, 157, 326, -92, 560, 258, -352, 284, 37, 86, -43, -294, -42, 188, -61, -147, 99, 92, -211, 328, 274, -213, 146, -392, -274, 106, -74, -309, 763, 144, 165, 587, 53, -374, 403, -389, 280, 162, -105, -279, -310, -210, 102, 292, -627, -48, -37, 189, 416, -320, 213, 326, 337, -312, -329, -45, -262, 414, 304, -110, -210, 212, -495, -28, -250, -190, 686, -50, 94, 511, -129, -169, -186, 176, -165, -73, -101, -16, 641, -122, -337, -221, -837, -284, 295, -139, -197, 247, 25, -149, 93, -227, 465, 217, -213, 510, 197, -289, 92, 200, -161, 428, -396, 200, 729, -79, -249, -65, 363, -373, 112, 273, 188, 265, -79, -238, 122, -258, -116, 583, -1083, -75, 493, -112, 175]
2893A75o4p26J053k29n51O4M50k1l40K71n9M22o41K80M52k03n99M07j90j48P18
2914E21k18o96N97l17l03O20m22k49O23k22p5M87l61J29N04m66K18M34o46m21
2934b63Q09o72O8J13l6K22j45n22L35O47r14J70L55m50O81R9j122P53L33n98k89
2955d26M91n70M62L71j223N27L47K21m89N61l96K78k84MO78n76L55L81r34J47
2975g5K79o29J33P21j047P56J83Q3m85J17l65J91M73l48K93k94L4M6J70l50M83
2996C69j07o76J93O17q19K09P44o39m04J67P8L02J45o39J40L32q6L33J41o51P74
3017E23m90l05O31j05p53Q92j116O25O8Q2n10P35l44J44K17q71K73R97n76l6L34
3038D15o38P6O54p55L79j40o75P15l7k45P2M43l51K13k61R3L64J47k22K39n67
$$ y = [175, 111, -615, 438, 209, -342, -278, 172, 151, -189, 82, 23, 445, -196, 84, 536, 333, -266, 141, -49, -197, 521, 303, -393, 204, -113, -416, 204, -218, -467, 156, -66, -141, 346, -15, 114, 618, 152, 370, 804, 158, -263, 546, -126, -58, 55, 19, 241, 96, -426, -91, 556, -358, -188, 167, -283, 398, 497, -625, 128, 461, -137, -426, 65, -505, -43, 328, -895, -368, -21, 200, -289, 272, -124, 154, -130, -126, 552, -24, 331, 712, -222, -75, 204, -425, -292, 429, -618, 138, 321, 404, -81, 36, -329, -138, 335, -13, 280, -14, 20, 66, 236, -114, 369, 262, -414, -221, 396, -423, -214, 530, -109, -513, -346, -268, 34, 179, -460, -320, 12, -74, 259, 400, -251, 523, 33, -272, 359, 254, -499, 393, -723, -98, -30, 52, -458, 277, -67, 77, 294, -577, -304, 693, 117, 81, 415, -223, -147, 507, -248, 131, -9, -684, 31, -6, -251, -179, 264, -87, 126, -135, -42, 322, 469, 247, 486, -81]
3059h1J73L25p2r39P67l66P6M30l27J63j79L9k09L09M00p94k44P55m43P62m09
3080A36K92k14k35J11J32k31o47R99n76K68K59n14r0L71n35P15k90M6O2K00o46
3101c87K07N26n60K01L72n34m1p8k41J76O11q64N05O07o43N34j23p01L17L48k07
3122B5P24q20k01Q65n12n15L93l99K8O92l18M4j51n06J82M19l34J51L35k55M98
3143C45L49j007R8M38k8O2j44j57p2K28l40L7L63r02O26R9n00L84K93p96P69j81
3165c6j33P00o60k28P30J24m98L37p15J83L07p9o34K06J45M5K1l18L94J045j008
3186g2K45K65m51q6K61k43K07J08m53p1M17n07O76K5q2j37L16p35J008p71O2O7
3208D9P1j97N58m90j41L61L82j430R72J33o51K01LQ2J07k65l80M30K85l65P12
$$ y = [-81, 92, 417, 345, -594, 173, -193, -117, 313, -14, 149, -30, 9, -200, 109, 509, -285, -529, 226, -217, 545, 136, 428, 214, -21, 90, 222, -9, -656, 343, -233, 35, 294, -220, -310, 61, -474, 241, -49, -3, 59, 259, -387, -180, 346, -214, -13, 359, -175, -216, -294, -535, -359, 252, -612, -107, 500, -143, 391, 268, -433, -116, 232, 25, 749, -71, -272, 593, 81, -434, -41, -440, -412, 280, -38, 6, -145, -651, -469, -50, -384, -233, 102, -153, 345, 694, -313, -215, 223, 195, 257, 113, -44, -116, 112, -228, -191, 172, -730, -104, -5, -505, -121, 172, -624, 145, -36, -169, 531, -129, -357, 373, 497, -1, 336, -379, -196, 111, 32, -602, -396, -251, -206, -185, -503, -109, 936, -72, 173, 438, -13, -99, 162, -81, 126, 234, -219, -290, 127, -380, 296, 321, 239, 102, 418, -317, 691, -80, -18, 49, 120, -77, 481, -9, -150, 211, 593, -837, 135, 268, -383, -182, -179, -97, 10, -255, -635, -205, 80, -285, 427]
3229D27o15m79O50L54j35P2k90Q8M12n81N59n32K4p7J51m08K82K07p06M08K75
3250H6l35M73K94j360J400j17j002P98K98n12r7M23r84M15M68n77R6J58p87J498
3270F36q13l24Q45N5n23Q74n33m22Q11o25L20L52p73L21j03q6p4L63m44j63M50
3291A44o12M58K85j127Q27L23r03J098K56p93J93L30q64M79K10m11L45p76j15
3310f53M98J51l74J80L09l59j5J73j4J19K63m46N62o52N6Q07l77m15k4L83k16
3331d4N47n18p94J003k15l66N78o7p3J60o85K40O69o13K99j75j07N10o5p49L36
3352a29J12p42R97n7o05MO0K42j14K50k69N15M0q54R15k11l55O41k69l15L69n1
3374A74l27M36o36j82O42j38l04P35k54l30J6L2L89p3l90J58M71o22M71O4m80
$$ y = [427, -188, -667, -17, 337, 202, 274, -16, 72, 484, -97, 462, -70, -46, -123, 28, -380, -98, 109, -597, -189, 86, -249, 224, 518, -842, 558, 441, -561, 237, 535, 23, -74, 349, -635, -220, 248, -329, -233, -75, -862, 636, -177, -501, 344, 399, -124, 750, 217, -205, 606, -19, 301, 653, -120, 201, 98, 12, -62, 301, -143, -306, 144, -468, -10, 275, -852, -25, 298, -605, 493, 749, -44, 149, 479, -385, 94, 304, -107, 238, -538, -653, -155, -4, -378, -198, 111, -248, -263, -90, -104, 15, 278, -168, 394, -258, -202, 605, 228, -187, -211, 172, -44, 503, -15, -809, 194, -21, -387, 191, 124, 51, 211, -474, -234, 435, -178, 121, -54, -161, 349, 284, -465, -129, -17, -759, 238, 181, -424, -420, -360, -118, -232, 18, -251, 264, 304, -550, 365, 154, -201, 440, 171, -144, 225, 174, -153, 283, -353, -535, 107, -31, -335, 400, 146, -184, -168, -136, 253, 180, -210, -52, 419, -203, 268, 332, -148]
3395a48j59L6l11O44l5j63j16J95o53J157N8o17j38L14J04L11m34P4M24j64l62
3416A7K61j44k97O47r06N5O43p24K7M82m34j58Q96M0n66J001j196k64Q82k5k81
3437d4M24m63J47J2k92m66Q55l41J53P1l01P5M17n23M46J48j000R55m7n48N69
3458B47l20m90Q88p29M93J45q2j7l25M53o54K65L48n54M04L2o73Q08K29n36R44
3479H76r32q0L95n34Q6O69m05j4j19j00M76J78n27k26N47o63M86q1R0J42m2k73
3501e1M24O4n26M47n46J3L16r6l11O18n39m4K13j57l9L39Q0j16O61n29k85K01
3523A37k90l60J197q34m5L91j69k07N38n50k30O56p44R49m21j72j27O09o04K32
3543d4J58m70N32J66n81J023p71j58j66M36m55K26L09r45N75P5j91N61k88j5K98
$$ y = [-148, -307, -271, -582, 62, 27, -136, -252, -57, -710, 447, 505, -112, -250, 64, 168, 479, 45, 119, 543, 379, 17, 278, 134, -163, 484, -422, -367, 276, -448, -421, 61, -373, -531, 365, 405, -161, 840, -356, -620, 262, 237, -44, 380, -83, 64, 76, -216, -682, 173, -168, -15, 56, -245, -170, 247, -276, 170, 318, -682, 273, 226, -322, 247, -73, -563, 325, -404, 89, 234, 152, 135, -190, 263, -391, -126, 222, -332, 72, 104, -569, 239, 468, -68, 876, -56, -136, 259, -275, -189, 480, 75, 61, -58, -158, 318, 496, -31, -257, 290, -373, 113, 32, 122, 264, 222, -51, 373, 437, -89, 358, -188, -175, 141, 45, -266, 352, -187, -231, -18, -175, -214, 125, 205, 89, 750, 221, -64, 137, -153, -513, 684, -150, -195, 196, 27, -180, 358, -192, -422, 234, -510, 439, 18, -154, -281, 328, -276, -44, 114, -356, 176, 342, -239, 784, 13, -145, -311, 125, -330, -104, 205, -740, -165, -90, -281, 280, -8, -23, 275]
3564B75o9r18N93J93l3P47j457L97N59m49n00Q12q3l10O80p83R3N45p57O55k34
3585d4L10n56M98k8k1n6j20N47m29n26N85m64J09j78R03p24L92j88k22K62o1m74
3607d85M71N55r12N52M9o03L88l94J42M33n71K25K98K02j165J277n76j66O52J40
3627E12n93O04p79L07P24o19J28J14l66K55l33N7q9n1m33L27L03n49O06J47o74
3648d02L47L33o80P19L71q24L20J39m41J81K25k96J86l14n75R44l60l31N08n9
3668ij85L06K56m66L89l68k15P42p67L11M18q12L55P72j018L4K47j74K10M3K24
3689B93l03K04q80K90K90m05K73L48k06J51L1n8L44l48j74N23k90n27N92n8k67
3710a77K64j61l50J116r16m23P53J81m07O65l83j24L66n76k31J14K56J16M42p77
$$ y = [275, 206, -712, -119, 74, 41, 788, -669, -272, 287, -162, -662, 150, 67, -243, 437, -346, -253, 292, -465, 190, -44, 266, -290, 208, 180, 159, 103, -17, 530, 101, -425, 160, -304, -195, -373, 530, -194, 198, 10, -212, 50, -11, -485, -14, 541, -371, 181, 230, -373, 15, -379, -237, 196, -375, -150, 148, 350, -815, 462, -114, -280, 372, 512, -81, 523, -256, 51, 775, 156, 284, 398, 32, 287, -46, 11, -78, -129, -562, -235, 68, -481, 125, 272, -402, -55, 278, -402, 317, 688, -136, 184, 323, -118, 63, 288, -8, 178, -136, -711, 233, -127, -458, 50, -9, -194, 112, 368, -98, 291, -77, -292, 450, -317, -6, 412, -400, -45, 727, -291, -257, -10, -184, 26, 69, 293, -10, 194, -686, -396, -106, -511, -238, 110, -96, 55, 86, 28, 372, 24, -150, 373, 83, -444, 148, 90, -177, 87, -74, -424, 692, -224, -647, 106, 287, -120, 545, 162, 38, 404, -172, -403, -289, -33, 83, 525, -252]
3730b52N83r0l62l90Q55l38O5L10l35j44K69q96O41K39k84Nl8O2J8N38r24O23
3752A55M7r45Q42Rj54QN05k40k65L44n47N28l65k43M40Q0r76J006q8n14J143p63
3774Gl52L8L59k15M1L74k74L9m34P12K92j092j7M03k45K61O36q47r5P35o72J05
3796b41L43n92M55K20n22J52N92q84N20J78j36j53p1k09M95J06r00N47K45K1j44
3817B2M3n94P05m74L73K78m03m55N19k62q3O71l86j65Q07o96q1Q12j214O58J77
3838B52o65J32P15q8k5l30k33J84k67K56L08J58m10n4L60o14P9K22n75J069k04
3859B70p57O90j54l45K42J25K2J53Np86N75J52m99P19J0r36Q07p21k8M62M4l25
3881b75M25j61Q0k22M46k10O30r16M72M54q57K94L11m47K33L56j076P59l90j06
$$ y = [-252, 331, 241, -121, -511, 344, 6, 71, 381, 46, -98, 171, -725, -84, 155, -129, -124, -162, -100, -82, 456, -468, 155, 202, -743, 99, 108, -46, -38, 467, 227, -38, 306, -241, 287, -78, -321, 119, 199, -777, 229, 141, -373, 770, 7, -345, -307, 52, -163, -122, 252, -22, 17, -417, 295, 587, -505, -522, -119, -364, -103, 533, -314, -409, 326, -346, -241, 102, -490, -35, 185, -337, -185, 407, -477, 43, 221, 85, -68, -139, -348, 147, 253, -647, -100, 145, 166, 22, 65, -529, 176, -298, 75, 353, -50, -505, 14, -248, -331, 340, -46, -211, 596, -100, -181, 631, -583, 75, 252, -413, -281, 434, 346, 321, -9, -242, -58, -325, -69, 239, 397, -13, -67, 293, -321, -242, -20, -595, 474, 270, -487, 203, 49, -296, -54, 71, 93, 246, 251, -535, 40, 192, -307, 412, 422, -514, 293, -428, -456, 6, 50, -275, 150, -11, 69, -153, 293, 83, 713, -203, 269, 723, -134, 160, 471, 24, 257, 613, -463, 296, -94, -200]
3901b00J86K92m72L48l13j46L94J72L5Qm93j52O19rr3L77l01n80M74J0m65L69
3923F0j63L41o6k27r1R59q75j22K85j11K41J85l95j92O0L74j1K07j01n58M94o83
3945c89M91K28m94J20J76k85N96k45m71K28J25k80O79j46k62j53N06p81N29K16
3965C88q72Q73q89J70K64K20n19K12L76p15R42n03J81K44m10k31L36j14p12R22
3985A63m06K69k14k24O2J142j005j32P28p06j46N79QR8K46m81J55J30n97M90N2
4006B11l48M9J86m28J99J21M1J1K30j19j48L06j027O98K56j096J448q34J23O77
4026E56p85j74M68m14N10m9m59N6N53k96j50N24m11K4Mn23N08K38M7m76O3k99
4048d85O01L1m16K69L50m95L66J58j211J048k30l87P06j08j49M52o81K38n0J55
$$ y = [-200, -14, 278, -194, 154, -159, -305, 89, 261, 296, 304, -189, -341, 278, 269, 176, 553, 252, -328, 146, 156, -309, 60, -103, 238, 172, -55, -146, 813, -62, -184, 101, -10, 231, 416, 21, -171, -111, 263, 252, 459, 358, -200, 294, -389, 102, 330, -164, -44, 132, -153, 443, 198, -273, -45, 80, -200, 479, 333, 71, -82, 424, -357, 172, 388, -484, 389, -500, -330, -66, 154, -365, -153, 223, -492, 450, -53, 128, 372, -38, -269, 67, -47, -759, 163, -243, 26, -188, -412, -350, 792, -213, -345, 383, -323, -469, 110, 118, 216, 462, -19, 136, 266, -331, 159, 211, -137, -88, 98, -330, -131, -10, 31, 42, 272, 153, 5, 311, -716, -18, 238, -858, 590, -244, -121, 556, -229, -403, 65, -349, 161, 112, -347, -291, 262, -34, -184, 340, -71, -47, -43, -566, -58, 180, 227, -249, -186, -485, 116, 147, -269, 0, 350, -145, 221, 379, -832, 216, -14, -401, 305, 197, 48, 500, -181, 57, 7, 162]
4068A62m81N65j08j96L13k82l97Q86q41L22M62p85j08R81m36m19J254n56j78J04
4088B62j00l31M99l26k54M23m98O1M74o22L31Q38j092Q3L15q77L84J84j22M77
4108A09j91l55N94N33j012O16j41j84L6L05l95K39m5k12O53j024k02Q99mJ31n40
4129a90L02m0r0OR9R2m36L34M3j29L56k13m96j70Q39l19mj67R2m1M20p73O98P2
4153B85m21M39k35l25K57J60m8M5k18%K9k06n28M38J20m97J193o00l25Q23k79
4174A07l98K16K44n70P64m97j10L99J42k01R7n77K6L47P1j18J58k52P0J38p68
4195g12R57Lj70M3j06l04L22K23n16K59j95K56R4k87k19M03j58n83Q69k35L6K54
4217B34L52r20Q01p51L8Q42n13l33M78P3o32M93J87p03N29k97k5L88o03K01N11
$$ y = [162, -319, 246, 138, -58, 255, -27, -424, 462, -379, -57, 405, -380, -488, 493, 57, -362, 892, 336, 158, 262, 162, -169, 330, 4, -250, 173, -325, -264, 210, -412, -81, 757, -335, -252, 63, -814, -430, -246, -368, 109, -82, -437, 157, 690, -322, 294, 153, -31, 5, 310, -85, 154, 109, -103, 550, -474, -676, 223, 219, 350, -190, 112, 72, -18, -12, 87, 179, -257, 77, 120, -9, 347, 134, -362, -532, 307, -12, -16, -183, -91, -132, 288, -485, 213, 285, -136, 303, 68, -257, 0, 160, 112, 157, -61, -61, -32, -238, -766, -328, -208, -705, 488, -112, -437, 386, 107, -291, -75, 169, -401, 363, -134, -244, 155, 297, 96, 193, -384, -358, -11, 60, -58, 100, -152, -82, 56, -712, 245, 248, 78, 121, 15, -289, 33, 256, -260, -1, -196, 60, 154, -133, -352, 51, -107, -690, 179, -56, -20, 234, 586, -334, 467, -284, -246, 596, 83, -250, 228, 301, -331, 162, 349, -354, 175, -122, -147, 241, -362, -161, 350]
4238C50k20K98m53Q4o6N01j64l45M7k13J66K89p40M65j75J18M85k30n10M27K4
4259A38k59P46m24m36L46L84m66J13J53j44%K04p50P52l36j67L08Q3o12K72J66
4280G1n80P92j40J51l88k43L95J29j21K93M08j066Q0O87l25n94Q18q36L99K46
4300A76m65J23N60p92N98j18r25J239l98J62r6j87j6N36m94n04M80L07o93O62
4320A55P4j204R29J83m61O03k3k22M82o68L02j7k20l6K75k28q9O89n45N2M78m93
4342A6k87N28q31N86K6k68j50N26k14O4K11q36J118j93k18L37m59L89k22J75o13
4363c15O41K0n30m1K8j64P82o67k94J042n37j21N18j08k29K50m03Q2M85m50m48
4384d59P00o91O39J00n44L46J00l83o9M47m10r6M90n32P66k23n17K99O16j017
$$ y = [350, 130, 428, -25, 59, -7, 494, 330, -15, 32, -181, -15, 274, -466, -1, -176, -58, 427, 197, -313, 114, 138, -121, 625, 201, -235, 111, 495, 29, 142, 295, 151, 151, 355, -395, 357, 21, -146, 162, 245, -367, -95, 71, -509, 283, 143, 294, -94, -337, 58, 187, 66, 359, 767, -299, -219, 468, 143, -451, 367, -469, -70, 176, -289, -166, 394, -398, 200, 82, -843, 396, -2, 160, 64, -123, -139, 397, -97, -601, -121, 186, -507, 155, 229, -975, -46, 137, -324, 279, 256, 34, 516, -152, 150, 133, -87, -123, 152, -76, -165, 524, -21, 31, 509, 16, -271, 257, -574, 12, 38, -230, -380, 146, -68, -4, 207, -629, 489, 296, 78, 415, -44, 345, 123, 298, -315, 326, 346, -184, -225, -197, -361, 421, -246, -540, 502, -35, -156, 362, 254, 25, 275, -128, -46, 439, -11, -459, 241, -450, 189, 289, -255, 91, 191, -192, -261, 186, -224, -320, 170, -362, 404, 181, -336, -37, 579, -438]
4404d38Q33m1o93O43O7q70L98N37p32O26n83m8M33K92p53O60p14K34J82J96l25
4425i6N87o92p3P57j44n35N43j002L88K97j65l6P20j32m00K49n28M1K36m50J98
4446b37N99n84N15j10m42R7L36l91L84l94L3N11L1n34M63l44k16Q75q00q7N84
4467B89n78J57R76o14m05L02l12p35J087l59P5L02m31j46P60q64N61j8j6j40L71
4488B62l30l94J210q11R8l62R1j60O20k55j71M16k83K3L36l11r4K08q5j13Nj66
4510b66M74M77q83K88k59j62J88j4l94N66p8q9j07j77K94Q64j008M96L5m12MK50
4532H7J1l64N51n63M38J60r04M77N73j086j4J087o73J4P56r01L99M00l28J75l21
4553b6p73J087k50j43L18m35J24n8l45K9L49m77K41L83p4j63R19r78l9L88J25
$$ y = [-438, 395, 354, -339, 304, 371, -499, -101, 436, -296, 330, -253, -301, 132, 424, -329, 331, -383, -149, 33, 229, -96, 491, -201, -274, 483, 339, -196, 347, -655, -267, 30, -135, -171, 549, 417, 17, 266, -262, -221, 15, -435, -237, 362, -222, 293, 183, -259, -162, 174, -217, 167, -227, -194, 317, 348, -186, 277, -67, -283, 592, -208, -295, 289, -289, -132, 844, 230, -175, 127, -185, -920, 167, -192, -117, 185, -246, -392, 368, -496, 65, 47, 31, -109, 262, -68, -462, 748, -63, 35, -327, -236, -396, 224, -31, -202, 214, -69, -46, 290, -21, -115, 93, 8, -105, -100, -266, 208, 685, -198, 90, -169, -331, -143, -157, -551, 15, -63, -152, -259, -436, -142, 722, -286, 210, 245, -167, -163, 87, 98, -266, 285, -278, 160, 320, -584, -107, 466, -620, -634, 453, -220, -206, 550, -351, 48, 448, 120, 295, -26, -799, 288, 38, -105, 213, -222, -98, -156, -501, -472, -123, -600, -359, 24, -50, -213, 706, -272, -311, 77, 202]
4574B02q8M98l73p90O20J50j83J67l95J98L20o71q4M48k64J89p0J9L73j97m95
4595d26O32o5m69O18L02j148Q25j84L28n23p5J45K70l96r0J44L11m97L90K66m85
4616a27L67K14o93R05j059Q35k72Ql04Q2l7oK10n98L79N28o74k61R82q18K43M5
4638e1L12j87k0m43M01J62m79O01J59o50K06r5j09J59L40r08N44K91j29M9k75
4659a22k69J050o07j78O32m57n08M62J70l01l05Q28o70M79j68m72J049o05k44
4678b36O80k47j56j2M02oK8n69M0K22m45N06r4l18N1J41K63L38j26p00L83qn92
4701d55O01j52j86R4O87p72Q5J87o7K5ll21k35P68p30L92j95j23P21l99o35J208
4723D95K91r44L12l16k43Q18q01N87m5m06k72P01M75q89K28R9q4L15m44L32m14
$$ y = [202, 114, 612, 239, -551, 69, 219, 36, 203, -192, 6, 326, -345, -429, 19, -245, -56, -126, -107, 266, 69, -426, 206, 141, -328, 290, 592, -556, 269, 85, 413, -110, -185, -40, 230, -166, -256, -112, 199, -298, 92, 358, -127, 240, 454, -239, 666, -393, 442, 170, 178, -126, -44, -81, -87, 123, -475, -96, 432, -242, -503, 479, -339, -96, -51, 261, 74, 54, -389, 12, 174, -305, 296, 455, -195, 11, -84, -193, -34, 306, -602, -58, 233, 104, 153, -122, -391, 659, 52, -126, 506, 49, -459, 3, 173, -128, -433, 395, -275, 204, 36, -436, 613, 8, -236, 444, 197, 41, 29, 431, 425, 453, -116, -76, 146, -299, 207, 113, -205, -154, -13, 250, 588, 462, -238, 145, 137, -455, 146, -6, -192, -98, 589, -183, -98, 89, 22, 47, 44, -277, -512, 256, -474, -82, -277, -400, 321, -78, -713, 495, 786, -158, 154, -162, -405, 413, -388, 199, 154, -252, -524, 177, 652, -237, -9, 90, 6, 321, -123, 209, -205]
4744b05N09j83J23P7k54L33l61k67L17p13P06R7n30Q17o05j87O3L01o59J193o15
4765d3k11J74L63L5j02qp16J009l98k39K97k16M97j00n70l5L71l01j76O52j062
4786g79P47O53j277O17m1k86M63o1k80N41m25M58j7j58j89KL51m40k27O10o08
4807c46M07L65n85r3J82L57M36l83l76j5K6m09M47k92L10j87Q1l32K44J33k81
4828c11L09k82M92l45J55J12L51k72L40j15j057Q02J39o48r0J010n45O8j4n24
4848d25P35J33j31J31np48L78J86p02O44K28o83R35r26K79L2%j01k02K95k51M02
4870B04p77K82K53k06K01K83k14m4M35q88N26k84L90m3J19l59O9M4m18M50Mk93
4892b66O8M59o55K31L90j23N4l5o37O35L71j156J043l95j7J11R2l56M59m62k92
$$ y = [-205, 304, 121, 244, 321, 67, 400, 39, -228, 89, -624, 82, 179, -351, 466, -139, -326, -263, 38, -621, 572, -43, -254, -80, 283, 318, 216, 208, -508, 501, 103, -136, 161, -55, 442, 342, -228, -263, 108, -193, -369, 283, -779, -32, 621, -656, -39, -80, -366, 97, 36, -244, 297, -128, 330, 313, 155, -34, -32, 319, -121, -348, 262, -346, 61, 426, -159, -252, -70, 287, 723, 340, -36, -51, -25, -434, 13, -279, 31, -156, -75, -407, -163, -30, -311, -2, -284, 208, -137, 18, 130, 481, 209, 549, 434, -623, 179, 318, -330, -420, 590, 45, 113, 99, -425, 310, 443, 312, 443, 438, -310, 68, 254, -448, 196, 424, -259, 676, -250, 29, 61, 61, -40, -242, 53, -198, 204, -573, -291, -38, -244, -43, 240, 26, -18, 417, -471, 55, -229, 161, 118, 237, -122, -53, -9, -427, 23, 27, -266, -198, 261, -394, -163, 227, 104, 158, 123, -514, 121, 492, -664, 379, -16, -33, 78, 170, -186, 273, -189, -481]
4913d81N43L64p93N1J174j459P08K2j24M17l3n87L31k4k21M15j02J4J91m82L65
4934B89l2p48L56N87p94J78K31m35M1M33n0L99o44j38J42O02n42K97j30K26l01
4955c3m7j90N18k20l7Q1J90j044J194R0m15k16j54k59Q03k28j74L68k91p5Q53
4976G14l97m75J83Q1m11K59K0l43K22j3M88o5j14K5P3n81J070p12j09n0Q2M3J43
4999A33J36l62J31J84j23j75M79o52L63J69k99j0m24k4K25Q8M0N76j62m79R36
5020G50r00r8Q54j271P91j86M8l03L28P9l43K93l85K45P13m43o00O73m14M21L15
5041E67m47j53R74q98j13N34m50J1k00N16o17L46m80L56n2O38m62l5L00k04k97
5062a66J52N3N03n67j55K83O3K6j81j71M93l51L04J80n15L0N06j031N85N37j66
$$ y = [-481, 62, 426, -367, -316, 858, -601, 107, 129, 5, 422, 389, -198, 133, 109, -112, 303, 201, 215, 406, -76, 289, 257, -491, -135, 452, -342, -164, 67, -368, -327, 106, 56, 455, -189, -327, -185, 417, -125, 172, 42, 268, -33, -80, -270, 248, 28, -9, 72, 262, -782, 412, 502, 87, -129, -283, -542, 261, 33, -141, 227, -64, -139, 714, 317, -158, 25, 106, -305, -46, -26, -369, -147, -160, 328, 263, 149, 174, 247, -334, 736, 24, -85, -135, -53, -10, 133, 269, -93, 38, 222, 99, -76, 403, -249, 114, 283, -16, -26, -450, -474, -249, -161, -121, 455, 293, -186, 750, -150, -248, 606, -665, 126, -60, -12, -315, 13, 92, -251, 42, -343, -98, 615, 172, -428, 245, -169, 252, 567, 120, -33, 941, 43, -70, 464, 14, 25, -175, 341, -276, 70, -410, -54, -106, 532, 70, 35, 335, 131, -166, -14, 39, 542, -25, -180, 103, 166, 192, 11, -160, 333, -18, 286, 466, -49, -19, 487, -544, 41, 578, 412]
5083D12l05K86j78j06k10k7K27K3j10r8L80j16j6L43p87l16P23j21j5N39o79K11
5105F0l94O0Q50o85q3K11o00L95M22j23o93J053p10j12J95N91j42m55k15P26l36
5126A5j66M35n7rl23O76r02N32M05n51k2R2N7o21Q27m71R5o2o7L25L90o09O42
5149F31k5p61K08J45k88L28K69q73N58j89k97P04m14k46M55o00J7O53k77m14Q18
5170D02O2q26J45J04o36J262m96m77M48J38l96R07n14O1j19l13L07O69j218M06
5190h4M27o30L42q8m23L88K25m67Q41q6r81Q5P16l49j5K08m68L92L93q45N99K35
5212D15m62J29m0m31R47p50k70J028o38l36M55k07j0r7N45l21L02l38k85Q22l75
5233H3k61K27o4n7K27o94K28O39n83j39J071o40k11J72l24j36O92o28K03M59n30
$$ y = [412, 107, 393, 215, 109, -101, -128, 99, 122, 12, -86, 294, 178, 162, 505, -282, -598, 125, 4, -11, 528, -151, 60, -334, -274, 576, -109, -192, 19, -581, -186, 236, 113, -580, 473, -237, -349, -154, 437, 295, -160, -375, 351, 15, -151, 284, 227, 218, -105, 571, -331, 201, 606, 55, 33, 125, 182, -439, 388, -83, 12, -50, -117, 208, 598, -11, 631, 606, -155, 53, 198, -90, 238, 507, -366, 192, 3, -294, 410, -4, -250, 205, -395, -378, 275, -2, -416, 402, 464, -362, -217, -113, -749, 513, 17, -460, -12, 126, -270, 637, 123, 184, 65, -248, 59, 728, -490, -84, 343, -287, 55, -33, -456, -68, 157, -310, 531, 445, -536, -451, 265, -84, -99, 109, -359, 33, 426, -419, 180, 415, -47, 82, 42, -389, 558, -192, -462, 566, -72, -408, 47, -160, -170, -267, 278, -43, 259, -79, -364, 458, 83, -178, 49, -15, -72, 155, -539, -311, 328, -255, -394, 677, 37, -174, -2, -326, -462, 230, -398, -195, 264, -266]
5254b66M81l93J56l4K30o58P55k13k34r4K73j46L06k34k08L10n4K8J33o8O8q2
5276E6k11MK26k54J74j98j21J29N06l83j09M62m20M7L24o98j63O81l65L45N54
5297E86j173O1N61l10M80R0q9l85N14m98j55N43j029Q78l8n24M54L77n08N44m51
5318g2l87O24j35k42O64j83n51Q23k88l43K68n85L25K95n38J37K75Pk16L24j45
5339E7l68N09m35k28P01o30M89L5n46L88L9m02J47R04o03M68j41q79M18l2o1O04
5361D34l71m43K91M42p77L21M46r04L07M53l40N30l39q64J527r74N1K50k3p58
5381g41R14k2k38N31p23L74N90r41L27N54o77J16M62o92j58O47n62N49j18p71
5401e79K2P07k68K59k47lM19k36J64K29m65p9L76o43o8N08m93J45P79q42j17O17
$$ y = [-266, 215, -178, -22, -56, 174, -484, 271, 58, -176, -270, 3, -143, 163, -71, -279, 31, -23, 5, 138, 70, 138, 56, -155, -151, 75, -179, -5, -203, -324, -195, 311, -72, -181, 281, -139, -92, 232, -466, -629, 52, -313, 32, 586, -587, -526, 35, -275, 205, 295, 206, -179, 335, -163, -318, 225, -804, 74, 36, -488, -34, 343, -165, 379, -72, -459, 165, 30, -212, 452, 269, -282, 541, 253, -90, 178, -407, -82, 213, -325, -188, 87, 94, -122, 202, 57, -311, 198, -237, -465, 236, -394, 95, 130, -416, -28, 11, -391, -244, 660, 57, 525, 384, -495, -77, -109, -170, 434, 63, -380, -89, 353, -424, -103, 343, -561, -254, 199, -141, 389, 50, -814, 713, -261, -210, 40, 17, -741, 173, 151, -87, 444, -279, 95, 685, -256, 71, 625, -52, 64, 526, -166, -324, 323, -239, 310, 192, -579, -557, 150, -118, 141, -106, -109, 310, 74, 238, 467, 2, -77, 299, -344, -412, 96, -397, -252, 527, -315, -432, 185]
5423A85J6l10j1L54o14N59m7o0K62q07K20L80n94L56O55p61K53k0L4j34r8Q80
5445F98o21L55l35M6n8k69L72j63p03L47N85k88l74K27p5J03J7r3K39K0j59J61
5467C2L06n32L21M00j62j66j87M6j55K27k63N09m99K57M46m50l76M56l74J23M23
5488C82l33l70N31p56O41P09j136J52M49l12j59R9L52m28P66q03O53j91r30J003
5508C19k31m75K49M61q90N36j02n09J074l76n65R94o40m13P29k59K54L45n52o55
5528g06J266p01n4P09l61j8R4l10j40P43q29jN93m65m50Q89l84J97po4J73O2l15
5551g9M58m3m87O20j16k40K5L5l37L74k71m11P61j05k41M01n73rO10m67J42J85
5573B32l37p7J017p43m13K33J85p1J85k13k62Q37n88J4M36l96k22N20R9k87ml12
$$ y = [185, 201, -109, -120, 234, -380, 179, 132, 72, 334, -473, -253, 127, -467, -111, 544, -217, 36, 16, 50, -84, -182, 698, 77, 432, 97, 143, 85, -184, 188, 25, -678, -331, 254, -34, -408, -181, -256, -153, -136, -229, 10, 30, -129, 32, 338, -194, 127, 527, 365, 199, 12, 58, -97, 130, -133, 376, -123, 134, 580, 130, -246, 210, -164, -41, 382, 49, -321, 210, -546, 95, 804, -332, -180, 269, -43, -202, -103, 249, -179, 587, -216, 437, 246, -684, 319, 88, -387, -138, 323, -567, -31, -133, -642, 432, 56, -509, 485, -155, -568, 161, -98, 156, 501, -51, -706, 560, -141, -195, 514, 153, 135, 229, -81, -221, 522, -307, -308, 285, -180, -630, 259, -125, 72, 65, 1, 174, 236, -79, 379, 336, -151, 469, 353, 113, 138, 173, -164, 210, -61, -472, 289, 184, -57, 344, -229, -238, 372, -95, 47, 232, -105, -182, 835, 92, -321, -88, 97, 26, 211, -2, -264, 573, -15, -1, 435, 39, -183, 337, 436, 149, 145, -167]
5595a67J8O29n50K1j0k48M62k1m90M12l3k62K8N32o44J35L93l41L59n76L20N26
5617D93o60j22N20k49j24N39j76n55L58j16K12pk77k6L34l84j68O56l19k7N27
5638D29o97J38k2l97O33J28k29J07J01j31j56L75o30Q05j33q5k27J18J79p13K37
5659a70q4M76J57o58J44J70K0J99P5j96J77p34M71O0k78k64P38m87K30J50j83
5680A3k83O16l86q3K31n83O59L21o29N34m27k05N68l75k13M34J85m19l14L48m66
5701d74O51Q4n49L44O4l48P76o20l83J69N77k74n49M00K31pk13j54P6L30l59P58
5723E30n46l56P94m48J61l5J99l52P30q47L51N6k63K62p9j72rN4j20J81j43k76
5745c28M13L08r47N39q4n89O53J10m03O90k20n41J52M87m66J25M07l95l4n4K21
$$ y = [-167, -149, 480, -70, -49, -59, -307, 155, 134, -356, 56, 23, -239, -211, 321, -323, -188, 205, -136, 223, -353, -33, 493, -167, -289, 231, -18, -142, 397, 221, -334, 24, -92, 120, 113, -164, -190, 144, -240, -408, 248, -71, -98, 429, -268, -130, -152, -549, 84, 212, -17, 90, 191, 60, -96, 279, -351, 454, 321, 236, 9, 127, 306, -407, -170, -254, 222, 379, -279, -135, 35, 55, 254, 329, 133, 310, -424, 47, 107, -171, -435, 303, -184, 46, 196, 13, -270, 346, -40, -123, 108, -475, 184, 505, -124, 410, -17, -222, 346, -29, -242, 192, 377, -42, -356, -8, -474, 177, 261, -288, 56, 120, -228, 548, -72, -455, -286, 291, 17, -532, -132, 99, 92, -121, -275, -199, 131, -228, 530, -16, -372, 422, -26, 135, 100, 299, -53, 677, -170, 181, 237, -26, 236, 157, -15, -24, 30, -90, 91, -52, -328, 85, 393, -554, -15, -99, -688, -35, 75, -328, 362, 142, -399, -247, 240, -226, -101, 306, -89, -123, -177, 44]
5766D4M72n13k61N37j87o54M40Jl4Q27j012J89K25l37J79K28l38M86J67p66M74
5787A67k75k38N46K6Nk78m7k23M27N67n88l42O18o84J68M81o59J67L2O1j35L99
5809A95n49K54r8J9L64K28l36n24N12j89O18l96o00O04J46l11M85k21m20R13l17
5830C77q80J037j203M17K14k2l53J072o37m86L58L19L7P6pk18j21m14M97K34p22
5851d25M28J02l42K09K61l9j47j17l23L49k16j40O59J05m89O68L8r01j0M56l16
5872a90K60l0p73J102k13mM84q25m1K66J15QN94p08L39R8n32M93J40q24L4L89
5894A82l75k36K92j88N1M78n93R14o11o56Q33k12L2J0j20l5O74o80K5J77j4l75
5916d27P84l54k03K11J0j62k30M86n23O19n69j24P88j22o84Q08n79O34K26r45
$$ y = [44, 516, 3, -258, 279, 92, -562, -122, -121, -155, 672, -340, -151, 74, -263, -84, 144, -194, 292, 459, -307, 167, -108, -346, 200, 226, 231, -47, -94, -317, 110, 677, 89, -253, 365, -319, -151, 330, -329, -162, -130, -69, -204, 195, -354, -100, -198, -179, 185, 413, 77, -447, 65, -124, 494, 98, -502, 102, 248, -63, 422, 201, -219, 694, 377, -503, 534, -669, -252, -38, -60, -413, 659, 22, -464, -106, 213, 250, 326, 319, 101, -20, -434, 63, 297, -425, 3, 105, -237, -28, 233, 194, 47, -70, -393, -44, -260, -400, 259, 364, -125, 543, 581, -320, -330, 126, -190, 70, 40, -733, 369, 156, 152, 636, -189, -230, 36, 151, 159, 753, 45, 384, 482, -50, 443, 583, -241, -207, 182, -193, -429, -137, -325, -274, 204, -389, 525, -86, -742, 91, -121, -89, -79, -199, -234, 440, -240, -215, -38, -52, -427, 357, 3, -200, 11, 21, -141, -371, 115, -408, 211, -358, -482, 306, 184, -500, 308, -271, 363, 589, -356]
5936c56J74Q96j100J85O11r42N76M23j349Q42N14j04m88J88n36P89J20m95L09
5955B57l7K69k73K32r62P76K93m79J94N3k94M46j05n61N70o68L01M10j51n18R55
5976G08q73J67km40L66P67o35k34OK35m88N52l00o1Q83q72p5L34k84J06P56p60
5998a44lN71o34N38j67m60O65k39r36Q91J30j91L50k76j18k50P79p76O97l61k59
6019a93N08k45n24O89l1m49M57k07j7J71r0p20J234j113O6Q28n84P31l33p16O71
6040A33k41M13k12m1J64k50j18Oj01M71k88K78j6q42J500j273k4K83j83L49j54
6061a46P94l41K64n58k13O36o67N30K1j94l16O6J00m0J90j41k49P04n04l20M98
$$ y = [-356, -182, 714, -386, -201, 410, -532, 44, 467, -882, -40, 474, 370, -118, 70, -466, 323, 443, -52, 257, 220, 489, 216, 448, -514, 262, 555, 76, 270, 323, 29, 475, 370, -191, 379, -289, 12, 422, 271, -247, 708, -165, 2, 0, -440, -74, 693, 58, -176, -170, 65, -423, 129, -171, -232, 651, -221, -296, 38, -246, -140, 616, -144, -147, 424, -210, 328, 161, -299, 366, 127, -809, 82, 212, 21, 371, 95, -23, -273, 506, -270, 427, 66, -193, 315, 70, -454, 235, 204, -245, 212, 5, -12, 159, 69, -651, 583, -530, -464, 364, -220, 511, 178, -538, 133, -108, 305, 93, 52, 216, -34, -152, -146, -247, 224, -64, 214, 198, -644, 856, -417, -441, -158, -341, 8, -146, 648, 307, 571, 13, -200, 436, -231, 299, 320, 126, -190, -124, -24, -64, 126, -15, -264, 440, -64, -384, 114]
$$ [...]
16383a71
##END NTUPLES=NMR FID
##END=
