##TITLE=31Pdec_LR-738-PE-K
 CDCl3, 24 sc
 10.11.2021
##JCAMPDX= 6.0         $$ Bruker NMR JCAMP-DX V2.0
##DATA TYPE= NMR SPECTRUM
##DATA CLASS= NTUPLES
##ORIGIN= UXNMR, Bruker Analytische Messtechnik GmbH
##OWNER= root
$$ XWIN-NMR		Version 3.5
$$ Wed Nov 10 10:54:39 2021 Russian Standard Time (UT+4h)  she@DPX200
##.OBSERVE FREQUENCY= 81.013821
##.OBSERVE NUCLEUS= ^31P
##.ACQUISITION MODE= SIMULTANEOUS
##.ACQUISITION SCHEME= undefined
##.AVERAGES= 100
##.DIGITISER RES= 16
##SPECTROMETER/DATA SYSTEM= spect
##.PULSE SEQUENCE= zgpg30
##.SOLVENT NAME= Acetone
##.SHIFT REFERENCE= (INTERNAL, Acetone, 0, 248.564)
##AUDIT TRAIL= $$ (NUMBER, WHEN, WHO, WHERE, WHAT)
$$ ##TITLE= Audit trail, XWIN-NMR		Version 3.5
$$ ##JCAMPDX= 5.01
$$ ##ORIGIN= Bruker BioSpin GmbH
$$ ##OWNER= she
$$ F:/spectra/data/she/nmr/P31/1/pdata/1/auditp.txt
$$ ##AUDIT TRAIL=  $$ (NUMBER, WHEN, WHO, WHERE, WHAT)
(   1,<2021-11-10 10:53:13.93 +0400>,<she>,<DPX200>,
      <created by zg, POWCHK disabled, PULCHK disabled
       configuration hash MD5:
       00 E9 B6 7A A2 85 ED C7 34 08 36 98 17 FE 4E 26
       data hash MD5: 32K
       FD C2 08 1B 6B EB 3F A5 04 7A 63 62 B7 00 B8 61>)
(   2,<2021-11-10 10:53:18.92 +0400>,<she>,<DPX200>,
      <Start of raw data processing
       efp BC_mod = 2 LB = 1 FT_mod = 6 PKNL = 1 PHC0 = -8855.89 PHC1 = 219.4694 SI = 64K 
       data hash MD5: 64K
       C5 6C 84 85 18 EF BF 05 51 E0 DB 13 60 BB B2 79>)
(   3,<2021-11-10 10:53:45.39 +0400>,<she>,<DPX200>,
      <pk PHC0 = 14.09323 PHC1 = -85.2 
       data hash MD5: 64K
       FE 30 4D 8F 2D 9D E3 4C 66 5E 86 4D 57 C2 7F B4>)
(   4,<2021-11-10 10:53:58.03 +0400>,<she>,<DPX200>,
      <abs ABSG = 5 
       data hash MD5: 64K
       1C D8 32 2D A5 19 3F 24 03 C5 3A E2 C8 22 65 15>)
$$ ##END=
$$ 
$$ hash MD5
$$ 39 CC 9A 45 81 72 38 73 63 77 14 1E CF 39 06 03
##$RELAX= 
##$RELAX= 
##$RELAX= 
##$RELAX= 
##$RELAX= 
##$RELAX= 
##$RELAX= 
##$RELAX= 
$$ Bruker specific parameters
$$ --------------------------
##$DU= <F:/spectra>
##$EXPNO= 1
##$NAME= <P31>
##$PROCNO= 1
##$TYPE= <nmr>
##$USER= <she>
##$AMP= (0..31)
100 100 100 100 100 100 100 100 100 100 100 100 100 100 100 100 100 100 
100 100 100 100 100 100 100 100 100 100 100 100 100 100 
##$AQSEQ= 0
##$AQ_mod= 1
##$AUNM= <au_zg>
##$AUTOPOS= <>
##$BF1= 81.014009
##$BF2= 200.13
##$BF3= 200.13
##$BF4= 200.13
##$BF5= 200.13
##$BF6= 200.13
##$BF7= 200.13
##$BF8= 200.13
##$BYTORDA= 1
##$CFDGTYP= 0
##$CFRGTYP= 5
##$CHEMSTR= <none>
##$CNST= (0..31)
1 1 145 1 1 1 1 1 1 1 1 1 1 1 1 1 1 1 1 1 1 1 1 1 1 1 1 1 1 1 1 1 
##$CPDPRG= <waltz16>
##$CPDPRG1= <>
##$CPDPRG2= <waltz16>
##$CPDPRG3= <>
##$CPDPRG4= <mlev>
##$CPDPRG5= <mlev>
##$CPDPRG6= <mlev>
##$CPDPRG7= <mlev>
##$CPDPRG8= <mlev>
##$CPDPRGB= <>
##$CPDPRGT= <>
##$D= (0..31)
0 1 0 0 0 0 0 0 0 0 0 0.03 2e-05 3e-06 0 0 0 0 0 0 0 0 0 0 0 0 0 0 0 0 
0 0 
##$DATE= 1636527193
##$DBL= (0..7)
120 120 120 11 120 120 24 19 
##$DBP= (0..7)
150 150 150 150 150 150 150 150 
##$DBP07= 0
##$DBPNAM0= <>
##$DBPNAM1= <>
$$ [...]
##$SUBNAM3= <"">
##$SUBNAM4= <"">
##$SUBNAM5= <"">
##$SUBNAM6= <"">
##$SUBNAM7= <"">
##$SUBNAM8= <"">
##$SUBNAM9= <"">
##$SW= 501.771253377433
##$SWIBOX= (0..15)
0 1 3 0 0 0 0 0 0 0 0 0 0 0 0 0 
##$SW_h= 40650.406504065
##$TD= 32768
##$TD0= 1
##$TE= 0
##$TE2= 300
##$TE3= 300
##$TEG= 300
##$TL= (0..7)
0 120 53 12 22 120 120 120 
##$TP= (0..7)
150 150 150 150 150 150 150 150 
##$TP07= 0
##$TPNAME0= <>
##$TPNAME1= <>
##$TPNAME2= <>
##$TPNAME3= <>
##$TPNAME4= <>
##$TPNAME5= <>
##$TPNAME6= <>
##$TPNAME7= <>
##$TPOAL= (0..7)
0.5 0.5 0.5 0.5 0.5 0.5 0.5 0.5 
##$TPOFFS= (0..7)
0 0 0 0 0 0 0 0 
##$TUNHIN= 0
##$TUNHOUT= 0
##$TUNXOUT= 0
##$USERA1= <user>
##$USERA2= <user>
##$USERA3= <user>
##$USERA4= <user>
##$USERA5= <user>
##$V9= 5
##$VALIST= <valist>
##$VCLIST= <CCCCCCCCCCCCCCC>
##$VD= 0
##$VDLIST= <DDDDDDDDDDDDDDD>
##$VPLIST= <PPPPPPPPPPPPPPP>
##$VTLIST= <TTTTTTTTTTTTTTT>
##$WBST= 1024
##$WBSW= 4
##$XGAIN= (0..3)
0 0 0 0 
##$XL= 0
##$YL= 0
##$YMAX_a= 1990
##$YMIN_a= -9770
##$ZGOPTNS= <>
##$ZL1= 120
##$ZL2= 120
##$ZL3= 120
##$ZL4= 120
##$ABSF1= 248.5645
##$ABSF2= -253.2056
##$ABSG= 5
##$ABSL= 3
##$ALPHA= 0
##$AQORDER= 0
##$ASSFAC= 0
##$ASSFACI= 0
##$ASSFACX= 0
##$ASSWID= 0
##$AUNMP= <proc_1d>
##$AZFE= 0.1
##$AZFW= 0.5
##$BCFW= 0
##$BC_mod= 2
##$BYTORDP= 0
##$COROFFS= 0
##$CY= -3
##$DATMOD= 1
##$DC= 0
##$DFILT= <>
##$DTYPP= 0
##$F1P= 0
##$F2P= 0
##$FCOR= 1
##$FTSIZE= 65536
##$FT_mod= 6
##$GAMMA= 0
##$GB= 0
##$INTBC= 1
##$INTSCL= 5.30512e-09
##$ISEN= 30
##$LB= 1
##$LEV0= 0
##$LPBIN= 0
##$MAXI= 10000
##$MC2= 0
##$MEAN= 0
##$ME_mod= 0
##$MI= 50
##$NCOEF= 0
##$NC_proc= -8
##$NLEV= 6
##$NOISF1= 182.463
##$NOISF2= 159.3651
##$NSP= 0
##$NTH_PI= 0
##$NZP= 0
##$OFFSET= 248.5645
##$PC= 4
##$PHC0= -8841.797
##$PHC1= 134.2694
##$PH_mod= 1
##$PKNL= yes
##$PPARMOD= 0
##$PSCAL= 0
##$PSIGN= 0
##$REVERSE= no
##$SF= 81.014009
##$SI= 65536
##$SIGF1= 159.3651
##$SIGF2= -187.1042
##$SINO= 113.3802
##$SIOLD= 16384
##$SREGLST= <1H.CDCl3>
##$SSB= 0
##$STSI= 65536
##$STSR= 0
##$SW_p= 40650.406504065
##$SYMM= 0
##$S_DEV= 0
##$TDeff= 32768
##$TDoff= 0
##$TI= <>
##$TILT= no
##$TM1= 0
##$TM2= 0
##$TOPLEV= 0
##$USERP1= <user>
##$USERP2= <user>
##$USERP3= <user>
##$USERP4= <user>
##$USERP5= <user>
##$WDW= 1
##$XDIM= 65536
##$YMAX_p= 365201580
##$YMIN_p= -47266051
$$ End of Bruker specific parameters
$$ ---------------------------------
##NTUPLES= NMR SPECTRUM
##VAR_NAME=  FREQUENCY,     SPECTRUM/REAL,   SPECTRUM/IMAG
##SYMBOL=    X,             R,               I
##VAR_TYPE=  INDEPENDENT,   DEPENDENT,       DEPENDENT
##VAR_FORM=  AFFN,          ASDF,            ASDF
##VAR_DIM=   65536,         65536,           65536
##UNITS=     HZ,            ARBITRARY UNITS, ARBITRARY UNITS
##FACTOR=    0.620285442955139, 1,           1
##FIRST=     20137.2065510759, 0,            0
##LAST=      -20513.1999529892, 0,           0
##MIN=       -20513.1999529892, -47266051,   0
##MAX=       20137.2065510759, 365201580,    0
$$ Real data points
##PAGE= N=1
##DATA TABLE= (X++(R..R)), XYDATA
$$ [...]
12929d664896R517605M421514j2111964j2723155O001525J8093769J0022454k481942
12921A6074910n713195o925773j1568252q967079M427511J1352377R15828j0601252
12913a1004925n171463P913126Q997232j10895l582430l24422j669793o343157
12905a1296727j737961J0601161J3317904R68881j0093418o702539K507229L107119
12897F71649l274268m926918L35569M088301K468558J026403L663458N842750
12889I895502K656702k397963k379074K111082L248570k205200p460612n495761
12881b026754M98156K206413j186096k787190J72932K397776M50821j115031K045749
12872F56776O093147N037203R5504l233092l915936m515863m131551K66799O157226
$$ y = [-4664896, 4852709, 9274223, -2837741, -15560896, -9559371, 8534398, 18556852, 16074910, 10361715, 3435942, -8132310, -17099389, -12671878, -1319501, -403673, -11004925, -16176388, -8263262, 733970, 623075, -2959355, -3283777, -4953570, -11296727, -13034688, -2433527, 10884377, 11853258, 1759840, -4942699, -2435470, 671649, -2602619, -7529537, -7193968, -3105667, -637109, 389294, 4052752, 9895502, 12552204, 10154241, 7775167, 9886249, 13134819, 10929619, 3469007, -2026754, -1528598, 677815, -508281, -3295471, -3122539, -724763, -273942, -1388973, 656776, 6749923, 11787126, 11882630, 8649538, 4733602, 217739, -3913812, -3647013, 2510213]
12863B510213O696114R32469l818398k316316J638745K121632N959O4786K538677
12854A0373881L363849J378424m83057j237617l263174o070970m629408K203882
12846A635810O717614K042122o382565o889419J488711O885833J915612n231944
12838B181774k919062O728218J0717601K808134r400025j5103008j1884824n153752
12830b2024944m02072J548540L252458O001956P230935M459318J197170L627891
12822D891252R595090Q103353m789481j6711339j4343944k393420L960472J538366
12814a0149651L08378L488831K875327k772205j759340R608211J5519684L271552
12806B0390787j4450074j6096658k465092O367755J916087l531976j10422N155639
$$ y = [2510213, 9206327, 10138796, 6320398, 4004082, 5642827, 7764459, 7770418, 7835204, 10373881, 13737730, 15116154, 14633097, 13395480, 10132306, 4061336, -568072, 1635810, 8353424, 10395546, 4012981, -2876438, -1387727, 5498106, 7413718, 2181774, -737288, 5990930, 16708531, 19516665, 10116640, -4986368, -16871192, -22024944, -22427016, -20878476, -17626018, -11624062, -4393127, 66191, 1263361, 4891252, 14486342, 22589695, 17800214, 1088875, -13255069, -15648489, -11688017, -10149651, -9841273, -6352442, -3477115, -6249320, -8008660, 1599551, 17119235, 20390787, 5940713, -10155945, -12621037, -6253282, -4337195, -7869171, -7979593, -2823954]
12798b823954L621461j76702J061334L283592r66616p819233p414526j5686M875418
12789f374912M080015M122880P830617Q110879m23690j1489935j4788048q811886
12781a7744080m27376M998250P421416P922495O204188K470997j848520n393128
12773C604242o463500k774476M678573R021825M292744n074647p833713r41892
12765a490844N611179L216745k534269q76265O618070P740949j299272r179181
12757G807112o097511J700790J663772o395146j0758598n219105L210675N701587
12749h386424L144360K317356N545541Q777251P492448J203344o240167r025098
12741D828611m747666J022272k56118p805090r627078J743690J6418659J8066610
$$ y = [-2823954, 797507, 620805, 1682139, 4965731, 3999115, -3820118, -11234644, -11250330, -6374912, -2294897, 1827983, 9658600, 17769479, 17345789, 5855854, -8932194, -17744080, -18171456, -13173206, -5751790, 2170705, 8374893, 10845890, 8997370, 3604242, -2859258, -5633734, -955161, 8066664, 12359408, 7284761, -548952, -1490844, 4120335, 7337080, 4802811, 3926546, 10544616, 18285565, 16986293, 7807112, 1709601, 3410391, 5074163, -1320983, -12079581, -17298686, -14088011, -8386424, -5242064, -2924708, 2620833, 11398084, 18890532, 20093876, 13853709, 4828611, 80945, 1103217, 847099, -6957991, -16585069, -14841379, 1577280, 19643890]
12733A9643890N089711q123646j0624272n959014k124044m47133P50902j08624
12725a902230l671299n255745j586030K710774J996271j150772o06404K918157
12717f547278L672911O13840k076500k630964k801151k452205K30490L950364
12709h040493N697786N472609L928559j430516j0182853j3198258l618458Q972866
12701a2398758Q511091l377958p896836K646641J2289705N379544r914973j3965287
12693a8726831k974525Q831652R968761L263397j921845j53442P168655J3185547
12685A8641369J0626949l1797r533199j0723015o668503l584794j129047L448265
12677A046228O405332J917125o730529r321398k369339O483823Q635822L661934
$$ y = [19643890, 24733601, 16609955, 5985683, 26669, -2097375, -2544508, -1793606, -1902230, -5573529, -10829274, -12415304, -9704530, -7708259, -8859031, -9465435, -6547278, -2874367, -2260527, -4337027, -6967991, -9769142, -12221347, -11990857, -8040493, -2342707, 3129902, 7058461, 5627945, -4554908, -17753166, -21371624, -12398758, -3887667, -7265625, -15162461, -12515820, -226115, 5153429, -4761544, -18726831, -21701356, -12869704, -2900943, 362454, -1559391, -1712833, 5455822, 18641369, 29268318, 29236521, 19703322, 8980307, 2311804, -1272990, -2402037, 1046228, 7451560, 9368685, 2638156, -6683242, -9052581, -2568758, 6067064, 9728998]
12669I728998k419726l911087l98160K289079k056122j0440881j1236675O08334
12661a7836240J3620827J2747454q91825j1960769j1016168l334355K352233M248226
12653a2070617M334959L421291L139700N982287R392570O095164n008173j3798920
12645A488261j0730074p4968M927545j149970r751605r683336k78821R022956
12637a6230012R936201L400249l255587m654706j416501K602007M475793L498553
12629a644003P03902j686075j627498Q92328L754887M411309J499320l697541
12621B606629o644127l488748K384406K392340m505465p193826J717237J1649608
12613a081946Q027370l775861n140630N355187Q132418m959738j5273275p098551
$$ y = [9728998, 7309272, 3398185, 3000025, 5289104, 3232982, -7207899, -18444574, -17836240, -4215413, 8532041, 7640216, -4320553, -15336721, -18671076, -16318843, -12070617, -7735658, -4314367, -1174667, 4807620, 14200190, 20295354, 15287181, 1488261, -9241813, -9316781, -4389236, -5539206, -15290811, -24974147, -25252968, -16230012, -6293811, -2893562, -6149149, -10803855, -12220356, -9618349, -5142556, -1644003, -940101, -2626176, -4253674, -3361346, 393541, 4804850, 6304170, 2606629, -4037498, -7526246, -5141840, -2749500, -7254965, -14448791, -12731554, -1081946, 6945424, 3169563, -1971067, 3384120, 11516538, 6556800, -8716475, -15815026]
12605a5815026N960022L018438r911178j0619708K674234J0090169L748970j472557
12597a2326636M603985J0476214L308083r356031j0524271K416962J5387269J5027543
12589A9013118J656628j2776523j6171673p656540J975887L575882O04186J673637
12581h105398O281433O764170J940738j511473o32760J045292K195603M736678
12573A2714283N851254Q9176r016338j0478391j606846P928430J0184099O934886
12565B2600553J531737n882451j1774742r456123o01952M181785J097010j339981
12557C55836K311377N082084P41235m564123k736485K845578L487460j700744
12549E822218o788477p670850l447305M923447J1833467R604251o33734p789508
$$ y = [-15815026, -9855004, -6836566, -16747744, -27367452, -24693218, -14603049, -10854079, -12326636, -7722651, 2753563, 6061646, -3294385, -13818656, -11401694, 3985575, 19013118, 20669746, 7893223, -8278450, -15934990, -13959103, -10383221, -9779035, -8105398, -1823965, 4940205, 6880943, 5369470, 4736710, 5782002, 7977605, 12714283, 18565537, 18654713, 9638375, -840016, -2446862, 5481568, 15665667, 22600553, 24132290, 18249839, 6475097, -2981026, -3582978, 598807, 1695817, 355836, 2667213, 7749297, 8490532, 3926409, 1189924, 4035502, 7522962, 5822218, -966259, -8637109, -12084414, -7160967, 4672500, 14276751, 13643017, 5853509]
12541E853509n905786k256268m323345p756366n158995J549552O310565Q731997
12533b955137R638385M648091p231729j5406734r995691K338637O660538Q08725
12525a1494915l274562K148473J1483463J5147601R697567j476862j0907862j1338700
12517a5797l181486M043026L004437k119792l501937j692823j506586r71794M532695
12508a410057J0020895N385561p463835j4042627p108401L267401M458137k210205
12500i103131o217551l479343K02094m92694k867793p50006O399740J1787564
12492d521120R134739K72149p141697q173452l845282K752008Q510661Q882573
12484E870579J215918q752822j0701642l157000L628779K059729k757842k530497
$$ y = [5853509, -52277, -2308545, -6631890, -14388256, -19547251, -17997699, -11687134, -2955137, 6683248, 11331339, 4099610, -11307124, -21302815, -18964178, -12303640, -11494915, -14769477, -12621004, -1137541, 14010060, 23707627, 22230765, 11322903, -15797, -3197283, 845743, 3850180, 1730388, -1771549, -3464372, -4970958, -5942752, -1410057, 8610838, 13996399, 6532564, -7510063, -14618464, -11351063, -6892926, -9103131, -15320682, -18800025, -18597931, -19090625, -21958418, -22708424, -16308684, -4521120, 4613619, 4885768, -2255929, -10429381, -14274663, -11522655, -3011994, 5870579, 7086497, -1666325, -12367967, -15524967, -11896188, -9836459, -12594301, -15124798]
12476a5124798J908311M675627M926309M949310L322739j589082n259992k618844
12468d810420K893373L959434N43910j503764o95895n50231j518018m32516K421906
12459C07779K971733J40157l030970m557291m470792k040333K391549M703965
12451c584203K086078j325739k67384K656898J146013l659401m484782L31442
12443g101078M533983L760051K61253k885645n308215n945829k638619L071922
12435a2252177N970995L717292m62183k139315N79941O712188J1824267R622298
12427B3573306p12187j0294228r507933m61926N323477J488661o369532q787274
12419e747636k681447O868144J1558674O909635k885659q510855o061597j020897
$$ y = [-15124798, -13216487, -8540860, -3614551, 1334759, 4657498, 3068416, -2191576, -4810420, -1917047, 2042387, 2586297, 1082533, 386638, -163593, -1681611, -2114127, 307779, 3279512, 3419669, 388699, -4168592, -8639384, -10679717, -8288168, -3584203, -1498125, -2823864, -3091248, -434350, 711663, -2947738, -7432520, -7101078, -2567095, 1192956, 1454209, -1431436, -6739651, -12685480, -15324099, -12252177, -6281182, -2563890, -3026073, -5165388, -4585447, 2126741, 13951008, 23573306, 22861119, 12566891, 3058958, 2597032, 7920509, 9409170, 3039638, -5747636, -8429083, -1560939, 9997735, 16907370, 14021711, 5510856, -550741, -1571638]
12411a571638M99106o04051j214414k179459m112589l294927J359043L497196
12403g621733o35450l932393M43067O301962M085789k723719l960690o57917j718010
12394a0419094n899402l564002M191592N266268k279802n474954K139819R719362
12386f320213O970373n55151k623844L03183K135053K892638N988764R577074
12378A8367877Q607153K154374o013970j0834139q250839L89673N766862K07969
12370A0394960r633106r721304M39788O145686L31801n642498j147186O853632
12362a978227O380504p53149m506673k940644r37879J206466N598306P382045
12354I450749L3530j1520762j4306355m474899P728692J1318347N929197j183845
$$ y = [-1571638, -1072532, -1676583, -2890997, -5070456, -9183045, -12477972, -11118929, -7621733, -8257183, -12189576, -11746509, -5444547, -1358758, -4082477, -8043167, -8701084, -10419094, -16318496, -19882498, -15690906, -10424638, -12704440, -18179394, -16039575, -6320213, 650160, 95009, -2528835, -2225652, -90599, 2802039, 8790803, 18367877, 26975030, 29129404, 23115434, 12281295, 4030456, 4420129, 10186991, 10394960, 761854, -8959450, -8519662, -2373976, -2042175, -7684673, -8831859, -1978227, 4402277, 3649128, -857545, -3798189, -4736068, -3529602, 2068704, 9450749, 9484279, -2036483, -16342838, -20817737, -13089045, -1770698, 4158499, 2974654]
12346B974654l663293l35400M681250N296906j18473n806601m809366K512722
12338G32399Q584857O821455j645657q717251o814461K555103Q838545M545053
12330A4900043m551046p210106l009121j872836o880215q531929l83818R918804
12322g620224J2025449O789744J130042l496032q623978j0742123n427037L810857
12314a2153302R152846Q553954N440449J489185l267213o058753m392144j483408
12306b718386k229454n551588o396308l185466J885392P050477J0257008P965862
12298G077537O56439m225701j307200M425982N097044J528758l45965m19552k499265
12289I988077m724175k224839K402581J963501k469765k522462K680039L895220
$$ y = [2974654, -688639, -1024039, 3657211, 8954117, 8835644, 3029043, -1780323, 732399, 9317256, 16138711, 14493054, 5775803, -1038658, 1516445, 10354990, 14900043, 10348997, 3138891, 129770, -1743066, -8623281, -17155210, -17539028, -7620224, 4405225, 11194969, 12325011, 8828979, 205001, -10537122, -15964159, -12153302, -3000456, 5553498, 10993947, 12483132, 9215919, 3157166, -1234978, -2718386, -4947840, -10499428, -16895736, -20081202, -18195810, -11145333, -888325, 7077537, 7733976, 3508275, 2201075, 6627057, 11724101, 13252859, 12906894, 12487342, 9988077, 5263902, 3039063, 5441644, 7405145, 4935380, 2412918, 5092957, 8988177]
12281H988177k883770q904535n836729J935213M647325P46851l264696k610973
12273g183137J661862N741192O014984J352260m326569m560156J333199N605677
12265E639312J787529n822327p633828k210246K035909m53091m237195j616836
12257a2510773M897911N785477o66293m722705L01410P021967M487499m930856
12249c36363q604072k203211N230397O445303N481496O965009N886185l085212
12241A5779532j2895435j1502237N93344J0086118Q336029Q94938k343676j4011
12233H934602J422046k021051o176472m182559L510677P668442J837513p369888
12225C623310q194762r85468J949010m230580q921267l616277L904561L056420
$$ y = [8988177, 6104407, -2800128, -8636857, -6701644, -2054319, -1307468, -4572164, -7183137, -5521275, 219917, 6234901, 7587161, 3260592, -1299564, 33635, 5639312, 7426841, 1604514, -6029314, -8239560, -6203651, -6656742, -10893937, -12510773, -7612862, -1827385, -2493678, -7216383, -6914973, 106994, 4594493, -336363, -8940435, -11143646, -5913249, 532054, 6013550, 12978559, 18864744, 15779532, 2884097, -8618140, -8024796, 2061322, 10397351, 11292289, 8948613, 8934602, 10356648, 8335597, 2159125, -2023434, 1487243, 9155685, 10993198, 3623310, -4571452, -5556920, -3607910, -7838490, -16759757, -20376034, -16471473, -13415053]
12217a3415053j561578Q65316P328314N892422k431071l680270N904564J2705773
12209A1608417O521663n152973j0429588r080441p143968m930734J34184N122220
12201a3351220N252703K061069L19898L2349j499254k532673O58623N605412N426371
12192A973278n97859m725377j316964N214757O495232J168246m422617n421213
12184a632517l533973j572484K133095R076238J3519206P767294n134121j2197633
12176H425105p305388N52016J168993k495764j933448J591636L56707m875432
12168d515575n296746J148355O720184O718008M830028L746127Q51749l585609
12160A0616521m061457r9705N38208n610964j0541226o589336J957316O013992
$$ y = [-13415053, -14976631, -14111315, -6783001, -890579, -3321650, -7001920, -1097356, 11608417, 18130080, 12977107, 2547519, -6532922, -13676890, -18607624, -18473440, -13351220, -8098517, -6037448, -5717550, -5685201, -7184455, -9717128, -9058505, -3453093, 1973278, 1375419, -3349958, -4666922, 547835, 7043067, 8211313, 3788696, -1632517, -5166490, -6738974, -4605879, 4470359, 17989565, 25756859, 20622738, 8425105, 1119717, 1671733, 2840726, 344962, -1588486, 3150, 359857, -4515575, -9812321, -8663966, -1943782, 4774226, 9604254, 13350381, 14202130, 10616521, 6555064, 6455359, 6993567, 1382603, -9158623, -15747959, -13790643, -7776651]
12152g776651M287878J659206K13569q48472l27053K945075N840600M611502P33392
12143A1339046j569206j328124n47489o23396k139196m875730n663585r57258
12135f364938O113199P580550K553999n32169K114838K847459l421661q422845
12127B468432l781047L859104L440986k116904k518340O69829k094891q430695
12119h503526o291003L647449O635593j514425p030201k115393K058404l222357
12111a6335459p025935K058050J3583275J0446976k897520p248027R65264O034290
12103d19086m61017q220223p062786p97954L753066P322981J0235199O637834
12095A0988014l914512r922841l763280M851731L141527m401925l858303M677795
$$ y = [-7776651, -3488773, -1829567, -1615998, -2464470, -2791523, 153552, 5994152, 10605654, 11339046, 9769840, 8441716, 7894227, 7270831, 5131635, 255905, -5407680, -6364938, -251739, 7328811, 9882810, 9350641, 11465479, 14312938, 10891277, 2468432, -1312615, 2546489, 5987475, 3870571, 1352231, 2022060, -72831, -8503526, -14794529, -11147080, -4511487, -6025912, -13056113, -15171506, -13113102, -16335459, -23361394, -21303344, -7720069, 2726907, -170613, -7418640, -6453376, -419086, -880103, -9100326, -16163112, -16961066, -13208000, -5885019, 4350180, 10988014, 7073502, -2849339, -6612619, -1760888, 1380639, -3021286, -6879589, -2201794]
12087b201794P339173k59538n982738j489884M757948K705415k711043j067009
12079A090530N311370N120382l372342r725380p461449k096027k30779L48074
12071a1015621M430172R451869Q322092k25915r130656j0479666k950148P377378
12063d220495J1956911O935227k955499q922235p467250l124941j039929n36583
12055i374794J182444K668226O29716k924097j715557N634331J2028207J0010140
12047A8138616Q80953o937940p572920l417901r21917k303518l403073l46437
12039e884137L955991L366035j917695m253153P99725P332113O828223l06928
12031I920174o135099n805242j218723M155826P835084O734759J13183n873086
$$ y = [-2201794, 5137379, 4877841, -1104897, -2594781, 2163167, 4868582, 2157539, 1090530, 6401900, 11522282, 8149940, -1575440, -9036889, -11132916, -11363695, -11015621, -6585449, 2866420, 11188512, 10962597, 1831941, -8647725, -11597873, -4220495, 7736416, 14671643, 11716144, 2793909, -4673341, -7798282, -8838211, -9374794, -8192350, -5524124, -4894408, -7818505, -9534062, -3899731, 8128476, 18138616, 19019569, 12081629, 4508709, 1090808, 168891, -2134627, -5537700, -5884137, -1928146, 1437889, -479806, -4732959, -3933234, 3398879, 10227102, 9920174, 3785075, -2020167, -3238890, 916936, 8752020, 15486779, 15599962, 9726876]
12023I726876m058872K404081K815649m886215r753059l917110N747397Q386239
12015F464986L859949r23769l559189n201803l788923J845587N248610J73247
12007D118695p706740p461478O89843O539438O202909N461659O560684M139762
11999A8544772l002225p613978n601999k051793j678861k602128l166868n142210
11991a2315290o512708j848634N896918N930380k372633n016636M982227J4662244
11983C405868J0602254q12808n574768l732054m040825n837972k518736L281213
11975e227828M119900K238823L811955M162909l796199j1317012m288227J0534545
11967B38866J2094148j259170q205415L71275O749543k615892j3698034q356234
$$ y = [9726876, 5668004, 8072085, 10887734, 6001519, -3751540, -7668650, -1921253, 6464986, 10324935, 9401166, 5841977, 640174, -3148749, -1303162, 3945448, 4118695, -3588045, -11049523, -10359680, -3820242, 2382667, 7844326, 14405010, 18544772, 15542547, 7928569, 2326570, 274777, -1404084, -4006212, -7173080, -12315290, -18827998, -20676632, -14779714, -8849334, -11221967, -16238603, -11256376, 3405868, 14008122, 13195314, 7620546, 3888492, -152333, -5990305, -8509041, -5227828, -1107928, 1130895, 4942850, 9105759, 5309560, -6007452, -10295679, 238866, 12333014, 11073844, 2868429, 3239704, 9989247, 7373355, -6324679, -14680913]
11959a4680913O228570J0226301J606589m757240j777998K966473K368721j705030
11951D75473m398527l037446K327337P249860N438263j850779n248953j620437
11943f65209l5162n762695q985840r28519Q824307O100284m376738o459503J039517
11934a1249558M018915j780328m275537K968133R672820O631221p8056j535855
11926D371755o52158l856424p116761k232329P554246R661612m17355j2259881
11918d947295j3073878k314766Q389009Q011915k215123r911924n161057P488695
11910a3734424J3544344N745254p189411j1556714m816111L806334O715132N514326
11902a971270M177658J611904l635133o118704K91003R971230R626048k149556
$$ y = [-14680913, -8452343, 1773958, 3380547, -1376693, -3154691, -188218, 2180503, 475473, -3923054, -6960500, -4633163, 2616697, 8054960, 6204181, 955228, -665209, -700371, -6463066, -15448906, -16377425, -7553118, -1452834, -5829572, -12289075, -11249558, -7230643, -9010971, -13286508, -10318375, -645555, 5985666, 5907610, 4371755, 3719597, -136827, -7253588, -9485917, -1931671, 7729941, 7312586, -4947295, -18021173, -20335939, -11946930, -3935015, -6150138, -16062062, -21223119, -13734424, -190080, 5555174, -1634237, -13190951, -18007062, -14200728, -7485596, -1971270, 2206388, 3818292, 183159, -5935545, -5644542, 4326688, 13952736, 11803180]
11894A1803180j0012223l692022N466011J473797j0675485j2232194O6608J0024708
11886g777620Q333816M341687N993138O017714j868157q573447m565890L023067
11878D924308K447007l148712l078777J562206J396193l341369l617311K002917
11870h53538N503219L220011k69047j670639k228248k128652n78178l6361k339889
11861a381322l341541O22811M941380L854700L27724k85325j66637k339223j605423
11852F27144N319748Q659084k61815j1207197r026102J058146K297290m406279
11844f939981l164165O899208R142475p44794o985408j540909L766960R77852
11836A411238p63633M091827N181754k882528p447040m1675O738944O09201q657438
$$ y = [11803180, 1790957, -1901065, 3564946, 5038743, -5636742, -17868936, -17802328, -7777620, 556196, 4897883, 10891021, 16908735, 15040578, 6467131, 1901241, 4924308, 7371315, 4222603, 1143826, 2706032, 4102225, 760856, -2856455, -853538, 4649681, 7869692, 7600645, 5930006, 3701758, 1573106, 994928, 958567, -1381322, -4722863, -4100052, 841328, 4696028, 5023752, 4738427, 4571790, 2232567, 627144, 5946892, 14605976, 14344161, 3136964, -5889138, -4830992, -2533702, -6939981, -10104146, -3204938, 5937537, 5192743, -1792665, -3333574, 433386, 1411238, 647605, 4739432, 9921186, 7038658, -408382, -450057, 6288887, 6898088, -1759350]
11827a759350o294106K810484M732803n3646k263917k914351q122686j2363945
11819b6228714n555357P788876J3432730Q562194L313955L589481N495516M875048
11811A5273729J136370n759819j2552457j1451746j118727P251550M959927n47942
11803b809115J318369N959960K471229o349018q791398l853937l5019J420929
11795a0668000N893735J1057048R322022K505102j381370l351643r295815j3703802
11787i622723o076763P729112J0484624R34401m108197K059212O699580K111113
11779A0210359j615573K709628N697561J82353m184627P61020M592330m057593
11771A4295458j5529406j3033539L94242P357074L153296q49052J063923J412787
$$ y = [-1759350, -8053456, -5242972, -510169, -563815, -2827732, -5742083, -13864769, -26228714, -31784071, -23995195, -10562465, -2000271, 1313684, 4903165, 10398681, 15273729, 16410099, 10650280, -1902177, -13353923, -14472650, -7221100, -2261173, -2809115, -1490746, 4469214, 6940443, 591425, -8199973, -12053910, -12088929, -10668000, -4774265, 6282783, 15604805, 18109907, 16728537, 13376894, 4081079, -9622723, -15699486, -7970374, 2514250, 3448651, -659546, 1399666, 8099246, 10210359, 8594786, 11304414, 17001975, 17184328, 12999701, 13760721, 18353051, 14295458, -1233948, -14267487, -13873245, -6516171, -3362875, -4211927, -3148004, -1735217]
11763a735217m149551p984459l294010N028410Q375398N766191J773951j282917
11755B497796l593804l798239j19607N137217O205859L82053p643235r947309
11747a0879269m265983L135487N210689K821493K160997M721306N230999O19658
11739H755377m549500m756524j213584J318450K192112M267025O954536N225068
11731A8192960k822169j0796006r937299k37383P630242M597224m378074n982651
11723c733156K466284P683374m39206j2037541j0052670M604960J3970657R040996
11715A1503698P06924L57881L123572o67523p983563q893018l423568l36704k110735
11706g723036k780926j00835J055931j081965j432431K086041L457494j488099
$$ y = [-1735217, -5884768, -13869227, -17163237, -12134827, -3759429, 2006762, 3780713, 2497796, -1096008, -4894247, -5013854, 123363, 6329222, 6711275, -931960, -10879269, -15145252, -12009765, -6799076, -3977583, -1816586, 2904720, 8135719, 8755377, 4205877, -550647, -1764231, -445781, 1746331, 6013356, 12967892, 18192960, 15370791, 4574785, -5362514, -5599897, 2030345, 6627569, 2249495, -3733156, -1266872, 6416502, 5977296, -6060245, -16112915, -11507955, 2462702, 11503698, 12210622, 12568503, 15692075, 15024552, 7040989, -1852029, -5275597, -5612301, -7723036, -10503962, -10604797, -9548866, -10630831, -12063262, -9977221, -6519727, -8007826]
11698h007826o548875l135484O851436J2587044P724949k789211r442041p940938
11690a0700946j604451L324217L733832K224830L545850P666924Q495376K317101
11682A9002733m948657m672846R95129O54874q556422j3763896m412659R974654
11674e727090J1694895N41142o502763j428036M331038O42218n116740k628989
11666d194325L087795J749475k791809N70784Q676298O869656o648294j5719560
11658h399980r529452L002656Q360204O092228L364149J495106k214146n187899
11650c017134k164906M893415P490017J797353n892925o654589J88758N633110
11642B273099J817430o598205o891203L444180J0253209K118611j0875031j0574172
$$ y = [-8007826, -14556701, -17692185, -10840749, 1746295, 9471244, 6682033, -2760008, -10700946, -12305397, -8981180, -5247348, -3022518, 523332, 8190256, 16685632, 19002733, 14054076, 9381230, 10376359, 11031233, 2474811, -11289085, -15701744, -5727090, 5967805, 6508947, 6184, -1421852, 2909186, 3551404, -1565336, -4194325, -1106530, 642945, -2148864, -1578080, 7098218, 13967874, 7319580, -8399980, -17929432, -14926776, -6566572, -474344, 2889805, 4384911, 2170765, -3017134, -5182040, -288625, 7201392, 8998745, 3105820, -3548769, -3360011, 2273099, 4090529, -2507676, -9398879, -5954699, 4298510, 6417121, -4457910, -15032082]
11634a5032082J268878N442632l610586q450418K374982J4472471J0204762l363588
11626C307051o560683K106570O287141q80821q162918o012181P41812L985182
11618e188847L660326K787825O85053l269242n783451m200387k96174L025217
11610h579680M481649K931150j502974m243202n35358O102266O831556Q42618
11602F328025j949234M556459J2361434R559101l433803j3803459j1112852J618336
11594D124007J1193570P381502o106788j4492064q570284L526010O860373J85554
11586D101880l363936K737261Q182635K919189n777615m184671O032020R693034
11578B0339797O66064r453094q165006J635718P356521K972229n811772r917884
$$ y = [-15032082, -13763204, -8320572, -11931158, -20381576, -18006594, -3534123, 6670639, 3307051, -3253632, -1147062, 5140079, 4259258, -3903660, -9915841, -9174029, -5188847, -1528521, 1259304, 1944357, -1324885, -7108336, -11308723, -11604897, -8579680, -4098031, -1166881, -2669855, -6913057, -7448415, -1346149, 5485407, 6328025, 4378791, 8935250, 21296684, 30855785, 27421982, 13618523, 2505671, 4124007, 15317577, 22699079, 16592291, 2100227, -6470057, -2944047, 3916326, 4101880, 737944, 3475205, 11657840, 14577029, 8799414, 4614743, 10646763, 20339797, 21005861, 11552767, 3387761, 5023479, 12380000, 15352229, 9540457, -377427]
11570c77427o121166J343437N884364M966937J690841n3090k74572j050362k289576
11561C719386k618350k586691k925238j546346K581462M657542K18211n259572
11553c759596k247845O715402Q130700j328563p211740P30998J0590715N704576
11545A7324647q212412j0324819L854931J6015368J2099400p14408r493748j2774574
11537G774385j3763433r758393M0995O293629J785817n400964l582418L810535
11529a2799847M689351j215288l198689J325679M028203K256849K853208O582244
11521D521710M305812n451272r708999o33798J0498037R685185L96504m602217
11513I010962l446360l766477o500321n317538k21786J584540j148396j597608
$$ y = [-377427, -6498593, -5155156, 729208, 5696145, 7386986, 7333896, 7059324, 6008962, 3719386, 1101036, -1485655, -4410893, -5957239, -3375777, 1281765, 1499976, -3759596, -6007441, 707961, 8838661, 7510098, 298358, 1029356, 11620071, 17324647, 9112235, -1212584, 2642347, 18657715, 30757115, 30042707, 20548959, 7774385, -5989048, -15747441, -15706446, -9412817, -7627000, -13027964, -16610382, -12799847, -8110496, -9325784, -12524473, -11198794, -7170591, -4913742, -2060534, 4521710, 8827522, 3376250, -6332749, -6966547, 3531490, 13216675, 13613179, 9010962, 5564602, 1798125, -4702196, -10019734, -10241520, -8656980, -9805376, -11402984]
11505a1402984K303309L847931l93118m233073k095075K428205L191761K19375
11497f133669k849806m394709l630852O44539N767253N356905j273723n550378
11489a2064440j397462M995145M553942m20384o88031M221891N482106J46535
11481D829302l923552j354191K054257n73893n733239n096017K010937Q347485
11473E61089Q479741L410694k437258m345857J22688P056443P611917j080006
11465A9379451r547941p476215J013599K544453n711832j1889980p638654n0386
11457a9377505O17327l383283k338262N650795J3316892J5202704J1801288M645287
11449B6135243m439850r773333o003228K748166N484603j290992q443957o970098
$$ y = [-11402984, -9099675, -5251744, -5644862, -9877935, -11973010, -9544805, -6353044, -6133669, -8983475, -13378184, -17009036, -16364497, -10597244, -5240339, -6514062, -12064440, -13461902, -8466757, -3912815, -4333199, -5021230, -799339, 4682767, 4829302, 905750, -448441, 1605816, 1031923, -4701316, -9797333, -7786396, 561089, 9040830, 12451524, 10014266, 5668409, 5791097, 12847540, 20459457, 19379451, 9831510, 2355295, 3368894, 5913347, 201515, -11688465, -19327119, -19377505, -18760178, -22143461, -24481723, -18830928, -5514036, 9688668, 21489956, 26135243, 21695393, 11922060, 5918832, 8666998, 14151601, 12860609, 4416652, -2553446]
11441b553446J64006L897505J939274p66126j830326m144776q034021p578177
11433a8906087Q33201J0237313R663822j241723j0209361p609103J497403N574557
11425a0159978K601147O1511J104215R42833j520103K67912P432886R372833l00662
11416I802594j0544357p915299J798593K156674o861089p941479N079657J5284298
11408H59592P437529r234088j4629012m783234P019580J0336206O560639N97989
11400D165201m958574p122681l449839K468460L506820j094408m125870o22007
11392a1232898N447525P191960L504672j124980k953613k345475j733461k126906
11384e373176j978448N94019M586604O166307K840145l226140p078556n764510
$$ y = [-2553446, -2389440, 1508065, 3447339, 2681213, 850887, -3293889, -11327910, -18906087, -18072886, -7835573, 1828249, 586526, -9622835, -17231938, -15734535, -10159978, -7558831, -7497320, -6393105, -5450272, -6970375, -6702463, 730423, 10103256, 9802594, -741763, -8657062, -6858469, -4701795, -11562884, -19504363, -14424706, 859592, 8297121, -936967, -15565979, -20349213, -13329633, -2993427, 3567212, 4165201, -793373, -7916054, -11365893, -8897433, -5390613, -6485021, -10610891, -11232898, -5785373, 1406587, 4911259, 3786279, 832666, -1512809, -3246270, -5373176, -7351624, -6757605, -2171001, 3995306, 6835451, 3609311, -3469245, -9233755]
11376i233755q67678L064677K674088o29681j844690J377471N169330M964669
11368D674431K540778K572482L673356K79057o030574o188995J679986O396600
11360I597121m71080j0628302j0446351j014897M529148J460303r35038M169746
11352c739350J0212383P943526r63897p487137p460477l970348o05975J635987
11344d435288J875862p78761m288122m655182j151286K522486L856350N079827
11336a974114P984993Q079939j34040j2076995j4781268l852354P851792O143640
11328b758407m413166o741944L913587J3721406J1523356L904527J935974L466237
11320B4551570o24464r218554j1973902n024805M628201R704492Q996253L702587
$$ y = [-9233755, -10101433, -7036756, -4362668, -4992349, -6837039, -5459568, -290238, 4674431, 7215209, 9787691, 13461047, 13740104, 7709530, 1520535, 3200521, 9597121, 9126041, -1502261, -11948612, -12963509, -8434361, -6974058, -7909096, -3739350, 6473033, 14416559, 13452662, 5965525, -1494952, -5465300, -6071275, -4435288, -2559426, -3338187, -7626309, -12281491, -13432777, -10910291, -7053941, -1974114, 6010879, 14090818, 13956778, 1879783, -12901485, -16753839, -8902047, -2758407, -7171573, -13913517, -9999930, 3721476, 15244832, 19149359, 21085333, 24551570, 23927106, 14708552, 2734650, -2290155, 2338046, 12042538, 21038791, 24741378]
11312B4741378m123857r047428o074873J490346M514871k67209o771629q730210
11304d268611o407671k677739J842807O949517J0037851Q014823Q28550p374264
11296F945263j0285394n110779K439737L240390k568621m305929L175227J0152330
11288C682224O822293r10896k199631l34874n315910j2289627o844646Q355299
11280i035768J3120279R38044r525064l587261P176221N359306m837492p357199
11272g748934r01533K034237k840765p010127m663477O60169M563140O326944
11264i580346N472454K340898O53415K250788K574595j167005k455460M449208
11256D538547J2058456Q908100k250440p805252l012880L571396M533967J022816
$$ y = [24741378, 20617521, 11570093, 5495220, 6985566, 11500437, 11233228, 4461599, -4268611, -10676282, -13354021, -11511214, -4561697, 5476154, 13490977, 14319527, 6945263, -3340131, -8450910, -6011173, -2770783, -5339404, -9645333, -6470106, 3682224, 10504517, 9593621, 7393990, 7059116, 1743206, -10546421, -17391067, -9035768, 4084511, 5022555, -4502509, -8089770, -913549, 4445757, -391735, -7748934, -8650467, -6616230, -9456995, -16467122, -21130599, -20470430, -15907290, -9580346, -4107892, -1766994, -1113579, 1137209, 3711804, 2544799, 89339, 4538547, 16597003, 25505103, 23254663, 15449411, 12436531, 16007927, 20541894, 21564710]
11248B1564710l914043q470526q891415l643690L46846l351517p757588j859618
11240a5976841Q993785Q408998m602639j2282443n281260M566141N497509K738499
11232g938251M480290O467675K506437k537859k441710j030040k313399r00824
11224c707681N482655O566039k660415p543544M314669J7929483J0404514j1562660
11216A9223060j9104289m637432Q210269K671700p857050n148856N648585P848494
11208F854481o85558q101513o651610J773903J1776972J6654405J0678800k638739
11200B9661141j0771872p662016j724198j680380l738603j784442l22297n084129
11192c106796r277816l800815N058779M325224l105746k419245P223415R849820
$$ y = [21564710, 17650667, 9180141, 288726, -3354964, -3008118, -6359635, -14117223, -15976841, -6983056, 1425942, -3176697, -15459140, -20740400, -16174259, -10676750, -7938251, -3457961, 3009714, 5516151, 2978292, 536582, -493458, -2806857, -3707681, 1774974, 8341013, 5680598, -1862946, 2451723, 20381206, 30785720, 19223060, 118771, -4518661, 3691608, 6363308, -1493742, -6642598, -994013, 6854481, 6168923, -1932590, -8584200, -6810297, 4966675, 21621080, 32299880, 29661141, 18889269, 11227253, 9503055, 7822675, 4084072, 2299630, 1977333, -3106796, -12384612, -16185427, -11126648, -6801424, -9907170, -12326415, -5103000, 4746820]
11184D746820k74363p556343j86297R938109N984325o998572j0382522o89506
11176e418349O801202K169221o536930p904022k230741L425284O205176P014972
11168C525813N508882K044689L84033K452323L653336p19383o986012p428534
11160B435147j845820K011708l7342l240484k267595Q43275J030103j472533j872218
11151d415759J850791O358881P381879M135781n28764k907961k011802j122364
11143H740682m064365r032115r162604j690518O436753O104316k281697q854120
11135a3803668n966076L615192J0787555R869835L312623k127160l057721k458982
11127A71598l939447n057424j085955N101561M373195m648801j0911144o075687
$$ y = [4746820, 4472457, -3083886, -3270183, 6667926, 12652251, 5653679, -4728843, -5418349, 1382853, 3552074, -2984856, -10888878, -13119619, -9694335, -3489159, 3525813, 9034695, 11079384, 11463417, 13915740, 17569076, 16849693, 9863681, 2435147, 589327, 2601035, 2563693, -676791, -2944386, -2101111, -1071008, -2543541, -4415759, -2564968, 3793913, 11175792, 15311573, 14782809, 11874848, 9863046, 8740682, 4676317, -4355798, -13518402, -15208920, -8772167, -2667851, -4949548, -13803668, -19769744, -16154552, -5366997, 4502838, 7815461, 5688301, 2630580, 171598, -3767849, -8825273, -9911228, -4809667, -436472, -5085273, -15996417, -22072104]
11119b2072104L019549N170303J563295J249831M819494N191338K277324L148168
11111D367198P247016N323744l917771r290344m297873L018616L693507N62015
11103F706108O9624Q40777j410502n070384o281483n156519k529529K504384O886498
11094c441026M239016l226522l813629N444375J1011427K865992q921121r511783
11086e353271j034612M461046M633075M558930K881044l434162p006036k4391
11078c18377Q722806M918622o960399r646161j344778K505328l618345p259356
11070a3000660q54595O867136Q095991O751415N870415J296991n405745m798947
11062D822001K427201K781979o343264q753340L898852J5862250J1536466r12857
$$ y = [-22072104, -19052555, -13882252, -12318957, -11069126, -6249632, -1058294, 1219030, 4367198, 11614214, 16937958, 13020187, 3729843, -568030, 2450586, 6144093, 6706108, 6775732, 7616509, 6206007, 1135623, -5145860, -10302379, -12831908, -10327524, -3441026, 797990, -2428532, -6242161, -797786, 10213641, 13079633, 4158512, -5353271, -6387883, -1926837, 2706238, 7265168, 10146212, 6712050, -293986, -318377, 8404429, 13323051, 6362652, -3283509, -4628287, -2122959, -5741304, -13000660, -13855255, -6988119, 1107872, 7859287, 13729702, 15026693, 9620948, 4822001, 7249202, 10031181, 3687917, -5065423, -1166571, 14695679, 26232145, 25319288]
11054B5319288o089387n855707q975601j0178314p68456J0167934P582594l246067
11046G956284m674040L195213L478948o981085j1317291j037536J0139299Q642528
11038I402320J15807l212297m72925K325307L794284M537456J732562m447875
11030A3774639o187334J024954Q478365M852738o666563j1483127l433838O850203
11022G210037O175100m242977j0964926n826028M160948P000489J810709j576486
11014C746866J739059M968641J854740k811776j973408J247444l48951m009569
11006D413046p91314P926959R896818K56656j0444194j1140222m441050M8094
10998d275207j74148k36463K208528L914630K039994j886965m651451n098849
$$ y = [25319288, 19229901, 13374194, 4398593, -5779721, -6548177, 3619757, 11202351, 7956284, 3282244, 6477457, 9956405, 2975320, -8341971, -9379507, 759792, 9402320, 9518127, 6305830, 5832905, 8158212, 11952496, 16489952, 18222514, 13774639, 7587305, 8612259, 17090624, 21943362, 15276799, 3793672, 359834, 7210037, 13385137, 9142160, -1822766, -7648794, -3487846, 3512643, 5323352, 3746866, 5485925, 10454566, 12309306, 9497530, 7524122, 8771566, 8422615, 4413046, 3621732, 11548691, 21445509, 21702165, 11257971, 117749, -4323301, -4275207, -4449355, -4685818, -2477290, 1437340, 3477334, 1590369, -3061082, -8159931]
10990h159931m299733l277039j451213K380145P582485J1126811J0176355M661703
10982A8739583k691776p662835o729606r87510K776269m94389n884965m169711
10974g104940L613008O096653p70249o408849k453480L691742K193410j972009
10966c114714J334552P831256N154506m936193q008259m80606N274493K068341
10958E123376j963901N30303M543366M077106K212706K268547M61525m744425
10950A2508603o774472k619990K1436m046771p520563l501142J826998P68973
10942i336928j197368M246748J1062815P285180m149755q688678k513128L167457
10934a23657O43193m788549n790973k089698L437145P757255N777984m109052
$$ y = [-8159931, -12459664, -15736703, -17187916, -14807771, -7225286, 3901525, 14077880, 18739583, 16047807, 8384972, 1655366, 667856, 3444125, 2949736, -2935229, -7104940, -3491932, 2604721, 1834472, -4574377, -7027857, -3336115, -1142705, -3114714, -1780162, 6051094, 11205600, 6269407, -1738852, -2219458, 3055035, 5123376, 3159475, 3689778, 8233144, 12310250, 14522956, 16791503, 17253028, 12508603, 5734131, 3114141, 3135577, -911194, -8431757, -11932899, -10105901, -9336928, -10534296, -6287548, 4775267, 12060447, 7910692, -777986, -3291114, -123657, 519536, -4269013, -10059986, -12149684, -8712539, -955284, 4822700, 713648]
10926G13648j2097459o711904O136084P962686m457714j1579809K59286J7248069
10918b527113J7930753L365394p960776p908732m416885k770960J208763P489483
10910D409927P216519k406807j0842947q895473j277704K460662J365524j8448
10902g988747q87944j963955q7037N884100Q645022J812134p833610q202167j9741
10893a0641945M452139Q22340j633363L424092Q848642O248760p89104l569764
10885G161797j464186j55493j564581k990348k804352q26585L285006O553396
10877G194654K749194p345784j1696221k293355J0360307R616544l423481j1502706
10869f340848o324836K113200M226875M415191Q741228J1640754N768980l627566
$$ y = [713648, -11383811, -18095715, -11959631, -3996945, -8454659, -20034468, -19775182, -2527113, 15403640, 18769034, 10808258, 2899526, -1517359, -4288319, -3079556, 4409927, 11626446, 9219639, -1623308, -10518781, -11796485, -9335823, -7970299, -7988747, -8876691, -10840646, -10927683, -5043583, 3601439, 5413573, -2420037, -10622204, -10641945, -6189806, -5367466, -7000829, -3576737, 5271905, 11520665, 10731561, 7161797, 5697611, 5542118, 3977537, 987189, -1817163, -2643748, 641258, 7194654, 9943848, 2598064, -9098157, -11391512, -1031205, 8585339, 5161858, -6340848, -12665684, -10552484, -6325609, -1910418, 6830810, 18471564, 24240544, 20612978]
10861B0612978o181050k752243k248631n382796m303376J934964M281167r37007
10853E024006n059493j347841L540178P07577n670514m836040K623410N237872
10845B19155p00676m715996J042599Q426070N050372o683970j2445086n998467
10837a5805999L330051M803970k23444l014464p2081M109880M358654O28302k847024
10828d732155j920688L373778Q200933P655918K369478k652046m635268n232756
10820B427194n854242n181526k967400j899901k839886k009437L384857R475913
10812e464428R680729L030412m608026p102447l846778N71988J490035p01973
10804f950488j190472K258975N245779L182749r07635j033092J342385k71013
$$ y = [20612978, 14431928, 11679685, 9431054, 4048258, -255118, 1679846, 5961013, 5024006, -35487, -1383328, 2156850, 2864427, -2806087, -7642127, -5018717, 219155, -481521, -5197517, -4154918, 4271152, 9321524, 2637554, -9807532, -15805999, -12475948, -7671978, -7895422, -10909886, -10981967, -6872087, -2513433, -1885131, -4732155, -6652843, -3279065, 4921868, 12577786, 14947264, 12295218, 7659950, 2427194, -3427048, -8608574, -11575974, -13475875, -16315761, -18325198, -14940341, -5464428, 4216301, 7246713, 2638687, -4463760, -8310538, -7738550, -6248515, -6950488, -8140960, -5881985, -636206, 2546543, 1638908, 605816, 1948201, 1677188]
10796A677188n015560m756068J641824N015079J276513r83420M600089R982660
10788A3438305N330867m353499o824738j413859J668245j942168n982621m934098
10780e013566o44029K922257M057197K157061j652234l148199K12368M225421
10772C116276L033885k026810m005889J32749N907255O559555k70935q981480
10764C464606r100519K404309J2343668N022764j3536315j9116216l044284J3519187
10756h042800J0149554l777134o892089Q18732L162726k828137n101291M1386
10748a2469053M163864M663100O679353P906410R83558q962265q565122J141122
10740d459033N464297N50048k508151K69960K35437m228093l620871K519188K569139
$$ y = [1677188, -3338372, -8094440, -6452616, -1437537, -161024, -1144444, 3455645, 13438305, 18769172, 14415673, 7590935, 6177076, 7845321, 5903153, -79468, -5013566, -5657595, -2735338, 1321859, 3478920, 1826686, -1321513, -1109145, 3116276, 6150161, 4123351, 117462, 250211, 6157466, 12717021, 12446086, 3464606, -5635913, -3231604, 9112064, 14134828, 598513, -18517703, -21561987, -8042800, 2106754, -1670380, -8562469, -7743737, -4581011, -7409148, -12510439, -12469053, -8305189, -3642089, 3037264, 10943674, 11927232, 2964967, -5600155, -4459033, 1005264, 1555312, -952839, -682879, -447442, -4675535, -8296406, -5777218, -3208079]
10731c208079m450173m860989L943043O385868l336076r052782n19307Q520719
10723f577776M718576l117838l001911r96272n128369o119506N175830J6382198
10715A334932J1452479k436369p364291l327736k627625m880381n11446P212288
10707a148149O336299j261960k777880K408623L015732j869941j167456O495917
10699A0031185Q831040J002015o487384n590985j482107n92983j059102l45083
10691D306596j001698l473633k747070K810783P203369N750794J652877r8172
10683A4403846J64000p95762l277138l984024k28439N313532N020508m288190
10675A2328333j3012873q321919O141445J1614049N32349j1731109j0496042k948782
$$ y = [-3208079, -7658252, -12519241, -8576198, -2190330, -5526406, -14579188, -15098495, -6577776, -1859200, -4977038, -7978949, -8975221, -14103590, -20223096, -15047266, 1334932, 12787411, 10351042, 2986751, -340985, -2968610, -7848991, -8360437, -1148149, 5188150, 3926190, 1148310, 3556933, 6572665, 4702724, 3535268, 10031185, 18862225, 19864240, 13376856, 7785871, 6303764, 5710781, 4651679, 4306596, 3304898, -168735, -2915805, -105022, 7098347, 12849141, 14502018, 14403846, 14567846, 13772084, 10494946, 6510922, 6282483, 11596015, 16616523, 12328333, -684540, -9006459, -2865014, 8749035, 9281384, -2449725, -12945767, -15894549]
10667a5894549j943092k337244O966621J7210575R813701j0988428j9583335n919339
10659b2675090J0541570J0746536J556185R68762J1273437J8685092J2653145
10652D3749637l262132j6266719j5899056m230918M617058J45632j0468532j1485120
10644a3100150n04973Q776512O541771j130426l674691j63182L169212K966776
10636B880849J092831L82914J215836Q66511l299601q169920o177391L409936
10628g798035R701786M038918o241274p545700K57125N319070K947889N05915
10620A185694K641726M359030K062792K76297K356184L659190k61203n572681
10612A0707029o049904k301687p8113k181065n793502o558650l282644J202921
$$ y = [-15894549, -17837641, -20174885, -13208264, 4002311, 13816012, 2827584, -16755751, -22675090, -12133520, -1386984, 169201, 1137963, 12411400, 31096492, 43749637, 40487505, 24220786, 8321730, 4090812, 8707870, 8853502, -1615030, -13100150, -13605123, -4828611, 1713160, 582734, -3091957, -3255139, -85927, 2880849, 3973680, 4356594, 5572430, 6438941, 3139340, -5030580, -11207971, -7798035, 1903751, 5942669, -298605, -7844305, -7587180, -2268110, 679779, 1185694, 3827420, 8186450, 10249242, 10525539, 12881723, 16540913, 16279710, 10707029, 4657125, 2355438, 2277325, 96260, -5697242, -12255892, -15538536, -14335615]
10604a4335615L790145N061844O933947P032753J281054o798959p398531J266881
10596c166481Q566112O824948J856228R03790J53265n568935j0022988n196204
10588e650265L595173N680121K137177J235490K327682q45453n159069k328241
10580I92615M357541L484385n060419r455898n141153j5046Q18154J556043M677197
10571c786581O019938L653535J000904p40564l691249o313210m751202o08752
10563i217181J824461M007870Q847652J1381483N461890l549810n397774j102603
10555A2255988N02326j354923j238003j150740o157983r784193j863071J0711994
10547A921395J0330093l498003j1808957m852005M902462L699652n004547r360033
$$ y = [-14335615, -10545470, -5483626, 1450321, 8483074, 9764128, 2965169, -4433362, -3166481, 5399631, 12224579, 14080807, 14984597, 15137862, 9568927, -454061, -5650265, -2055092, 3625029, 5762206, 6997696, 9325378, 8479925, 3320856, 992615, 5350156, 8834541, 3774122, -5681776, -10822929, -10837975, -10019821, -8463778, -3786581, 2233357, 5886892, 6887796, 6147232, 2455983, -3857227, -8608429, -9217181, -7392720, -3384850, 5462802, 16844285, 22306175, 18756365, 13358591, 12255988, 12758314, 11403391, 10165388, 9014648, 2856665, -6927528, -8790599, 1921395, 12251488, 8753485, -3055472, -7907477, -3005015, 694637, -4309910, -13669943]
10539a3669943m915415L363945P100551J736814o172832l877869Q004490J1603579
10531C173320p79759j0259482o93607J1973903N482470q664912l925287J3180295
10523I486941J2305958p500161j5031094k07078J0863945K810539o079833j124527
10515E524690M440403j431082p917267n128442j140265r25363M023402J2743223
10507A0189299J0248808k966259p137236J211274K786295o556185q292216k60348
10499g76568j255112p715138M897510K6500551J7312924j5105842j4575798K0982460
10491C0264987K0703174k7229372k1365499Q9757379J78113832R4957079r4532469
10484B70669111j79163130q9926877K4950187L2413867j9480662k5175919J0439422
$$ y = [-13669943, -18585358, -15221413, -8120862, -6384048, -12556880, -16434749, -8430259, 3173320, 2393561, -7865921, -8559528, 3414375, 8896845, 231933, -3693354, 9486941, 21792899, 14292738, -738356, -945434, 9918511, 12729050, 6649217, 5524690, 9965093, 8534011, 616744, -4511698, -5651963, -6577326, -2553924, 10189299, 20438107, 17471848, 10334612, 11545886, 14332181, 7775996, -516220, -776568, -2031680, -9746818, -4849308, 21651243, 38964167, 23858325, 9282527, 30264987, 50968161, 23738789, 2373290, 92130669, 270244501, 365201580, 270669111, 91505981, 1579104, 26529291, 58943158, 39462496, 14286577, 24725999]
10477B4725999J7388082q502940j7574638l213232j93133j1146358p833429Q075927
10469A726278P705592r076549j3527422K80977R733663O953277O190807R269160
10461A9255783K435283j1226179j2070760J13565L258765q549891j4299108j941939
10453b3024481J2116544J0739446R73128j835654J926838J541559n072801r337166
10445a1972587m331749P183375J4782786R722372m257048j2231600n980850L892970
10437c192331K331495q207427j1853026l398294M822678K101685o077131p541260
10429c1013611M16683R883220J2884076Q712627K612686l13234m491j56994k271219
10420G49743l750669l041994k646769m280200n105882k628785M23781P94468J048779
$$ y = [24725999, 42114081, 33611141, 16036503, 12823271, 12630138, 1483780, -6349649, 1726278, 9431870, 355321, -13172101, -12891124, -3157461, 3795816, 9986623, 19255783, 21691066, 10464887, -1605873, -1492308, 1766457, -6783434, -21082542, -23024481, -10907937, -168491, 804637, -1031017, 895821, 2437380, -2635421, -11972587, -16304336, -9120961, 5661825, 15384197, 11127149, -1104451, -7085301, -3192331, -860836, -9068263, -20921289, -24319583, -19496905, -17395220, -23472351, -31013611, -30596928, -20713708, -7829632, 882995, 3495681, 3182447, 3177956, 3020962, 749743, -3000926, -6042920, -8689689, -12969889, -18075771, -20704556, -20280775, -19486307, -18437528]
10411a8437528N617024J2309139J3681359P047695j627259n182893l283573r51524
10403I172440j047172j286955O63576K278938J30225k764241Q4921P019905P570035
10394B1821672j639129q465812j753944J0136509R639138m192571j4166171j0191928
10386A187764j984939j522490n255572k764996N218946Q220214K386929l965551
10378A520305k421702M094347N836285J86330m009671Q20720P844567L608227
10370A7479408j0812255j7246516m741305J3532635J7354550N759818n495062
10363A5831273p276746m503761k682150m75321L289224N840039N450324K916427
10355A8389309j285010m936376k776309N163886R456545M822079M60943M654630
$$ y = [-18437528, -12820504, -511365, 13169994, 20217689, 18590430, 13407537, 10123964, 9172440, 8125268, 6838313, 7501889, 9780827, 9911052, 7146811, 7231732, 14251637, 21821672, 20182543, 11716731, 9962787, 20099296, 29738434, 25545863, 11379692, 1187764, -797175, -2319665, -7575237, -10340233, -5121287, 3098927, 5485856, 1520305, -901397, 3192950, 9029235, 9215565, 5205894, 6026614, 13871181, 17479408, 6667153, -10579363, -15320668, -1788033, 15566517, 21326335, 15831273, 8554527, 4050766, 1368616, 893295, 4182519, 10022558, 15472882, 18389309, 17104299, 12167923, 9391614, 14555500, 24012045, 28834124, 29295067, 33949697]
10347C3949697P506196m069838k0760551k0892654l530610R802098P120406j224959
10339G899785m256007l977631k668002L200635J0057797P288639l176988o147805
10331H220423J204532L051335p277929j4113162n688720O293214P306546K130061
10323A126300J081546R10784l775211n107114L792048J1865612O210679n363355
10315A0741289o671324N52451J722243n411020r229392m545681K091424N520001
10307e230009O334084M026566j762917n398843k018333K767833P99913m749050
10299e230756m764620K84432K259610l7940l55660K431299K787644p56962l526809
10290f909762l388394k599421j112775L528414R213712R769790L810221k401822
$$ y = [33949697, 41455893, 37386055, 16625504, -4267150, -7797760, 2004338, 9124744, 7899785, 3643778, -333853, -3001855, 198780, 10256577, 17545216, 14368228, 8220423, 9424955, 12476290, 5198361, -8914801, -14603521, -8310307, -1003761, 1126300, 2207846, 3118630, -656581, -5763695, -1971647, 9893965, 16104644, 10741289, 4069965, 4622416, 6344659, 933639, -8295753, -12841434, -10750010, -5230009, 1104075, 5130641, 3367724, -2031119, -4049452, -1281619, -481706, -5230756, -9995376, -9710944, -7451334, -7489274, -7844934, -5413635, -2625991, -3382953, -6909762, -10298156, -12897577, -14010352, -10481938, -1268226, 8501564, 12311785, 9909963]
10282I909963k319546L712245Q944603O855480j403055o994567m436064k88437
10274A3980622l729727j0941053r872549L1289O372899L804848O54056J849529
10266B149914J310391k678161j422546O415265Q019502k082000j0569111p559161
10258f415907l013210o362656p397473M015308J5003399Q425875p468147j1025691
10250a4238502l20156Q035769O882050L547946J323160l169663o687506k568258
10242g195160M837416O011371L131777M356242O369745J032331n878204k888257
10234I777261M629475J946923p996862q130185L171162R619867N162888R28411
10226A9108940J303669k779065j1312170r919249M294817J3517364O521850m324911
$$ y = [9909963, 7590417, 11302662, 20247265, 27102745, 25699690, 18705123, 14269059, 13980622, 10250895, -690158, -10562707, -10531418, -4158519, -353671, 300385, 2149914, 3460305, 782144, -640402, 5774863, 13794365, 11712365, 1143254, -6415907, -9429117, -15791773, -23189246, -19173938, -4170539, 4255336, -3212811, -14238502, -14558658, -6522889, 359161, 3907107, 5230267, 2060604, -4626902, -7195160, -2357744, 3653627, 6785404, 11141646, 17511391, 18543722, 12665518, 9777261, 14406736, 16353659, 8356797, 226612, 3397774, 13017641, 18180529, 19108940, 20412609, 17633544, 6321374, -3597875, 696942, 14214306, 20736156, 16411245]
10218A6411245m967438p47548k507788o916460m838951K162471O610704P386813
10210A2593048O565663K526187m108742n837425R00584P241493L164124q145854
10202A4899078j4618877r771923K233101J1672689J0350328j079150j1026739
10195B658507q524435K318786P194377J343218n197740l589286K807881O276449
10187E287757M346966j174979o493318n806219K400569R136942M854301n365033
10179G186986q232351k575958P53820j278837n71520M008789K935647n066336
10171b839760p751690L33237Q192543O456194K41846l366644n807143p391162
10163a1932579k415132P515371J0300756K595701k785392J855085O328081J926943
$$ y = [16411245, 11443807, 10696259, 8188471, 1272011, -3566940, -1404469, 5206235, 12593048, 19158711, 21684898, 17576156, 11738731, 12639315, 19880808, 23044932, 14899078, 280201, -9491722, -7258621, 4414068, 14764396, 13685246, 2658507, -5865928, -3547142, 3647235, 4990453, -207287, -3796573, -988692, 5287757, 9634723, 8459744, 1966426, -3839793, -1439224, 7697718, 12552019, 7186986, -1045365, -3621323, -2867503, -4146340, -4717860, -709071, 2226576, -2839760, -10591450, -10258213, -2065670, 4390524, 4632370, 1265726, -4541417, -11932579, -14347711, -6832340, 3468416, 6064117, 3278725, 5133810, 11461891, 13388834]
10155A3388834k947264K12469L279241k723272r401373n634716J922854Q68189
10147a035038m972637l844357K584578M461797K656997M126496N254027j317570
10139G914293q967516n763104L440356L669338m161913m981732L092212N069856
10131f88210l850355q772783j58510J0194437Q660212J51409l166063j773955
10123E96182l756529p383191l198758Q277746J3423227L424701j2372072j6571146
10115a7559840m450572J0744530J4021204N479227k878988l510624L97802L633650
10107E876389N032003L410721l147129j0367257r587085j397919K540500k287116
10099i926893m601644L522904J0537546K672468j1627743j2077385K895167J4049709
$$ y = [13388834, 10441570, 10654039, 13933280, 11210008, 1808635, -3826081, -1903227, -1035038, -6007675, -9852032, -7267454, -2805657, -148660, 3977836, 9231863, 7914293, -1053223, -6816327, -3375971, 293367, -3868546, -8850278, -5758066, -688210, -4538565, -13311348, -13469858, -3275421, 5384791, 5536200, 2370137, 596182, -3160347, -10543538, -13742296, -5464550, 7958677, 11383378, -988694, -17559840, -22010412, -11265882, 2755322, 8234549, 5355561, 1844937, 2242739, 5876389, 10908392, 14319113, 11171984, 804727, -8782358, -10180277, -7639777, -9926893, -14528537, -11005633, -468087, 2204381, -9423362, -21500747, -18605580, -4555871]
10091d555871R789638k03026l057944M56249L010048K822378J924146P53116J37304
10082A1076038K086784M668414K569528m055366q042169n639226j682988j102065
10074a21050k143410j878544j693726k611308j292794L730642O903338L005509
10066C898657l778782m743981Q04653M191807m62580p639028p336351J409311
10058a3656294Q344542N034024l514621n253686K043456P415601K506649o564158
10050c644487q692186l278590J466863J890594J760933L248462L724968K062062
10042a461381O22182j16432k145561m077678j757056L503782M607213k59999l285280
10033d370210J345322P480201N476552k979390o455443J7129P642094N919266
$$ y = [-4555871, 5233767, 5030741, 1972797, 2429046, 5439094, 8261472, 10185618, 10938734, 11076038, 13162822, 17831236, 20400764, 16345398, 8303229, 2664003, 981015, -121050, -2264460, -4143004, -5836730, -8448038, -9740832, -6010190, 893148, 3898657, 119875, -4624106, -3819453, 372354, -90226, -7729254, -15065605, -13656294, -5311752, -277728, -3792349, -9046035, -7002579, 413022, 2919671, -3644487, -12336673, -15615263, -14148400, -12257806, -10496873, -7248411, -3523443, -1461381, -839199, -955631, -3101192, -7178870, -8935926, -5432144, -824931, -1084930, -4370210, -3024888, 4455313, 9931865, 6952475, 497032, 514161, 8156255, 14075521]
10025A4075521l036348p663423k704444M288550L832075l204576q201072o315298
10017h929015l73482M814235O623330M183282o76107k782467L96160L362178K8915
10008F647029n122562k665635N546561P446938j04197o149521m020112j263182
10000C15319l875356m348930L721844J1278527P446512k154535n063929j875296
9992E444156j436955l146067m43525L158502j083008r140843q420837J038399
9984a4030178O453764L491371Q24356K397105K052794j600581j580993K597560
9976F05198K603999k128480j982408M027898M528650k933726n429132J852581
9968A144580M730487n208836j3402809n685100P413000Q525071K080493L659802
$$ y = [14075521, 11039173, 3375750, 671306, 4959856, 8791931, 5587355, -2613717, -8929015, -9302497, -4488262, 2135068, 6318350, 5642243, 2859776, 3255936, 6618114, 6647029, 1524467, -1141168, 4405393, 11852331, 11748134, 5598613, 1578501, 315319, -3560037, -7908967, -4187123, 7091404, 14537916, 12383381, 7319452, 5444156, 4007201, 861134, 417609, 3576111, 2493103, -6647740, -15068577, -14030178, -7576414, -4085043, -3260687, -863582, 1189212, -411369, -1992362, 605198, 3209197, 1080717, -901691, 3126207, 7654857, 4721131, -708001, 1144580, 5875067, 666231, -12736578, -18421678, -11008678, -2483607, -403114, 3256688]
9960C256688J0709202P576146n067574r799118j769748L816419k001119q021003
9952a300107l276514N067831M827768k171072n464775k477472R28933J772156
9944b093252K390545L414127J873227l141140p578338o649062m92784M989882
9936g286795L684503l331062p590252l084439N575616R018066N678547K855873
9928E520057N129984P898645M760868l336950r460019q687917k779284J701089
9920G46473k06895n537992n170490M516149J4103355J1333798k336299j2941029
9912D507070j2008215m749502J416402O218398R486123N395434o917130j5076858
9904a1728278p860473O720399J0683695J674418m498701J468972R249254O455566
$$ y = [3256688, 13965890, 21542036, 16474462, 6675344, 4905596, 8722015, 6720896, -1300107, -4576621, 491210, 5318978, 3147906, -2316869, -4794341, -3865408, -2093252, 297293, 3711420, 5584647, 2443507, -5134831, -11783893, -12276677, -7286795, -3602292, -6933354, -14523606, -17608045, -12032429, -3014363, 2664184, 5520057, 10650041, 18548686, 23309554, 19972604, 10512585, 1824668, -954616, 746473, 539578, -4998414, -10168904, -5652755, 8450600, 19784398, 17448099, 4507070, -7501145, -12250647, -10834245, -4615847, 4870276, 10265710, 3348580, -11728278, -19588751, -12868352, -2184657, -510239, -5008940, -3539968, 5709286, 12164852]
9896A2164852k706905n885135j276196K932781K827181J706337J059590j407764
9888I414741m962782n586840l123179j427208r96468J458662N668881P274597
9880G720404N301901K981251R42552k159139k458239M690918J1656199L618647
9872C2294494j7728360k9766769j8178524K182794Q932227L395324K793667R205805
9864f869342Q010913l846223j0094071j350454R511317P806302j825400o113015
9856d769973l489358j033175N87528N495682J0479295P615588j972063p992366
9848D921158n449627j94578J559918J149920J836284J991424j229591n264111
9840f79203m511085J362590N777547L682664r69749k491O861389R825427K339842
$$ y = [12164852, 9457947, 3572812, 2296616, 5229397, 8056578, 9762915, 10822505, 9414741, 4451959, -1134881, -4258060, -5685268, -6681736, -5223074, 445807, 7720404, 13022305, 16003556, 16946108, 14786969, 12328730, 17019648, 28675847, 32294494, 14566134, -15200635, -33379159, -31196365, -22264138, -18868814, -16075147, -6869342, 1141571, -2704652, -12798723, -14149177, -4637860, 3168442, 1343042, -4769973, -8259331, -9292506, -8704978, -3209296, 7269999, 14885587, 12913524, 4921158, -528469, -723047, 836871, 1986791, 3823075, 5814499, 4584908, -679203, -5190288, -3827698, 1949849, 5632513, 4662764, 4660273, 11521662, 21347089, 23686931]
9831B3686931q194243r700109k487269J934536j253824m008967k52215L688800
9823C413640K39399o289763o532067k57057N184605O407096N318301K513057j696495
9814H300716k757335K004659N354183r64829j0981932j0661135K40098O410849
9806c054726P96535m292557K109970J0985726P903675l185590o043815K345004
9798G564222Q089337K572649o001374p231462k776561K55359Q52316J605234J620828
9789F550548l22750p36858K763847M936227M15320n791379m766514J313454J403848
9780E765743o344073r848447q39265J2080764J5124852P417999o77779l268833
9772A9410961m275666p791225j0702992p582561Q01073O812243L925351n052222
$$ y = [23686931, 15492688, 5792579, 3305310, 5239846, 3986022, -22945, -275160, 3413640, 3653039, -2636724, -9168791, -9425848, -4241243, 2165853, 7484154, 9997211, 8300716, 5543381, 7548040, 12902223, 11937394, 955462, -9705673, -9465575, -3054726, -2258191, -6550748, -4440778, 6544948, 14448623, 11263033, 5219218, 7564222, 15653559, 18226208, 12224834, 4993372, 2216811, 2472170, 3324486, 4929720, 6550548, 6227798, 5490940, 8254787, 13191014, 13606334, 7814955, 3048441, 4361895, 5765743, -578330, -10426777, -11266042, 814722, 15939574, 23357573, 22679794, 19410961, 15135295, 7344070, -3358922, -10941483, -10140410, -3328167, 597184, -4455038]
9764d455038r451074k949389P349441R116945J336638m780771k605559J407734
9756e031073J76889k659066r97281K752770L923552M952607Q035506O206017n123639
9747A2236282j4423719p984217O564228Q954442k581233q883666j310344N549034
9739a879193N30525m979544K039505J2798077J1172898P1810m751334k82414J982714
9730A6703044l159971q087627o790676k627887K4885J546738K767564K894691
9722C270761K548100K480464M13576m300630n636521J164255R190290P291783
9714A6422078l180853r367052n013362K521521N126909M067668L665955K970409
9706A7213273j267849q110528j2654391j0324739n94738J0390738J2628815K973972
$$ y = [-4455038, -13906112, -16855501, -9506060, -389115, 947523, -3833248, -6438807, -5031073, -4854184, -7513250, -8510531, -5757761, -1834209, 3118398, 11153904, 17359921, 12236282, -2187437, -10171654, -3607426, 5347016, 2765783, -6117883, -7428227, -1879193, -1348668, -6328212, -4288707, 8509370, 19682268, 19754078, 15002744, 14720330, 16703044, 13543073, 5455446, -1335230, -3963117, -3938232, -2391494, 376070, 3270761, 5818861, 8299325, 8712901, 4412271, -1224250, -59995, 9130295, 16422078, 13241225, 3874173, -1139189, 1382332, 6509241, 10576909, 14242864, 17213273, 15945424, 7834896, -4819495, -15144234, -15738972, -5348234, 7280581, 10254553]
9698A0254553q697450j0369762l027167K690587K926999L601736O874824O002509
9690A0256829k527575j1168543j1049021l007147N508125R097112O682536N36420
9682D328736m152613l661998r64918r22798r01321M819664J1325080O566870p717451
9673H719251j3002239n16457J2709627P618811p737338j0178551L254717J1696813
9665A2564634L117452q585183o844084K669192L348719n471795q518245N81943
9657g137367R227857N116747n656520q638671k439599J345246k093927l663956
9649a3940190L101098R728478N826920l540239n142809J907616N819731J701551
9641E462156j836956J143300L607752j656404q709510p145049J909583P802735
$$ y = [10254553, 1557103, -8812659, -11839826, -9149239, -6222240, -2620504, 4254320, 10256829, 7729254, -3439289, -14488310, -17495457, -11987332, -2890220, 3792316, 4328736, 176123, -3485875, -4450793, -5373591, -6274912, -1455248, 9869832, 16436702, 8719251, -4282988, -4799445, 7910182, 15528993, 7791655, -2386896, 867821, 12564634, 15682086, 7096903, 252819, 2922011, 6270730, 798935, -7719310, -7137367, 2090490, 7207237, 1550717, -7087954, -9527553, -8182307, -10276234, -13940190, -10839092, -1110614, 4716306, 1176067, -3966742, -2059126, 3760605, 5462156, 3625200, 4768500, 8376252, 6719848, -1989662, -9134711, -7225128, 577607]
9633E77607N541165Q44387N32546M050449N724432K261516l168540m269048J83193
9624A2277707L318472q89918p758476p627891m42316M360674L234852K908400
9616I381504O107664N087833l584689r423182l653762M988126K788692p259637
9608D432549j0137513j703821O628029N536757j678642p059393o743454r62078
9600a1687566O370101Q061986J498480n038487k362896N271629O046426p21925
9592G437748l968710M62749L575182j073559p564397q660308n940097k968165
9584a8699557J766412Q102914R233450J620107o951831p276449j222518L136045
9576a0291427L679508L499520K308121k428099p751447p102804j96353N660161
$$ y = [577607, 6118772, 6963159, 7495705, 11546154, 17270586, 19532102, 16363562, 12094514, 12277707, 15596179, 14706261, 6947785, -680106, -1122422, 3238252, 6473104, 9381504, 15489168, 20577001, 16992312, 7569130, 3915368, 8903494, 11692186, 4432549, -5704964, -7408785, -780756, 4756001, 3077359, -3982034, -10725488, -11687566, -5317465, 2744521, 4243001, -795486, -3158382, 2113247, 8159673, 7437748, 3469038, 3931787, 7506969, 6433410, -1130987, -9791295, -15731392, -18699557, -16933145, -8830231, 403219, 2023326, -4928505, -12204954, -13427472, -10291427, -6611919, -3112399, -804278, -3232377, -10983824, -18086628, -18282981, -12622820]
9568a2622820N263360J475601l7063J797442L526262K683509P91912K78320j50847
9559C005676l977208r644083r250770R51815J2277436J2937868L939798k827679
9551G412853k170480j147258m691399o648903j372049N065310M115823j196361
9543f32464j318571M253092O232418p2169p849212q142937q29326O155449O063113
9534C859393J46449m515197l706092p83147m12174n08654L536678Q276879M965781
9525A0859916n678565j1425535n595469L172165M397878L30999q19781J332742
9517c425650J573680n71061j932736k783342m365423l674171J010061M136277
9509a0032365J312348j331020L606048J0772350R003694p16735o514064l676835
$$ y = [-12622820, -7359460, -5883859, -5920922, -4123480, -597218, 2086291, 2878203, 3156523, 3005676, -971532, -10615615, -19866385, -18914570, -6637134, 6300734, 10240532, 7412853, 5242373, 4095115, -596284, -7245187, -8617236, -3551926, 563897, -632464, -1951035, 2302057, 8534475, 8462306, 613094, -7529843, -8359169, -2203720, 3859393, 4005842, -509355, -4215447, -4998594, -5410768, -5919422, -2382744, 5894135, 10859916, 5181351, -6244184, -11839653, -8667488, -4269610, -3938611, -4758392, -3425650, -1851970, -2423031, -4355767, -7139109, -11504532, -15178703, -14168642, -10032365, -8720017, -10051037, -6444989, 4327361, 13331055, 12614320, 6100256, 2423421]
9501B423421L55123p96969m983750p824545o956484l67070R978617J4264883N399571
9492A1492797p933141j0676418k482040L950585M272189O008298R919687O396844
9484B0948801m795047r743985l333020Q91530n649245j0578717k421596P408555
9476g272724K648461r801188j0373933J984902R950682O003745M72735R59680
9468e427640K278160N01673O98947M762232N303024r65534n092674L94353Q280129
9459A0732670O407709m597218j2002768p406131M021921J0678055O957338k105993
9451A2685583p064249m297526R07690K220472M50865N60825L015885L547176P56706
9442A2783427j876407k263679k582719m249358m626812j082798M797034Q812328
$$ y = [2423421, 2778544, 1981575, -3002175, -10826720, -17783204, -18150274, -8171657, 6093226, 11492797, 3559656, -7116762, -9598802, -5648217, -1376028, 4632270, 14551957, 20948801, 16153754, 6409769, 3076749, 3968279, -1680966, -12259683, -14681279, -7272724, -4624263, -14425451, -24799384, -22814482, -12863800, -6860055, -6387320, -5427640, -3149480, -2647807, -1948860, 2813372, 8116396, 7150862, 2058188, 2452541, 10732670, 17140379, 12543161, 540393, -6865738, -2843817, 7834238, 14791576, 12685583, 5621334, 1323808, 2231498, 4451970, 4902835, 5463660, 8479545, 12026721, 12783427, 10907020, 8643341, 6060622, 1811264, -2815548, -3898346, 898688, 9711016]
9434I711016P834792J675316n931448q571422l256069M509816N876696m57647
9426A1391050o607339n776002l0705L881676K771330j181219m054190l369683
9418b975082O00523N066427P163118O492031M260382R03679l302723o385910o281713
9409E540732l532636J76190M555724Q566781Q196050J430489o273289p547016
9401A1113025l314054r04078k355170k356451R88460J839499l305653q609699
9393f904121p118373m16774N050756O608056N297715J667957k893076m315572
9385c023432r48564K534115J633781p98834K23499K664620Q57804l830929m025790
9376d713730J631556N469801K199059l445447m285662p55896J298118l46481k193338
$$ y = [9711016, 17545808, 19221124, 13289676, 4718254, 1462185, 5972001, 11848697, 11391050, 4783711, -992291, -1022996, 2858680, 5630010, 4448791, 394601, -2975082, -2374559, 2691868, 9854986, 16347017, 20607399, 21511078, 18208355, 11822445, 5540732, 2008096, 2184286, 6740010, 15306791, 23502841, 24933330, 18660041, 11113025, 7798971, 6894893, 4539723, 2183272, 3171732, 5011231, 1705578, -6904121, -14022494, -14439268, -9388512, -2780456, 2517259, 4185216, 1292140, -3023432, -3971996, -1437881, 195900, -602934, -379435, 2285185, 3142989, -687940, -4713730, -3082174, 2387627, 4586686, 1141239, -3144423, -3900319, -2602201, -2948682, -5142020]
9367e142020p88947L018657N540612M070496l89821l323428r93717M460918O463536
9358A2916286K334182k564655k325769M58068j297463o878986o888045K406675
9350a839707J0846062P270383l823700p644807j5262P323898M891773j317950
9342A5690690j485418J720645j185147r423770j2506534o919850o46129P82780
9334a3972733J732099N787191P808806L330675k352737k532977j27184j607615
9326a934475m830509k588436M562063Q637812O190816J126509l525464p532347
9318A05969p588150J37693J0108634J0685097Q17005o627263l274470K885822
9310G250337J134907n539783p014321k008461L016412N830118Q205060P375111
$$ y = [-5142020, -5930967, -2912310, 2628302, 6698798, 6308977, 2985549, 1991832, 6452750, 12916286, 15250468, 12685813, 10360044, 10818112, 9520649, 2641663, -4246382, -1839707, 9006355, 16276738, 12453038, 4808231, 4792969, 12116867, 17008640, 15690690, 14205272, 15925917, 14740770, 5317000, -7189534, -14109384, -14755513, -13972733, -12240634, -6453443, 1355363, 4686038, 2333301, -199676, -326860, -1934475, -6764984, -9353420, -4791357, 3846455, 10037271, 11163780, 7638316, 105969, -7482181, -7344488, 2764146, 13449243, 14266248, 7638985, 4364515, 7250337, 8385244, 2845461, -4168860, -6177321, -3160909, 2669209, 10874269, 18249380]
9302A8249380k28014q321851o364733L563785P655348M56807p883193q329277
9294a201748m969185m287771l811024J82550L422845J902749R96220N578245Q637526
9285F450407K295334o080109l547393O322120P444339k965487r688483m240147
9277d009419K390717m68092n497745j187159P945359Q997389J721140k593037
9269G299153k98618O76741l255750m559160J784371Q090188M725526n158832r713059
9260d09440m747431J614717J387506k755712l276191L76183K092801k4836q03929
9251f546332J880410K043034l727493p629083j787890O867042M630547p680445
9243a1950210j4319996p251535L458569O327881L622206L005835M464318M069572
$$ y = [18249380, 18021366, 9699515, 3334782, 6898567, 14553915, 15010722, 7127529, -1201748, -6170933, -10458704, -14269728, -14087178, -10664333, -8761584, -7765364, -2187119, 6450407, 8745741, 2665632, -881761, 5440359, 12884698, 9919211, 230728, -4009419, -1618702, -2086794, -7584539, -8771698, -826339, 8171050, 9892190, 7299153, 7000535, 7677276, 4421526, -137634, 1646737, 9736925, 14462451, 9303619, -409440, -5156871, -3542154, -2154648, -4910360, -8186551, -7810368, -5717567, -5742403, -6546332, -4665922, -2622888, -6350381, -13979464, -15767354, -8900312, -4269765, -11950210, -26270206, -33521741, -30063172, -23735291, -20113085, -17107250, -12642932, -8573360]
9235h573360K517126J435614j515527n824928m276913N075625J1226467N308591
9227E372695m140598l614872L969735M844151k671051o578611j849831K674552
9219a993830L65515l482395k003326L689178Q888652J0487579N780906m858562
9211A6873717j2657672p803154N603870J1933145M273693p367286j1282735p703452
9203h129874l190912p65808o94422l242406n698661l108984M270949J0097863
9195a0462255J0512230P228069J774611n097907q462324l942009K442104R99589
9187e007892m825856k776625N881522O092947m484417q751973R89358Q093784
9179d789152l15239r769067k519167J0991736Q596279o622788j1882576j914829
$$ y = [-8573360, -6056234, -4620620, -6136147, -11961075, -16237988, -11162363, 64104, 5372695, 1232097, -2382775, 1586960, 6431111, 3760060, -2818551, -4668382, -1993830, -1628315, -5110710, -7114036, -3424858, 5463794, 15951373, 21732279, 16873717, 4216045, -3587109, 2016761, 13949906, 18223599, 10856313, -426422, -8129874, -11320786, -12086594, -12781016, -16023422, -21722083, -24831067, -20560118, -10462255, 49975, 7278044, 9052655, 3954748, -4507576, -8449585, -6007481, -5007892, -9833748, -12610373, -6728851, -635904, -5120321, -13872294, -12882936, -4789152, -5104391, -14873458, -17392625, -6400889, 2195390, -4427398, -16309974, -18224803]
9171a8224803N685572K255304k74185N305096P557336k105610j2359349r159242
9163b1319881K794277Q479645M104184j130571P4646N672614R423250P374140
9155A5472304N51002n717087o860271m023812j003022K128044O524311P787522
9147A4858991P90318q832073q894629J044681O828565K88817q241653o088946
9139h245929K520794M423994j369772l274045L517807R218230M200948o932669
9131D059358j1588766n215538M323973P338963K878921k602355m257832l223767
9123h287043k405320j770878j5316J839060J780031L17612l54222L88792J760852
9114f746432L317393L862020J222644l261728l476061K824825P615619K573823
$$ y = [-18224803, -12539231, -10283927, -10558112, -5253016, 2304320, 198710, -12160639, -21319881, -18525604, -10045959, -5941775, -7072346, -6997700, -1325086, 8098164, 15472304, 16023306, 10306219, 3445948, -577864, -1580886, 547158, 7071469, 14858991, 15649309, 6817236, -2077393, -1032712, 5795853, 6084670, -2156983, -8245929, -5725135, -1301141, -2670913, -5944958, -2427151, 6791079, 10992027, 4059358, -7529408, -12744946, -8420973, -1082010, 1796911, -805444, -5063276, -8287043, -10692363, -12463241, -12478557, -10639497, -8859466, -8541854, -8896076, -8507284, -6746432, -3429039, 432981, 1655625, -1606103, -5082164, -2257339, 5358280, 7932103]
9106G932103o981157q070086K29217M708092j051148n826289J279523J2068052
9098D288307J0341444l598944j2712918p106834L800372O448766Q81527k930674
9090e88954k73171M292884N508474L218329k55947l134399l697271j321103P41120
9081D489962j761429o336568m208476P080290J6330583J1103351m898852j5212905
9073F585956j1524687k537219N69269j166248l9126M810150P336098M790633N53127
9064I377953k376121m711906p258675q235434n438102O26193N897620N353507
9056f764965j060172n525653m53061R754793J2076698K826008o102881m601841
9048A48926O55492k111448j0002084r874298K13512P317988L140345m185517k924396
$$ y = [7932103, 950946, -7119140, -6889923, -2181831, -3232979, -9059268, -7779745, 4288307, 14629751, 11030807, -1682111, -8788945, -4988573, 1460193, 2341720, -588954, -862125, 3430759, 8939233, 12157562, 11901615, 8767216, 5069945, 3748842, 4489962, 2728533, -3608035, -7816511, -736221, 15594362, 26697713, 21798861, 6585956, -4938731, -7475950, -6906681, -8072929, -8112055, -3301905, 4034193, 8824826, 9377953, 7001832, 2289926, -4968749, -13204183, -18642285, -18016092, -12118472, -6764965, -7825137, -13350790, -13803851, -4049058, 8027640, 10853648, 4750767, 148926, 804418, -1307030, -11309114, -21183412, -20969900, -13651912, -10511567, -14697084, -17621480]
9039a7621480N564007R615274L262447o355926q103841n54584O249945L861368
9031d082790l215139m547503K41613J892921j521952k71405R359589J5700227
9023A3555561R103232k492940o719261n205881n706090n741734p5847M029268
9015G46308k364599j0114351l760549J0576373J1508118l438029j2943203n082060
9007a4871992O622794P457641J885152K76373K241524L004533K348039n84646
8999H379418p760089j2172093l498738J0999672J0871721m852737j1895640Q52600
8991i075886J1411170Q14146j4143971q536922R024540J1287404l039337j0051386
8983a2310242j019472P256750L463619k737199j433017K565442K510787Q05842
$$ y = [-17621480, -12057473, -2442199, 820248, -5535678, -13639519, -14194103, -7944158, -4082790, -7297929, -11845432, -11603819, -9710898, -11232850, -11504255, -2144666, 13555561, 22658793, 20165853, 13446592, 8240711, 2534621, -3207113, -3282960, 746308, -1618291, -11732642, -15493191, -4916818, 6591300, 3153271, -9789932, -14871992, -8249198, -791557, 1093595, 1369968, 3611492, 6616025, 8964064, 8379418, 619329, -11552764, -15051502, -4051830, 6819891, 1967154, -9928486, -9075886, 2335284, 3149430, -10994541, -19531463, -10506923, 780481, -2258856, -12310242, -13329714, -6072964, -2609345, -5346544, -6779561, -4214119, -1703332, -897490]
8975h97490M14587j631981o246490q250667m579051J786046P592650J1170039
8967f42357R628096L147083n92726L451075P016109L94610r432008p884320K978260
8958H063822O893967m53117o282522l705542r81615l153522k942019K637755L758603
8949C835810m429974j0520102m399739O529234R961181O475627L151254o90418
8941I912873q487109j4441856r755037K686735J0788408Q708804J672315k965489
8933a880356k776191K18818K169619Q87248j005045L16604K344616j139089q105782
8924h969558p848879K964190J2854665J0969540K023475k250995K10569K758643
8916A2711650K443226J790557J203621j443829m996282o185866n569728n993589
$$ y = [-897490, -482903, -2114884, -8361374, -16612041, -21191092, -19405046, -11812396, -642357, 8985739, 12132822, 11540096, 14991171, 22007280, 22401890, 12969882, 5085562, 8063822, 14957789, 14504672, 8222150, 4516608, 3534993, 381471, -2560548, 77207, 3835810, -594164, -11114266, -15514005, -8984771, 976410, 7452037, 10603291, 9912873, 1425764, -13016092, -22771129, -20084394, -9295986, -587182, 1085133, -1880356, -4656547, -4437729, -2268110, -1380862, -2385907, -2069303, 275313, -863776, -8969558, -16818437, -13854247, -999582, 9969958, 11993433, 9742438, 9953007, 12711650, 15154876, 16945433, 18149054, 16705225, 11708943, 5523077, -46651, -6040240]
8908f040240o353883l109662K499304M540661N81811m123223k204271P023184
8900g186319J4785368J0782556l495995j2634357n107305R395839J1083471j803274
8892A5819984j0172284l491673M304976j251867j0601322o369931O436897P394337
8884B069117o044745j3678473l576295J1125696J3625110O150865J303653K284798
8876A3259726L159177J400484q85944l898421q346078r364331j768322R271038
8868B827329J1751488K566537p768343q870056k539989K854749M280555M328270
8860I430540L523738k0442m343927m712826j840361j496163l861336j816215N817986
8851F80994Q740174Q21072p431235l677702N729319M909775n527225r065064l89075
$$ y = [-6040240, -12394123, -15503785, -13004481, -8463820, -7882009, -12005232, -14209503, -7186319, 7599049, 18381605, 14885610, 2251253, -2856052, 6539787, 17623258, 15819984, 5647700, 2156027, 6461003, 5209136, -5392186, -11762117, -5325220, 2069117, -3975628, -17654101, -21230396, -10104700, 3520410, 9671275, 10974928, 13259726, 16418903, 17819387, 16933443, 13035022, 4688944, -4675387, -6443709, 2827329, 14578817, 17145354, 9377011, 506955, -2033034, 821715, 5102270, 9430540, 12954278, 12933836, 8589909, 3877083, 2036722, 540559, -3320777, -5136992, 680994, 9421168, 10242240, 2811005, -866697, 4862622, 9772397, 4245172, -4819892, -5208967]
8842e208967O631817L025631j479319K260308O737314L456240o99114J828792
8834A6552702J973454r571805j9801809j0029249J1252195J6957367J966234j0077170
8826g78081m748188L357524q37728p315153p31823J1313817J0432055k049141
8818H643282p757803p30236N523572J866801k968288R44228P790134N416113n830763
8809A2897040j3616833j0508262k248571J551638p82088l211001q82315M623211
8801a2177181Q296085P143107K045237l597619n849078k752281L345101P256318
8793C709689O256344K442062j361480n081943q219913o916213O64918Q355853
8785a50683P869547K33997n254777m275983k596997n246051p548232k552370P109447
$$ y = [-5208967, 1422850, 4448481, 2969162, 5229470, 11966784, 15423024, 14723910, 16552702, 18526156, 8954351, -10847458, -20876707, -9624512, 7332855, 9299089, -778081, -5526269, -2168745, -3006473, -10321626, -11053449, 260368, 10692423, 8643282, 885479, 155243, 5678815, 7545616, 4577328, 5521556, 13311690, 18727803, 12897040, -719793, -11228055, -13476626, -11924988, -12707076, -15918077, -16800392, -12177181, -3881096, 3262011, 5307248, 1709629, -4139449, -6891730, -3546629, 3709689, 9966033, 12408095, 11046615, 5964672, -2255241, -9171454, -8506536, -150683, 7718864, 7952861, 2698084, -1577899, -4174896, -9420947, -16969179, -19521549, -12412102]
8776a2412102J1652449P181250K41270j699640M82132R35239j288417q38237M306711
8767H560655O896458k90031j1488016j2780442j737569P131369K601932o480272
8759g585916m978712M779623P371890k80098m538918J232563N403996j344628
8751E9800q781407l176573R732260J2992681M203664k576054K00810L478864j775072
8742A4358973r759666q979163P07330Q102665N639721j778727m153422N83657
8734D721368M299111L44556n939483l846209O156801J0602968J572487j0860515
8726G051084j2358913m423539l53986m338861o802239j422843N173056N321790
8718a2154451K139470K535277N399346M668092R1999k698302j187614J377335
$$ y = [-12412102, -759653, 6421597, 6662867, 4963227, 5445359, 6380598, 5092181, 4253944, 8560655, 15457113, 15167082, 3679066, -9101376, -10838945, -3707576, -1105644, -7585916, -12564628, -7785005, -413115, -693213, -5232131, -3999568, 1404428, 59800, -8721607, -11898180, -2165920, 10826761, 15030425, 12454371, 12655181, 16134045, 14358973, 4599307, -4379856, -3672526, 4430139, 10069860, 8291133, 4137711, 4721368, 9020479, 9365035, 3425552, -420657, 5736144, 16339112, 17911599, 7051084, -5307829, -9731368, -10085354, -14424215, -21226454, -22649297, -17476241, -12154451, -10014981, -7479704, -2080358, 2587734, 2679733, -18569, -1206183, 171152]
8710A71152J983523J360530J102655J130926O51096q27651l210066m485770j170499
8701c294104O597612J1785211P145565m496014j1662698p908782L63492K895056
8693A425338j625903o443972p478392o739296n618374j957851L892254O487776
8685a8058420L157863o18320O23637L016444k65468n910739l339835Q376480J6067179
8676C048821R590117l873618r150256k145111P231332R004404L667894j328648
8668A6044935j225304J312193P2256n928706q933699j839537R345192R925848
8660A8773178l513391j5712044j1867531K751161J1235518P818553J352860j123612
8652I714692k051794l872984l392796O80743L539595K003653n81713r98820j088402
$$ y = [171152, 2154675, 3515205, 4617860, 5748786, 6399882, 5572231, 2362165, -2123605, -3294104, 3303508, 15088719, 22234284, 17738270, 6075572, -1833210, -1469718, 1425338, -200565, -6644537, -14122929, -20862225, -26480599, -28438450, -24546196, -18058420, -14900557, -15518877, -14895240, -11878796, -12144264, -18055003, -21394838, -13018358, 3048821, 12638938, 8765320, -384936, -2530047, 4701285, 13705689, 17373583, 16044935, 14819631, 16131824, 16204080, 10275374, 1341675, -497862, 8847330, 18773178, 15259787, -452257, -12319788, -9568627, 1666891, 9485444, 10838304, 9714692, 7662898, 3789914, 397118, 1077861, 4617456, 6621109, 6039396, 5040576, 3952174]
8643C952174k188781j305454K407004L395074k189796q630646p181569J913851
8635i828143R342186P845222k95756o698399n799989l85962J900804j651452n020775
8626a0592264k680356J139547o69393m831196j532578Q592828J3267615P412879
8618A0107082Q23864J063016J214999n595231j0744169k968040J0672013J2504383
8610A7077917M72429q709179m308458M186190L071406n636534q570623m51609
8602b868461Q907345P673072k506500q082146j286999Q344832O146199o344513
8594I982829j2374924m266566N296543L155074m698442m757144J853682L357006
8586b451942k016748m837606j803679P25953N14142K461569O363566N314437r18866
$$ y = [3952174, 1763393, 457939, 2864943, 6260017, 4070221, -4560425, -11741994, -9828143, -485957, 7359265, 7063509, 365110, -5434879, -5820841, -3920037, -5571489, -10592264, -13272620, -12133073, -12802466, -17633662, -19166240, -10573412, 2694203, 10107082, 10930946, 11993962, 13208961, 7613730, -3130439, -6098479, 4573534, 17077917, 17550346, 8841167, 4532709, 8718899, 11790305, 6153771, -2416852, -2868461, 6038884, 13711956, 11205456, 3123310, 1836311, 10181143, 16327342, 9982829, -2392095, -6658661, -1362118, 1792956, -2905486, -7662630, -5808948, -2451942, -4468690, -9306296, -11109975, -10384022, -9869880, -7408311, -1044745, 4269692, 3350826]
8577C350826l717826j79913K264072o22842l730913l738923m116222m939180q52908
8568a6283829N877288M629991m521041o370192N152484J3695617M854395r873157
8560b838444j0199474K300724R216443M250522k015057l121615l602815m587340
8552a0597056j64155Q588217J1181685M186834k728375k344646K75468p07959
8544G690013j669864J654082M297841L9721o933910p404441q95498M024874K400635
8535C203453p25947J854309R050636J1740749L789953q846505j3289619n144636
8527A632393N454178O824283M20390l596556j963668q63252l808214o284449m304423
8518f489318k75811K543683M594818O046017M680758Q78454j375121j412482l308798
$$ y = [3350826, -367000, -546913, 1717159, 1094317, -2636596, -6375519, -10491741, -15430921, -16283829, -10406541, -5776550, -10297591, -16667783, -11515299, 2180318, 7034713, -2838444, -13037918, -10737194, -1520751, 2729771, 714714, -2406901, -6009716, -10597056, -10761211, -2172994, 9008691, 13195525, 10467150, 8122504, 8397972, 7690013, 6020149, 7674231, 11972072, 12011793, 5077883, -2326558, -3222056, 802818, 3203453, 2477506, 4331815, 13382451, 25123200, 28913153, 20066648, 6777029, 1632393, 7086571, 13910854, 14331244, 10734688, 8771020, 7907768, 4099554, -2184895, -6489318, -6765129, -4221446, 373372, 6419389, 11100147, 11978601, 10603480, 9190998, 5882200]
8509E882200p142014o370253J080041O690698L481686k186600m9468P207156P153734
8500A5747180l349012j2738514j0712977j153065N303854N389448L971468L999821
8492F458203K375486l386615r218288q791924k337035K793271J748157r82034
8484a1340779J889850Q949564J0867716L613720n069677o006695n52773L223054
8476E573980K941761L375601O301137O539414N54431p015089r455793o402871
8468B412571j751226L246181Q918989J1346602N133054o784221j3119009p934052
8460A468889R62400K518763k892743o150365m040441k449247m369385l915838
8452a8867967L327605J1221804J0949002L538660k464711l269947k566853k849376
$$ y = [5882200, -1259814, -7630067, -6550026, 140672, 3622358, 1435758, 1386290, 8593446, 15747180, 12398168, -340346, -11053323, -12206388, -6902534, -1513086, 2458382, 6458203, 8833689, 5447074, -3771214, -12563138, -14900173, -12106902, -10358745, -11340779, -9450929, -501365, 10366351, 13980071, 8910394, 2903699, 2350926, 5573980, 8515741, 11891342, 18192479, 24731893, 25286324, 18271235, 8815442, 2412571, 661345, 3907526, 12826515, 24173117, 29306171, 22521950, 9402941, 1468889, 2431289, 4950052, 2057309, -4093056, -8133497, -10582744, -14952129, -18867967, -15540362, -4318558, 6630444, 10169104, 7704393, 4434446, 1867593, -981783]
8444i81783j471642K890138N957187L670614j370012l172384l91531K301201O83300
8435H115088l966666p428899q239912q189236p388244k719522O175923J2730112
8427a0911356J0382164K163863k708810j528109k83741k112236j998374L224036
8419c772563P741524N705392N98380j225260m94683j136236k020544p74282n29818
8410D091910l832774n114251L15936M995812k09069q493792n439431O483935R188731
8401A987007k580904j1744294m913525Q010450J0845644M648319J298975L205735
8393A0757407L549650R85928K41827N88963l546654j0367846j0286284k57172
8385h334181J0100320J0637167L096521k882362k729529j191554l778356p927603
$$ y = [-981783, -2453425, 436713, 6393900, 10064514, 8694502, 5522118, 5130587, 7431788, 8115088, 4148422, -3280477, -11520389, -19709625, -27097869, -29817391, -23641468, -10911356, -529192, 1634671, -1074139, -2602248, -2885989, -4998225, -6996599, -3772563, 3968961, 9674353, 10272733, 9047473, 8552790, 7416554, 5396010, 4621728, 4091910, 259136, -4855115, -4539179, 456633, 247564, -8246228, -13685659, -7201724, 1987007, -593897, -12338191, -17251716, -9241266, 1604378, 6252697, 7551672, 10757407, 14307057, 15292985, 15534812, 16123775, 12577121, 2209275, -8077009, -8334181, 1766139, 12403306, 15499827, 12617465, 9887936, 8696382, 4918026, -3009577]
8377c009577o409644J108976N633199J542287l869877r41252O364868N688259
8369F107239l607591q152405j238187O644681M196623m356835p550400l075892
8361a1032767K745423N503057M506048n81658p236350q859980k866139M508078
8353a3314288O927889N693464L702543l27747n066500l216529O287607J1928571
8345A2615010N913278k348168j413165K774881j947031j1029691r799089J210602
8337d023373O819587K225543j638722M78252K07771o158969q855585j614141P004599
8328e555038P408803K121518k252852n081198o672616l913015K007933L675348
8320h261117k32596j364987L192771M523076j310683l446452N351567J3023165
$$ y = [-3009577, -9419221, -8310245, -2677046, -1134759, -5004636, -5945888, 418980, 6107239, 2499648, -5652757, -6890944, -246263, 3950360, -406475, -7956875, -11032767, -8287344, -2784287, 1721761, 1140103, -6096247, -14956227, -17822366, -13314288, -6386399, -692935, 3009608, 2681861, -2384639, -5601168, 686439, 12615010, 18528288, 16180120, 14766955, 17541836, 15594805, 4565114, -5233975, -4023373, 2796214, 5021757, 3383035, 3861287, 4069058, -2089911, -10945496, -12559637, -5555038, 1853765, 3975283, 1722431, -3358767, -10031383, -13944398, -11936465, -8261117, -8493713, -9858700, -6665929, -2142853, -3453536, -6899988, -1548421, 11474744]
8312A1474744N838141q158044j0490327q24055M030282k509641q494425m630189
8304a3763514K429238L640833J370017J793527L061105P7448m510527k958192
8296h860065N613585J2682250J0574104J203297p012955q745466n960903k967627
8288c473780m03528L282432O525988N670087J381325j128974K15284J540774K0425
8279A3630033j796950j684043j927747l654233k982274J552862L576653j776690
8271D937611p926484n120094M360053Q862727M381544o52891Q89717M667164K121716
8262A6521063p448083j5784744j4316806k565965J0527035J4519291Q567119J991866
8254A2010776J342570K128781j400409m926856k037361J848318l131121j1993970
$$ y = [11474744, 17312885, 9154841, -1335486, -2159541, 1870741, -638900, -9133325, -13763514, -11334276, -7693443, -6323426, -4529899, -1468794, -1391346, -5901873, -8860065, -3246480, 9435770, 20009874, 21213171, 14200216, 5454750, -506153, -3473780, -3877308, -594876, 5931112, 11601199, 12982524, 11853550, 12068834, 13609608, 13630033, 11833083, 10149040, 8221293, 4567060, 1584786, 3137648, 6714301, 4937611, -2988873, -8108967, -3748914, 5113813, 9495357, 8842466, 9732183, 14399347, 16521063, 9072980, -6711764, -21028570, -23594535, -13067500, 1451791, 10018910, 12010776, 13353346, 15482127, 14081718, 9154862, 7117501, 8965819, 5834698, -6159272]
8246f159272q778091P631864J7494935P600660r084937j2112074j226336P652478
8238C019227O794756K756848J473790J040964l18067n62131q7427k436783o479524
8229E201653n859775J103164P652845P276959P10722p122277j1532278q783381
8221a1352368Q15032R343290Q139908n6606l769066L59908K984655j642131n592034
8212g69412j024803N823386M892941j165561k939302j093965l525230q890711
8204h692657p846694l68749L314827J199844L301695J1788836J3102291l50236
8196A5449157j4066820j0365473N703028J3646784N391620p738785j2880690p745630
8188a2606809L473479J3982657J4536400J718611j2998188j3835781j764846O577030
$$ y = [-6159272, -14937363, -7305499, 10189436, 17790096, 8705159, -3406915, -4633251, 3019227, 9813983, 12570831, 14044621, 15085585, 14767518, 14205387, 14117960, 11681177, 5201653, -658122, 445042, 8097887, 15374846, 16085568, 8963291, -2568987, -11352368, -10537336, -1194046, 6945862, 6889256, 3120190, 3480098, 6464753, 4822622, -769412, -1794215, 4029171, 8922112, 7756551, 4817249, 3723284, 198054, -8692657, -16539351, -16908100, -13593273, -12393429, -9091734, 2697102, 15799393, 15449157, 1382337, -8983136, -3280108, 10366676, 15758296, 8019511, -4861179, -12606809, -9133330, 4849327, 19385727, 21104338, 8106150, -5729631, -7494477, -917447]
8180i17447K968694k481464j11296M233364J669345l603102k400164K924362K761137
8171E043429l102642n468185j219265K340851n5131m060880l431623J407568N458317
8162c087561N168915N05669n063446n916371K8718O587629N533630j594872m195205
8153b032894K398673R291312O543427k130438m885007N71233L956927j378522
8145A2334711p901463n312199L476320O465928N40527m611342k412899P41560
8137C321143k359324o316208j999308O478614O470525k636061p210351p76745
8129e027715N576856J098860p828082q864823k818872O09181L05771L486635J0294977
8120c167212J2001098N590695j366583k865653j442990j94235K354469N412308
$$ y = [-917447, 2051247, -430217, -541513, 3691851, 5361196, 1758094, -642070, 2282292, 5043429, 1940787, -3527398, -4746663, -2405812, -2460943, -6521823, -9953446, -8545878, -3087561, 2081354, 2587023, -2476423, -8392794, -8364076, -1776447, 3757183, 2162311, -2032894, 365779, 9657091, 16200518, 14070080, 9185073, 9756306, 13713233, 12334711, 4433248, -878951, 2597369, 9063297, 9603824, 4992482, 2579583, 3321143, 961819, -5354389, -7353697, -875083, 5595442, 2959381, -4250970, -5027715, 549141, 1648001, -6180081, -15044904, -17863776, -17254595, -16948824, -13462189, -3167212, 8833886, 14424581, 13057998, 10192345, 8749355, 8555120, 10909589, 16321897]
8112A6321897L345465m571824r927897o871155r32353L48994j266480m46691J016244
8103b983800j265922l673344N57912P878862P300992k292929q587320l362290
8095f427839N766431P144502J278649k679707k071837l024998q110181j0406131
8087a8531111l499904Q047682J3496140R123315J635316j710186j573810k581186
8079D406256m668669l488217J358084M110443R30739m242155n407414k756483
8071i757416p78773m91641Q82486L265343K905561n68837k081138R75801L653205
8062a995409N90749n288022o415321j119123M656048N757004L177847M53535r30955
8053a113647r97814L01793K087284K561322J722893J513874J647760j377202q095078
$$ y = [16321897, 19667362, 15095538, 5167641, -1703514, -2635867, -2286873, -3553353, -4000044, -2983800, -4249722, -7923066, -7365154, 513708, 7814700, 5521771, -3065549, -6427839, -661408, 6483094, 7761743, 5082036, 3010199, -14799, -8124980, -18531111, -22031015, -13983333, -487193, 8636122, 10271438, 8561252, 6987442, 4406256, -262413, -3750630, -2392546, 1717897, 2648636, -1593519, -7000933, -9757416, -10536189, -11027830, -10145344, -6880001, -3974440, -4543277, -6624415, -5648614, -1995409, -1404660, -6692682, -13108003, -14227126, -9571078, -3814074, -636227, -182692, -1113647, -2111461, -1809668, 277616, 2838938, 4561831, 6075705, 7723465, 6346263, -1748815]
8044a748815j1962383o270949N847650J3391149J0274883J810690l293851l215954
8036D832420k049487j869710p57337K082500M163087L942034L451756M529516
8028A8324779N232950K857656j287760l336741k352384j261836k284071m271670
8020A1620923n134234m277593j776494K262688O104283O499327K326693l478161
8012A4147432p179386p824212o393113l759526j322710j050693k371255j616110
8004a7369573K424603N264608L031709q24129m19827L198170M068462J488187
7996H62210O24607K598055K113167k642052n641741k795629Q09062j012832n639266
7987a0724419n942734p04475M928762O509757L134418l523576q499149n688514
$$ y = [-1748815, -13711198, -19982147, -14134497, -743348, 9531535, 11342225, 8048374, 4832420, 2782933, 913223, 155886, 2238386, 6401473, 10343507, 13795263, 18324779, 23557729, 26415385, 25127625, 21790884, 19438500, 18176664, 15892593, 11620923, 6486689, 2209096, 432602, 2695290, 8799573, 15298900, 17625593, 14147432, 6968046, -856166, -7249279, -11008805, -12331515, -13382208, -15753463, -17369573, -14944970, -9680362, -6648653, -7472782, -7892609, -4694439, -625977, 862210, 1486817, 4084872, 6198039, 3555987, -2085754, -4881383, -4072321, -5085153, -10724419, -16667153, -17371628, -12442866, -5933109, -2798691, -6322267, -14821416, -20509930]
$$ [...]
##END NTUPLES=NMR SPECTRUM
##END=
