##TITLE=31Pdec_LR-738-B-CR9
 , 24 sc
 19.11.2021
##JCAMPDX= 6.0         $$ Bruker NMR JCAMP-DX V2.0
##DATA TYPE= NMR SPECTRUM
##DATA CLASS= NTUPLES
##ORIGIN= UXNMR, Bruker Analytische Messtechnik GmbH
##OWNER= root
$$ XWIN-NMR		Version 3.5
$$ Fri Nov 19 10:31:42 2021 Russian Standard Time (UT+4h)  she@DPX200
##.OBSERVE FREQUENCY= 81.013821
##.OBSERVE NUCLEUS= ^31P
##.ACQUISITION MODE= SIMULTANEOUS
##.ACQUISITION SCHEME= undefined
##.AVERAGES= 24
##.DIGITISER RES= 16
##SPECTROMETER/DATA SYSTEM= spect
##.PULSE SEQUENCE= zgpg30
##.SOLVENT NAME= CDCl3
##.SHIFT REFERENCE= (INTERNAL, CDCl3, 0, 248.564)
##AUDIT TRAIL= $$ (NUMBER, WHEN, WHO, WHERE, WHAT)
$$ ##TITLE= Audit trail, XWIN-NMR		Version 3.5
$$ ##JCAMPDX= 5.01
$$ ##ORIGIN= Bruker BioSpin GmbH
$$ ##OWNER= she
$$ F:/spectra/data/she/nmr/P31/1/pdata/1/auditp.txt
$$ ##AUDIT TRAIL=  $$ (NUMBER, WHEN, WHO, WHERE, WHAT)
(   1,<2021-11-19 10:30:31.76 +0400>,<she>,<DPX200>,
      <created by zg, POWCHK disabled, PULCHK disabled
       configuration hash MD5:
       00 E9 B6 7A A2 85 ED C7 34 08 36 98 17 FE 4E 26
       data hash MD5: 32K
       94 86 8A 26 27 2E 41 EB 3B DC 10 7F C4 DD B6 06>)
(   2,<2021-11-19 10:30:35.95 +0400>,<she>,<DPX200>,
      <Start of raw data processing
       efp BC_mod = 2 LB = 1 FT_mod = 6 PKNL = 1 PHC0 = -9262.766 PHC1 = 208.0695 SI = 64K 
       data hash MD5: 64K
       1B 6F BE 30 1B 50 1A 1E F9 3B 49 56 28 26 41 C9>)
(   3,<2021-11-19 10:31:02.89 +0400>,<she>,<DPX200>,
      <pk PHC0 = 25.34413 PHC1 = 0 
       data hash MD5: 64K
       7F 61 96 CB 58 DE 0C 3F E6 94 95 CD BE 53 75 11>)
(   4,<2021-11-19 10:31:06.50 +0400>,<she>,<DPX200>,
      <abs ABSG = 5 
       data hash MD5: 64K
       0F 61 16 7B B6 B3 94 3D 38 22 A1 7F 04 B8 F5 B8>)
$$ ##END=
$$ 
$$ hash MD5
$$ C1 43 1A 75 6B 6B D4 3F CC A0 5A 26 52 29 36 F2
##$RELAX= 
##$RELAX= 
##$RELAX= 
##$RELAX= 
##$RELAX= 
##$RELAX= 
##$RELAX= 
##$RELAX= 
$$ Bruker specific parameters
$$ --------------------------
##$DU= <F:/spectra>
##$EXPNO= 1
##$NAME= <P31>
##$PROCNO= 1
##$TYPE= <nmr>
##$USER= <she>
##$AMP= (0..31)
100 100 100 100 100 100 100 100 100 100 100 100 100 100 100 100 100 100 
100 100 100 100 100 100 100 100 100 100 100 100 100 100 
##$AQSEQ= 0
##$AQ_mod= 1
##$AUNM= <au_zg>
##$AUTOPOS= <>
##$BF1= 81.014009
##$BF2= 200.13
##$BF3= 200.13
##$BF4= 200.13
##$BF5= 200.13
##$BF6= 200.13
##$BF7= 200.13
##$BF8= 200.13
##$BYTORDA= 1
##$CFDGTYP= 0
##$CFRGTYP= 5
##$CHEMSTR= <none>
##$CNST= (0..31)
1 1 145 1 1 1 1 1 1 1 1 1 1 1 1 1 1 1 1 1 1 1 1 1 1 1 1 1 1 1 1 1 
##$CPDPRG= <waltz16>
##$CPDPRG1= <>
##$CPDPRG2= <waltz16>
##$CPDPRG3= <>
##$CPDPRG4= <mlev>
##$CPDPRG5= <mlev>
##$CPDPRG6= <mlev>
##$CPDPRG7= <mlev>
##$CPDPRG8= <mlev>
##$CPDPRGB= <>
##$CPDPRGT= <>
##$D= (0..31)
0 1 0 0 0 0 0 0 0 0 0 0.03 2e-05 3e-06 0 0 0 0 0 0 0 0 0 0 0 0 0 0 0 0 
0 0 
##$DATE= 1637303431
##$DBL= (0..7)
120 120 120 11 120 120 24 19 
##$DBP= (0..7)
150 150 150 150 150 150 150 150 
##$DBP07= 0
##$DBPNAM0= <>
##$DBPNAM1= <>
##$DBPNAM2= <>
$$ [...]
##$SUBNAM3= <"">
##$SUBNAM4= <"">
##$SUBNAM5= <"">
##$SUBNAM6= <"">
##$SUBNAM7= <"">
##$SUBNAM8= <"">
##$SUBNAM9= <"">
##$SW= 501.771253377433
##$SWIBOX= (0..15)
0 1 3 0 0 0 0 0 0 0 0 0 0 0 0 0 
##$SW_h= 40650.406504065
##$TD= 32768
##$TD0= 1
##$TE= 0
##$TE2= 300
##$TE3= 300
##$TEG= 300
##$TL= (0..7)
0 120 53 12 22 120 120 120 
##$TP= (0..7)
150 150 150 150 150 150 150 150 
##$TP07= 0
##$TPNAME0= <>
##$TPNAME1= <>
##$TPNAME2= <>
##$TPNAME3= <>
##$TPNAME4= <>
##$TPNAME5= <>
##$TPNAME6= <>
##$TPNAME7= <>
##$TPOAL= (0..7)
0.5 0.5 0.5 0.5 0.5 0.5 0.5 0.5 
##$TPOFFS= (0..7)
0 0 0 0 0 0 0 0 
##$TUNHIN= 0
##$TUNHOUT= 0
##$TUNXOUT= 0
##$USERA1= <user>
##$USERA2= <user>
##$USERA3= <user>
##$USERA4= <user>
##$USERA5= <user>
##$V9= 5
##$VALIST= <valist>
##$VCLIST= <CCCCCCCCCCCCCCC>
##$VD= 0
##$VDLIST= <DDDDDDDDDDDDDDD>
##$VPLIST= <PPPPPPPPPPPPPPP>
##$VTLIST= <TTTTTTTTTTTTTTT>
##$WBST= 1024
##$WBSW= 4
##$XGAIN= (0..3)
0 0 0 0 
##$XL= 0
##$YL= 0
##$YMAX_a= 1246
##$YMIN_a= -2646
##$ZGOPTNS= <>
##$ZL1= 120
##$ZL2= 120
##$ZL3= 120
##$ZL4= 120
##$ABSF1= 248.5645
##$ABSF2= -253.2056
##$ABSG= 5
##$ABSL= 3
##$ALPHA= 0
##$AQORDER= 0
##$ASSFAC= 0
##$ASSFACI= 0
##$ASSFACX= 0
##$ASSWID= 0
##$AUNMP= <proc_1d>
##$AZFE= 0.1
##$AZFW= 0.5
##$BCFW= 0
##$BC_mod= 2
##$BYTORDP= 0
##$COROFFS= 0
##$CY= -3
##$DATMOD= 1
##$DC= 0
##$DFILT= <>
##$DTYPP= 0
##$F1P= 0
##$F2P= 0
##$FCOR= 1
##$FTSIZE= 65536
##$FT_mod= 6
##$GAMMA= 0
##$GB= 0
##$INTBC= 1
##$INTSCL= 5.30512e-09
##$ISEN= 30
##$LB= 1
##$LEV0= 0
##$LPBIN= 0
##$MAXI= 10000
##$MC2= 0
##$MEAN= 0
##$ME_mod= 0
##$MI= 50
##$NCOEF= 0
##$NC_proc= -8
##$NLEV= 6
##$NOISF1= 182.463
##$NOISF2= 159.3651
##$NSP= 0
##$NTH_PI= 0
##$NZP= 0
##$OFFSET= 248.5645
##$PC= 4
##$PHC0= -9237.422
##$PHC1= 208.0695
##$PH_mod= 1
##$PKNL= yes
##$PPARMOD= 0
##$PSCAL= 0
##$PSIGN= 0
##$REVERSE= no
##$SF= 81.014009
##$SI= 65536
##$SIGF1= 159.3651
##$SIGF2= -187.1042
##$SINO= 113.3802
##$SIOLD= 16384
##$SREGLST= <1H.CDCl3>
##$SSB= 0
##$STSI= 65536
##$STSR= 0
##$SW_p= 40650.406504065
##$SYMM= 0
##$S_DEV= 0
##$TDeff= 32768
##$TDoff= 0
##$TI= <>
##$TILT= no
##$TM1= 0
##$TM2= 0
##$TOPLEV= 0
##$USERP1= <user>
##$USERP2= <user>
##$USERP3= <user>
##$USERP4= <user>
##$USERP5= <user>
##$WDW= 1
##$XDIM= 65536
##$YMAX_p= 219559469
##$YMIN_p= -126422930
$$ End of Bruker specific parameters
$$ ---------------------------------
##NTUPLES= NMR SPECTRUM
##VAR_NAME=  FREQUENCY,     SPECTRUM/REAL,   SPECTRUM/IMAG
##SYMBOL=    X,             R,               I
##VAR_TYPE=  INDEPENDENT,   DEPENDENT,       DEPENDENT
##VAR_FORM=  AFFN,          ASDF,            ASDF
##VAR_DIM=   65536,         65536,           65536
##UNITS=     HZ,            ARBITRARY UNITS, ARBITRARY UNITS
##FACTOR=    0.620285442955139, 1,           1
##FIRST=     20137.2065510759, 0,            0
##LAST=      -20513.1999529892, 0,           0
##MIN=       -20513.1999529892, -126422930,  0
##MAX=       20137.2065510759, 219559469,    0
$$ Real data points
##PAGE= N=1
##DATA TABLE= (X++(R..R)), XYDATA
$$ [...]
40697 2945660 1381216 2201889 1935907 259046 841517 5095367 9338883 9415038 5100106
40688 5100106 -871711 -5223555 -5093949 -94018 5650660 7101282 5058750 5329373
40680 5329373 9642403 12147545 7939610 689136 -2394522 66045 3640778 4842483
40672 4842483 3355175 -370053 -5087287 -7689673 -6412335 -3938936 -3548234 -3901786
40664 -3901786 -1899633 1245556 1937630 714490 1106752 2825519 2280636 -125807 261128
40655 261128 4233869 6615458 4191878 -57566 -3007599 -5947852 -10005112 -12411885
40647 -12411885 -11320735 -9736701 -10235684 -9719982 -4395164 3004063 6197500 3866837
40639 3866837 384741 -1063708 -1680901 -3393117 -5679972 -6927009 -6740211 -6132440 -6263200
40630 -6263200 -7022281 -6918826 -5428202 -4800957 -6892632 -8633345 -5011588 2560747 6129234
40621 6129234 1927309 -4189597 -5933913 -5684843 -8558132 -12203340 -10546378 -5133565
40613 -5133565 -3820656 -8137042 -10445878 -5738610 1178779 3706381 2432445 1616502
40605 1616502 1512940 -417031 -3414101 -3895310 -1315242 644527 -722000 -3459126
40597 -3459126 -3448460 682207 6008281 8565775 7701207 6167284 5570194 3874984 -455641
40588 -455641 -4077604 -2637747 1892331 2879056 -1284202 -4481869 -2039603 2537247
40580 2537247 3609356 1784465 1371418 2635073 2320343 359955 225246 2576985 3858171
40571 3858171 2296378 727232 1649748 3375459 3453692 2722193 3103432 3735697 2477685
40562 2477685 -15201 -711570 1656563 5176132 7329395 7051437 4358781 3171
40554 3171 -4074954 -5692134 -4676957 -3131209 -2841935 -3356937 -3147743 -1737737 -12035
40545 -12035 845274 157882 -1735056 -3241246 -2672665 -291522 1771699 2379719 2913026
40536 2913026 4821462 7126975 8131297 8155541 8037251 6141878 502901 -6325841 -8842334
40527 -8842334 -6100824 -3399561 -4356670 -5565174 -2627999 2320665 4119106 3005663
40519 3005663 3588857 6404002 6899087 3693373 1752862 4673883 8612109 7523053
40511 7523053 1297116 -4724837 -6142865 -2620530 3219087 7227804 6023062 715452
40503 715452 -3221053 -2302579 621374 1033136 -629082 -787850 715282 643600 -1567781
40494 -1567781 -2573452 -729555 1164143 233396 -2563904 -4495139 -4455447 -2920443 -811780
40485 -811780 333263 -670908 -2254051 -961815 3769279 7878023 7445762 3353553
40477 3353553 -475153 -1656194 -390817 2235074 4759232 5402199 3784635 1840777
40469 1840777 1445776 2171174 2868966 3940953 5932720 7278854 6131968 3658658 2734847
40460 2734847 3576165 3346282 448471 -3084685 -4169022 -2013240 1560259 3824072
40452 3824072 3062414 55640 -2477730 -3118963 -3718531 -6448997 -9998652 -11403645 -10914721
40443 -10914721 -11488684 -13403193 -13494542 -10909168 -9363135 -11212452 -13031452 -10638276
40435 -10638276 -5678114 -2972739 -3068422 -1994181 2039388 6016969 6743153 4545954
40427 4545954 1503652 -933073 -1565886 317956 2963978 3071673 294932 -1629809
40419 -1629809 -74179 2535604 2280836 -774659 -3495386 -4601850 -5413525 -6172457 -4971215
40410 -4971215 -1118734 2816188 3525361 312754 -4557581 -7742695 -7038166 -3274430
40402 -3274430 -210891 -933911 -4114004 -5616230 -4070975 -2473668 -3331225 -4854042
40394 -4854042 -3986588 -1111056 1047151 2009678 3989120 7849853 11223817 11216331 7299589
40385 7299589 1319985 -3812016 -5566828 -3809461 -1339736 -500620 368318 4294527
40377 4294527 9538913 10062739 3811178 -3171328 -4044049 1253 1976730 -1310898
40369 -1310898 -5929825 -6882845 -3863844 -145300 1574940 1016481 -320301 -713862 1552
40360 1552 240241 -867962 -1689404 -408240 1840950 2391118 766157 -1563549 -4233036
40351 -4233036 -7543045 -9628284 -8095603 -4621767 -3610032 -5489611 -5881132 -2778885
40343 -2778885 396127 1200063 2351601 5774942 7375257 3079104 -3481249 -5319863
40335 -5319863 -1977970 822703 10128 -2240363 -3916880 -5029696 -4051226 1163138
40327 1163138 7739299 9069566 3792789 -1893293 -3287851 -3183803 -5571718 -8521353
40319 -8521353 -7951564 -4621358 -2307526 -1723852 -1243231 -1515805 -3920511 -5625900 -2152896
40310 -2152896 4650886 6814886 616267 -7630515 -9370461 -4427299 13155 -375431
40302 -375431 -2127816 -180387 4323786 5263225 -404971 -8681629 -13289581 -12196215
40294 -12196215 -7941242 -3375940 383619 2639056 2748825 1561215 1051942 1974823
40286 1974823 3504356 5102074 6508617 6048369 2043671 -3485716 -5836336 -3568018
40278 -3568018 -216102 1414805 2993177 6336279 9112361 8524672 6434088 6608476
40270 6608476 8739978 9331620 7210095 4162817 1213983 -1619496 -2768041 -754949
40262 -754949 1956937 1285780 -2180502 -3796237 -2321990 -1907126 -5062361 -8326664 -7667268
40253 -7667268 -4544083 -3321256 -4993912 -6534114 -5201037 -1350797 2132772 2122138
40245 2122138 -1602265 -4865469 -2977432 3121645 7340700 6165379 2631534 823338
40237 823338 161991 -1690669 -3522782 -2522408 377497 1669442 1080076 1900840 5228769
40228 5228769 7643348 5817098 851156 -3204844 -3533612 -606229 2568621 2877078
40220 2877078 -156999 -4051791 -6419801 -7272988 -7134482 -4816062 208156 4597347
40212 4597347 3958964 -1296674 -6258644 -7749646 -6794065 -4672025 -877319 3454296
40204 3454296 4457908 962146 -2337773 -930615 2668305 2531435 -1439082 -2830617
40196 -2830617 1992518 8252465 8833625 3294320 -2241557 -3112140 -967267 -121546 -1612479
40187 -1612479 -2914761 -2495728 -1948750 -2846028 -3693397 -1999985 1814350 4903012 5922789
40178 5922789 6138510 6674651 7087589 6901806 6092444 3827025 -246974 -2997416 -60209
40169 -60209 7279820 11674959 8946737 3599393 1452283 1252459 -878527 -2737069 341095
40160 341095 5218303 3560965 -4615831 -9230894 -4944838 938350 324580 -3653892
40152 -3653892 -3402386 455571 1584504 -659291 -1173746 1071505 1472953 -1854094 -5440784
40143 -5440784 -7012971 -8149102 -9198360 -7657738 -3241797 971108 3889668 7191579
40135 7191579 9375956 5816513 -2439512 -6848817 -2870525 2734347 1650978 -4062943
40127 -4062943 -6310228 -3320464 -447791 -819423 -2386593 -3606381 -5380068 -6805252
40119 -6805252 -4791714 731610 5759481 7667366 8007392 8873756 9892534 9755670 7846902
40110 7846902 3920508 -1031914 -3820632 -2310341 727949 871584 -1272835 -1306570 1118125
40101 1118125 1328368 -2402440 -5827822 -5957055 -5527419 -6832145 -6513216 -1259815 5549687
40092 5549687 8185328 6468785 4214608 2445787 -324724 -2998561 -2949781 -1333893
40084 -1333893 -1810781 -4234349 -4931762 -3365125 -3049301 -5023819 -5835016 -3658669 -1339815
40075 -1339815 -1040369 -593559 1894200 4138851 3919101 3424995 5228136 7033050 5175786
40066 5175786 1197744 -78389 2055612 3568005 2155786 -268807 -1882184 -3292430
40058 -3292430 -4506340 -3587853 -111661 3215905 4127059 3356514 2401541 1719151 2439530
40049 2439530 6155992 10755152 10325261 2796360 -5454295 -6965913 -2859453 -280346
40041 -280346 -1732480 -2673537 127340 3499620 3084475 -691603 -4402917 -6208541 -6101403
40032 -6101403 -4104514 -945980 1098720 527974 -1084000 -951102 1312476 3203221
40024 3203221 2065401 -2222113 -6749743 -7923424 -5347360 -2703684 -3078053 -4598369
40016 -4598369 -3595511 -875668 -444389 -2317627 -2092565 1269557 3170111 1298085
40008 1298085 -191693 1763015 3162992 -240036 -5190453 -6302388 -5086323 -6431025
40000 -6431025 -9103763 -7674494 -2335037 1206041 1246821 1692451 3665992 3354031 -112936
39991 -112936 -2013350 103842 2512172 2288257 1950053 3472615 3562457 -402961 -4439283
39982 -4439283 -3134953 2405246 6421664 5981518 2674154 -1130912 -4073784 -5294131
39974 -5294131 -5037487 -4638004 -4182709 -2134919 1257938 2872893 878830 -2651735 -4961972
39965 -4961972 -5510822 -4227642 -639299 3247532 3278487 -948377 -4392096 -3565623 -1162415
39956 -1162415 -707740 -1131140 -412171 7418 -982989 -430846 3313582 5698261 2604988
39947 2604988 -1711032 -313107 5289364 7050496 2162459 -4167070 -7303967 -7741306
39939 -7741306 -6598517 -2943692 2705344 6914944 7016008 3354977 -2008671 -5934797
39931 -5934797 -5024956 265019 4089007 2239035 -1496460 -1264826 1319760 638340 -2047875
39922 -2047875 19402 6919531 10429581 6542981 1295920 968669 3745112 4806760
39914 4806760 3415948 1115777 -1627800 -3462640 -1911421 1847737 3095282 1071902
39906 1071902 480253 2642279 2044185 -4049117 -9444703 -8193740 -3805224 -2675730
39898 -2675730 -3575653 -1243275 3430782 4864296 2306246 354508 807752 750609 -1148969
39889 -1148969 -2192639 -284249 3200433 5648921 5327688 1897261 -2381831 -3467381
39881 -3467381 -682097 1008012 -2428077 -7430049 -7202985 -1045369 5176447 6499831
39873 6499831 2575758 -4315130 -10194970 -10015380 -2705344 5413577 7418834 4912745
39865 4912745 4887052 8681308 10733734 8316131 5401382 5220225 5426537 3391139 987114
39856 987114 1015056 3057656 5606837 8486869 10608100 9095592 3629549 -1443119 -2230618
39847 -2230618 -41191 1436051 1217586 766528 804277 1026610 1624688 2964970 4671007
39838 4671007 6358080 8308459 10592568 12503379 13096093 11311062 6462374 480556
39830 480556 -1990798 872960 3976232 1464259 -4018961 -4361410 1512015 5376708
39822 5376708 2152393 -2668509 -2202851 1693903 3106562 1594613 486399 -443278
39814 -443278 -3537857 -6984112 -6936933 -4552199 -4333363 -6268701 -6131231 -3379994 -2072962
39805 -2072962 -3206583 -2745327 1001536 4248689 4525603 4799014 7301271 8378475 4093008
39796 4093008 -2758725 -6081877 -4528685 -1709133 -285353 -214632 -1379284 -3343166
39788 -3343166 -3287459 967034 5777237 4476323 -3325693 -9839295 -8940382 -3960316 -2201117
39779 -2201117 -4901137 -7382632 -7484133 -8180686 -11032400 -12152612 -7683161 -42914
39771 -42914 4968155 5735328 5921195 8439046 11738491 12780520 10927191 7427563 2988563
39762 2988563 -2320019 -7740958 -12062548 -14842332 -16197876 -15553611 -11794520 -5120183
39754 -5120183 1920752 6112492 6557901 5416310 4945757 4368797 1336829 -3425612 -5516792
39745 -5516792 -2492888 2242183 3879532 2658647 2274475 3192495 2355960 -439437 -1306061
39736 -1306061 873031 1562586 -2145226 -5815872 -3814918 1971950 4789283 2698621
39728 2698621 355586 1446714 4097593 4531206 1659666 -2788852 -5948047 -5376252
39720 -5376252 -1627860 990754 -699715 -3651460 -2270968 2996676 5515741 1729014
39712 1729014 -4346870 -7630862 -8001802 -7106241 -4140317 905640 3704830 513756
39704 513756 -5646451 -8598843 -7165288 -5045172 -4084526 -2994879 -2101438 -3539248 -5939640
39695 -5939640 -4424472 2030719 7745513 7498358 3031985 -242590 -17603 2172792
39687 2172792 4299738 4865206 2570646 -2013197 -5693526 -5912242 -3473559 -306351
39679 -306351 3238442 6564076 7160420 4348806 2227397 4314346 7077123 4311750
39671 4311750 -2805381 -6343684 -3145231 666814 -675118 -4144158 -3202114 2772674
39663 2772674 8877898 11337424 9339697 3114736 -4873264 -9044657 -6424290 -1883601
39655 -1883601 -2236574 -6179873 -6359920 -1335124 1708055 -1869765 -7143241 -7622167 -4538617
39646 -4538617 -3044342 -3574894 -3102170 -2171912 -4008675 -7460319 -7277899 -2373782 1677250
39637 1677250 490240 -3109627 -3715789 -765641 2001641 2662944 3216659 5709675 8780846
39628 8780846 9050684 5169903 -164936 -2530778 -402158 3020695 3601332 1469085
39620 1469085 643278 3211606 6104646 5076557 196377 -4656810 -6738530 -6467271
39612 -6467271 -4786102 -1297995 3730609 7519793 7156378 3324315 -247599 -1240312
39604 -1240312 -982096 -1609952 -2672215 -2118308 246214 2184582 1792843 -746389 -4131445
39595 -4131445 -6906909 -7334595 -4510363 -434859 1266080 119342 124782 4223283 9493983
39586 9493983 10842371 8044278 5427099 5028200 4229543 1054548 -2113967 -2195034 163549
39577 163549 2212069 2789210 1905649 -1011478 -5168251 -6462312 -1617511 6192542 9959426
39568 9959426 7529824 3593463 1783641 -524359 -6200074 -11130146 -8708442 -266348
39560 -266348 5168533 2828780 -1580014 -785464 3549466 4337340 241048 -3137223 -2914269
39551 -2914269 -3034539 -6428640 -8947007 -5682567 564063 2732712 -448765 -3524472
39543 -3524472 -3100869 -2011604 -3396669 -5523938 -5218202 -2883732 -880502 699763
39535 699763 3270068 6147332 6929165 5027749 2271718 209450 -922284 -725355 1355140
39526 1355140 4037327 4464464 1688261 -1582530 -2068161 170002 2284875 2567472 2125179
39517 2125179 2312120 2142148 -130046 -3417613 -3947182 97725 5688750 8348345 7353994
39508 7353994 5369971 3493877 -203483 -6177462 -10294850 -7863393 211107 7622802
39500 7622802 9054432 4958839 92439 -1309728 1256258 4845825 5838999 3030253
39492 3030253 -1375276 -3805970 -2533292 1011768 3949741 4919727 5263979 6882648
39484 6882648 8932445 7859212 1782190 -6147898 -10568970 -9660304 -6128905 -2834990
39476 -2834990 -160381 1880011 2095427 371785 -1083935 -863792 -597915 -1772160 -2412957
39467 -2412957 23692 3977982 5514909 4057382 2839101 3629440 4608529 4345727 4463124
39458 4463124 6433463 8311675 7183908 3477840 415712 -270560 47586 -420222 -1510094
39449 -1510094 -2150273 -2334914 -2687721 -2757566 -1474043 590524 1291054 150076 -422690
39440 -422690 985141 1555064 -1928276 -7044845 -7750258 -2815388 2134459 2558610 572716
39431 572716 -85121 -319130 -2648132 -5161398 -3763560 1060477 4682575 5001287 4328568
39422 4328568 4814141 5991488 6951688 7403204 6585138 4349511 2809133 3508398 4003526
39413 4003526 1390920 -2021417 -1837590 478539 -760022 -5512613 -6822025 -1629134
39405 -1629134 4033482 3967550 -167020 -3683490 -5946995 -7752047 -6726782 -1208755
39397 -1208755 4915228 6916721 5978229 6027130 6633859 4712495 1089128 -500001 392947
39388 392947 1219202 1795416 3891208 6207132 5287187 1351055 -1796466 -2596169 -2637638
39379 -2637638 -2075372 418081 2920926 1308032 -3752819 -6362131 -3921883 -1145907
39371 -1145907 -3039381 -8129570 -11437680 -10675523 -6881698 -1970995 1896021 3162677
39363 3162677 3089025 4454009 6612737 5409595 58958 -3894890 -1751929 3568369
39355 3568369 5773888 3566927 528224 -1423303 -3684007 -6580844 -7765287 -5893182
39347 -5893182 -2870068 -1326627 -1818564 -3227066 -4335158 -4446199 -3687915 -3075518 -3307792
39338 -3307792 -3483634 -2125778 453525 1984674 842081 -1980520 -3920734 -3359299
39330 -3359299 -676562 2804268 6114262 8483966 8674151 5987216 2175604 454796
39322 454796 1357922 1389511 -2047568 -5965485 -5194374 233252 4759144 4664488 2103471
39313 2103471 677170 535627 -55673 -1139538 -1605610 -1387152 -895060 153787 1425402
39304 1425402 1176007 -1163429 -3137714 -2182484 816234 2916980 3027460 2533930 3006785
39295 3006785 4961907 7859533 9813540 8617684 4673093 1404430 1067551 1954645
39287 1954645 1777542 1572960 3208320 4874449 2973228 -2222080 -6529023 -7398880 -6168689
39278 -6168689 -4754542 -3440582 -2258479 -1265693 989227 5761550 10136975 8798461
39270 8798461 1605629 -4418262 -3589504 1043750 2424907 -758397 -3521078 -2794438
39262 -2794438 -1300527 -2269286 -4428482 -4651549 -2895265 -1647955 -1923184 -2588764 -3007676
39253 -3007676 -3586319 -3649430 -1495368 2511801 5166459 4172174 983596 -1527573 -2536080
39244 -2536080 -2633720 -1606386 461351 1194615 -1512852 -5303809 -5382283 -1289559 1977084
39235 1977084 1056278 -982939 643036 5565783 9096671 8333390 4622861 941810
39227 941810 -577676 820166 3926429 5667297 3862381 -108061 -2896226 -2989672 -1326990
39218 -1326990 1021504 3392102 4099048 1351765 -3639146 -6897401 -6402685 -4738932
39210 -4738932 -5289043 -7173226 -6402588 -1850629 2496171 2498329 -710985 -2398611 -503248
39201 -503248 2446705 3816387 4085333 4136521 2588915 -1137949 -3628756 -1490510 2839697
39192 2839697 3876576 1099211 -732740 544603 1599233 -250559 -3277985 -5640484
39184 -5640484 -8083517 -9752664 -6976189 -168767 3386719 -1116256 -8211860 -9444010
39176 -9444010 -4784361 -573132 736466 1621063 2321568 345816 -3240056 -4212034 -2475340
39167 -2475340 -2468823 -5360183 -7066872 -5431264 -3340049 -2799426 -1651365 1326666 3256297
39158 3256297 1945125 -618714 -2223566 -3678390 -5524923 -5720588 -3450164 -1338270
39150 -1338270 -1000787 -208234 2552357 4485211 2726174 -1290765 -4894552 -8046912
39142 -8046912 -10785072 -10613311 -6624006 -2865728 -2977517 -4317733 -2361266 1513405
39134 1513405 2114191 -1238950 -4094726 -4035875 -3166370 -3271158 -3447380 -3415418 -4760043
39125 -4760043 -7468445 -8902477 -7698777 -5483979 -3275455 543434 6499760 11006891
39117 11006891 9978279 4154119 -1764528 -4762347 -5934828 -7123808 -7553718 -5532971
39109 -5532971 -2221360 -972342 -2445905 -3129387 -666495 1826782 180811 -3877095
39101 -3877095 -5042733 -3281697 -4454261 -10548678 -15345387 -13393587 -8023647 -5486296
39093 -5486296 -5517358 -3809711 -537703 694908 592063 3245904 7688492 8013149 3369877
39084 3369877 614738 4046970 8835922 8719938 4968326 2806825 3053676 2814762 1746323
39075 1746323 1876829 2470338 545939 -3453922 -5273815 -2994745 365945 1682675
39067 1682675 1698947 2305508 2626544 385512 -4211704 -8153365 -8662839 -5242349 559195
39058 559195 5998251 8344783 6879806 3807091 2123682 2552557 3456528 3532547 3232674
39049 3232674 3336635 3600658 3582937 3607170 3854662 3451341 1729024 -319866 -1314891
39040 -1314891 -1726350 -3087028 -5009013 -4928880 -1539793 3042090 5584705 5239476 3828177
39031 3828177 3444586 4673664 6596795 7740408 7395803 6481919 6529128 7410560 7003695
39022 7003695 3948332 40909 -1236329 1452514 5521205 6640357 2859154 -2958815
39014 -2958815 -5146113 -876835 6115495 8941234 5145493 -737288 -3053104 -1501049
39006 -1501049 36779 -525602 -1541144 -1331009 -774648 -1058591 -1135833 431420 2229813
38997 2229813 1239396 -2377993 -4232012 -1119123 4277865 6719708 5488254 4603138
38989 4603138 5765611 5508673 1587386 -2134241 -1456637 787231 -1026762 -5440684
38981 -5440684 -5261152 768076 4790146 1046985 -5973697 -8853373 -7616602 -7324162
38973 -7324162 -8843795 -8312343 -4458253 -680225 463198 338978 974305 2154673 2754852
38964 2754852 2379374 917938 -1453396 -3352555 -3141005 -1126194 860143 2212076
38956 2212076 4079986 6779860 8345398 6594604 1945606 -2466223 -3558409 -1315416
38948 -1315416 1225112 1570235 685111 958871 2200571 2220221 895031 206007 76799
38939 76799 -1716736 -4619970 -4937126 -2094684 -209574 -841352 219228 4975300 7780507
38930 7780507 3610376 -3066971 -4536311 -1128567 1203580 1450062 3190697 5534999
38922 5534999 3544697 -2372134 -6114484 -5643716 -4761093 -4199301 -32872 6761648 8631863
38913 8631863 3542320 -47724 3986372 9483971 8006039 2258285 1012631 4933636
38905 4933636 6427614 1893659 -3916012 -5833691 -4072341 -1197262 1588471 3739860
38897 3739860 4417782 3376195 974063 -2264162 -4425009 -2444484 3536555 7972594
38889 7972594 5878098 -237767 -3408916 -1452400 1021964 -180707 -3748810 -5874741
38881 -5874741 -4943536 -1841944 1904548 4872107 6199223 6333316 6489778 7269643 8589143
38872 8589143 10219024 11077518 9138536 4122812 -645949 -1608881 288356 879043 -1362488
38863 -1362488 -3561326 -2897576 -30585 2908755 5289431 7368415 8445262 7513411
38855 7513411 5102185 3097575 2820628 3925269 5022364 4998060 3896169 2797809 2821828
38846 2821828 4158996 5958060 7000505 6751773 6177262 7024803 9330188 10212965 6984157
38837 6984157 1421301 -1446996 327995 2939678 2129084 -1066820 -2336388 -311753
38829 -311753 2158669 2342685 472377 -1712309 -2806756 -1854227 1054962 3620136 2849248
38820 2849248 -1186761 -4735429 -4601152 -1528738 1860944 4779401 7684887 9166580
38812 9166580 6796913 1674258 -1219475 647409 3322538 1936041 -1737998 -1974852
38804 -1974852 1391352 2101701 -2500895 -6910556 -6582425 -5581127 -9056198 -12947416
38796 -12947416 -9535221 -801728 3145647 -824654 -4652519 -2307375 1625785 1058034
38788 1058034 -1554557 -483962 3611943 6099959 6554686 7836173 9536073 8689754
38780 8689754 5600743 3399753 2810463 2260310 2005850 3114791 3416563 -23127 -4683683
38771 -4683683 -4469074 1405421 6526858 5919824 2203272 795338 2318528 2749695 -350404
38762 -350404 -4182332 -3539938 3173463 11197160 13904027 10340653 6085267 5458155 6011814
38753 6011814 3536334 -525300 -1205469 1966916 3958795 1302299 -3794619 -6941785
38745 -6941785 -6171587 -2800486 -105614 -752094 -3344055 -2990245 1814572 5163635 1151242
38736 1151242 -6470646 -7996008 -811875 7523665 10196114 8815453 7825998 7108546
38728 7108546 4157982 -471500 -4172838 -6247274 -7388000 -7174608 -5101760 -2530059
38720 -2530059 -1070992 -439281 81633 -134393 -1150755 -728566 2713489 6745719 7493660
38711 7493660 4922015 2751460 3168097 4330023 3932879 2920723 3674017 5518278 4641727
38702 4641727 -538546 -5866814 -5735102 -336639 4232421 3645523 67674 -2232725
38694 -2232725 -2771601 -3677983 -5330370 -6638467 -7826898 -9365420 -9580649 -6963474 -3592839
38685 -3592839 -2557181 -3220458 -2974650 -2314957 -3618668 -6001158 -6473601 -5502558 -5941363
38676 -5941363 -6841250 -4466746 207430 1622488 -1433004 -3643401 -2044644 -443461
38668 -443461 -1891420 -3207141 -1190516 1434709 1159511 -107603 895496 2726450
38660 2726450 2490846 1440468 1992138 2562326 952204 -268781 2133062 5210136 3814318
38651 3814318 -301459 -549713 3759771 6023648 2784079 -1155530 -569542 2841776
38643 2841776 4442058 3777451 3619441 4453737 3980801 1243296 -1914194 -3518421 -3312916
38634 -3312916 -1567166 2015183 6991150 10850171 10775173 6943910 2627672 372473
38626 372473 -330396 -510518 828871 4074693 5747167 2010860 -5075922 -9173557 -7831470
38617 -7831470 -4665440 -2787034 -1194086 633787 37819 -3732288 -6451553 -4742562
38609 -4742562 -955729 1508062 3524109 6521725 7772618 5000369 2141256 4114450
38601 4114450 8364904 8367693 4002619 1444813 3153238 4878157 3407788 1010823 557715
38592 557715 1600854 3194610 5868808 8698415 8592270 4871150 1249318 1091170 3299317
38583 3299317 4581804 3503075 997856 -1114695 -1301761 209531 1023472 -517687
38575 -517687 -2795948 -3706075 -4441184 -6868995 -8799592 -6945279 -3658524 -4561825 -9116140
38566 -9116140 -10103862 -4179413 3437009 7369110 8874970 10566798 10416181 6233090
38558 6233090 1360214 8059 326014 -1932932 -5443568 -5350386 -1912549 -648782 -3583332
38549 -3583332 -6094274 -4009639 728743 3627200 3424611 1920667 492327 -558013
38541 -558013 -420194 1899170 5527833 7678874 6575837 3806405 2651885 4023595
38533 4023595 5440368 4814219 3493020 3554812 3726299 1444300 -1670225 -832229 4505475
38524 4505475 8765774 8028839 5616130 6532284 9715507 10164067 6674951 2953536 1968552
38515 1968552 3206825 4980639 5696853 3229367 -3003133 -9111827 -9735670 -4829641
38507 -4829641 -102399 382358 -1148308 -356193 3328650 6973608 8047503 6063250
38499 6063250 2081782 -1450536 -1726952 1581089 5258366 5795001 3099347 26033
38491 26033 -770655 1496957 5830983 9572229 9513399 4867933 -1216290 -4637980 -4473575
38482 -4473575 -2786801 -1111913 721905 2429936 2456993 303125 -2112495 -2709290 -1774817
38473 -1774817 -1107429 -1466048 -1950425 -1348581 791137 3940986 6729946 7843553 7371862
38464 7371862 6572424 5893218 4472493 2281517 949235 950584 -76790 -3680864 -6825454
38455 -6825454 -5277825 -204215 2521758 115987 -3794931 -4901616 -3555974 -2272851
38447 -2272851 -1254769 508811 1976782 1174194 -1602095 -4205199 -5220389 -4259375
38439 -4259375 -1317807 2096310 3070476 821929 -1855826 -2896723 -3882125 -5693654
38431 -5693654 -4957379 237294 4335537 910134 -6350336 -7109411 837640 8343552
38423 8343552 8566249 5737589 6042880 7159221 3580417 -2747189 -4924018 -1870283
38415 -1870283 671482 -673237 -3122636 -3657357 -3021335 -2281792 -277678 3068400 4703344
38406 4703344 2719551 26594 499106 3132421 3634583 1380953 848918 4666429 8585871
38397 8585871 6797142 584038 -2799791 -196761 3327463 2654852 207606 1012148
38389 1012148 3910375 3867045 1064230 598839 3280636 4124463 1466908 179061 2748403
38380 2748403 4252408 835965 -3117242 -2175905 1013172 592020 -2535486 -3003449 -560545
38371 -560545 256214 -1443962 -2247873 -1628907 -2426342 -3884157 -1582906 4289285 7532601
38362 7532601 5139432 1721220 1924552 4135457 5121765 5682259 7483911 8605366 6869579
38353 6869579 4370895 4083782 4487770 2260745 -1434770 -2250897 321849 1871912 -201337
38344 -201337 -2635663 -917123 4279290 7589283 5395446 -62711 -3643160 -3134478
38336 -3134478 -554838 1780466 3672463 4613336 2367019 -3102908 -7064547 -5583296
38328 -5583296 -1722521 -1151794 -2920347 -967203 5046066 7638607 2627369 -4302953
38320 -4302953 -6135756 -4051778 -3450688 -4909575 -4889620 -2667653 -981511 -1197071 -2353821
38311 -2353821 -3803816 -4977272 -4026855 -426900 2663774 2209171 -370032 -2131371
38303 -2131371 -3276354 -4675757 -3815597 1038632 5008807 1846039 -5921314 -9168981
38295 -9168981 -4732510 1168219 3092532 2862926 3508508 3449530 765199 -1759912 -375958
38286 -375958 3929180 7025872 6703618 3754589 331484 -1054587 580971 2713528
38278 2713528 2174243 376138 1462399 4779881 4858857 426915 -2998799 -2288964 -1568060
38269 -1568060 -3677971 -3833550 2031258 8731840 9136221 5090709 2948276 2371796 -1200138
38260 -1200138 -5810148 -4903483 741621 2883627 -1503012 -6413969 -7218884 -6220046 -5550050
38251 -5550050 -3009687 1628013 3881733 2096720 781054 2423173 2862700 -678240
38243 -678240 -3772157 -2335041 348786 120133 -437399 2451684 5887778 5355216 3204480
38234 3204480 4316909 7016483 6439467 3867531 3969670 4988006 1121701 -6117201
38226 -6117201 -8581856 -4288002 -344724 -1180605 -2583571 -558770 1980559 1626149
38218 1626149 646089 1892595 3258109 2179656 872580 2127154 3954671 3253458
38210 3253458 1305915 938376 1314968 209789 -1192637 -294305 2279145 4021366 4288648
38201 4288648 3132938 -570119 -5581514 -6285540 186150 7463655 7048379 392516
38193 392516 -3029576 657210 5298707 5090227 2275131 1412402 1926375 862577 -1005036
38184 -1005036 -668238 1810520 3833929 4874362 6667750 9248230 10305314 8969700
38176 8969700 7409003 7517899 8064214 6739451 3888200 2281456 3229805 4613558 3618072
38167 3618072 321613 -2627744 -3171816 -1332632 1692030 4021088 3275945 -1028736
38159 -1028736 -5142884 -4177789 1558679 6336892 6304418 3607876 1506993 -506719 -3477974
38150 -3477974 -4722972 -1459122 3896160 6908499 7540674 8286574 7890310 3181460 -3641654
38141 -3641654 -6341498 -3891485 -1947158 -3602079 -5020380 -2798336 282899 457135
38133 457135 -1018087 -1047043 90680 600184 801711 1199328 196631 -2501387 -3371113
38124 -3371113 -19022 4109373 4155942 733115 -1565251 -456913 2862742 6465363
38116 6465363 7831777 4003586 -3947175 -9143029 -6538793 -164331 2316439 -91858
38108 -91858 -2672919 -3883776 -5965986 -7781433 -5250183 204363 1550308 -3175006
38100 -3175006 -7129373 -4764883 616472 3072683 2070617 109347 -2593152 -6176127
38092 -6176127 -7928119 -5883287 -2560591 -918796 227228 2600078 3908228 2005774
38084 2005774 403506 3605862 9031653 9948072 5588531 2091191 3127070 5470258
38076 5470258 5158401 2903951 1302378 753926 550947 994643 2162406 2713064 1767083
38067 1767083 445603 294496 1454670 3091830 4388586 4817489 4652586 4988978 5891323
38058 5891323 5414876 2537948 -42368 1013982 4531690 6083086 4052936 879353
38050 879353 -1498081 -3248902 -3485324 -302645 4659124 6347584 3157314 -531654
38042 -531654 -1075834 -552168 -1949215 -3612118 -2646477 -438746 -48958 -626695 652699
38033 652699 2918054 2968529 1206550 1041835 2726715 2928480 851559 -279567 880162
38024 880162 1199165 -1420344 -4090035 -3509033 -1244676 -880408 -2092562 -1524390 1299736
38015 1299736 2856300 1086512 -1159364 -66386 3474181 4626046 992026 -3941403
38007 -3941403 -5041045 -1894621 1143790 945327 -932067 -1718076 -1901770 -3904942 -7584668
37998 -7584668 -9783942 -8356572 -4516806 -731856 2056612 4257679 5682082 4936629
37990 4936629 1167466 -3778242 -6016175 -3784297 -298855 -198228 -3294963 -5137927
37982 -5137927 -4506183 -5911881 -11896077 -17230309 -15703546 -9628647 -6484580 -7629974
37974 -7629974 -7181571 -2361315 1979134 1315594 -2089285 -3922427 -3956309 -3571837 -1525717
37965 -1525717 3042328 6548435 5114235 980202 -258710 1987190 2657097 -828569
37957 -828569 -4282438 -2470590 3854981 9020588 9196258 6068947 3842728 3919690 3622616
37948 3622616 333695 -4341545 -6183629 -3742278 159483 2763715 4661871 7316088
37940 7316088 9693063 9829119 8384260 8024500 9601949 10931044 9440494 4873272
37932 4873272 -499858 -3633137 -3160486 -585232 1697270 3502931 6330608 9676668
37924 9676668 10559283 7788867 3998953 1833937 910151 574534 2476399 7210537 11110490
37915 11110490 10344047 6396771 3570843 2666049 1472469 205763 1337023 4220414
37907 4220414 5038835 2958014 1696866 3544595 5976336 5983877 3956673 1205610 -2747443
37898 -2747443 -7770651 -11015578 -10195505 -6936382 -4294154 -2673146 -568214 2205890
37890 2205890 4339963 4896948 3542570 294740 -3307637 -4523877 -2802631 -1008897
37882 -1008897 -1138278 -959683 2145805 5961395 5964439 2171509 -699099 -10479 1841474
37873 1841474 2120592 1521436 1418100 720275 -1712164 -3779307 -2457699 1573603 4376902
37864 4376902 3526590 275214 -2803735 -4260424 -3896038 -2513940 -1884176 -3160807 -4901778
37855 -4901778 -4347891 -1122162 2129555 3372262 3466820 3891633 4313196 3917728 3180201
37846 3180201 2429733 553844 -2544876 -4054626 -1873178 1277332 1010992 -2158730
37838 -2158730 -3474440 -1251917 754465 -550802 -3185293 -3827654 -2625192 -1786065
37830 -1786065 -2026578 -2932740 -4626609 -6557738 -6526157 -3379933 801396 3223624 3407777
37821 3407777 1921882 -1657738 -7087710 -11769408 -13392838 -12684965 -11263536 -8798568
37813 -8798568 -4915147 -1743211 -1450162 -2969845 -4008404 -4213295 -3500583 -213678 5040893
37804 5040893 6780096 1244407 -6575101 -8513295 -4403784 -1196791 -1722723 -1734409 1100786
37795 1100786 2852684 576995 -2663675 -3586632 -3995223 -6312042 -8458254 -7554828 -5106715
37786 -5106715 -4174710 -4159844 -2447435 910510 3759722 5219207 5264341 2824222 -2323308
37777 -2323308 -7152448 -8171054 -5941898 -4279245 -5373492 -7532887 -7320359 -2910549
37769 -2910549 3844215 8351196 7828628 4860502 4018775 5356691 5109309 2943502 3187242
37760 3187242 7154747 9927827 8020972 4914894 4585737 4435743 286411 -5423226
37752 -5423226 -6772071 -3275040 440396 2211972 3699968 5342961 5772750 5630824
37744 5630824 6480916 6531863 3149102 -787341 644636 7025521 11013947 8636362 4088762
37735 4088762 2010724 943695 -1884133 -4265664 -2294747 3056237 7034613 7153762
37727 7153762 4807855 2259363 921287 1447879 2911706 2831407 253087 -2220077 -1694362
37718 -1694362 734791 1493258 -230149 -1471030 -43386 2319109 2611720 765288
37710 765288 -560106 139148 1429916 1609686 1428738 2422772 3563297 2229520 -1319498
37701 -1319498 -3312887 -1489493 1893059 3770813 4262950 4536923 3500305 158380
37693 158380 -2965181 -3021527 -1807118 -2686733 -3712370 215352 8039155 11877165 7823218
37684 7823218 1469199 -841516 -854828 -3469558 -7213503 -6210228 143859 5904267
37676 5904267 7057862 5682497 4590628 3068789 381505 -834223 1652084 5214965
37668 5214965 5569665 2867015 769779 283188 -1250611 -4623141 -6569671 -4988914
37660 -4988914 -2643985 -2722104 -3682265 -2329828 116204 -403966 -4124364 -7095667 -7359613
37651 -7359613 -6638632 -5449586 -1947082 2827687 4198336 1223920 -503434 2741121
37643 2741121 6750896 6691599 5587356 8800420 13570922 12083133 3739917 -3435435
37635 -3435435 -4150472 -1654293 -816099 -1688372 -2327959 -2925104 -4354938 -6113651 -7485135
37626 -7485135 -7899053 -5872774 -1344812 1362983 -1885023 -7500078 -7433944 -781962 4855469
37617 4855469 5247391 4776838 6554307 5985750 163271 -4130487 -61928 7296923 7850762
37608 7850762 1604696 -2572452 -1155413 867830 685864 1686547 4917962 5415171
37600 5415171 784876 -3647241 -2726423 1040960 2426970 1310160 773994 1078642 671080
37591 671080 685461 3239944 6527937 6420007 2650382 -764678 -1390546 -697951 106040
37582 106040 2494567 6891291 9833413 8033343 3565581 1670124 3809017 6055734
37574 6055734 4974564 2137369 1015663 1673649 1395730 -390878 -972967 1504073 5384369
37565 5384369 8042497 8938640 8687049 6841345 2630978 -2863733 -6992412 -7847953 -5458442
37556 -5458442 -1314357 2380305 3794225 2993227 1896618 1860936 2054341 1124744 -556772
37547 -556772 -1623442 -1784045 -1661820 -1289386 -407704 262352 -191190 -1035879 -527278
37538 -527278 1638187 3963191 5118435 4749047 2576832 -1246714 -4616263 -4525760 -752409
37529 -752409 3137358 3718649 1406744 -889972 -1367080 20475 3040451 6728143 8038542
37520 8038542 4191928 -2712735 -6283375 -3012573 3253027 6464312 6110018 6371356
37512 6371356 8694836 9814204 7826331 5560847 5521441 5392071 2124597 -2312572 -3358063
37503 -3358063 -358523 3282261 5316469 6148341 5950334 4315484 2510111 2254347 2342029
37494 2342029 80822 -4231464 -8078337 -11180557 -14357983 -14631194 -7904825 2564726
37486 2564726 7412247 3632127 -778498 1347234 6074676 5478761 -97602 -3786334
37478 -3786334 -3064109 -1817418 -2787512 -4274760 -4428263 -3717808 -2592702 -598385 1747106
37469 1747106 3160093 3495590 3034237 1088263 -1867805 -2485067 1332943 6085940 6538202
37460 6538202 2843491 -245476 -296975 872214 1389372 1191856 282917 -868492 -77134
37451 -77134 3273696 5125930 1899113 -2728311 -2245933 2446794 4306626 1661075 450479
37442 450479 3276054 4495414 100486 -4807619 -3823094 991907 2863656 -163757
37434 -163757 -4696356 -7610588 -7316882 -2660476 4360020 7670791 4195838 -629362
37426 -629362 151777 4760767 5487490 316317 -4829499 -5417251 -3532086 -2617252 -2692730
37417 -2692730 -2910652 -4051850 -5783915 -5258239 -1304591 2929135 4172399 3274358 2659652
37408 2659652 2098339 211048 -1730054 -1212563 1076997 1720738 -447716 -2875813 -3332191
37399 -3332191 -2598505 -2135311 -1753677 -1291871 -2225885 -5125345 -7197018 -5428596 -1385701
37390 -1385701 456712 -761547 -943977 2590060 6580360 5923466 176939 -6276468
37382 -6276468 -8972799 -6327268 293807 7028692 9632178 7780207 5926534 7304251
37374 7304251 8906160 5911661 -536791 -4502117 -3503401 -681851 1453987 4144129
37366 4144129 7783810 9347698 7278615 4969102 6020741 8959220 9935094 8378279
37358 8378279 6725935 6147514 5505057 3626626 499020 -2859310 -4446640 -2900355
37350 -2900355 -179047 -123323 -2935845 -4328308 -2251528 -561842 -2551956 -4795750
37342 -4795750 -2572157 1592694 1274998 -3281183 -4991517 -1009721 2758218 801275
37334 801275 -3905596 -4835664 -1038659 2912140 3677080 1797838 -991880 -3229081 -2936950
37325 -2936950 1136626 7005170 10781416 11223612 10795166 11405545 11304165 7840455 1790342
37316 1790342 -3199370 -4915641 -4283005 -2858573 -979786 689478 58654 -3694564
37308 -3694564 -7452709 -6806352 -1416322 4463267 7211255 7414705 7327048 6990795 4979060
37299 4979060 1953245 1092151 4372941 9545977 11801043 8697614 3166508 875556
37291 875556 4229889 9799819 12391208 10513671 6536860 2902993 627305 624747 3260878
37282 3260878 6377402 6798084 4447007 2191589 1080150 -937004 -4496035 -6725934
37274 -6725934 -5708834 -3739840 -3514299 -3834628 -2050921 1393268 3743695 3601460 1489472
37265 1489472 -1304735 -2336261 920468 6909062 9779503 6729254 2630981 3074703
37257 3074703 5583902 3377924 -3696396 -8322931 -5990686 -344430 2913454 2382006
37249 2382006 -466703 -4336648 -7189469 -6119221 -1197321 3086909 2834621 -698755
37241 -698755 -3557093 -4129633 -3554363 -2711297 -1370693 117751 244543 -2059047 -5739347
37232 -5739347 -7838547 -6030936 -1512268 1567071 709231 -1909614 -2535545 -677452
37224 -677452 1273536 2002346 2109393 1900974 1277138 1090297 1673271 1097014 -1636410
37215 -1636410 -3116224 69425 4532343 3672828 -1878993 -4215179 -70898 4378890
37207 4378890 3842790 1909675 3552547 5897733 3552814 -1173053 -1349812 3392079
37199 3392079 6536495 5056632 2814057 2750378 2445838 -299826 -3151407 -3700211 -3880173
37190 -3880173 -6272877 -9030509 -8221169 -3575807 1279770 3478771 3292385 2369155 1726502
37181 1726502 1439221 848564 -878658 -3404744 -4825467 -3729954 -1231242 405301
37173 405301 870471 1755420 3114317 2383825 -1539691 -4986765 -3467302 1488289 3430250
37164 3430250 283252 -1751868 2756882 9061661 7885782 -768005 -6554160 -2969309
37156 -2969309 4247702 6562076 4414195 3773218 5388100 4882906 1696559 412846
37148 412846 2880900 5696981 6979679 9454808 14135768 16424319 12449015 5341137
37140 5341137 1112621 1222621 3121346 5429435 8039685 8964833 6046000 1213515
37132 1213515 -1366347 -1168122 -1031651 -1148407 1562255 6949849 9831619 7481195 4337928
37123 4337928 5310331 8142721 7571527 4641708 5774242 12773786 19403672 19316704 13052155
37114 13052155 5504066 359397 -908393 1825997 6437153 9397292 9813754 10070651
37106 10070651 10720275 8579890 2840444 -1257560 390327 3492518 1376224 -4291310
37098 -4291310 -6057589 -2893038 -1652843 -5247341 -7603418 -3836089 1802748 3200836
37090 3200836 1767774 2423420 4561162 3907380 857984 -48252 1777218 1815319 -2050262
37081 -2050262 -6281004 -7256940 -5694630 -3965932 -2789547 -2387388 -3736482 -6535781
37073 -6535781 -8193181 -6801937 -3674980 -1629173 -2027263 -4279475 -6788180 -7740637
37065 -7740637 -6537876 -4989128 -5405609 -7087566 -6786473 -3337993 547430 2302712
37057 2302712 2804253 3724012 3934813 1569164 -1662126 -1782929 1674203 4446641 3351573
37048 3351573 729399 972677 4334946 6903724 6077142 3140358 95084 -2988444
37040 -2988444 -5998757 -7067608 -5510847 -4282714 -5945976 -7668274 -4685321 1654324
37032 1654324 4523394 1456145 -1860955 -546403 1819604 -588538 -5635708 -5682612
37024 -5682612 862215 6748156 5705435 10110 -3995980 -4241687 -3800137 -5327713
37016 -5327713 -7468404 -6828283 -2268876 3376786 6232190 5812478 5107894 5833937 6021463
37007 6021463 3994571 1994742 2755059 4712687 4575766 2921106 2567397 2619805 -206009
36998 -206009 -4474532 -4570858 283671 3877032 2618086 1194243 4316428 8253748 6676641
36989 6676641 1225438 -829437 2070049 3932700 1302731 -1366670 939540 6017028
36981 6017028 7862605 4951901 1089487 -625127 -727088 -234506 1695148 5186856
36973 5186856 7394382 5823353 2784395 3063162 6851014 8612456 4749312 -984032
36965 -984032 -2932532 -1791990 -2905940 -7509372 -10812194 -9353404 -5481574 -2814051
36957 -2814051 -1427612 -78127 312172 -1387858 -3437669 -3260713 -1133973 646694
36949 646694 967734 100588 -1833477 -4289841 -5413978 -4025370 -1632510 -587115 -1193179
36940 -1193179 -2353074 -3821639 -5761901 -7049185 -6174990 -3458435 -860355 47304
36932 47304 -803862 -1944425 -1116816 2167246 4560418 2199631 -3149026 -5048955 -1279599
36923 -1279599 2637941 1989053 300323 3062103 7785381 7322230 1502997 -2047398
36915 -2047398 626590 4406789 3543389 -183516 -1394806 752946 2533052 1812671
36907 1812671 619915 1787013 5178680 7756699 6988388 4039848 2750713 4804217
36899 4804217 7552297 8260631 8287595 9880487 10801874 6961147 -87889 -3585518 -604608
36890 -604608 4083543 5025850 2674098 558244 -148760 -60840 1247802 3863696 5445469
36881 5445469 4024948 1599943 1793946 4694050 6813483 5956824 3820893 3504637 5915295
36872 5915295 9038649 10250917 9277797 8479141 9409752 9982360 7153215 1981574 -1009290
36863 -1009290 -32763 1566203 371378 -2655757 -4554633 -4482843 -3436302 -2329024 -2434072
36854 -2434072 -5172975 -8998404 -9077380 -3307266 3356552 4268722 -355360 -4019860 -2824541
36845 -2824541 -86546 -1038492 -5549843 -8157786 -4802362 1837891 4714859 366256
36837 366256 -6766663 -9571329 -6689501 -2915915 -1834519 -2072637 -1430948 -218080 1280628
36828 1280628 4147289 7025235 5506970 -1012745 -6061217 -4176686 1390303 4118248
36820 4118248 3885090 5042302 7419399 6375592 978171 -4617838 -8015325 -10546355
36812 -10546355 -12082426 -10289363 -6165704 -4126539 -4861875 -4056951 -328024 1647022
36804 1647022 -1001720 -4013575 -2565788 1577763 3924243 4366164 5732104 8130785
36796 8130785 9334739 8841350 7622939 5544433 2486492 276443 263724 896316 880012
36787 880012 2335776 6902838 11001569 9875912 5092830 2877732 5214006 7615890
36779 7615890 6468491 3840009 3153552 3947983 3658264 2190701 1937798 4177638 7456920
36770 7456920 9416262 9211966 8092060 7843243 8680414 9039721 7667604 5071087 2374728
36761 2374728 -45286 -1828365 -1969252 -419683 949232 858661 938099 3340126 6972480
36752 6972480 8585763 7098044 4391161 2161579 518853 -435779 -318288 10996 -834858
36743 -834858 -2133805 -1664530 499875 1524792 231314 -650968 1529733 5120539 6210991
36734 6210991 3888070 1270290 1386141 3625221 4829584 3110202 -292934 -3095998
36726 -3095998 -4977506 -7108098 -8947473 -7980331 -3884590 -476937 -997324 -3408108
36718 -3408108 -3685090 -2283992 -3043373 -6130888 -7041031 -3685755 265036 1454664 2084614
36709 2084614 5588099 10041331 10140040 4644051 -1745249 -3988440 -1833304 859914
36701 859914 502037 -2546452 -4190427 -1232100 4244420 7146427 6399319 6532578 10581489
36692 10581489 14880165 14171293 9185065 4964440 3368851 1917616 -543422 -1952479
36684 -1952479 -1539648 -1768938 -3947090 -5427175 -3624762 -302759 795144 -920787
36676 -920787 -2592187 -2101705 -510463 -250777 -2155934 -4561847 -4802509 -1543298 3978811
36667 3978811 8799589 10297800 7878260 3474533 442152 713719 2482482 2002655
36659 2002655 -1560247 -4693991 -4093742 -770045 2065885 3169603 3016513 1533830
36651 1533830 -759749 -1153373 1949855 5560118 6141510 5749557 8876237 13875004 13918251
36642 13918251 7393828 850404 -583833 617615 901854 1888544 5355855 7683766
36634 7683766 5401060 1972225 2550958 5334245 4952379 1772320 431996 872685 -1239528
36625 -1239528 -5651898 -7128521 -4589354 -2728293 -2913405 -674068 4555675 5267174
36617 5267174 -3124026 -13454828 -15492847 -9089660 -2289819 321580 610123 277254
36609 277254 -1674699 -4771963 -6183306 -5121093 -3836119 -3330653 -1961904 629222
36601 629222 1847703 87602 -2430950 -2632949 -584614 1057904 532713 -1116963 -1137133
36592 -1137133 1878873 5300488 3846754 -4329696 -13564618 -15476194 -8300760 1011991
36584 1011991 4833219 2556288 -1080509 -2930228 -3937387 -5520242 -6413429 -4395109
36576 -4395109 87494 3667225 3688454 1123435 -825220 -348914 1751492 3807092 4543058
36567 4543058 2904041 -986127 -4177620 -2912358 2223188 5658400 3532766 -1124302
36559 -1124302 -2593093 -18672 2471138 1978783 -378751 -2376483 -2829265 -791621
36551 -791621 3921034 8730693 9848756 6868451 3423705 2464975 3115075 2910369 951765
36542 951765 -1896033 -3964355 -3560267 -879199 848144 -1246670 -5076516 -5627306 -2017526
36533 -2017526 1167160 723210 -881298 -102734 2330340 3371233 2172672 -47945
36525 -47945 -2263667 -3210395 -1098571 3551673 7016034 6945421 5454511 4886648 3457603
36516 3457603 -999570 -5576673 -5568562 -1775377 696558 473993 1437743 5577953 9414463
36507 9414463 9337949 6313516 3021914 12469 -2434762 -1714934 3921554 10881750 12640483
36498 12640483 7081808 -893599 -4889399 -3610302 -883190 -93545 -490554 351848
36490 351848 2137969 2332719 799252 845373 4100473 7058118 5589288 1217696 -549806
36481 -549806 2435001 6700100 8423022 7732581 6814080 6453259 5946479 4629327 2243527
36472 2243527 -885178 -3269910 -3280983 -1411343 -117459 -800638 -2331149 -3050590 -2751438
36463 -2751438 -2214547 -2374180 -4374717 -8596223 -12872591 -13517916 -9248247 -2757772 2354675
36454 2354675 4772800 4998658 3627163 1268229 -1290759 -3898724 -6673951 -8200562
36446 -8200562 -6130235 -757916 4143815 5778166 5652395 6395256 7217205 5495730 1725143
36437 1725143 -534377 289547 1815333 1608961 479958 407870 1111595 775238 -634566
36428 -634566 -907708 1241503 4059193 4775448 3060179 1374474 1903964 4041829 5288719
36419 5288719 4117083 1573749 281026 1779231 4427833 4527727 774041 -3108605
36411 -3108605 -2630120 707095 711429 -4002097 -6389356 -756446 7658531 8876232 1982861
36402 1982861 -4203577 -4146671 -1814024 -1976392 -2745187 -1171979 -138165 -3461709 -8099521
36393 -8099521 -7935186 -3381183 -856030 -3232563 -6537100 -6667839 -4457378 -2793818
36385 -2793818 -2648408 -3500977 -4805105 -5811611 -6140743 -6891268 -8746640 -9192771 -5056189
36376 -5056189 1856484 5642490 4155160 2066634 3830624 7156320 6848480 2660330
36368 2660330 -585031 340870 3786992 6391345 6563758 4550261 1597198 -280461
36360 -280461 230041 1757885 1604508 -172377 -250274 2842143 5318340 2754501 -2999814
36351 -2999814 -5292356 -1583019 2909753 2590524 -885322 -2161448 -1080956 -2687216
36343 -2687216 -8318160 -12286754 -9903170 -4506720 -2780394 -5796929 -8729168 -7903802
36335 -7903802 -4237520 -399165 1748773 1026413 -2261735 -5025540 -3991806 -196582
36327 -196582 2020747 1145397 401439 2243303 4225392 2888731 -615535 -2018073 2134
36318 2134 2456211 2913644 2909038 5110718 8882350 10775660 9045624 5614934 2923864
36309 2923864 830603 -1468428 -1962818 2267334 9378080 12759853 8936804 2684385
36301 2684385 1204375 5140999 8960595 9033309 7163797 6121887 5877994 5557259 5685206
36292 5685206 6525950 6662084 5187948 3437501 2777693 2414556 1257270 406688 1495613
36283 1495613 3376981 2835872 -1171631 -5600708 -6312098 -2303125 3506630 7355887
36275 7355887 7921150 6357598 3889309 786496 -2128864 -2860568 -454802 3420201
36267 3420201 6445076 7910425 7779081 5630381 2735416 2721162 6590685 9098685 4873606
36258 4873606 -2881564 -5387517 -224912 5575636 5787794 2360268 -174526 -1770461
36250 -1770461 -3905030 -4350855 -603479 4410095 5664989 3339887 1630407 1581815 443850
36241 443850 -2265338 -3377758 -1489724 785431 1273003 1167258 1993774 2850965 2405519
36232 2405519 1097915 -270800 -2016131 -4062489 -4785837 -3054686 -227566 1344014
36224 1344014 1147826 905659 2531524 6010241 8859246 8016538 3312726 -1227730 -984657
36215 -984657 4257496 10079547 12115617 9743168 5387861 1858108 583106 1003820
36207 1003820 1257799 379891 -291957 1027847 3766929 5584629 5489359 4680625 4410658
36198 4410658 4706137 5092310 4837528 2767386 -1018362 -3461566 -1305560 4047825 7287745
36189 7287745 5790100 2631423 1448275 1184320 -1275407 -5221748 -6445559 -3171227
36181 -3171227 1374254 3132042 1827218 145547 -329238 -607239 -1919111 -3480335
36173 -3480335 -3638031 -2525415 -2039871 -2841281 -2757285 671427 6736570 11820288 12873834
36164 12873834 9903235 5500324 2726270 2831840 4110777 3616761 830137 -1451420
36156 -1451420 -984454 683028 776736 -271570 370295 3403532 6495338 7708171 7162735
36147 7162735 5376299 2687390 383021 -374143 -738422 -2296441 -3199529 -106106 5600505
36138 5600505 8148899 5496315 2504120 3513411 6257482 6705219 5792934 6562648 7759132
36129 7759132 5891033 1970571 530995 2400138 3744076 2582801 1175346 871809
36121 871809 -502196 -3968739 -6189545 -3845607 1576406 6106874 8203291 8730921
36113 8730921 8003845 5902388 3880399 3877311 5423169 6244573 5847438 6337092 9258131
36104 9258131 13568656 17516971 20701754 22890497 22282858 17293928 9974393 5427651
36096 5427651 6689199 11431215 14938702 15302710 14116513 12933584 11456164 9470367
36088 9470367 8228024 8665699 9760439 9961608 9242231 8657781 8817848 9782551 11505768
36079 11505768 13396714 14426688 14606427 15208669 16528744 16863188 15108530 12920384
36071 12920384 12454374 13167490 13002005 11953665 12228424 15051016 19024773 21502381 20501528
36062 20501528 16144000 11468571 10480540 13697033 17119963 17547545 16876687 18381660
36054 18381660 20966342 21154982 19222662 18492104 19233509 18628745 17018707 18347040 22837079
36045 22837079 25011160 21987476 18722216 20986869 27031014 30670663 29858197 27737207
36037 27737207 27083480 27879421 29214167 29952266 28450362 24781556 22247385 23721651
36029 23721651 27618828 30394609 31633565 33320747 35373308 35819355 34943226 35539949
36021 35539949 38893981 43426288 47227967 49320098 48972842 46648153 45051470 46419853
36013 46419853 49533150 52108485 54522170 57651578 59192489 57100879 54908693 57319003
36005 57319003 61438498 59928860 53419872 51255664 57011549 61717342 56941840 47704128
35997 47704128 45286055 51934117 60082874 63672843 62897374 59509762 54771709 52014667
35989 52014667 54876261 61819016 66895707 66638321 62560041 57204783 52026459 49050208
35981 49050208 49982392 52958852 54050352 52464534 50628099 49187328 46240767 41884182
35973 41884182 39015949 38718377 38944092 38548812 38444237 38179498 36120847 33814756 34797015
35964 34797015 37718869 36692424 30911640 27618146 31608567 37640299 38323586 34510860
35956 34510860 31937794 31689933 30643699 28481168 27435837 26778081 24068320 20853798
35948 20853798 20851782 23091999 23107121 20743730 20422366 23220287 25096033 24023358 22493558
35939 22493558 21334699 17774607 12425606 11517519 17742238 24350871 23624421 17050103
35931 17050103 11681616 9912851 8941668 8013087 9507628 13224275 15578166 15429545
35923 15429545 15860011 18704923 21419257 21283603 19321695 17687806 15829457 12155142
35915 12155142 8050544 7145819 10448073 14450414 15172342 12892483 11295931 12084776
35907 12084776 12442912 9344482 4966691 4882165 10564658 16656518 17335916 13128595 9180703
35898 9180703 8568722 10153928 12057859 14012775 15938224 16766800 15754141 13607890
35890 13607890 11723225 11203509 12543420 14932724 15828267 12750017 6110941 -556589
35882 -556589 -3466809 -1269793 4450853 10158847 12382389 10465818 7414055 6671192
35874 6671192 8147555 8930705 7752210 6609912 7317430 8494089 7514561 4280470 1352741
35865 1352741 645215 1410936 1808281 1411739 1260623 1792631 2089233 1842204 2729068
35856 2729068 5991973 9346627 9053633 5516636 3774585 6782168 11002882 11269481
35848 11269481 7733486 4710663 4274756 4781766 4951166 5522051 6834186 8204291 9829547
35839 9829547 11962022 12188130 7466790 -415544 -5316218 -3878809 1296968 6519511
35831 6519511 10768135 13090165 11289380 6483565 4626907 9108552 14976679 15107299
35823 15107299 9638593 4423583 2090281 206538 -2426950 -3501141 -2164293 -1328884
35815 -1328884 -3047279 -5197091 -4827135 -2051508 1244296 4200324 6570873 7423179
35807 7423179 6193326 3798347 1203295 -1964441 -5989825 -9330151 -9851980 -7325517
35799 -7325517 -3561954 -462352 1141955 1124411 -291114 -2287339 -3641015 -3856824 -4018151
35790 -4018151 -5722873 -8710305 -10429623 -9178839 -6901512 -6755358 -8215408 -7686466
35782 -7686466 -4726655 -3853772 -7654276 -11581766 -9740139 -3566898 199024 -763192
35774 -763192 -1996732 -35699 2755259 3031207 1620848 799684 -168086 -3013014 -5970660
35765 -5970660 -5207109 -395118 4218357 4979442 3052662 2351632 4264406 5993917 4604425
35756 4604425 1424965 420150 2263108 2889730 -539086 -5071254 -6149038 -3952812
35748 -3952812 -1829745 -337031 2424877 5633470 6292457 4920775 5192153 7272389
35740 7272389 7269240 4601958 3759544 6495416 8665497 8080131 8810814 12884764 14169800
35731 14169800 7219761 -2914396 -7351011 -5970187 -5052358 -5227666 -1371148 6050142
35723 6050142 9310699 5246400 515596 1524181 5590440 6179875 1965877 -3286812
35715 -3286812 -6133309 -5392408 -1840641 1289582 474228 -3252720 -4841206 -2492559
35707 -2492559 -406675 -1866209 -4030124 -3133148 -695745 -56879 -185799 1807362 4420332
35698 4420332 3632424 -145187 -2303037 -883819 1600209 3122963 4122034 4184358 1801727
35689 1801727 -1317551 -682124 3963699 6728280 4017269 624688 2546611 6850698
35681 6850698 5192733 -3225947 -9078490 -5372922 3351424 8278704 8103301 7737496
35673 7737496 8167347 5256618 -1011961 -3791726 690254 6506414 6439682 2501042 1762577
35664 1762577 4699379 5146613 1127028 -1955312 -478972 1887640 1017692 -960262
35656 -960262 66 3021841 4403070 3583042 2524161 1382824 -706770 -2154006 -815165
35647 -815165 1480917 768540 -2921221 -5525936 -5267874 -4675253 -5339879 -5018807 -2151254
35638 -2151254 441242 -330882 -2398158 -998904 4297411 8576925 7932938 3922552
35630 3922552 632097 -298239 -46299 50612 -844423 -3794954 -8476163 -11226012 -8214174
35621 -8214174 -1319064 2758911 1070993 -1475419 513732 5019669 6600717 5492940
35613 5492940 6626559 10581714 12281800 9611927 6791436 6711012 5943577 1260487 -3880987
35604 -3880987 -4239645 -711781 1523899 381429 -2118059 -4299417 -5954201 -6414985
35596 -6414985 -5512110 -5251458 -6837773 -7378434 -3441880 3306026 8053199 9424892 9946085
35587 9946085 10674695 9806681 6600225 2684793 -676459 -3048613 -2863653 948475 5419007
35578 5419007 5945391 2653159 120128 221110 -111582 -2801685 -5176863 -4973878 -4564145
35569 -4564145 -6922622 -10389278 -10834122 -7221279 -2245003 1194698 1809235 -541263
35561 -541263 -4729461 -8244721 -8995954 -7281311 -5183572 -4272853 -4322898 -3942582 -2332521
35552 -2332521 -538045 -293518 -1309621 -1311715 167012 316107 -2401010 -4636992 -2651009
35543 -2651009 1375710 1917286 -1839768 -5116577 -4550896 -1483390 1952246 5157611
35535 5157611 6645066 4183216 -928347 -3882600 -2367323 1071754 3654158 5152464
35527 5152464 5162256 2655185 -161278 973961 4959465 4809445 -2099316 -8882052 -8642143
35518 -8642143 -3939489 -1435256 -1585823 -80315 3487141 5120050 3313631 625619
35510 625619 -1129143 -2323867 -2497367 -390869 2892298 4480223 3677781 2530644 2782555
35501 2782555 4580219 7181223 8672384 6604054 1457395 -2407648 -1935699 712303
35493 712303 2127321 2495045 3026527 2165364 -799076 -1591927 3608668 10922879 13314905
35484 13314905 10672089 8594119 8352318 5706507 -33915 -3475098 -1466004 2680540
35476 2680540 5482722 7735487 10261952 11077807 9695386 8893698 9189473 6888340 1117257
35467 1117257 -2598239 -314948 3482898 2390711 -2231374 -4010978 -1568709 558246
35459 558246 244598 863492 4779873 8613816 7721608 2693241 -1504041 -1956535 -905540
35450 -905540 -1838156 -4224825 -4265316 -831458 1970559 23275 -4942449 -7552049 -5787887
35441 -5787887 -2558157 -727267 -161791 -80990 -802134 -2001600 -2170179 -1095876 -513481
35432 -513481 -1319212 -2392612 -2804355 -2809524 -2337652 -1242734 -1167642 -3795956 -6985021
35423 -6985021 -6624046 -3107109 -1603465 -4511969 -8134337 -8754699 -7383036 -5896025
35415 -5896025 -3254802 737821 2084948 -2413395 -9571369 -13393556 -12148068 -8383240
35407 -8383240 -4225206 -344561 2387736 3771882 5178620 6763555 6068112 2296669
35399 2296669 -916877 -619578 511463 -1434404 -4924927 -5472359 -2666533 188894
35391 188894 1727767 2902217 3321705 2247872 1717250 3416554 4078947 -25543 -5404937
35382 -5404937 -5165075 -132072 1500601 -3313167 -8049810 -7236204 -4139571 -3839934 -5048273
35373 -5048273 -4122890 -2358146 -3325493 -5947849 -5815113 -1896127 2561276 4784051 4439076
35364 4439076 1931654 -1774421 -4426384 -4661221 -4209299 -5194481 -6239701 -4346430 35941
35355 35941 3139890 3081199 1862035 1657682 1860441 918616 -1063016 -3097837 -5305996
35346 -5305996 -8378221 -11438255 -12021310 -8881207 -4055640 -909361 -33417 1437287
35338 1437287 5499548 9891510 11062909 9351460 8214796 8632084 7829120 4331228
35330 4331228 631142 -948175 -1639758 -2910588 -2901522 226273 3747377 3534979 625395
35321 625395 85788 3304502 5784148 3794837 -520157 -2711285 -1894476 -633761 -744569
35312 -744569 -1636137 -2049181 -1596333 -847997 -877941 -2140867 -3194511 -1826808 1489626
35303 1489626 2892692 -155087 -4651746 -5198014 -961398 3425153 4366820 3575798 4180034
35294 4180034 5359874 3890051 -421769 -4261614 -5606110 -5830214 -6393224 -6341774 -4547074
35285 -4547074 -2121250 -859964 -1076899 -2611967 -5944069 -10045209 -11091630 -6588768
35277 -6588768 141516 3039640 806102 -1952270 -1484777 577514 726929 -1474347
35269 -1474347 -4068440 -6041908 -7516368 -8012200 -6933976 -5107234 -3862083 -3035319
35261 -3035319 -1573636 291082 1196795 878477 661078 1501092 2751153 3176634 2250770
35252 2250770 152434 -2616049 -5005656 -5371130 -2650445 1893476 4624768 2592478
35244 2592478 -2654742 -5605895 -2867956 2053063 2485728 -2918785 -8360535 -8494906
35236 -8494906 -4732886 -1796976 -853009 378099 2315811 2617607 643454 -1015193
35228 -1015193 -630779 77486 -900577 -2561290 -2750272 -1512698 -324061 819179 3038839
35219 3038839 5649168 6024578 3104551 -569678 -1435498 1157577 4471017 5541467
35211 5541467 4037524 1832366 358812 -894094 -3108464 -5944216 -7316214 -5458482
35203 -5458482 -865142 3876212 5979393 4489242 1115515 -959081 90820 2775985
35195 2775985 3781335 1648135 -1824213 -4171359 -5044485 -5422262 -5263625 -3844512 -1978005
35186 -1978005 -1594934 -2621824 -2489176 -20460 2138284 1002115 -2251431 -3921231
35178 -3921231 -3286321 -3340809 -5546980 -7016674 -4759725 -459010 1473565 -595719 -4280612
35169 -4280612 -6697053 -6930519 -5354242 -2862859 -997195 -728372 -636607 1792295 6419919
35160 6419919 9863012 9556739 6675292 3843662 1694430 -448570 -1669350 244801
35152 244801 5298904 9787017 9414708 3767190 -2725794 -4643929 -861775 4135648
35144 4135648 4966937 1293593 -2136870 -1496379 1860916 4072534 3846391 2912269 2536435
35135 2536435 2062527 901807 -124625 1654 1370643 3631425 6245215 7868640
35127 7868640 7038851 4287730 2210064 2359759 3278648 2939780 2047645 2995883 6018401
35118 6018401 8527037 8527100 6640458 4014864 427394 -3864480 -6246449 -4398174 -75947
35109 -75947 2534751 2196160 1511110 2022164 1692244 -1169309 -4505678 -5530230 -4711186
35100 -4711186 -3824276 -2245190 1098503 3746738 2243360 -1900963 -3548693 -1563188
35092 -1563188 -186832 -1621855 -2410553 230020 3248943 2753757 341860 -111223 811699
35083 811699 -417111 -3674212 -5268782 -4154898 -3193608 -3671064 -2855224 1515030 7409244
35074 7409244 10723100 9339013 4202975 -1777958 -5422958 -5556414 -3788153 -1713164
35066 -1713164 1655992 7341138 12569680 13177256 9613816 6729650 7110656 8293317
35058 8293317 7389542 4825903 2333833 670366 540920 2349214 3917294 2286353
35050 2286353 -968031 -718859 3558385 5742832 2194216 -2450708 -3109056 -2728744 -6557861
35041 -6557861 -11800379 -10907275 -3724414 1668172 916011 -1152031 549627 3114832
35033 3114832 373239 -7794176 -14870405 -15121045 -9313635 -3603267 -3268854 -6743789
35025 -6743789 -6869242 -108881 7383035 6953330 -595064 -5853492 -3737227 800208
35017 800208 1753439 258662 183396 1188637 1075286 753035 1749654 2237271 605610
35008 605610 -351976 1643288 2538686 -2296406 -9027613 -9806689 -5061309 -2851340 -5584686
34999 -5584686 -6529974 -2236994 656924 -3523650 -9186836 -7760107 -1159763 1537832
34991 1537832 -1744058 -3962565 -816488 3394213 3799181 2144420 2490137 4660516
34983 4660516 5929828 5747908 4900202 2683929 -1018285 -2952764 -361620 3422521
34975 3422521 2156151 -4264736 -8738864 -6500309 -1263159 993233 422484 1108254
34967 1108254 3154939 2719560 -530132 -1908319 714419 3089907 1536241 -702147
34959 -702147 1298287 5553976 5579643 277057 -4470009 -4620322 -2741757 -2003458 -731440
34950 -731440 3279624 6986846 5569763 -195695 -4661554 -4789329 -2901685 -2046420 -2446375
34941 -2446375 -3248321 -4411495 -5503041 -5189174 -3349169 -1765409 -1708275 -2807609 -5044515
34932 -5044515 -9142999 -13489721 -13670095 -7981570 -1386643 -438324 -5089503 -8999535
34924 -8999535 -7919977 -4288941 -2561953 -3142642 -2987453 -231740 4001303 7360742
34916 7360742 8059271 5714244 2037515 68311 1193454 3483681 4422492 4399403 5405266
34907 5405266 6927191 6125068 2629347 182932 1743240 5102437 5668710 2344354
34899 2344354 -1625183 -2965080 -1477854 675534 813176 -2721245 -8631471 -12443372
34891 -12443372 -10686397 -5662197 -3504732 -6607444 -10535944 -10037545 -5769165 -2672984
34883 -2672984 -3324820 -5812678 -7554418 -8180436 -8133980 -6948369 -4363688 -1792927 -1150288
34874 -1150288 -2516191 -3845874 -3030942 94563 3797586 6297402 7319686 7544548
34866 7544548 6916450 4677667 1418660 -387192 765561 2977410 3097308 930712
34858 930712 -535706 815163 3802092 6117638 7216431 7975043 8762006 9195287 9082008
34849 9082008 8305304 6186636 2254179 -2326673 -5155155 -4798715 -2036512 1243921
34841 1243921 3727500 4907775 4375851 1941233 -1334348 -3118678 -1845896 1205040
34833 1205040 2785731 1201661 -1633023 -2482265 -788262 753025 -163115 -2404955
34825 -2404955 -2998556 -1192692 448300 -628669 -3604295 -5189338 -3379655 826283
34817 826283 5322014 9011906 11416379 11622722 9163064 5289314 1834518 -852754
34809 -852754 -3301652 -4689533 -3463788 -483618 937352 -640082 -2524235 -1807273
34801 -1807273 83454 -855778 -5517490 -9964140 -9639812 -4082534 2562130 4984434
34793 4984434 1268571 -4983187 -7715170 -4566756 875958 3801285 3495823 2292169
34785 2292169 1124690 -853490 -3202699 -4253298 -4290439 -5314644 -6901524 -5615933
34777 -5615933 -221916 5196577 5647031 1264341 -3108917 -3571704 -842002 1239977
34769 1239977 -184995 -4139754 -6719262 -5380041 -2079081 -900981 -2913764 -5388252
34761 -5388252 -6047368 -5337311 -3820484 -566983 3928984 6128507 3748242 -129707
34753 -129707 -487210 2960394 5556834 3886857 -626341 -4470614 -5803606 -4787492
34745 -4787492 -2397426 -137934 456053 -684627 -1798512 -1296602 193833 448696 -1610151
34736 -1610151 -4140606 -4014808 -793061 1723608 -235956 -4555493 -4434258 2821110
34728 2821110 10739760 10717986 2875046 -4041331 -3739645 675948 2460131 275430 -1745413
34719 -1745413 -879333 1137263 1696801 615086 -1048973 -2974102 -4973284 -6123421
34711 -6123421 -5998100 -5564542 -5475786 -4685987 -2434201 -403323 -566893 -1629730 -538766
34702 -538766 2446423 3531259 1272750 -728050 713706 3147229 2060777 -2255111
34694 -2255111 -5292301 -4960668 -3677731 -3540877 -3064382 -143941 4210204 6721086 5221107
34685 5221107 507391 -4154581 -5423691 -2993754 182587 2070706 4497639 9585070
34677 9585070 15001592 16440455 13635535 9585040 4811884 -2014051 -7847374 -6483026
34669 -6483026 2024425 9523422 10348983 7672896 5668971 2070601 -5608265 -12202271
34661 -12202271 -10999480 -4341043 -507576 -2117655 -4966708 -6820644 -9344229 -11401064
34653 -11401064 -8554913 -1047519 4606050 4581312 2596613 3119552 4966688 4944371 3457115
34644 3457115 2730158 2526480 1124085 -1342083 -3049771 -2639663 52364 3610507 4904152
34635 4904152 2049385 -2005354 -2248494 1294693 3251300 971446 -1725176 -1280872
34627 -1280872 -178874 -2132895 -5277104 -4987705 -1300711 1233426 190892 -2246243
34619 -2246243 -3149784 -1861519 842937 3852096 5727757 5573535 3952873 1707824
34611 1707824 -1319558 -4894701 -6984512 -5951762 -3328714 -2067383 -2484230 -2278602
34603 -2278602 -453469 1200030 1100791 337582 866690 2286640 1844573 -2162941 -7780812
34594 -7780812 -10992399 -9901506 -6362931 -3160927 -1173060 -507997 -2336653 -6720640
34586 -6720640 -9944016 -7915335 -2219822 1130782 -362659 -3060677 -3759773 -4357755
34578 -4357755 -7171256 -9527070 -7116319 -519069 5480492 7881649 7571178 6409637
34570 6409637 5199730 4134611 2999273 1304401 -340242 -167535 1905863 3100216
34562 3100216 1503354 -669402 65503 3706086 7230863 8519484 7428341 4273146
34554 4273146 -72864 -3370907 -3715766 -1600567 1228609 3813479 5472449 5163340
34546 5163340 3251895 1846379 1385212 -431966 -3801540 -4333034 568058 5862555
34538 5862555 4739873 -1468135 -4890226 -1857101 3627811 7113762 8518634 8577439
34530 8577439 6087375 1312882 -2016830 -1140045 1870893 3024311 1415550 -274954
34522 -274954 1059377 6031864 11689358 13445956 9734727 4043305 299199 -2198990
34514 -2198990 -5993516 -9395312 -8162003 -2745930 1553167 2289256 2425516 3983093
34506 3983093 4553757 2312026 -458565 -1524802 -1919238 -2229968 -194915 4584404 7677881
34497 7677881 5609534 1304819 -208275 1361082 2996033 3944730 5503100 7124420
34489 7124420 6947854 5066500 2844422 228357 -3129290 -5499976 -4983207 -2470312
34481 -2470312 95291 2672995 5352631 5739691 1853916 -3930579 -7563138 -8514155
34473 -8514155 -8661532 -7792718 -4703210 -1478745 -1601504 -4038283 -4053147 -283915 3429969
34464 3429969 3940437 2386515 1115919 957143 2435485 5761539 8455074 6833347
34456 6833347 1351834 -3048825 -3320709 -1453199 139783 2184609 5123331 6185544
34448 6185544 3465338 17469 11596 2674476 3814833 2255971 1067222 2507885 4848474
34439 4848474 4994849 2395180 -534459 -1175275 425963 1524546 45593 -2474753
34431 -2474753 -2946187 -1447313 -1172585 -3094663 -4071512 -2095752 2995 -773555 -2074074
34422 -2074074 410097 5659394 8132715 5660786 2174332 1705790 3288894 3216112 -356721
34413 -356721 -6251710 -11316655 -11792462 -6397344 749036 3107391 -719313 -5096356
34405 -5096356 -4952519 -2310237 -2288172 -5156229 -6535015 -4424104 -1692588 -1183682 -2015546
34396 -2015546 -2021365 -1125021 -711287 -1432260 -2869973 -4029869 -3520709 -834455 2080829
34387 2080829 2517164 896630 590136 2844529 4646761 3421374 1058493 596740 1367956
34378 1367956 928119 -75744 785632 2522375 1574922 -1882936 -3251514 -599163 1901253
34369 1901253 205275 -3470437 -4084893 -877477 2577044 3945575 4122829 4126215 3425380
34360 3425380 1957257 1239219 2324041 4101276 4612031 3311226 1380465 78936
34352 78936 -834613 -2669911 -5419357 -6536338 -3736904 1099747 3228982 1095768 -1446577
34343 -1446577 -667869 1780094 1791112 -945419 -2994640 -2535203 -1242324 -896762 -1129670
34334 -1129670 -913611 144559 2225459 4718870 5254774 1963012 -3089899 -5565368
34326 -5565368 -4509598 -3403488 -4598383 -5795230 -3891152 247948 3245929 3758377
34318 3758377 3244268 3251835 3992336 5044207 5834466 5753206 4935736 4460799 4837682 5004818
34308 5004818 3959335 2775818 3587038 6505688 8746426 7634174 4242153 2945787
34300 2945787 6344964 11313292 12288575 8807365 6668496 9671154 13518785 11850061
34292 11850061 5903884 2785713 4947825 7398199 6196116 3788683 3578235 4378241
34284 4378241 3457298 844790 -2588536 -7238638 -11458275 -10281993 -1878908 7979195
34276 7979195 12333931 11092616 8509161 5999851 2626112 -248492 -804262 -1284038
34268 -1284038 -4677902 -8515886 -8204871 -5201282 -4930015 -7081741 -5405721 2035714
34260 2035714 9471608 11820891 9915822 5708298 -701379 -6634838 -6591091 -559567
34252 -559567 3579672 760780 -3507008 -1444516 5433575 9153252 6804073 3295181
34244 3295181 3736672 7632249 10337601 7707306 366327 -5276468 -2908774 5390087
34236 5390087 10513435 7720367 1772329 -1683895 -3532035 -5767377 -5523568 -1142840
34228 -1142840 1688879 -1949976 -6635854 -4287049 2083785 2457790 -4279019 -9138909
34220 -9138909 -7428973 -3689246 -1228554 2461939 7089843 6772805 384725 -4437237
34212 -4437237 -2879994 -263227 -1962798 -3972624 -607360 5200815 7305148 6639691
34204 6639691 7722042 9033243 5756656 -355950 -2597616 17180 1605086 -794094
34196 -794094 -3449281 -3250341 -2557199 -4358642 -7096011 -7023679 -3316889 892677 1556247
34187 1556247 -2178728 -6066636 -4601514 1841734 6473543 5018773 1473976 1087538
34179 1087538 1644150 -2197533 -8674004 -10372638 -5175698 1190728 3795547 3271468
34171 3271468 1495746 -846676 -1336119 2597242 7155432 4302266 -6268584 -13956860
34163 -13956860 -10706690 -1932106 1664593 -1409390 -3909231 -2166428 -602016 -3636660
34155 -3636660 -8872344 -10557016 -6798292 -1256684 1221415 -534481 -3515402 -4621093
34147 -4621093 -4292434 -4823048 -6168515 -6282290 -5328274 -5809597 -7701879 -7487629 -3869055
34138 -3869055 -576684 -861449 -2642708 -2246728 82835 1847278 2753652 3755599 3855304
34129 3855304 1751017 -1015584 -2185583 -2381623 -3030621 -2723006 109524 2686571 1055799
34120 1055799 -3188019 -4563020 -1855512 582884 45286 -1336796 -1737968 -2637825 -4443460
34111 -4443460 -3951875 523055 5156727 5330290 1739511 -1518599 -2742358 -3056704 -2804917
34102 -2804917 -1408287 -233749 -1884048 -6022255 -8763675 -7474634 -4232160 -2945592
34094 -2945592 -4174193 -4762740 -2729180 -559189 -1857573 -5534113 -6199413 -1396746
34086 -1396746 4375723 5480825 2803536 1693412 3353256 3289695 -848655 -4919219
34078 -4919219 -4423851 -1026867 648099 -153609 -751152 -391529 -826015 -2254079 -2804366
34069 -2804366 -2257731 -2747040 -5062971 -7224723 -7584843 -6860715 -6267289 -5819126 -5077352
34060 -5077352 -3501294 5506 5184888 8169859 5127898 -989873 -2184496 3643214
34052 3643214 8486967 5280958 -1415549 -2179860 2959482 5231717 1571932 -769112
34044 -769112 3306633 8148316 6756020 2215572 2354101 7139086 9675947 8036095
34036 8036095 7682928 11411397 14468227 12319721 7243294 3732337 2063791 226777
34028 226777 -1499118 -1973932 -2526989 -4917545 -7772162 -8479552 -7072945 -5026660 -1761697
34019 -1761697 4109849 11037743 15494052 16300261 15090426 12915000 9293517 4449274
34011 4449274 -216248 -3852438 -6111547 -5843943 -2377438 2283590 5134754 5739052
34003 5739052 5682243 5276393 3909650 2930919 4303050 6530165 6252278 4424134 6128857
33994 6128857 12556495 17867400 17005041 12732840 11156638 13184580 14620413 12855885
33986 12855885 9162795 5139051 957432 -2608951 -3814275 -2578309 -1217793 -1574392
33978 -1574392 -2849537 -2857933 -391988 3798399 7482473 8696381 8050157 8688995 12512970
33969 12512970 16980355 17507809 12921992 6662485 2424552 637408 38958 776804
33961 776804 3962060 8597008 10868406 7699481 710439 -4563312 -4229944 -182170
33953 -182170 2576617 2323607 2233280 5089106 8869542 9615951 7112306 5109842 6358751
33944 6358751 9712975 12259846 12427280 10674588 8687594 8316195 10100728 12544386
33936 12544386 13754986 13679365 13625725 13934043 13605489 12048280 9605196 6563908 3525295
33927 3525295 2606420 5784394 11370271 14491463 12400100 7555281 4210808 3656339
33919 3656339 4264675 4649517 4985322 6214218 9393503 14785184 20287712 22132026 18857079
33910 18857079 13493704 10174261 9872701 11250435 13829940 17433294 19914728 19178209
33902 19178209 16945755 16655446 17622066 15631196 10207286 6535279 7818920 10089529
33894 10089529 8249292 3892146 2690515 6207258 10933988 14185140 16262678 17266271
33886 17266271 16475587 15286124 16371748 19044513 19622645 17653620 17473559 21492512
33878 21492512 25893402 25852816 21810664 17542372 14913828 13874640 14987072 17987678
33870 17987678 19715991 17631210 14259099 14121759 16977374 18229562 15935127 13349905
33862 13349905 13860235 16815800 19279848 19140176 15988698 11662500 10054175 13142006
33854 13142006 16930545 15112132 7623865 1588371 2273595 7157216 11062402 12980387
33846 12980387 14545484 15410769 14424608 12991844 12915116 12516949 9280283 5360341 5884658
33837 5884658 11595874 17189842 17835985 14214074 10282064 8946424 10887449 14920560
33829 14920560 18146260 17886315 14801108 12398885 12511155 13124276 11778379 9168455
33821 9168455 7798287 8513715 10037501 11002438 10993814 10225455 9364467 9211004 9812977
33812 9812977 10575194 11662359 13896402 16355645 15885327 11020882 5262529 3903485
33804 3903485 7788213 12580861 14446152 13959159 13506656 13451165 13019227 13171314 15596574
33795 15596574 19295154 21017878 19581246 17264312 15997535 14637478 11699317 8531516
33787 8531516 7191392 6774422 5133983 3511207 5566655 11106960 14480835 11307919
33779 11307919 4188077 -719473 -866037 1518916 3785054 5114267 4992209 2819233
33771 2819233 -203305 -1299051 594363 3416175 4805717 4816818 4783323 5000596 5148768
33762 5148768 6040582 8872054 12656447 14255813 11970202 7977660 5828663 6085233
33754 6085233 6246316 5141413 5112220 8294755 12599860 14087152 12509490 11307637 11945163
33745 11945163 11743300 8685693 5055004 3767628 3617804 1379833 -2857851 -5743662
33737 -5743662 -5344245 -2792911 339803 3382768 5339986 5286365 4442915 5239087 7681153
33728 7681153 9096057 8204291 6935107 7074069 7479176 6236923 3700684 1568490 293260
33719 293260 -773652 -1531860 -1113640 658198 3039326 5352234 7286337 8449831 8429850
33710 8429850 7293859 5623112 4086353 3087549 2681678 2854227 3874197 5828136 7646245
33701 7646245 7690536 5984698 4480831 3952777 2395885 -1383880 -4322143 -2487183 2935456
33692 2935456 6722345 6605877 5384300 5540068 5841769 4789898 3613716 3590076 3623038
33683 3623038 2973726 3407318 5776207 7137909 4544292 -317452 -3435819 -3661253 -2453036
33674 -2453036 -183659 3781069 8499529 12352249 15555535 18553134 19139173 15045121
33666 15045121 8625886 4800590 4507975 4399584 3127351 3181249 5325444 6023949 3042244
33657 3042244 -135275 1166514 6249933 10208518 10208049 7790884 5733903 5029057 4815448
33648 4815448 3775152 1747610 563082 2201336 5378549 5719674 951672 -5543798
33640 -5543798 -8446476 -6747324 -3967648 -2762559 -2124212 -444945 1313998 1325151 267192
33631 267192 686860 3154246 5173886 4815454 3759550 4920260 7902293 9224611 7203031
33622 7203031 4076508 2298837 1286268 -271931 -1280072 -292401 1060034 245989
33614 245989 -1486055 -470396 3427702 6144440 5325972 3100962 1786932 649289
33606 649289 -1103160 -1602877 659577 3764801 5101692 5000912 4944460 4303372 2004264
33597 2004264 -218892 323160 3019134 4623758 3638190 1256510 -1490647 -4541851
33589 -4541851 -6822338 -6351748 -2952428 1200763 4127491 5421832 5089966 3073736
33581 3073736 397451 -950418 -69317 1816031 2665447 1461303 -876826 -1848702 436937
33572 436937 4614369 6883466 5547216 3065807 2153286 1955389 346504 -2108134 -3468426
33563 -3468426 -3870353 -4269637 -3436021 -188838 2784078 2017384 -626668 -81705 3786193
33554 3786193 5597945 2701303 -1515335 -3855250 -5176121 -5950109 -3847237 948085
33546 948085 3398801 720817 -2923534 -3310281 -2990977 -5722877 -8417158 -5768030 -259642
33537 -259642 277629 -5421590 -9907442 -7758194 -2066841 1732910 2926253 3537874 3655335
33528 3655335 2146984 -596270 -3407181 -6083190 -8540320 -9936771 -10098047 -10118213 -10284894
33519 -10284894 -9104139 -5622619 -1214060 2030380 3423783 3541505 3348401 3886864
33511 3886864 5318234 6097829 4844432 2890366 2614599 3342015 2041863 -1388086 -3167793
33502 -3167793 -1401719 844860 639401 39822 2418285 6273733 6815795 2914315 -1255590
33493 -1255590 -1821659 325877 1411726 -794401 -5126865 -8363367 -8007731 -4644012
33485 -4644012 -1652451 -1846483 -4506230 -6450984 -5720526 -3296509 -1380852 -903831 -896516
33476 -896516 105240 2107471 3201351 1633832 -1647195 -3528201 -2260742 518910
33468 518910 1973425 1359514 193568 -288339 -708865 -2385653 -5071419 -6472616 -4754501
33459 -4754501 -1482730 -502353 -2843491 -4550846 -1845456 3030539 4496329 1606435
33451 1606435 -626865 1477515 5543101 7268068 5893293 3538894 2015852 2431438
33443 2431438 5311197 8967977 10257002 8895009 8212681 9674893 10197068 7597526
33435 7597526 4841761 5167451 6710171 6482228 6118365 8147845 9693977 6517466 1160149
33426 1160149 -284871 1652410 815150 -3523940 -5245388 -2508547 -1306573 -4406863
33418 -4406863 -5454489 121587 5759988 2980793 -5241040 -8640743 -4171421 1778429
33410 1778429 4139802 4148197 3538690 1295855 -2056334 -3064431 -690285 1740895 2133915
33401 2133915 2632544 4535365 4665382 422871 -4886428 -5838482 -1987623 2500006 4834341
33392 4834341 5541556 5232319 3245157 -21232 -2336788 -2176985 -215188 2191546 4293491
33383 4293491 5459391 5353092 5102463 6232696 7614656 5748108 -299215 -6179101
33375 -6179101 -6770872 -2179400 3175174 6465054 8370525 9310024 7578704 2945009
33367 2945009 -893705 -365155 2959751 4376764 2542838 961033 2457089 4920051
33359 4920051 4365508 701170 -1934350 -596896 2635368 3401244 603787 -2565819
33351 -2565819 -3236722 -2454362 -2762223 -3871472 -3458169 -1755496 -1958206 -5004557 -7063844
33342 -7063844 -4558664 381600 2255038 -1026714 -6105001 -8392210 -6358683 -2150162
33334 -2150162 317095 -1482180 -5825163 -7978495 -5848688 -2792553 -2588777 -3659821
33326 -3659821 -1858136 2398075 4268009 1685174 -1928675 -2888568 -1284679 1217629
33318 1217629 3846638 5643897 5478749 4668108 6143453 9478383 10470512 7544075 4491133
33309 4491133 4206240 3863928 49380 -4980885 -6801215 -5871024 -6003517 -7453759 -6778279
33300 -6778279 -3064296 642230 2548872 4444842 7741534 10637320 10601000 7301257
33292 7301257 2261240 -2312144 -4046017 -2080808 1305490 2785003 1907582 1088573
33284 1088573 2091331 4879245 9201809 13937477 15233512 9741426 713659 -3588733
33276 -3588733 198304 6135782 7329832 4881296 4364002 6437824 6661781 3670812
33268 3670812 1468554 2288063 2523889 -1113059 -5411813 -4999804 -553723 2250744 1310699
33259 1310699 443833 2171857 3326390 948654 -1620688 599546 5845060 7495431
33251 7495431 3857030 381922 966755 2407165 282339 -4083201 -6471482 -6491537 -7002618
33242 -7002618 -8442604 -7979180 -3909186 2452858 9051281 14241426 15782361 11833485
33234 11833485 3901361 -3167195 -5101740 -1561720 3897271 6318540 3058485 -3366630
33226 -3366630 -7226700 -5945207 -3063334 -3028767 -5058648 -5001729 -1566486 2704311 5364160
33217 5364160 5348323 1550282 -5583245 -11520497 -11224999 -5646522 -694131 433292 -351725
33208 -351725 -1415830 -3908490 -7407748 -8300883 -5304390 -2324091 -2674535 -4213951 -3749699
33199 -3749699 -2853933 -4858761 -8260991 -7956918 -2712818 2482934 2370190 -2548440 -6834927
33190 -6834927 -6019402 -1152738 2658384 2446510 978201 2519448 6370940 7985523
33182 7985523 6060947 4123572 4234061 3859002 1099820 -1519170 -1624772 -1336173 -3181036
33173 -3181036 -5080333 -3858847 -1169273 -1119138 -3567059 -4432362 -1997320 1169686 2397953
33164 2397953 1743003 773450 987399 2819305 4363300 2752871 -1181399 -2381505 1443326
33155 1443326 5704641 5886831 4838624 7349418 10850396 9213083 3855937 2046624
33147 2046624 4140993 2314978 -5525004 -10278558 -5220981 3291306 5680774 3121996
33139 3121996 3277051 6657003 6781244 2244954 -726651 1235062 3573510 1874644
33131 1874644 -1392484 -1859373 -130401 563924 258508 1392907 3950158 5588405 5816728
33122 5816728 6309331 7102725 5964443 2383025 -820560 -1439820 -1084155 -2390196 -4830398
33113 -4830398 -5810358 -4765605 -3257992 -1540661 1564484 4952241 5115814 1497760
33105 1497760 -1361328 180802 3371800 3061995 -814097 -3950706 -4660398 -5237916 -6272599
33096 -6272599 -4898999 -600147 1882231 -1243240 -6835195 -8646240 -5103553 190948
33088 190948 4208033 6933965 8606534 8352964 6405077 4796820 4563374 4287806 2750138
33079 2750138 1319062 2004897 4177763 5177167 4061435 2977619 4093508 6414205
33071 6414205 6918256 4319856 295329 -2913675 -4428812 -3840977 -462562 4876701
33063 4876701 8740821 8101135 3957310 -38700 -2077395 -3004980 -3051770 -1022094 2249234
33054 2249234 2741958 -1973392 -8462675 -10600710 -6659175 -1150497 668698 -1447835
33046 -1447835 -3329564 -1855412 1604096 3633855 3356985 2751465 2753704 1817598 -510869
33037 -510869 -1460148 1010615 4439082 5322868 4440780 4706936 5279306 2881618 -1567033
33028 -1567033 -3311766 -1264101 695012 1110553 3120481 6675667 5625267 -2611424
33020 -2611424 -10567941 -10338457 -4978283 -2985649 -4841973 -3516369 2879844 7614925
33012 7614925 5755430 813066 -1502131 -437620 1728222 4049000 6113603 6304518
33004 6304518 3898131 706320 -1400129 -2542746 -3063539 -2181826 62176 1875083
32996 1875083 2300361 2675848 4087980 5296528 4528232 1706052 -2016448 -5244868 -6298953
32987 -6298953 -4205003 -397666 2501898 4019058 5898495 8760908 11142940 11947226
32979 11947226 11161854 8289905 3329017 -833049 -1013533 1015876 362170 -3332581
32971 -3332581 -5255473 -3621382 -2490715 -4005183 -4320966 -1366148 -288234 -5185908
32963 -5185908 -10695160 -9268563 -3251556 -1523423 -5917035 -9423050 -7982595 -5851928
32955 -5851928 -7100027 -8823027 -6603207 -1728883 1216689 883296 -416720 -895321
32947 -895321 -719079 -103162 1576961 4636796 8109177 10131830 9434495 6814680 4634099
32938 4634099 4272535 4938506 5516950 5867171 5316034 2427367 -1772795 -3270059 -787778
32929 -787778 914819 -2387555 -7179783 -6854483 -1684606 1941431 1327182 -108743 -292437
32920 -292437 -1325094 -3443037 -3105474 190182 1537191 -1433592 -3994775 -1857095
32912 -1857095 1864294 1904916 -1237488 -3428863 -3150222 -896400 3880253 9937509 11824806
32903 11824806 6322629 -1261381 -3389493 -834892 -409043 -3670346 -5283882 -2671738
32895 -2671738 218972 594584 1445833 5180585 8139653 5906933 525983 -2063367
32887 -2063367 61114 3193823 3419289 618460 -2786958 -4872598 -5561071 -5983621 -6826148
32878 -6826148 -7282704 -6147114 -3920465 -2861156 -4527625 -7883005 -10133042 -9217731
32870 -9217731 -5722822 -2546280 -1973972 -2886906 -2232054 341696 1581591 -427618 -3238613
32861 -3238613 -4284522 -5129163 -7777427 -9440088 -6227435 -626232 831869 -2508081
32853 -2508081 -4140664 -574860 3448800 2999263 495696 528487 1654169 -606382 -5043282
32844 -5043282 -5435786 248503 6865271 9506612 9329188 9579840 9220481 4352104 -4787634
32835 -4787634 -11784969 -10748589 -3653145 1348820 -650208 -5613227 -5832112 640565
32827 640565 8269455 10961018 7796974 1840721 -3679878 -7044416 -8386660 -9414742
32819 -9414742 -10882585 -10344604 -5470923 393699 638437 -5108115 -9064543 -6132061
32811 -6132061 -1506089 -2274292 -5749430 -3532933 4751155 9957852 6499008 -419776
32803 -419776 -3333924 -2092116 -812276 -122851 2211768 5559755 6634757 4694235
32795 4694235 2232617 578892 -1361912 -3511398 -3498061 -675660 1763079 1024984 -1038234
32786 -1038234 -750900 1515889 1593854 -2278779 -6773776 -8340974 -7951992 -8547015 -9767667
32777 -9767667 -8581323 -4451526 -472525 901325 49772 -2608816 -8076177 -15422293
32769 -15422293 -19874319 -17284314 -9216230 -1306897 2352584 1465985 -2011166 -5034625
32761 -5034625 -4414654 331786 5385918 6259673 2681598 -2089959 -5810337 -8494120
32753 -8494120 -10019348 -9729274 -8333430 -7274436 -6220153 -4068182 -2201260 -3190630
32745 -3190630 -6012973 -6547188 -3864655 -1921120 -3122975 -4286217 -1956174 1786703
32737 1786703 2807830 1770089 2955538 7172101 10178851 8597766 3957765 -165273
32729 -165273 -2395207 -3529334 -4021602 -3131554 -194000 3982398 7097483 7230051 5233515
32720 5233515 4421949 6715310 9787755 9607290 5489020 955397 -434233 1539659
32712 1539659 4752455 7283137 8089027 6572313 2936288 -1345360 -4294195 -4729099
32704 -4729099 -2799788 156319 2097540 1571875 -677791 -1980567 -559151 2145359
32696 2145359 2918952 581274 -2603499 -3654251 -2087825 277847 1872648 2484305
32688 2484305 2230184 1022912 -631276 -1732192 -2280041 -3253163 -4285698 -3131339 902136
32679 902136 4557000 4218914 1154186 234462 3298366 6706878 6482482 3271103 508551
32670 508551 -378802 -849331 -2365629 -4477093 -5491029 -4150346 -1123016 928056 2375
32661 2375 -2259870 -2245353 304248 1291830 -1729834 -5329479 -4820444 -944062 1596310
32652 1596310 810954 -1302732 -3257710 -5300913 -6027753 -2694128 3471051 6674568
32644 6674568 3999683 -73061 166478 3803172 5414394 3059674 -78992 -1187581
32636 -1187581 -778692 -5824 1284847 3079804 4884550 7524758 11947484 15397213
32628 15397213 12928623 4968030 -778422 1123945 5711078 4434691 -1906526 -3985697
32620 -3985697 1766892 7135677 4197830 -2652264 -3195653 3517083 8247961 5386455
32612 5386455 122679 -670876 1580141 1043433 -2668547 -4341879 -1456964 2756606
32604 2756606 5040031 6427026 9065188 11855682 11730498 7782132 2190444 -2141107
32596 -2141107 -3494500 -1717534 1752890 4483557 4854435 3362924 1563661 107867
32588 107867 -1335962 -2625506 -2888479 -1931258 -810613 -414432 -251933 598517 1907561
32579 1907561 2609003 2435195 2182970 2271433 2115244 1355741 707707 841009 1252338 1211447
32569 1211447 1186187 2153464 3792991 4500615 3196366 381884 -2325736 -3053722 -845808
32560 -845808 2871682 4840421 3564305 1543591 1968924 4082018 4499416 2483390 388817
32551 388817 -1065201 -3628258 -6607344 -6043801 -1540368 682907 -4022362 -10794609
32543 -10794609 -10791982 -2921821 5120992 6774842 2705969 -2696626 -5884525 -4629828
32535 -4629828 1213425 7779273 9735047 6324694 1898636 -269955 -1027098 -1451962
32527 -1451962 -521532 1386963 1115727 -2188297 -4384833 -2166101 1596778 2004573 -1071653
32518 -1071653 -4220429 -6144611 -7708738 -7985787 -5035578 -255166 2333115 1580113
32510 1580113 529688 1595875 3376648 3203919 647146 -2394558 -3635164 -2154484
32502 -2154484 553653 1459493 -963766 -5190736 -8987210 -11607721 -12219075 -8872283
32494 -8872283 -2248150 1896322 -1392977 -8909641 -12526229 -9570218 -5078848 -3313404
32486 -3313404 -2510436 -32713 2388400 2104074 638143 1326663 3906591 5024185 3130933
32477 3130933 92709 -1544968 -946221 806665 1546637 -158696 -3062384 -4177996
32469 -4177996 -2330046 705544 3084559 4781414 5837210 5361896 3717459 3174791
32461 3174791 4659360 6180035 6130661 5499943 4991888 3103609 -482762 -2957407 -2971705
32452 -2971705 -3641241 -6867676 -8222356 -3141786 4362113 5966845 958505 -3259351
32444 -3259351 -2829526 -2066015 -4389436 -6104665 -3496621 -13961 -583375 -3020211 -1612975
32435 -1612975 3104135 4868760 1586599 -1458108 379175 4882176 7191365 6529038
32427 6529038 5646546 5915658 6278994 6115502 6131488 6310355 5433761 3411590 2193864
32418 2193864 3135544 4802510 4877192 3255631 1467357 -254495 -2886772 -5526584 -5182082
32409 -5182082 -943151 3903973 5761769 4891966 3611034 2112928 -923705 -4479800
32401 -4479800 -5333120 -2470457 1201126 2330141 524522 -2200276 -3769866 -3399278
32393 -3399278 -1858399 -658271 -285979 75117 341990 -980393 -3291827 -2654455 2271676
32384 2271676 5606210 1212519 -6874686 -7950670 489518 8588858 7782252 1825184
32376 1825184 -617521 1426960 2626213 1464203 1533064 4029695 5645803 4302622
32368 4302622 1808202 85058 -1092133 -1982228 -2071213 -1810790 -2089787 -2130353 -1128163
32359 -1128163 -1282602 -5008050 -9408464 -8535150 -2108434 2933789 1667471 -2358316
32351 -2358316 -2805212 705769 3032210 724738 -4413010 -8190151 -8196745 -5436080 -3054269
32342 -3054269 -3083927 -4151778 -3426068 -700817 1310960 822923 -1151670 -3012766 -4051310
32333 -4051310 -3348157 -389834 2295068 710351 -4599825 -7626606 -4532990 951729
32325 951729 2821371 492989 -2580370 -5407844 -9622169 -14218118 -15287037 -11699056
32317 -11699056 -6992293 -4347154 -2941901 -782563 1656678 2572145 1683036 57037
32309 57037 -1660750 -3214406 -3815705 -2798354 -894187 191234 -590517 -2887392 -5478047
32300 -5478047 -7142568 -7449821 -7094012 -7020654 -6911848 -5273373 -1764204 1235573 827419
32291 827419 -2399287 -4020809 -683844 5430793 8816901 7264250 4165814 3407582
32283 3407582 4316338 3825738 1759192 525245 168204 -2255619 -7321233 -10863693 -9271934
32274 -9271934 -4615475 -1769716 -2120473 -2991418 -2360127 -1206206 -1210488 -2515659 -4216305
32265 -4216305 -5399893 -5315137 -3737509 -1355312 1107966 3818411 6729101 8168127
32257 8168127 6371363 2381543 -512891 -730205 -45357 -406746 -747002 1284516 5093791
32248 5093791 6761846 3698349 -1653145 -4401644 -3222226 -1816888 -3623322 -7183512
32240 -7183512 -8807795 -8092175 -7478541 -7137751 -4626590 -401526 907978 -2856977 -7444851
32231 -7444851 -8286168 -7074806 -7986974 -10300282 -10282449 -8589266 -9303818 -11785213 -10326769
32222 -10326769 -3672664 1573033 465431 -2832990 -1785185 2681948 4803458 3553512
32214 3553512 3026372 4147414 2750410 -2598306 -6492832 -3605810 3856678 8973183
32206 8973183 8216866 3801171 -444223 -2467698 -2054150 -372813 488338 -367089 -1053489
32197 -1053489 661901 3600563 4227236 1643826 -1046344 -1145625 387809 1390602 1740601
32188 1740601 2173278 1854636 -459084 -4165646 -7846489 -11102004 -13168115 -11722050
32180 -11722050 -6385594 -1757725 -2624697 -6813760 -7492678 -2705534 2347488 3442748
32172 3442748 2431014 2175199 1694723 -268500 -1446180 -33889 1242634 -382139
32164 -382139 -2282230 -365905 4145113 6931498 7388895 7878031 8023900 5659458 2322520
32155 2322520 1650386 2734824 1366715 -2018558 -2328184 1313058 3603715 2087336
32147 2087336 1333184 4732585 8318113 7296544 3738962 2718916 4511270 5499197
32139 5499197 4007590 887519 -3157855 -6845547 -7464925 -4570630 -1861821 -1726118
32131 -1726118 -1241122 2093672 4513944 1697038 -2997267 -3104602 220690 -11070 -4741553
32122 -4741553 -7185075 -4284552 -1657296 -3960153 -7498035 -6982852 -3876118 -2608700
32114 -2608700 -2828922 -1377029 641218 -1232786 -7464245 -12974713 -13452923 -9876430
32106 -9876430 -6166361 -4769248 -5184076 -5368010 -4184035 -2845683 -3238125 -4700134 -4473707
32097 -4473707 -2122094 -768524 -2185547 -3606173 -2276828 -539100 -2531348 -7590221
32089 -7590221 -11106713 -10895646 -8505967 -5056182 -690636 1813056 -1573553 -9409620
32081 -9409620 -14204715 -11214181 -4157634 375936 676483 -803216 -2331788 -3248986
32073 -3248986 -2246994 425916 1059675 -2846657 -7541665 -7294782 -2747078 -58958
32065 -58958 -2031210 -5346699 -7183888 -8831109 -10615456 -8731804 -1156976 7037227
32057 7037227 8968509 4714296 770102 1657771 5502211 7645895 5810967 1477319
32049 1477319 -1937770 -2089995 171501 2274047 3831624 6943679 11425556 12815528
32041 12815528 8049855 720691 -3012890 -2099443 -273781 507495 1636384 3394159
32033 3394159 3949073 3371332 3826885 4506728 1183047 -6854755 -13702916 -13885083 -9257467
32024 -9257467 -5561070 -4766071 -4509254 -3228091 -1940992 -1660428 -2308606 -3910270 -6128699
32015 -6128699 -6868065 -4042667 1030237 4305959 3615299 860191 -807345 -378510 1057324
32006 1057324 2324680 3031837 3058597 2250546 860312 -191164 -102793 654013 618394
31997 618394 -847681 -2888070 -4942967 -7824974 -11466090 -13077365 -10283920 -5367162
31989 -5367162 -3152813 -4716629 -6647594 -6925086 -7436602 -9249518 -9644469 -6623770 -2896707
31980 -2896707 -1981990 -2997389 -2874214 -1608831 -1537916 -2881692 -3734663 -3567073 -3323830
31971 -3323830 -2792837 -1224736 -53102 -1634728 -5311898 -7704741 -7101160 -5057846
31963 -5057846 -3616352 -3247645 -3478996 -3373984 -1597528 1888181 4554090 3842847 556489
31954 556489 -2265214 -3112576 -2559541 -1086261 1127797 3051765 3904798 4547380 5531717
31945 5531717 5244786 2662300 86036 -193085 30921 -1836374 -3848045 -2395281 1182272
31936 1182272 2547172 1883780 3144967 6121985 6233203 3017180 1717416 4490433
31928 4490433 6807178 5130556 1642371 -1453478 -5427766 -9331771 -8230889 -2132480
31920 -2132480 577745 -4724257 -9828476 -5060114 5292706 8535868 1835800 -4948579
31912 -4948579 -4330074 98290 1639001 -516708 -3124323 -4018087 -2519043 1174980
31904 1174980 4786460 5352899 3133255 1177072 611619 -155390 -1352225 -1043916 963054
31895 963054 2434105 2670912 3215150 4001549 3159770 1449414 2053857 4545311 4190014
31886 4190014 -389933 -3845299 -1657558 3293692 5530175 4553820 3345156 2517466
31878 2517466 947973 120054 2534076 6454979 7076637 3330524 -495283 -907428 452737
31869 452737 268046 -1246977 -970887 2310955 5907730 6482464 4053859 1460625 52497
31860 52497 -2160113 -6747333 -11020758 -10782490 -6302834 -2227493 -1231730 -1383966 -908401
31851 -908401 -1450983 -3945517 -4895993 -978300 4735061 5738294 792132 -4381294 -4514384
31842 -4514384 -452635 3618005 5592421 6137145 5791746 3880310 446243 -2273224
31834 -2273224 -1686400 1624310 3508349 884269 -3948193 -5932503 -4042587 -2333472
31826 -2333472 -3391263 -4435310 -2301850 1068642 1757976 80064 -539625 559573
31818 559573 929901 -34612 -133973 1517097 3382403 4940058 7375807 10174634 10887288
31809 10887288 9328088 8150027 7847863 5175224 -1322574 -7834360 -9985717 -7970744
31801 -7970744 -4464699 -700017 2263437 1764221 -2540459 -5401022 -1778064 5153886
31793 5153886 7036434 1440505 -5192881 -6997415 -6144991 -7919019 -12013335 -13074507
31785 -13074507 -8710981 -2986917 -1076686 -2826653 -3322202 780800 6976158 9704686
31777 9704686 6940725 2663605 2105265 5634246 8759843 7680286 3187536 -919854
31769 -919854 -1717935 832183 4229518 5187391 2292513 -2389175 -5246793 -4942740 -3134118
31760 -3134118 -1312219 1023971 4034839 5511364 3340806 -1093561 -4182941 -4295672
31752 -4295672 -2778965 -1232809 -56109 362947 -382012 -863188 1489433 6400349 9778693
31743 9778693 8912583 6705501 7678155 10802930 10143126 3230454 -4692367 -6775447 -2570983
31734 -2570983 2389460 3494004 1039761 -1828452 -2604827 -858421 1745848 2569825
31726 2569825 698402 -1450322 -791119 2320330 4663202 4821260 4650455 5365252 5120387
31717 5120387 2446210 -349442 -91824 2371707 3373194 2007229 1186620 2558607
31709 2558607 3550300 1395232 -2084459 -2521505 798604 3614776 2490527 -194783
31701 -194783 755816 6134345 10881699 10768317 7985429 7617828 10116560 10890113 7439575
31692 7439575 3029832 1471011 1432991 -947043 -5568948 -7975958 -5285336 184154
31684 184154 3777612 3360461 863945 -52254 2226582 5395424 5746004 2908123 589251
31675 589251 1702142 4709333 6336485 5711703 3593258 -141938 -5053704 -8204854
31667 -8204854 -7531699 -5636780 -6057773 -7243752 -5307814 -1682973 -1719365 -5393090 -6331471
31658 -6331471 -1998223 1996075 1146858 -765976 1444663 5704451 6682249 4395872
31650 4395872 2752470 2572897 2156046 2300881 4441289 5653773 2138959 -3439672 -4812752
31641 -4812752 -1780857 -122754 -1778921 -2588669 -987461 -1056907 -3994900 -4148622 1702566
31632 1702566 7557521 6710210 2071578 1122981 3985165 4054950 -799797 -5077362 -4417573
31623 -4417573 -1272888 266690 349274 1127574 2221697 1842931 488478 315135 1534595
31614 1534595 2057983 864573 -293130 646508 3126389 4680980 4114992 2672437 1818881
31605 1818881 1276201 345477 -65840 1188362 2614149 1342989 -2026913 -2717847 1985314
31596 1985314 7785559 7669249 624290 -6738313 -7848089 -3347711 591046 -184689
31588 -184689 -3592829 -4621184 -1547511 2317294 3092842 1139728 43867 1442078
31580 1442078 2970171 1918746 -979742 -2788487 -2147987 -248699 1291831 1987513
31572 1987513 2055720 1560757 155343 -2646879 -6537951 -9591609 -9480566 -6267655 -2916262
31563 -2916262 -2000249 -2891213 -3357243 -2819945 -2318005 -1982249 -620047 2096794 4665546
31554 4665546 5436405 4355323 2905590 2935957 5124638 7747159 7704227 4105083 71481
31545 71481 -860891 485064 265123 -2362893 -3822801 -1996929 -197047 -2257392 -5941812
31536 -5941812 -5601618 -1008095 1344819 -2296088 -6392003 -3152181 6178393 12271742
31528 12271742 9849063 3603975 284478 -61098 -1119222 -2650484 -1541132 1276010
31520 1276010 1223109 -2203521 -3813413 -593462 3721052 4522588 2462757 508360 -1201186
31511 -1201186 -3395738 -3665648 525338 6287214 7674932 3507661 -1141072 -1557682
31503 -1557682 1758753 5133292 5682216 2900072 -1177699 -3145284 -1653501 701333
31495 701333 1105322 945166 3178604 6387599 6043869 1754178 -1736365 -1893615 -1665011
31486 -1665011 -3189044 -3307652 784919 5414292 4951845 283534 -2208268 611838
31478 611838 5223268 6845425 4577808 623847 -2457807 -2752178 194888 4177958
31470 4177958 5535213 2705393 -2191868 -5618391 -5575968 -2524471 1236518 3106105
31462 3106105 2551558 1930522 3404583 5285604 3845599 -783229 -3440322 -553096
31454 -553096 4469567 5538983 2389650 970904 4780252 9506896 8819605 3113807
31446 3113807 -1107325 32759 3380791 4026728 1719984 -229126 -185440 632857 1070937
31437 1070937 1085914 191057 -2223908 -4740051 -4794580 -2341461 -47565 888268 2162154
31428 2162154 4311975 4558035 1293202 -2007630 -912882 3583700 6550496 6086307
31420 6086307 4908039 5186125 5873111 5851550 5709190 4860501 871602 -5682978 -9129068
31411 -9129068 -5259152 2233841 6076153 4858868 3562504 4979358 5909181 3548340
31403 3548340 760214 1368934 3581042 2703776 -1243258 -3490726 -1988666 -280969
31395 -280969 -1616598 -4134720 -4248194 -1843692 686268 2363862 3432648 2818443 -600574
31386 -600574 -4657494 -5358107 -2182352 1060977 1559484 838181 1297666 2099346 1114165
31377 1114165 -594133 552610 5296164 9398682 8248139 2480935 -2516318 -2661360
31369 -2661360 512594 2270061 438632 -2762355 -4434449 -4364815 -3651051 -2075030 866213
31360 866213 3569710 3829348 2410208 2225620 3629127 3440594 -319556 -5354945 -8211233
31351 -8211233 -8211892 -6687616 -4520927 -2535595 -2364968 -4313984 -5579058 -3213575 1730991
31342 1730991 5245316 5086515 2508678 -166298 -1618889 -1492267 -278973 786735
$$ [...]
##END NTUPLES=NMR SPECTRUM
##END=
