##TITLE=31Pdec_LR-738-B-CR8
 , 24 sc
 19.11.2021
##JCAMPDX= 6.0         $$ Bruker NMR JCAMP-DX V2.0
##DATA TYPE= NMR SPECTRUM
##DATA CLASS= NTUPLES
##ORIGIN= UXNMR, Bruker Analytische Messtechnik GmbH
##OWNER= root
$$ XWIN-NMR		Version 3.5
$$ Fri Nov 19 11:11:30 2021 Russian Standard Time (UT+4h)  she@DPX200
##.OBSERVE FREQUENCY= 81.013821
##.OBSERVE NUCLEUS= ^31P
##.ACQUISITION MODE= SIMULTANEOUS
##.ACQUISITION SCHEME= undefined
##.AVERAGES= 24
##.DIGITISER RES= 16
##SPECTROMETER/DATA SYSTEM= spect
##.PULSE SEQUENCE= zgpg30
##.SOLVENT NAME= CDCl3
##.SHIFT REFERENCE= (INTERNAL, CDCl3, 0, 248.564)
##AUDIT TRAIL= $$ (NUMBER, WHEN, WHO, WHERE, WHAT)
$$ ##TITLE= Audit trail, XWIN-NMR		Version 3.5
$$ ##JCAMPDX= 5.01
$$ ##ORIGIN= Bruker BioSpin GmbH
$$ ##OWNER= she
$$ F:/spectra/data/she/nmr/P31/1/pdata/1/auditp.txt
$$ ##AUDIT TRAIL=  $$ (NUMBER, WHEN, WHO, WHERE, WHAT)
(   1,<2021-11-19 11:10:36.40 +0400>,<she>,<DPX200>,
      <created by zg, POWCHK disabled, PULCHK disabled
       configuration hash MD5:
       00 E9 B6 7A A2 85 ED C7 34 08 36 98 17 FE 4E 26
       data hash MD5: 32K
       37 EA 73 4A 99 56 97 66 5E 3E 40 42 F7 E7 41 8F>)
(   2,<2021-11-19 11:10:38.68 +0400>,<she>,<DPX200>,
      <Start of raw data processing
       efp BC_mod = 2 LB = 1 FT_mod = 6 PKNL = 1 PHC0 = -9243.316 PHC1 = 208.0695 SI = 64K 
       data hash MD5: 64K
       4F E7 F4 D9 10 5C AC A7 A1 9F 6C 39 28 75 37 6C>)
(   3,<2021-11-19 11:10:56.37 +0400>,<she>,<DPX200>,
      <pk PHC0 = 109.232 PHC1 = -219.4 
       data hash MD5: 64K
       34 46 3E 89 9F 63 A7 F4 C6 51 CA 80 A5 69 49 62>)
(   4,<2021-11-19 11:11:02.00 +0400>,<she>,<DPX200>,
      <abs ABSG = 5 
       data hash MD5: 64K
       10 D0 04 D4 AB 5D B1 8D 5F 36 21 AC CA 41 E1 77>)
$$ ##END=
$$ 
$$ hash MD5
$$ 0A 91 E2 69 64 36 E7 E2 0E C8 00 E2 4F 2A FA FF
##$RELAX= 
##$RELAX= 
##$RELAX= 
##$RELAX= 
##$RELAX= 
##$RELAX= 
##$RELAX= 
##$RELAX= 
$$ Bruker specific parameters
$$ --------------------------
##$DU= <F:/spectra>
##$EXPNO= 1
##$NAME= <P31>
##$PROCNO= 1
##$TYPE= <nmr>
##$USER= <she>
##$AMP= (0..31)
100 100 100 100 100 100 100 100 100 100 100 100 100 100 100 100 100 100 
100 100 100 100 100 100 100 100 100 100 100 100 100 100 
##$AQSEQ= 0
##$AQ_mod= 1
##$AUNM= <au_zg>
##$AUTOPOS= <>
##$BF1= 81.014009
##$BF2= 200.13
##$BF3= 200.13
##$BF4= 200.13
##$BF5= 200.13
##$BF6= 200.13
##$BF7= 200.13
##$BF8= 200.13
##$BYTORDA= 1
##$CFDGTYP= 0
##$CFRGTYP= 5
##$CHEMSTR= <none>
##$CNST= (0..31)
1 1 145 1 1 1 1 1 1 1 1 1 1 1 1 1 1 1 1 1 1 1 1 1 1 1 1 1 1 1 1 1 
##$CPDPRG= <waltz16>
##$CPDPRG1= <>
##$CPDPRG2= <waltz16>
##$CPDPRG3= <>
##$CPDPRG4= <mlev>
##$CPDPRG5= <mlev>
##$CPDPRG6= <mlev>
##$CPDPRG7= <mlev>
##$CPDPRG8= <mlev>
##$CPDPRGB= <>
##$CPDPRGT= <>
##$D= (0..31)
0 1 0 0 0 0 0 0 0 0 0 0.03 2e-05 3e-06 0 0 0 0 0 0 0 0 0 0 0 0 0 0 0 0 
0 0 
##$DATE= 1637305835
##$DBL= (0..7)
120 120 120 11 120 120 24 19 
##$DBP= (0..7)
150 150 150 150 150 150 150 150 
##$DBP07= 0
##$DBPNAM0= <>
##$DBPNAM1= <>
##$DBPNAM2= <>
$$ [...]
##$SUBNAM3= <"">
##$SUBNAM4= <"">
##$SUBNAM5= <"">
##$SUBNAM6= <"">
##$SUBNAM7= <"">
##$SUBNAM8= <"">
##$SUBNAM9= <"">
##$SW= 501.771253377433
##$SWIBOX= (0..15)
0 1 3 0 0 0 0 0 0 0 0 0 0 0 0 0 
##$SW_h= 40650.406504065
##$TD= 32768
##$TD0= 1
##$TE= 0
##$TE2= 300
##$TE3= 300
##$TEG= 300
##$TL= (0..7)
0 120 53 12 22 120 120 120 
##$TP= (0..7)
150 150 150 150 150 150 150 150 
##$TP07= 0
##$TPNAME0= <>
##$TPNAME1= <>
##$TPNAME2= <>
##$TPNAME3= <>
##$TPNAME4= <>
##$TPNAME5= <>
##$TPNAME6= <>
##$TPNAME7= <>
##$TPOAL= (0..7)
0.5 0.5 0.5 0.5 0.5 0.5 0.5 0.5 
##$TPOFFS= (0..7)
0 0 0 0 0 0 0 0 
##$TUNHIN= 0
##$TUNHOUT= 0
##$TUNXOUT= 0
##$USERA1= <user>
##$USERA2= <user>
##$USERA3= <user>
##$USERA4= <user>
##$USERA5= <user>
##$V9= 5
##$VALIST= <valist>
##$VCLIST= <CCCCCCCCCCCCCCC>
##$VD= 0
##$VDLIST= <DDDDDDDDDDDDDDD>
##$VPLIST= <PPPPPPPPPPPPPPP>
##$VTLIST= <TTTTTTTTTTTTTTT>
##$WBST= 1024
##$WBSW= 4
##$XGAIN= (0..3)
0 0 0 0 
##$XL= 0
##$YL= 0
##$YMAX_a= 3220
##$YMIN_a= -2096
##$ZGOPTNS= <>
##$ZL1= 120
##$ZL2= 120
##$ZL3= 120
##$ZL4= 120
##$ABSF1= 248.5645
##$ABSF2= -253.2056
##$ABSG= 5
##$ABSL= 3
##$ALPHA= 0
##$AQORDER= 0
##$ASSFAC= 0
##$ASSFACI= 0
##$ASSFACX= 0
##$ASSWID= 0
##$AUNMP= <proc_1d>
##$AZFE= 0.1
##$AZFW= 0.5
##$BCFW= 0
##$BC_mod= 2
##$BYTORDP= 0
##$COROFFS= 0
##$CY= -3
##$DATMOD= 1
##$DC= 0
##$DFILT= <>
##$DTYPP= 0
##$F1P= 0
##$F2P= 0
##$FCOR= 1
##$FTSIZE= 65536
##$FT_mod= 6
##$GAMMA= 0
##$GB= 0
##$INTBC= 1
##$INTSCL= 5.30512e-09
##$ISEN= 30
##$LB= 1
##$LEV0= 0
##$LPBIN= 0
##$MAXI= 10000
##$MC2= 0
##$MEAN= 0
##$ME_mod= 0
##$MI= 50
##$NCOEF= 0
##$NC_proc= -9
##$NLEV= 6
##$NOISF1= 182.463
##$NOISF2= 159.3651
##$NSP= 0
##$NTH_PI= 0
##$NZP= 0
##$OFFSET= 248.5645
##$PC= 4
##$PHC0= -9134.084
##$PHC1= -11.33049
##$PH_mod= 1
##$PKNL= yes
##$PPARMOD= 0
##$PSCAL= 0
##$PSIGN= 0
##$REVERSE= no
##$SF= 81.014009
##$SI= 65536
##$SIGF1= 159.3651
##$SIGF2= -187.1042
##$SINO= 113.3802
##$SIOLD= 16384
##$SREGLST= <1H.CDCl3>
##$SSB= 0
##$STSI= 65536
##$STSR= 0
##$SW_p= 40650.406504065
##$SYMM= 0
##$S_DEV= 0
##$TDeff= 32768
##$TDoff= 0
##$TI= <>
##$TILT= no
##$TM1= 0
##$TM2= 0
##$TOPLEV= 0
##$USERP1= <user>
##$USERP2= <user>
##$USERP3= <user>
##$USERP4= <user>
##$USERP5= <user>
##$WDW= 1
##$XDIM= 65536
##$YMAX_p= 292396624
##$YMIN_p= -502808808
$$ End of Bruker specific parameters
$$ ---------------------------------
##NTUPLES= NMR SPECTRUM
##VAR_NAME=  FREQUENCY,     SPECTRUM/REAL,   SPECTRUM/IMAG
##SYMBOL=    X,             R,               I
##VAR_TYPE=  INDEPENDENT,   DEPENDENT,       DEPENDENT
##VAR_FORM=  AFFN,          ASDF,            ASDF
##VAR_DIM=   65536,         65536,           65536
##UNITS=     HZ,            ARBITRARY UNITS, ARBITRARY UNITS
##FACTOR=    0.620285442955139, 1,           1
##FIRST=     20137.2065510759, 0,            0
##LAST=      -20513.1999529892, 0,           0
##MIN=       -20513.1999529892, -502808808,  0
##MAX=       20137.2065510759, 292396624,    0
$$ Real data points
##PAGE= N=1
##DATA TABLE= (X++(R..R)), XYDATA
$$ [...]
38445e920558J200095K394598P316536R079236Q65217q521192n932054M194209
38437D676087N970438k069257n118087K331842P154260K09220p748838l580545
38429A825120O606479O722966m687359j2543259p040024L710228O021810j412774
38421g96813p164992k552930P301239J0266243L155126m079955k291266L905465
38413G742117L301734m915512j0193770o851570j673168j528079k210387L298328
38405a3030307J1638180J3089459O054116j199830l038110k682574m192507n483214
38397A155213l355438r7127L15279o53739J325414N209763N309755Q70856j562822
38388H517154J587996M181266m83442p839567p218160K199863R027578N404677
$$ plain form
38445 -5920558 -4720463 -2325865 4990671 14069907 14935124 6413932 481878 4676087
38437 4676087 10646525 8577268 3459181 5791023 12945283 13154503 5405665 1825120
38429 1825120 8431599 15154565 10467206 -2076053 -9116077 -5405849 615961 -796813
38421 -796813 -7961805 -10514735 -3213496 7052747 10207873 6127918 3836652 7742117
38413 7742117 11043851 6128339 -4065431 -10917001 -12590169 -14118248 -16328635 -13030307
38405 -13030307 -1392127 11697332 17751448 16551618 13513508 10830934 6638427 1155213
38397 1155213 -2200225 -2297352 -1982073 -2635812 -1310398 3899365 9209120 10079976 8517154
38388 8517154 10105150 14286416 13802974 5963407 -1254753 945110 9972688 15377365
38380A5377365k486781m262259J89291K446490j604057p389304r156399o199330
38372a3084984j279118K823202M450108L855513L193494L500364K550456j489973
38364D519062n602851n042908m12169K578947Q05885k701674l879747k846991
38356a2582446k267070k854116k468514Q83506N759688P364614K677359m039698
38348g526677m464046K590650P616410L066099m535509l054083O731226J1105064
38340A1529134L356234o576055p451228k666377k518607o851109o226052J461681
38332a5942379O478957J998974n243722m589338L522772Q879670N867685j38805
38324H33814j766139O12743J639363j97348j576179r22653m76647j001884J75637
$$ plain form
38380 15377365 12890584 8628325 8817616 11264106 9660049 2270745 -6885654 -13084984
38372 -13084984 -14364102 -11540900 -7090792 -3235279 -41785 3458579 6009035 4519062
38364 4519062 -1083789 -6126697 -6538866 -3959919 -3154034 -5855708 -9735455 -12582446
38356 -12582446 -14849516 -17703632 -20172146 -19288640 -13528952 -6164338 -3486979 -7526677
38348 -7526677 -11990723 -9400073 -1783663 1282436 -3253073 -6307156 424070 11529134
38340 11529134 14885368 8309313 858085 -1808292 -4326899 -11178008 -17404060 -15942379
38332 -15942379 -9463422 -7464448 -12708170 -17297508 -13774736 -4895066 972619 833814
38324 833814 -932325 -319582 1319781 1122433 -453746 -1376399 -1853046 -2854930 -2679293
38315b679293L303337L501709j646600o127477l403387K562281K178108m333929
38307f645251n461488M452898J4772825J1939543j790965j1146055p785969O20291
38299a044171K858778j288959l706788r24168K204260J515162m8372J855782N161324
38290F582848M347798o91602m292174l421236r15022N39540J600827J410826l491581
38281A670224j1082426j1642194o08131J1826030J2466382K664804m997798m559278
38273d262387q97093J994229N081911O406659J634561n158705l921432M228554
38265E106297N716908l440518q713507k70986Q805416K315037j2070880j4077530
38257a6629763k497857M891799J367813k27859O946648J0096440j036616j4478323
$$ plain form
38315 -2679293 624044 4125753 2479153 -3648324 -7051711 -4489430 -2311322 -6645251
38307 -6645251 -12106739 -7653841 7118984 19058527 17267562 6121507 -1664462 -1044171
38299 -1044171 1814607 525648 -3181140 -4105308 -1901048 -385886 -434258 1421524 6582848
38290 6582848 10930646 10239044 5946870 2525634 1610612 2150152 3750979 5161805 1670224
38281 1670224 -9412202 -21054396 -21662527 -9836497 2629885 5294689 296891 -4262387
38273 -4262387 -5159480 -3165251 1916660 8323319 9957880 4799175 877743 5106297
38265 5106297 10823205 7382687 -1330820 -1601806 7203610 9518647 -2552233 -16629763
38257 -16629763 -19127620 -14235821 -12868008 -13095867 -6149219 3947221 2910605 -11567718
38249a1567718j2555476K157975J1877962Q724634J113492k362011k671418l275760
38241h558320l783729l380242l124982k343024J249743N862930O027243J099967
38233f950414k401537k87739K867371J294443k571967k253107K121627M211946
38225c969377J710406q84184r41436k118147o439930q032880r81483J0000141
38217a1656890J3779550O838240l112943p616200n578361l12759M898524O210839
38209C450000Q31973p074545q014401O25083R186866P846880p24316o693491o236477
38200f802428k335583K932916Q082410P768554r33313r606136p134376K862111
38192e165845N405716l166576r013005k225345Q333708R817491L905801l1779
$$ plain form
38249 -11567718 -24123194 -21965219 -10087257 -1362623 -249131 -2611142 -5282560 -8558320
38241 -8558320 -12342049 -15722291 -18847273 -21190297 -19940554 -14077624 -8050381 -6950414
38233 -6950414 -9351951 -9639690 -6772319 -5477876 -8049843 -10302950 -8181323 -3969377
38225 -3969377 -2258971 -3143155 -4084591 -6202738 -12642668 -20675548 -21657031 -11656890
38217 -11656890 2122660 8960900 5847957 -1768243 -7346604 -7659363 -2760839 3450000
38209 3450000 4281973 -2792572 -10806973 -10181890 -995024 6851856 6127540 -565951 -6802428
38200 -6802428 -9138011 -6205095 1877315 9645869 8712556 -893580 -8027956 -5165845
38192 -5165845 239871 -2926705 -11939710 -14165055 -5831347 3986144 7891945 7860166
38184G860166j244052m528452p161749k699151N080523N530744j775907n799188
38176d737066j431104L566117K336145j137311j024442O61274o2504q82540J795589
38167i15842M761771K601385k557692l004170L719259J1380339J2445535N261057
38159C3691642n622351j3236013j3124981p359180k820050l168345m186087k15098
38151a6040463O576371Q078363J518508n844861n601318J365588O681500N415518
38143B149206J202904n93346q87961l835667p667589n231555M249986J0687469
38135G3447O149207k721931l742285K353771L429109l645915o694454K052742
38127b746309J1331290O316116q684592j5653425q103147J888092L025937n00107
$$ plain form
38184 7860166 6616114 2087662 -5074087 -7773238 -2692715 2838029 1062122 -4737066
38176 -4737066 -6168170 -2602053 -265908 -1403219 -2427661 -1766387 -1828891 -2711431 -915842
38167 -915842 3845929 6447314 3889622 885452 4604711 15985050 28430585 33691642
38159 33691642 28069291 14833278 1708297 -5650883 -8470933 -11639278 -15825365 -16040463
38151 -16040463 -9464092 -1385729 132779 -5712082 -11313400 -9947812 -3266312 2149206
38143 2149206 3352110 2758764 1870803 -1964864 -9632453 -14864008 -10614022 73447
38135 73447 6222654 3500723 -241562 2112209 5541318 1895403 -4799051 -2746309
38127 -2746309 8584981 14901097 6216505 -9436920 -17540067 -15651975 -12626038 -13126145
38119a3126145J314935Q465236J1978094O668782l344870j0434658j0537610n049999
38111a4066235J334720M439208L518458O32041k076571l016097m77988N180964
38103d531500R134757O406080n37369l380753O97170M264148N2818q098573j0198016
38094f191238l648078M092424N934988K632351j240472l658960m625433k864876
38086i569294K699684Q999475J0116402M089325l309974m023679K602916P721874
38078A9326729L066335p762665j2289919n032595M376447L814756m112575n763898
38070d377385K590225P806190m89911j2377343j0826225K387876Q346339m50385
38062g390619q590377k281746Q430699N715342p006345j0107519R04749Q494749
$$ plain form
38119 -13126145 -11811210 -3345974 8632120 15300902 11956032 1521374 -9016236 -14066235
38111 -14066235 -12731515 -8292307 -4773849 -4141808 -6218379 -9234476 -9712464 -4531500
38103 -4531500 4603257 11009337 10471968 7091215 7788385 12052533 12105351 4006778 -6191238
38094 -6191238 -9839316 -5746892 188096 2820447 1579975 -2078985 -6704418 -9569294
38086 -9569294 -6869610 2129865 12246267 16335592 13025618 9001939 11604855 19326729
38078 19326729 22393064 14630399 2340480 -2692115 1684332 5499088 1386513 -4377385
38070 -4377385 -1787160 6019030 5529119 -6848224 -17674449 -15286573 -6940234 -7390619
38062 -7390619 -15980996 -18262742 -9832043 -4116701 -11123046 -21230565 -20325816 -11831067
38054a1831067J501582p573905l391315Q498083J2029471M822652k421064m320179
38046b685742m061408k165058L362675P410677K794806n284111m557754L321993
38038a863922L106818q569487j4593191k787207J4601101J8454046Q410091j922137
38030A4836112o247772p929691p405788k104480L936215L730584o04420j189836
38022b979076J670925Q88570l121046k607398K425705K797655l498307o772471
38014a1195443k091194K403607P6627l162874p27883K505276K33947k191506K980490
38005a1168953J0079822P145443m083253q885955p44426J0150153J2209730O117443
37997B0820004q34137n461639q193982q018786m029329J144977L941685L897838
$$ plain form
38054 -11831067 -10329485 -17903390 -21294705 -12796622 -767151 4055501 1634437 -2685742
38046 -2685742 -6747150 -8912208 -5549533 1861144 4655950 -628161 -5185915 -1863922
38038 -1863922 1242896 -7326591 -21919782 -24706989 -10105888 8348158 16758249 14836112
38030 14836112 8588340 658649 -6747139 -8851619 -4915404 -1184820 -1789240 -2979076
38022 -2979076 -1308151 -419581 -3540627 -6148025 -3722320 -924665 -4422972 -11195443
38014 -11195443 -13286637 -10883030 -10806403 -13969277 -14697160 -12191884 -11957937 -14149443 -11168953
38005 -11168953 -1089131 6056312 1973059 -6912896 -7657322 2492831 14702561 20820004
37997 20820004 19985867 14524228 6330246 -1688540 -5717869 -4572892 -631207 3266631
37989C266631K484571O46431j92533J965175N848124O197678L54698p124632r974825
37980C471318p787252m276445p89075L275301N392375J662749n896691r568867
37972a4516587n340647K363284P187666P688847N476646J352158l052454m035147
37964b876234j022822L31023m155240q951586n110115O016799J2748571Q149917
37956E130313j642206o989851o423329m300662k032948J979492O204073O324167
37948a750951J842454k622980l676470k934316k891074k181644K103403Q510213
37940c601365J0877265N441094l402744p385988m446703p56756r46068j079847
37932e301112L859975R723262Q247781M90651m083745k418990j781821o206263
$$ plain form
37989 3266631 5751202 6397633 6205100 8170275 14018399 20216077 20570775 13446143 3471318
37980 3471318 -4315934 -8592379 -9381454 -6106153 -713778 948971 -4947720 -14516587
37972 -14516587 -19857234 -17493950 -10306284 -2617437 2859209 4211367 1158913 -2876234
37964 -2876234 -3899056 -3568033 -7723273 -16674859 -21784974 -15768175 -3019604 5130313
37956 5130313 3488107 -3501744 -9925073 -14225735 -16258683 -14279191 -8075118 -1750951
37948 -1750951 91503 -2531477 -6207947 -9142263 -12033337 -14214981 -12111578 -3601365
37940 -3601365 7275900 12716994 9314250 1928262 -2518441 -3275197 -4221265 -5301112
37932 -5301112 -1441137 8282125 16529906 17020557 12936812 10517822 8736001 2529738
37924B529738r393072o211866j353867L67022K707109Q223641R184298k74315
37916E778688j0512835q245366L261580R677438P265504M217278L038774j865899
37908A2615162q852274q148057N51115N212589O98590l960596k679978j407496
37900e970945l241911j80277J0412415J5555847N375522r604574j3071966n362056
37892f087945J622996L409300L516127K251604j528337l189912M96047K639930
37884C129810k791545p679228j490666R480297J0337783J002445n041648l048522
37876C898726j128426k632461j646547K194865J040914n265773n959509K746519
37868f751692J0144686P256083j256852o734267p079073l055529M754046J0535632
$$ plain form
37924 2529738 -6863334 -13075200 -14429067 -14062045 -11354936 -3131295 6053003 5778688
37916 5778688 -4734147 -12979513 -9717933 -40495 7225009 11442287 14481061 12615162
37908 12615162 3762888 -4385169 -3834054 1378535 2077125 -1883471 -4563449 -5970945
37900 -5970945 -9212856 -9393133 1019282 16575129 21950651 12346077 -725889 -6087945
37892 -6087945 -4464949 -1055649 2460478 4712082 3183745 -6167 489880 3129810
37884 3129810 338265 -7340963 -8831629 648668 10986451 11988896 6947248 3898726
37876 3898726 2770300 137839 -1508708 686157 1727071 -3538702 -9498211 -6751692
37868 -6751692 3392994 10649077 9392225 2657958 -4421115 -7476644 -2722598 7813034
37860G813034O066995n858364j1711465n939721J681602K324487k61567k57622
37852f142621N02218M81144L934370J0292140R913605m20028r103079o585561
37844B872188K88585J161943j559430p61073J530476Q30786R82258N243094O205614
37835A6794441j384247p425603j941169N458648R163j1806122j1237494J648502
37827i883881Q270105K507683j299974M740228Q668738N67210j0076867r940366
37819f447124j518298L855295L001954Q95640M22758L49532q61907m087881q213957
37810a2603988q214997r17190P105560O333867n84758j702380M794527P377089
37802A587730J225888l215640R49532M088468l167447j2328456r902789Q98727
$$ plain form
37860 7813034 13880029 8021665 -3689800 -9629521 -7947919 -5623432 -5884999 -6142621
37852 -6142621 -5640403 -5159259 -1224889 9067251 18980856 18560828 9457749 2872188
37844 2872188 3160773 4322716 2763286 2002213 3532689 4363475 5345733 10588827 16794441
37835 16794441 15410194 7984591 6043422 11502070 11511233 -294889 -11532383 -9883881
37827 -9883881 -1613776 893907 -406067 4334161 13002899 13570109 3493242 -6447124
37819 -6447124 -7965422 -4110127 -1108173 -212533 210225 559757 -302150 -4390031 -12603988
37810 -12603988 -20818985 -21736175 -14630615 -8296748 -8881506 -10583886 -5789359 1587730
37802 1587730 2813618 -402022 547510 4635978 1468531 -10859925 -20762714 -19863987
37794a9863987N972995K500183O59797N141761Q603117N000280j543833m470204
37786B000109l438697j579952K87214K667166L689704M08428o056653r173559
37778a1196240l679603O182361R520472L007530l075423N10616O765449K655596
37770A0690758r044089j2453813l256236N282472M696066L141826P414888R426099
37762A5897971J994924o002439m000500K417538K630358m15496J487286L949254
37754A7958896k049632j1015870r971080l62958M788297K524875J007914J494794
37746D375236j914799n664863L8390J0245134Q364146n767145j1969413j180260
37738c473574R516609M222504p660042q656681J95102N600270L945151J465994
$$ plain form
37794 -19863987 -13890992 -11390809 -10731012 -5589251 3013866 8014146 6470313 2000109
37786 2000109 -1438588 -3018540 -2731326 -64160 3625544 4033972 -2022681 -11196240
37778 -11196240 -14875843 -8693482 826990 3834520 759097 1269713 8035162 10690758
37770 10690758 1646669 -10807144 -14063380 -8780908 -4084842 -943016 6471872 15897971
37762 15897971 17892895 11890456 7889956 10307494 12937852 12522356 14009642 17958896
37754 17958896 15909264 4893394 -5077686 -5440644 -652347 1872528 2880442 4375236
37746 4375236 2460437 -3204426 -3166036 7079098 15443244 9676099 -2293314 -3473574
37738 -3473574 6043035 10265539 2605497 -6051184 -5856082 -255812 3689339 5155333
37730E155333K18695j692236j560300L061553N582031j044629j0695144j1254682
37722a2229379k785418L472721K890549K219347N740783P839468L149080m028598
37714F268553n478381J8684N631655M968534o89525m342422k361902P42031l01434
37705D455793k352820R41247O358556L907220o067216j0781767m941631K30262
37697h250356l599508o617406J906480J2492646Q995878m014043p346347J814853
37689d617803N844064l655522j2084707n721991P287348J1095762M819788j402852
37681A564087l812790n288789m279960K847258J0808773R585840K15737m950289
37673F689867m84408L990104p25085q566924p392127K272609Q010843M073792
$$ plain form
37730 5155333 5374028 3681792 2121492 5183045 10765076 9720447 -974697 -12229379
37722 -12229379 -15014797 -11542076 -8651527 -6432180 -691397 7148071 10297151 6268553
37714 6268553 790172 808856 6440511 11409045 10719520 6377098 4015196 4757227 4455793
37705 4455793 2102973 3044220 9402776 13309996 7242780 -3538987 -8480618 -8250356
37697 -8250356 -11849864 -18467270 -16560790 -4068144 4927734 913691 -6432656 -4617803
37689 -4617803 1226261 -2429261 -14513968 -20235959 -12948611 -1852849 2966939 1564087
37681 1564087 -2248703 -7537492 -11817452 -8970194 1838579 11424419 11640156 6689867
37673 6689867 6205459 10195563 9470478 903554 -6488573 -4215964 3794879 7868671
37665G868671j285277r4526L168058O46063m627796l462128L675304O391707K48180
37656A2528256p175792q475925n394882k047956J717708N239834M066452j679607
37648a221912m105243L68217M079607J293648r43466M137934Q168554L63622j1440123
37639G00838r848681M455795J2313672M796762n304015n531851q42189n59705
37631A80626k456060n00964K243267n8570m252122l499465R12267K661557J195288
37622c574176P06482J601201J072069l57561j89390L64483j144104k282560J189693
37613b613863P539144J0592317Q111479L095142k146589p441782j0849959r199265
37605b913376l422676J164168J151751j603614l673008m173827l951665k690483
$$ plain form
37665 7868671 6583394 6488868 9656926 10302989 5675193 2213065 5888369 12280076 12528256
37656 12528256 5352464 -3123461 -8518343 -10566299 -8848591 -3608757 457695 -1221912
37648 -1221912 -5327155 -4958938 -879331 414317 -529149 3608785 11777339 12140961 700838
37639 700838 -9147843 -4692048 7621624 12418386 7114371 1582520 740331 180626
37631 180626 -2275434 -2776398 -533131 -591701 -4843823 -8343288 -7431021 -4769464 -3574176
37622 -3574176 -2867694 -1266493 -194424 -551985 -741375 -376892 -1520996 -3803556 -2613863
37613 -2613863 4925281 15517598 23629077 26724219 24577630 17135848 6285889 -2913376
37605 -2913376 -6336052 -5171884 -4020133 -5623747 -9296755 -13470582 -17422247 -20112730
37597b0112730J125002O993458J0297425O130554l238379p970560j942859P982130
37589g35959R922956K754580l537730l031389m66287q61848k011590j447384k072390
37580a487041n231203n895839r51541M606910N767964M821535M643442K581632
37572H855859k051988l095879J398676K466307m841854r322183j74442J2524539
37564E759035J0854662k745866r319571l625918j99551o539443j0521008k499174
37556a8836834P405437N756422l271171o158264o67331M008722K628580j121701
37548a0256140k518687p58887K546080M803619M259088K955475M049951M825406
37540I905905p88215j0263856j2100544k541223O716051N214707p00175O60357
$$ plain form
37597 -20112730 -18987728 -11994270 -1696845 4433709 1195330 -6775230 -8718089 -735959
37589 -735959 9186997 11941577 8403847 5372458 4906171 4044323 2032733 585349 -1487041
37580 -1487041 -6718244 -12614083 -13565624 -8958714 -3190750 1630785 6274227 8855859
37572 8855859 6803871 3707992 5106668 7572975 2731121 -6591062 -6765504 5759035
37564 5759035 16613697 13867831 4548260 922342 722791 -5816652 -16337660 -18836834
37556 -18836834 -11431397 -5674975 -8946146 -15104410 -15771741 -11763019 -9134439 -10256140
37548 -10256140 -12774827 -13533714 -10987634 -6184015 -1924927 1030548 5080499 9905905
37540 9905905 9117690 -1146166 -13246710 -15787933 -9071882 -3857175 -4557350 -3896993
37532c896993O613789M994496m810039r810537l497671M386471K856372m490169
37524g654281n324819M244040J4613930J4347349L283588p644516r185392m017484
37516B662415j500010l930676m245154J250925N519242J561211n561440n437629
37508i681116K189101P079641L171772l824624m971566J023968P483572P475104
37500I945852R29639m854568l123471L192959M232911k816195q488152m588308
37492e569333L495828N705610K781963K412939L863700n96258r365786j0431989
37484g703326k56545Q735862O122667j522298k309916K458252K254207m691694
37476C087209q759944m185956K669794L362646r18942k379136J847053O080890
$$ plain form
37532 -3896993 2716796 7711292 2901253 -6909284 -10406955 -6020484 -3164112 -7654281
37524 -7654281 -12979100 -8735060 5878870 20226219 23509807 15865291 6679899 2662415
37516 2662415 1162405 -2768271 -7013425 -5762500 -243258 1317953 -4243487 -9681116
37508 -9681116 -7492015 -412374 2759398 -1065226 -6036792 -5012824 2470748 9945852
37500 9945852 10875491 6020923 2897452 6090411 10323322 7507127 -981025 -5569333
37492 -5569333 -2073505 3632105 6414068 8827007 12690707 12094449 2728663 -7703326
37484 -7703326 -7959871 775991 6898658 5376360 3066444 5524696 7778903 3087209
37476 3087209 -5672735 -9858691 -7188897 -3826251 -4745193 -7124329 -5277276 803614
37468H03614M157536k355026o275221l838492J339486L669117J957409j027323
37460a568900k384294l77685M985552J0016499R437799L606535n80457q723q45333
37451B2280993p348980j1772998n634954M188883M116488m030176n462978K367678
37443a296044M871534m052045r673800m02845J1914828J0517300N8776l072910
37435H864794J857131J463549o860023j0865118m879229J870603J844442m58339
37427g162190M85433K263237J981276K136361L719216K772033j212117k303631
37419B679618J591342M121152J099343k884557l543649l514312m121305l49543
37411d921911Q211843J0975097J062996j1350116j1896388k464972L298282Q77445
$$ plain form
37468 803614 4961150 2606124 -3669097 -7507589 -6168103 -2498986 -541577 -1568900
37460 -1568900 -3953194 -4330879 654673 10671172 20108971 23715506 23135049 23126326 22280993
37451 22280993 14932013 3159015 -2475939 1712944 5829432 1799256 -3663722 -1296044
37443 -1296044 3575490 -476555 -10150355 -10553200 1361628 11878928 11937704 8864794
37435 8864794 10721925 12185474 5325451 -5539667 -10418896 -8548293 -6703851 -7162190
37427 -7162190 -6676757 -4413520 -2432244 -295883 3423333 6195366 4983249 2679618
37419 2679618 4270960 8392112 9491455 6606898 3063249 -451063 -4572368 -4921911
37411 -4921911 3289932 14265029 15328025 3977909 -7918479 -10383451 -7085169 -6207724
37403f207724j615745Q42774L874214M034592L827637L918701P53933m642864
37395D785518n127225Q35785M669160M92989n361120m420978R04980K482798q4308
37386h22401m13299K263088J361800m901399q132553j404152R068871J0489117
37378G509072K74106r961045r039775n7280M791120P69339m166025j719009N183292
37369f416205P557495L175835j840365k801517j406115j56492K052183N722239
37361E887058O763816J344841p289731j1251079p340620q45036J121341j805465
37353a3414875l353672P19083O421667O550113R15013k963147q22684K032521
37345c915981k48222l798058j321333M553658M277721k384700m486028K279120
$$ plain form
37403 -6207724 -7823469 -6980695 -3106481 928111 4755748 8674449 9428382 4785518
37395 4785518 -341707 494078 5163238 5656227 295107 -4125871 -3220891 -738093 -822401
37386 -822401 -1235700 1027388 2389188 -2512211 -10644764 -12048916 -2980045 7509072
37378 7509072 7783178 -2177867 -11217642 -11274922 -6483802 -5714463 -9880488 -11599497 -6416205
37369 -6416205 1141290 4317125 2476760 -324757 -1730872 -1887364 164819 5887058
37361 5887058 12650874 13995715 6705984 -4545095 -11885715 -12730751 -11609410 -13414875
37353 -13414875 -16768547 -16049464 -9627797 -3077684 -2162671 -5125818 -5948502 -3915981
37345 -3915981 -4164203 -7962261 -9283594 -4729936 -452215 -2836915 -7322943 -5043823
37337e043823P337356K022698n784920m652534R03923j808300j0615263r779098
37329b7419961M482785J6075137J2702978L182751J328481M424891J043143p839944
37321G980261j1130059p290851n469978o736624q94622J3042643J9051075O849281
37313A5401126j0018471j2162232j695103L750126q51808l397400J826592M495450
37305b651720j711704n716538K720219J3288602Q753807p917355j6050648o308815
37297a5594152P330239Q466086p94578o950208m840614r95757p67512j242274
37289a5388770J681928N414808M113446k063061n730432j978805M045526L779377
37281f125983j740775k312936N712828J1731969N428823o883125j0207739k335517
$$ plain form
37337 -5043823 2293533 4316231 -1468689 -6121223 -5217300 -7025600 -17640863 -27419961
37329 -27419961 -22937176 -6862039 5840939 9023690 10352171 14777062 15820205 7980261
37321 7980261 -3149798 -10440649 -15910627 -22647251 -23541873 -10499230 8551845 15401126
37313 15401126 5382655 -6779577 -8474680 -4724554 -5576362 -8973762 -7147170 -2651720
37305 -2651720 -4363424 -10079962 -7359743 5928859 14682666 6765311 -9285337 -15594152
37297 -15594152 -8263913 202173 -592405 -7542613 -12383227 -13378984 -14146496 -15388770
37289 -15388770 -13706842 -8292034 -4178588 -6241649 -11972081 -13950886 -9905360 -6125983
37281 -6125983 -7866758 -10179694 -4466866 7265103 12693926 5810801 -4396938 -6732455
37273f732455M061104J486377k276683R74319N633932J880110p401817j0018252
37265a2393365k505745N126116L986768k085900l290357K354518O897173L361987
37257A451195n099997r191100n172642J066610K862154J583701K502993N100454
37249d896632M100042q12287l849678k808838k252959m218095l385838L498334
37241a4625951R878298P692521q24499o325254m793976p07617R38247M02667Q50081
37232g515483L587895O224993N061619M27405j712538K501067P111182L466823
37224A9152963n479312p736757p46079M295353P94616l305986j137776Q59051
37216F696073l245133n885857n51955L009764m662403j1898162k745136J3232654
$$ plain form
37273 -6732455 -2671351 -1184974 -3461657 -2487338 3146594 5026704 -2375113 -12393365
37265 -12393365 -14899110 -9772994 -5786226 -7872126 -11162483 -8807965 -1910792 1451195
37257 1451195 -3648802 -12839902 -18012544 -16945934 -14083780 -12500079 -9997086 -4896632
37249 -4896632 -796590 -1608877 -5458555 -8267393 -10520352 -14738447 -18124285 -14625951
37241 -14625951 -4747653 2944868 2120369 -4204885 -8998861 -9706478 -8768231 -8365564 -7515483
37232 -7515483 -3927588 2297405 7359024 7786429 6073891 8574958 15686140 19152963
37224 19152963 13673651 5936894 5190815 9486168 10280784 6974798 5837022 6696073
37216 6696073 3450940 -2434917 -2986872 22892 -4639511 -16537673 -19282809 -6050155
37208f050155J2591993l971811j1816001k093859O135182M65209n249060J359770
37200h628732Q402125K636900n165578Q69941J2699944J1232527j972722q851227
37192A1223178m672867j394744l577546k560724L667685M497128l944650r623388
37184f385928k654458R285280J1978285L332061o456213q813273m809062r23346
37176e446654n29360o01891K643340O324818M073660k803932n216764o86977J762227
37167d81533k577413m341592L571630J0703473M654207o654214o165261M377314
37159C086611P556941o61460n954092j468119K262019j447428m043686K55505
37151d13709L185536p87616l162898J501435L082917n622489j2375826m014625
$$ plain form
37208 -6050155 6541838 2570027 -9245974 -11339833 -5204651 -4739442 -9988502 -8628732
37200 -8628732 -226607 2410293 -2755285 -1885344 10814600 22047127 20074405 11223178
37192 11223178 6550311 5155567 1578021 -982703 2684982 7182110 3237460 -6385928
37184 -6385928 -9040386 244894 12223179 15555240 9099027 285754 -4523308 -5446654
37176 -5446654 -5976014 -6577905 -3934565 2390253 6463913 3659981 -1556783 -2243760 -481533
37167 -481533 -3058946 -7400538 -3828908 6874565 11528772 4874558 -1290703 3086611
37159 3086611 10643552 9982092 4028000 2559881 4821900 3374472 -669214 -413709
37151 -413709 2771827 1984211 -1178687 322748 3405665 -2216824 -14592650 -18607275
37143a8607275J0137904J1642867J453590l788229J087591N131875K090715j823943
37135G325095k182109k811894n129453m199619J044388M789719M561729M240052
37127G637908M450256M57815p209536j0226891m615197L477151P713260Q514328
37119A0199094O824323O90733p343476r054569k648980K605042P5191m402437
37111c055079l263216Q93484K580909M292311R522641J1675016K513224j1956935
37103A3202355j6784159q337776K289953O314910O145425N368975J494091o238443
37095C455331j1027284p234559Q51501M777476K493378j175313j297117K917336
37087f239251P367870N436963l852420r892853j355708J4820503J6949648k023155
$$ plain form
37143 -18607275 -8469371 3173496 4627086 838857 1926448 7058323 9149038 7325095
37135 7325095 5142986 2331092 -2798361 -6997980 -5953592 -1163873 3397856 7637908
37127 7637908 12088164 12545979 5336443 -4890448 -9505645 -6028494 1684766 10199094
37119 10199094 17023417 17714150 10370674 1316105 -1332875 1272167 1347358 -3055079
37111 -3055079 -6318295 -5424811 -2843902 1448409 10971050 22646066 25159290 13202355
37103 13202355 -3581804 -11919580 -9629627 -3314717 2830708 8199683 9693774 3455331
37095 3455331 -7571953 -14806512 -13955011 -9177535 -6684157 -7859470 -9156587 -6239251
37087 -6239251 1128619 6565582 2713162 -7179691 -8535399 6285104 23234752 21211597
37079B1211597k0584389j6089689L641445J2575945M302086k590896K954307Q333254
37071A3753660J473476q137951o567394P57788k82725p162089n287818N676066
37063e776987R613424J84413q440587l768712O582121Q367099J725129k862805
37055E623095k330158k120560k993730N06519P691595R072546K48377r779489
37047E918195r992968j746182M408984L100785j101155k270348k17930K113925
37039B13306L112382J877690k565557p945917q163039p68175P301334P212818
37031B74842N79815k285027K575456O737559K324162n430159n380941L131752
37023B527459Q880933L881817o489514j0839550n220644L595230O561161J806414
$$ plain form
37079 21211597 627208 -15462481 -11821036 754909 5056995 2466099 5420406 13753660
37071 13753660 15227136 7089185 521791 1279579 996854 -6165235 -11453053 -5776987
37063 -5776987 3836437 4020850 -4419737 -8188449 -1606328 6760771 8485900 5623095
37055 5623095 3292937 1172377 -1821353 -1314834 6376761 15449307 15697684 5918195
37047 5918195 -4074773 -5820955 -1411971 1688814 587659 -1682689 -1900619 213306
37039 213306 3325688 5203378 2637821 -5308096 -13471135 -14239310 -6937976 274842
37031 274842 854657 -1430370 1145086 7882645 10206807 4776648 -604293 2527459
37023 2527459 11408392 15290209 8800695 -2038855 -7259499 -3664269 2896892 4703306
37015D703306m454241n613951j876460J742641L154787M664907O320850L758183
37007A2400022l842420r028891n049106L910729P612263K810474m289540o940126
36999b416595l847949J971052N147616J143028p044531q804249N51746J0266701
36991c033181P447674l651940p543898r60201L740785K6021l197309J083795N307074
36982g81180J095423n795290n232638R60699L584166J055536p66101L24610J496908
36973d057867J664158J532185k87835m112279n529688j720550K595630K505870
36965g410376J383153M013647O315855J689626o182046p498474j249538M166692
36957d771461L962197R30938k486680o155468o681654j38290Q689442R354846
$$ plain form
37015 4703306 249065 -5364886 -7241346 -5498705 -2343918 2320989 8641839 12400022
37007 12400022 8557602 -471289 -5520395 -1609666 6002597 8813071 4523531 -2416595
36999 -2416595 -6264544 -4293492 854124 1997152 -5047379 -13851628 -13299882 -3033181
36991 -3033181 4414493 762553 -6781345 -7741546 -4000761 -3974740 -7172049 -6088254 -781180
36982 -781180 314243 -5481047 -10713685 -9752986 -6168820 -5113284 -5879385 -5554775 -4057867
36973 -4057867 -2393709 -861524 -1149359 -5261638 -10791326 -12511876 -9916246 -7410376
36965 -7410376 -6027223 -2013576 4302279 5991905 -190141 -7688615 -8938153 -4771461
36957 -4771461 -809264 121674 -2365006 -8520474 -15202128 -15340418 -6650976 2703870
36949B703870J00022q908730q721914j249979N401011N237291j868314q905706
36941a6212449o134913O418491J4570560P388471n358325n875633M802575Q837409
36933H436186K66800o857309l327316J039596k838523o398768N88761J0532616
36925A442043R741558L60386m683144k469358j056310l259699l401149O13644
36917b712029L658853K302853j550167n687475q643898p044488L99335P564552
36909a1712464P078716N67727m102793l849609j610160Q36153L416713L593349
36901e782368j7930k330346R78829L861347j600224r316872n289954R550604J6941365
36892F994451O567666q990999j2156862k909729N586601O119053K259044j107384
$$ plain form
36949 2703870 2803892 -6104838 -14826752 -16076731 -10675720 -5438429 -7306743 -16212449
36941 -16212449 -22347362 -15928871 -1358311 6030160 671835 -5203798 -401223 8436186
36933 8436186 8702986 1845677 -1481639 -442043 -3280566 -9679334 -9090573 1442043
36925 1442043 11183601 11543987 6860843 4391485 3335175 75476 -3325673 -2712029
36917 -2712029 946824 3249677 1699510 -3987965 -12631863 -19676351 -19277016 -11712464
36909 -11712464 -4633748 -4066021 -8168814 -12018423 -13628583 -12792430 -9375717 -5782368
36901 -5782368 -5800298 -8130644 -7151815 -3290468 -4890692 -14207564 -19497518 -9946914 6994451
36892 6994451 13562117 4571118 -7585744 -10495473 -4908872 1210181 3469225 2361841
36884B361841k567286j681400O61790P67775k858872m978384m75498O116450N517727
36875B864143k178068o560543k377619K004149k646494j0769694p840791Q720680
36867a8784237K3039788J9444775K110861j0533167q658604n83819J390739l268392
36859D157944o485949m635386j292454N46320J858503L245238L089810J188091
36851A672117k40143k25791k6240J12886J305549K659407J813531k98290K14148
36842F987174L426493L675546k718665j1152004j3427754o991953K796406Q351688
36834i053069O517314R42547j524315J663713N229402K699388m145042o838603
36826d508665j831134M508920M714660m01399m429077l993516j084188J022721
$$ plain form
36884 2361841 -205445 -1886845 -1225055 -457280 -3316152 -8294536 -8770034 -2653584 2864143
36875 2864143 686075 -5874468 -8252087 -6247938 -8894432 -19664126 -27504917 -18784237
36867 -18784237 4255551 23700326 25811187 15278020 6619416 6035597 7426336 4157944
36859 4157944 -2328005 -6963391 -8255845 -7709525 -5851022 -2605784 484026 1672117
36851 1672117 1431974 1206183 1179943 1292829 2598378 5257785 7071316 6773026 6987174
36842 6987174 10413667 14089213 11370548 218544 -13209210 -20201163 -17404757 -9053069
36834 -9053069 -2535755 -1593208 -3117523 -1453810 3775592 6474980 2329938 -4508665
36826 -4508665 -6339799 -1830879 2883781 2482382 -1946695 -5940211 -7024399 -6001678
36818f001678R88046p2520O52032M588256Q294211O208743j295654o502469m057854
36809B801113J666902L039098k91663k528625j193017N88685P74525J346572L200542
36800I404132L215228p55419n435843o000567k463209J035684K349378L114943
36792D464327L934435J831714m194932p912068k163279R210890J2757106K608940
36784B0537133j0018044j1240917l203930J134464j528070k192254K298895K831301
36776a381422m776087r437349j526721J0255253J0798666M40710p569635o647075
36768i843660j249566M816612J0909094J1945441K548191j0190486j1835404j356642
36760d256420O314049K458535l997360l322359j20952k417850o562093m354976
$$ plain form
36818 -6001678 -5013632 -5086152 -4434120 154136 8448347 14657090 13361436 6858967 2801113
36809 2801113 4468015 7507113 7215450 4686825 3493808 4082493 4857018 6203590 9404132
36800 9404132 12619360 11863941 6428098 427531 -2035678 -999994 1349384 4464327
36792 4464327 8398762 10230476 6035544 -1876524 -4039803 5171087 17928193 20537133
36784 20537133 10519089 -721828 -3925758 -2791294 -4319364 -6511618 -4212723 -1381422
36776 -1381422 -6157509 -15594858 -17121579 -6866326 3932340 4373050 -3196585 -9843660
36768 -9843660 -11093226 -6276614 4632480 16577921 19126112 8935626 -2899778 -4256420
36760 -4256420 2057629 4516164 518804 -2803555 -2924507 -5342357 -11904450 -16259426
36752a6259426K365200N541395M152271L353377M118592L019300m14017l758831
36744B117861n982615n443748J000823R868691R562088l003225j2154533l477865
36736g512523J2257792J2206218m530254j5205117p358568N039930N772850j069238
36728c98910l184948m38137l63443l187286l764163j819982J72358L501363Q524779
36719i58369R773363M742643Q26873L863775O934495J688488o159091n791471
36711A4920706j7585j18134n686482n869471L75167K188552l167617m808033K587564
36702D04667R517469Q277707M508706L732508J17029j0090637j5966635p111290
36694f610476O826446P574302m874792j2326270n046050O064726P256313k08345
$$ plain form
36752 -16259426 -13894226 -8352831 -4200560 -847183 3271409 6290709 5876692 2117861
36744 2117861 -3864754 -9308502 -8307679 1561012 11123100 8119875 -4034658 -7512523
36736 -7512523 4745269 16951487 12421233 -2783884 -10142452 -5102522 670328 -398910
36728 -398910 -3583858 -4021995 -4385438 -7572724 -11336887 -13156869 -12984511 -9483148 -958369
36719 -958369 8814994 13557637 14384510 18248285 25182780 26871268 20712177 14920706
36711 14920706 14903121 14784987 9098505 3229034 3604201 5792753 2625136 -2182897 404667
36702 404667 9922136 18199843 22708549 26441057 26558086 16467449 500814 -6610476
36694 -6610476 215970 7790272 2915480 -9410790 -14456840 -8392114 -1135801 -1344146
36686a344146o092047o277926m091702j497020L081815R061083J1982969R303022
36678A4126048M481176K589772L240938J296793m678889q588039n037634J418208
36670H848373J394289n371491q425710j360414Q778060J1541784O681926J325286
36662B3412103j880610n686107r404512p960018r30764M728402M010475O70040
36654F959009J094634M981401O185940J204951o786669j2198218j2600569r306335
36646b0465856m475469L59219L567756L859282K437139K439694M440414M903822
36638b933999J910375l24583K678567P322397N900280j463226o136456l675080
36630C278275K96511k0131k118719j336892R42779J086441k8211j59602j017185
$$ plain form
36686 -1344146 -7436193 -13714119 -17805821 -19302841 -16221026 -7159943 4823026 14126048
36678 14126048 18607224 21196996 24437934 25734727 21055838 12467799 7430165 8848373
36670 8848373 10242662 4871171 -3554539 -4914953 3863107 15404891 22086817 23412103
36662 23412103 21531493 15845386 6440874 -1519144 -2449908 2278494 6288969 6959009
36654 6959009 8053643 13035044 19220984 20425935 13639266 1441048 -11159521 -20465856
36646 -20465856 -24941325 -24582106 -21014350 -17155068 -14717929 -12278235 -7837821 -2933999
36638 -2933999 -1023624 -1348207 1330360 8652757 14553037 13089811 6953355 3278275
36630 3278275 3574786 3554655 1435936 99044 1041823 2128264 2100053 1940451 923266
36621I23266m012603m898640K25923O756351O733917Q5163n914248o543463k870292
36612i514626K600404O982713N991842j147386p609902o635269j224548R12170
36604i644602o03064l22880J838541R39695k436162k552981L61733L44779j938641
36595a4013582Q77539P777445P253954l795218j1476900m263086R250186J2897578
36587D507916N538241j059283j692781j792722l815643k899443J786553K930100
36579C502938k667817o826616j998194N929020N563448k453615n661019J533104
36571c078751Q869297N322305m120104n800461K023578O998535J936574m962144
36563G188829m101126J058921J439245l233495o729037p395937o975435k999413
$$ plain form
36621 923266 -3089337 -7987977 -7762054 -1005703 5728214 5813377 -100871 -6644334 -9514626
36612 -9514626 -6914222 68491 6060333 4912947 -2696955 -9332224 -10556772 -9644602
36604 -9644602 -10247666 -10570546 -8732005 -7792310 -10228472 -12781453 -12419720 -12074941 -14013582
36595 -14013582 -13136043 -5358598 1895356 -1899862 -13376762 -17639848 -8389662 4507916
36587 4507916 10046157 8986874 7294093 5501371 1685728 -1213715 572838 3502938
36579 3502938 835121 -5991495 -7989689 -2060669 3502779 1049164 -4611855 -3078751
36571 -3078751 5790546 11112851 6992747 1192286 3215864 10214399 12150973 7188829
36563 7188829 3087703 4146624 5585869 2352374 -4376663 -11772600 -18748035 -21747448
36555b1747448O409174J3427891Q715701k535246n683635J633802O173279J42653
36547F536171p768823p701180k844756r97219j848822r77781R91028J106994K68524
36538a3235864J56649q57112l399659l986612p55316L305061O332647R782134
36530b658072J1441472N503781n602715r870304l065786L287451J84709l624892
36522d404356L106030J3174197J0908093k287979r078665k233501N734817K247340
36514A7165976p939363j0741314j256892J0840980J2063402l85073j4409491j5588968
36506a0250743m423785M807513M241604J998821N939775R008766J788747r278265
36498C832433j0432346j948094L725677K046117j47371K25150j073229l362811
$$ plain form
36555 -21747448 -15338274 -1910383 6805318 4270072 -1413563 220239 6393518 6536171
36547 6536171 -1232652 -8933832 -11778588 -12775807 -14624629 -15602410 -14611382 -13504388 -13235864
36538 -13235864 -13079215 -13936327 -17335986 -21322598 -22077914 -18772853 -12440206 -2658072
36530 -2658072 8783400 14287181 8684466 -1185838 -4251624 -964173 -779464 -4404356
36522 -4404356 -1298326 11875871 22783964 20495985 11417320 9183819 14918636 17165976
36514 17165976 9226613 -1514701 -2771593 8069387 20132789 19747716 5338225 -10250743
36506 -10250743 -14674528 -9867015 -5625411 -3626590 2313185 11321951 13110698 3832433
36498 3832433 -6599913 -8548007 -4822330 -2776213 -2923584 -2698434 -3771663 -7134474
36490g134474j7178P536568Q502000r198o488291j748732P791515J0066293L287887
36481B1786390m063158m524765J048479M794871L010r457969j1517987k693563
36473d624692M327245p29306p619006j147687J1557725R913109n576693j1348523
36465e247828J860518J3518195O103693q005938q284904K471387P033944J834379
36457A1283446k936208l309084l557604l241748J425559O482560M925232k76435
36449A0795718j028639J322583l68145m206283k440515K856350K373130l143722
36441F160477l721169J237542J388963m891642n895315K689148Q222117J138054
36433F328175r095439r149503j955287J081175j94777L052165J0869351J3148874
$$ plain form
36490 -7134474 -7151652 384916 8886916 8877718 2389427 640695 8432210 18498503 21786390
36481 21786390 17723232 13198467 14246946 19041817 19044827 9586858 -1931129 -4624692
36473 -4624692 -297447 -1026753 -8645759 -9793446 1764279 11677388 6100695 -5247828
36465 -5247828 -3387310 10130885 16234578 8228640 -56264 2415123 9449067 11283446
36457 11283446 8347238 5038154 1480550 -1761198 -335639 6146921 11072153 10795718
36449 10795718 9767079 11089662 10721517 6515234 4074719 6931069 9304199 6160477
36441 6160477 2439308 3676850 5065813 174171 -5721144 -3031996 5190121 6328175
36433 6328175 -2767264 -11916767 -13872054 -12790879 -12985656 -9933491 935860 14084734
36425A4084734O027888k295742m490683l092472k896235k515407J001889M745133
36417A0569105L508502j746471m647656k236079J369378J033441k789416n298722
36409b37918l625113J38412K218864K049407K370691M223327L973707j746449
36401I364928q735967p695006L363287J3604269J1612329L18513p272116n891934
36393H668303k625708k683638j275869N027901R008217M056181l074176k157740
36385A4943471L398820K388992m640243o578788k224391l309327j2999039j7167407
36377b6187912n749658J0176719J3974624O582195J697902M340403P155892N099105
36369A7089270J649823J72826j263092m580981p838050q421436o049874k226336
$$ plain form
36425 14084734 20112622 17816880 13326197 10233725 7337490 4822083 5823972 10569105
36417 10569105 14077607 12331136 7683480 5447401 6816779 7850220 5060804 -237918
36409 -237918 -3863031 -3724619 -1505755 543652 2914343 7137670 11111377 9364928
36401 9364928 628961 -7066045 -3702758 9901511 21513840 21832353 14560237 8668303
36393 8668303 6042595 3358957 2083088 7110989 16119206 20175387 17101211 14943471
36385 14943471 18342291 20731283 16091040 9512252 7287861 3978534 -9020505 -26187912
36377 -26187912 -31937570 -21760851 -7786227 -1204032 493870 4834273 11990165 17089270
36369 17089270 18739093 18911919 17648827 13067846 5229796 -3191640 -9241514 -11467850
36361a1467850P30429J552019K744264P653519J2638362Q720312m328301j3323752
36353D919002q788742P10298J682203l495655k461302M681476N225999l399683
36345i26404p594527L41876Q855660M955264n815515q316927K26188Q199432O347193
36336F272240k536634r604628r019464j637998N711692N878545j64134l135793
36328h236174K440772R667496Q405594k61265o050362m610168k378284m831815
36320e854206p472642l009283P141706J3809520J0927776J553377o532765q490791
36312B072692n652974k944149l339797m394336j424819N123585Q258785L457739
36304A156726l300105k074787O673436J1168182M502492n268211p082808k844492
$$ plain form
36361 -11467850 -10737421 -9185402 -6441138 1212381 13850743 22571055 18242754 4919002
36353 4919002 -3869740 -3159442 -1477239 -4972894 -7434196 -2752720 2473279 -926404
36345 -926404 -8520931 -8179055 676605 5631869 -183646 -8500573 -8274385 -74953 6272240
36336 6272240 3735606 -5869022 -14888486 -16526484 -10814792 -4936247 -5100381 -8236174
36328 -8236174 -5795402 3872094 12277688 12016423 5966061 1355893 -1022391 -5854206
36320 -5854206 -13326848 -16336131 -9194425 4615095 15542871 17096248 10563483 2072692
36312 2072692 -3580282 -6524431 -9864228 -14258564 -15683383 -10559798 -2301013 1156726
36304 1156726 -2143379 -4218166 2455270 13623452 18125944 12857733 5774925 2930433
36296B930433k322294n853045m182278L954117P105872p76729r122377o559009
36288a4825310J339019J873173l599935k516887O869664J1193431K723081q392387
36280e336151r030310o49360N825754N740380K844500O7853l126617n615895m275317
36271a3555163P05503N329822P064064O527799M135222l86374m679839m656911
36263D84123l83442K812560J331520j862792k134835j74832m47352l971285o466380
36254a0812715l962332K547811Q625974J0345501O391949j194345p389412p757722
36246c205291l197275Q43681J210877O11174K386372M680281L406525r05633l580951
36237B249760k466148R4601J979106L666477M990707L734435l95644l548596k112469
$$ plain form
36296 2930433 608139 -5244906 -9427184 -5473067 1632805 856076 -8266301 -14825310
36288 -14825310 -13486291 -11613118 -15213053 -17729940 -10860276 333155 3056236 -5336151
36280 -5336151 -14366461 -15015821 -9190067 -3449687 -605187 -537334 -3663951 -9279846 -13555163
36271 -13555163 -12849660 -7519838 -455774 6072025 10207247 9820873 5141034 484123
36263 484123 100681 2913241 4244761 2381969 247134 72302 -375050 -4346335 -10812715
36254 -10812715 -14775047 -12227236 -3601262 6744239 13136188 11941843 4552431 -3205291
36246 -3205291 -6402566 -5558885 -4348008 -3736834 -1350462 3329819 6736344 5830711 2249760
36237 2249760 -216388 -121787 1857319 5523796 10514503 14248938 13853294 10304698 8192229
36228H192229K508776N638795M629202P04011l581688o892552q769137p809445
36220e379809k234034O060514R888567L856889o671050r742443k376703M909675
36212a688394L634198m79616J472270O204978N266898J340147L196998P822748
36204B6770227L981095o726762r942352k455003K003884l429793p450725k039750
36196G10821K801099j668091n543137J907118J1210990P896275k320721l252833
36188A1741521M821348P882462K312898l317596o599587j1725244j4362212o341410
36180a5587820N664364O684921j160508j209773Q038309Q969351l811682j1666942
36172d079780j861062J1670727J1064563L90437o160760o860152p113145m199149
$$ plain form
36228 8192229 10701005 16339800 20969002 21673013 18091325 11198773 2429636 -5379809
36220 -5379809 -7613843 -1553329 8335238 12192127 5521077 -4221366 -6598069 -1688394
36212 -1688394 1945804 1466188 2938458 9143436 14410334 15750481 18947479 26770227
36204 26770227 30751322 24024560 14082208 11627205 13631089 10201296 2750571 710821
36196 710821 3511920 1843829 -3699308 -1792190 9418800 17315075 14994354 11741521
36188 11741521 16562869 24445331 26758229 23440633 16841046 5115802 -9246410 -15587820
36180 -15587820 -9923456 -3238535 -4399043 -5608816 2429493 11398844 7587162 -4079780
36172 -4079780 -5940842 5729885 16794448 17184885 11024125 4163973 -2949172 -7148321
36164g148321N263820J1893304N134554p617391r865737l56441O715464M166478
36156H185730k3585J778032N508129L558804l564803q058540m349691L914450
36148F948526O627201p94389r507068p772796J320952L310323m598983p839081
36140a2305315J836971J1865931R105893P85752M39942M615157J450510o296475
36132A1498366o578301o76445J86255k502899K706370J2356109R586961n655165
36124B0921251j1829203Q1683J0378500K079869j1658995r686830L476787P618868
36116A1381930K10863l111785K841272O028128J87571n151874k701386J228043
36108A0912762O13430O85993N739030P886652m43687j1220187j0653450L78112
$$ plain form
36164 -7148321 -1884501 10008803 15143357 7525966 -2339771 -2696212 4019252 8185730
36156 8185730 8162145 9940177 15448306 19007110 15442307 7383767 3034076 6948526
36148 6948526 13575727 12781338 3274270 -4498526 -3177574 132749 -4466234 -12305315
36140 -12305315 -10468344 1397587 10503480 11289232 11729174 16344331 17794841 11498366
36132 11498366 4920065 4243620 4429875 1926976 4633346 16989455 26576416 20921251
36124 20921251 9092048 9173731 19552231 21632100 9973105 286275 3763062 11381930
36116 11381930 11592793 8481008 11322280 17350408 17537979 12386105 9684719 10912762
36108 10912762 11526192 12212185 17951215 25837867 25394180 14173993 3520543 3898655
36100C898655Q059101N869083J264710J487786L765560L114006Q70025L88846
36092B8717772Q32255K23262n70985j257287m127196q122175o937961J011694
36084I769379O845072L245984l193135j488898N993307P287817O61474k808866
36076B6312134J673303M633818r45676p139623m182122L292678L792211l163131
36068B4273592p514072m012753K781246P785029J0695472J1238617O797181k409823
36060D9634489j0491889j1214547m526927L255179N257848P78382l490973r43048
36052B8258514O246695R525767N431394n61527l062782l200601l035405n37577
36044C9064478M894823Q176000N699324J373254j97339p38191k463739k005664
$$ plain form
36100 3898655 11957756 17826839 19091549 20579335 24344895 27458901 28328926 28717772
36092 28717772 29550027 29773289 29202304 27945017 23817821 15695646 8757685 9769379
36084 9769379 16614451 19860435 16667300 15178402 21171709 28459526 29121000 26312134
36076 26312134 27985437 32619255 31673579 24533956 20351834 23644512 27436723 24273592
36068 24273592 16759520 12746767 15528013 23313042 34008514 45247131 52044312 49634489
36060 49634489 39142600 27928053 23401126 26656305 31914153 32692535 29201562 28258514
36052 28258514 34505209 44030976 49462370 48900843 45838061 42637460 39602055 39064478
36044 39064478 43959301 52135301 57834625 59207879 59010540 58272349 55808610 53802946
36036E3802946K275521M023229p78038m221319J485872Q931639O155917k643713
36028F9032054l049163N490963R068177L293723m87625L170435M344732k533492
36020H8329804o704557J61894Q220963O087949P92531N159589J4443341J3434645
36012A29926159K156739l689312K226404Q233633M954266k07299L614642J3151942
36004A60367174J6086041Q683608j7225n71850O123574J1488402R636874L261262
35996B15057860m17292K070606P884543J2754712J4991023J3904562Q651284J514590
35988B76411888j537560K238906P526103P103372O53915o289618r533714q396735
35980B68176557m029506m74493l694578j3215551j8395458j1234413m6167J9226
$$ plain form
36036 53802946 56078467 60101696 59323658 55102339 56588211 65519850 71675767 69032054
36028 69032054 65982891 71473854 80542031 83835754 83348129 86518564 90863296 88329804
36020 88329804 81625247 81787141 90008104 96096053 96888584 102048173 116491514 129926159
36012 129926159 132082898 128393586 130619990 138853623 143807889 143600590 147215232 160367174
36004 160367174 176453215 185136823 185119598 184547748 190671322 202159724 211796598 215057860
35996 215057860 214640568 216711174 224595717 237350429 252341452 266246014 274897298 276411888
35988 276411888 274874328 277113234 284639337 291742709 292396624 286107006 276573292 268176557
35980 268176557 264147051 263672558 259977980 246762429 228366971 217132558 217086391 217105617
35972B17105617j0734063j5904392p268745K833812L43754r777620j2068117l408820
35964A61121426M217678J846659n846797r332904o184826j642710j585630o879054
35956A35713842j2453787j1879652m664612K535100M302304L066480L363819L081062
35948A23064556k782249j1240455j2426208l222495P051857P948880J22100p221888
35940A01294098p768356l695765j624535n148494j0701285j0935821l695351M091054
35932F1815545M797105K13478k080334o40383q24052l639734l168075K137343
35924E8610893M752660P384n240539k925013L484950M684788k43836l578014p38623
35915E8814650M900125P887817N617759j343527q769481j0248780m001775L426668
$$ plain form
35972 217105617 206371554 190467162 183198417 186032229 186375983 176598363 164530246 161121426
35964 161121426 165339104 167185763 161338966 152006062 145821236 144178526 142592896 135713842
35956 135713842 123260055 111380403 106715791 109250891 113553195 116619675 119983494 123064556
35948 123064556 120282307 109041852 96615644 93393149 100445006 108393886 108515986 101294098
35940 101294098 93525742 89829977 88205442 83056948 72355663 61419842 57724491 61815545
35932 61815545 66612650 66826128 64745794 64105411 63281359 59641625 56473550 58610893
35924 58610893 63363553 63370937 58130398 55205385 58690335 63375123 63131287 59553273 58814650
35915 58814650 63714775 71602592 77220351 75876824 67107343 56858563 52856788 56283456
35907E6283456M486296o57327o424319r085568p310556l27497Q464700J0863400
35899E6292585L939247l727004l469883O62311o16824o442336q478400n124740
35891C3034956j519922J554965O339163Q199451J052559q378029o807486M257397
35883C7733054Q902209J058250p471481p507215m823427n441357m515180R99801
35875A8934654L174631k414373n862381J254420J0324529Q868531o9816m941285
35867B9268910m299846m886455p174521o176000k537244p64625K23140L834763
35859G488122O583828K833431m241830o568322l304901K61416K690492N847273
35851A1589509P653102M882356L93297j111250j083030k510735k100798L355531
$$ plain form
35907 56283456 60769752 60112425 53688106 44602538 37291982 36964485 45429185 56292585
35899 56292585 60231832 56504828 53034945 53697256 53080432 46638096 38159696 33034956
35891 33034956 31515034 33069999 39409162 47608613 48661172 40283143 33475657 37733054
35883 37733054 46635263 47693513 40222032 32714817 27891390 22450033 17934853 18934654
35875 18934654 22109285 19694912 13832531 15086951 25411480 34280011 34210195 29268910
35867 29268910 24969064 20082609 12908088 6732088 4194844 3430219 3653359 7488122
35859 7488122 14071950 16905381 12663551 6095229 2790328 3051744 5742236 11589509
35851 11589509 19242611 24124967 24518264 23407014 22323984 19813249 17712451 21067982
35843B1067982P811016L972307l882114o322953l878762l890141o101807m160180
35835D615348J234340L429866J993852J494485P16861l907147o931673n42106
35827B103826R253574Q718941j633681p126419j971693L847115L003927J41141
35819A6336731o82239k295413m098327p91879M335534R65239q488087q341928
35811c060369M028422J0207681j79412j1102054n981772M709786J345604j1381509
35803a1413623j1452719N295130J8928340J5079900K172546n315524n423683l559112
35795D311255o20282M380229O821736J475732p072285p556407K540871J1148258
35787A5429107O332269o860227j2143341m332675L941673J993731l243811p63613
$$ plain form
35843 21067982 28878998 32851305 28969191 22646238 18767476 14877335 8775528 4615348
35835 4615348 5849688 9279554 11273406 12767891 13484752 9577605 2645932 2103826
35827 2103826 11357400 20076341 18442660 11316241 9344548 13191663 16195590 16336731
35819 16336731 15654492 13359079 9260752 8468873 12804407 13769646 5281559 -3060369
35811 -3060369 968053 11175734 10996322 -105732 -6087504 -1377718 -32114 -11413623
35803 -11413623 -22866342 -17571212 1357128 16437028 18609574 13294050 7870367 4311255
35795 4311255 3690973 8071202 14892938 16368670 9296385 1739978 4280849 15429107
35787 15429107 21761376 14901149 2757808 -1574867 2366806 4360537 1116726 353113
35779C53113M812747J634303p094389o957057K713026O494268j357152p370224
35771f771365k126353M324123Q76012n810823l950070L777426P145437N628180
35763C092567M797663K996138m068044j0815651q164739P30767M393781R33734
35755f103784n43919L839154O972672L071921l875833o847182m195885P88345
35747f894511L822669K294678k063527l589295O64309O301845P311058L953973
35739A1801199O97115j000207l011585n858906q074804q258572m719668L407243
35731a5018185J1565802J1440519J872596p089876o656087p63246J220185j723984
35723e152276l327296j093851J628224K442641J929685O45845l26180J610932
$$ plain form
35779 353113 5165860 6800163 -294226 -7251283 -4538257 1956011 598859 -6771365
35771 -6771365 -8897718 -4573595 -3697583 -9508406 -13458476 -9681050 -2535613 3092567
35763 3092567 7890230 10886368 6818324 -3997327 -12162066 -11431299 -7037518 -6103784
35755 -6103784 -6647703 -2808549 4164123 7236044 3360211 -3486971 -7682856 -6894511
35747 -6894511 -3071842 -777164 -2840691 -6429986 -5765677 536168 7847226 11801199
35739 11801199 12498314 11498107 8486522 2627616 -5447188 -13705760 -18425428 -15018185
35731 -15018185 -3452383 7988136 9860732 2770856 -3885231 -4648477 -3428292 -5152276
35723 -5152276 -8479572 -9573423 -7945199 -5502558 -3572873 -2927028 -3253208 -1642276
35715a642276N795243O202368O1157n508064k564922N463935Q391853L374803
35707A9574097l424883p130149p900866n542051J120440Q558948R479798J973303
35699A6708637o859693q813183l702752J039800o13066n446612m386092M473926
35691g599035J0597466N042079m535192l850456N150071O234147m556664j1445857
35683d963441m645070L839409J367521m321189l44806Q236985Q022359J59431
35675G351199m140783l414268l790062l708073J318026M598064k282501j0858573
35667a4926971o475751O210126R601201K783973J832615R888910J1111082o47140
35659A9378045j0331696p234893j084914k142533m232680o3905L188641k329063
$$ plain form
35715 -1642276 4152967 10355335 10416492 4908428 2343506 7807441 16199294 19574097
35707 19574097 16149214 9019065 1118199 -4423852 -3303412 5255536 14735334 16708637
35699 16708637 9848944 1035761 -2666991 -1627191 -2240257 -7686869 -12072961 -7599035
35691 -7599035 2998431 8040510 3505318 -345138 4804933 11039080 6482416 -4963441
35683 -4963441 -9608511 -5769102 -4401581 -8722770 -9067576 -830591 7191768 7351199
35675 7351199 3210416 -203852 -3993914 -7701987 -6383961 -1785897 -4068398 -14926971
35667 -14926971 -21402722 -15192596 -5591395 -2807422 -974807 8914103 20025185 19378045
35659 19378045 9046349 1811456 726542 -1415991 -5648671 -5712576 -2523935 -4852998
35651d852998r237088o940427J155518N574867O434921Q449749Q865203L452465
35643A2902210k451434j851336N37764m223673j2382793j1266087R94514J1380299
35635f360536R542552N16698l572724R89486O330702L871040m496199q638357
35627a817338m011381J614898K4835m031308o09941P437007P048459l773746j1003601
35618i122116n322072M843240P686799M173384J642316R65369o79349j785774
35610B401797k56313Q00440j240297k755258p17983R16014j357408l278227l15342
35601e802577L987548M841843M839204P391914Q017027J782592n806663n621402
35593A3629486Q60547L819750n91426o796907r110998p082079k887998M03729
$$ plain form
35651 -4852998 -14090086 -21030513 -19874995 -14300128 -7865207 584542 9449745 12902210
35643 12902210 10450776 8599440 9137204 4913531 -7469262 -18735349 -17740835 -6360536
35635 -6360536 3182016 3698714 125990 1115476 7446178 11317218 6821019 -1817338
35627 -1817338 -5828719 -4213821 -4188986 -8220294 -8830235 -1393228 5655231 1881485 -9122116
35618 -9122116 -14444188 -9600948 -1914149 2259235 3901551 4866920 4187571 2401797
35610 2401797 2145484 2945924 1705627 -1049631 -1767614 -851600 -2209008 -5487235 -5802577
35601 -5802577 -1815029 3026814 7866018 15257932 23274959 25057551 19250888 13629486
35593 13629486 14490033 18309783 17718357 10921450 1810452 -5271627 -8159625 -7755896
35585g755896l39453m114768m970499J16972O206766P549488N008686J903124
35577C604420j515987m345024k946626J347185O12255o276595q058643J401317
35569a6177698R997048M901568n602047m225660P277445J0723611M06896r209529
35561a908366o914212Q86017L847452J409122k630815o722546p209322Q58170
35553a8384500J2567758J4129839J952422r850395q903000j468307k43025m029156
35545a4228364j947339O873074J0895481L766285o135148p289725L23865O757848
35537i84023N308782l46843k696834o05551P23305q89381j041188K806764N310736
35528G585767J476951l974667l418541J064743J409082k351886k825932M31273
$$ plain form
35585 -7755896 -8095349 -12210117 -17180616 -17063644 -10856878 -3307390 1701296 3604420
35577 3604420 2088433 -2256591 -5203217 -3856032 -3243777 -9520372 -17579015 -16177698
35569 -16177698 -6180650 -1279082 -6881129 -11106789 -3829344 6894267 7301163 -1908366
35561 -1908366 -8822578 -7936561 -4089109 -2679987 -5310802 -12033348 -19242670 -18384500
35553 -18384500 -5816742 8313097 10265519 415124 -8487876 -9956183 -10199208 -14228364
35545 -14228364 -16175703 -9302629 1592852 5359137 -776011 -8065736 -7741871 -984023
35537 -984023 4324759 3977916 1281082 675531 1398836 509455 -531733 2275031 7585767
35528 7585767 9062718 5088051 1669510 2734253 4143335 1791449 -1034483 -603210
35520f03210o7835m530237l286551N552315R497673J337069p039967k509378P454363
35511E804242N761703p184734j3509592m198197R331032J2770961N884376k677211
35503A1982580p564847p809749l304919L062098M616746j515408q778048q135507
35495a7447054R85866J0312292J1753753M182831o610026j1862874o223137O041720
35487h866629J2993665P381701m020762q063636j825348M216607J332006n532202
35479b384598o281348j390837l33872m991860n021584N409665J5264244J0683649
35471A0953459l688376r791917k038758N296533Q89022o486012l293186O342270
35463a816965P327423k256188q598834l629990M663346O434238K610712j474291
$$ plain form
35520 -603210 -671045 -5201282 -8487833 -2935518 6562155 7899224 859257 -1650121 5804242
35511 5804242 11565945 4381211 -9128381 -13326578 -3995546 8775415 14659791 11982580
35503 11982580 4417733 -3392016 -6696935 -3634837 981909 -533499 -9311547 -17447054
35495 -17447054 -16461188 -6148896 5604857 9787688 3177662 -8685212 -14908349 -8866629
35487 -8866629 4127036 11508737 7487975 -575661 -2401009 1815598 3147604 -2384598
35479 -2384598 -8665946 -10056783 -10390655 -15382515 -20404099 -14994434 269810 10953459
35471 10953459 7265083 -2526834 -4565592 730941 1619963 -4866049 -8159235 -1816965
35463 -1816965 5510458 3254270 -5344564 -8974554 -4311208 2123030 4733742 3259451
35455C259451m765146o878463m687045J236703M648153L733399M356776P208177
35447H112005K948249j0351835j6824164m195372J3938143J4990687M03333q175117
35439H45929k942042J974012j613914l135025L947894P995344M02223p109381
35431C65040j835110P805125O461228l183298p254992l826461j422614j025925
35423c917007K410003N242078J57286p125352m462894N072671O928338J32204
35415D437327j431496M982093M989851o488189j3521737m882079O555530M526382
35407h32318m775157m259345O270402J1341739M453678m273556m957216j48184
35399B820043K009763j422359o663074p967526l041708L995230O385200K951656
$$ plain form
35455 3259451 -1505695 -8384158 -13071203 -11834500 -7186347 -3452948 903828 8112005
35447 8112005 11060254 708419 -16115745 -20311117 -6372974 8617713 9021046 845929
35439 845929 -2096113 -122101 -1736015 -4871040 -923146 7072198 7474421 365040
35431 365040 -1470070 6335055 12796283 9612985 2357993 -1468468 -2891082 -3917007
35423 -3917007 -1507004 3735074 3892360 -3232992 -7695886 -2623215 4305123 4437327
35415 4437327 3005831 7987924 12977775 6489586 -7032151 -11914230 -5358700 -832318
35407 -832318 -5607475 -9866820 -3596418 7745321 12198999 7925443 2968227 2820043
35399 2820043 4829806 3407447 -3255627 -11223153 -14264861 -10269631 -3884431 -932775
35391i32775p32278q03688L74001K88055L70021N87623k749927q684538q558791
35382b0842297J594842J1935992J0628442M01523n451378j055030O367712P849206
35374A1429012K514218m330863p646843o252650k833752o29028L31494J703008
35366e715404K374320N83426k0059N541328J2167042P777678p684540j7420097
35358b396306r910427M077530P201511M1220k972991L082297Q289100M863214
35350A2275148k751962o541405m849707j514010p53704l660176o237106k896412
35342a6929334M856979P905713K251644m033505k949636J535418K088683Q96817
35334d377221L157227M775442k36797n624773j129381Q603277R310658P562n804075
$$ plain form
35391 -932775 -1665053 -2468741 -2094740 -1806685 -1436664 -849041 -3598968 -12283506 -20842297
35382 -20842297 -19247455 -7311463 3316979 3718502 -1732876 -2787906 3579806 11429012
35374 11429012 13943230 9612367 1965524 -4287126 -7120878 -7749906 -7418412 -5715404
35366 -5715404 -3341084 -2757658 -2777717 2763611 14930653 22708331 15023791 -2396306
35358 -2396306 -12306733 -8229203 -1027692 -986472 -3959463 -877166 7411934 12275148
35350 12275148 9523186 2981781 -1867926 -3381936 -4135640 -7795816 -14032922 -16929334
35342 -16929334 -12072355 -4166642 -1914998 -5948503 -8898139 -7362721 -5274038 -4377221
35334 -4377221 -1219994 3555448 3318651 -2306122 -3435503 5167774 14478432 14485994 8681919
35325H681919k593192J70641l297796n504445p09318M535157L202328j469090
35317C016204l981686m905215m950267j129629M806695M624167k785230o582070
35309a1887031n63464N933026K967894l942374l607964K976106O217333L485505
35301A579031k04082k480714l851613j680237N321426J0057096N584509k103897
35293A2221519j592057N471875O358961j891470p335986k551335L812132J961054
35285A6454693l578849l390286j4014l050009j1155002j2086595j892511P794089
35277a0918484O756481R48874J974777Q317554P982413k113468j0764400q870255
35269f686508j436392J935670O30601N5737R71711J36800j718785q63902J869731
$$ plain form
35325 8681919 6088727 6259368 2961572 -2542873 -3252191 1282966 4485294 3016204
35317 3016204 -965482 -5870697 -10820964 -11950593 -7143898 -2519731 -5304961 -11887031
35309 -11887031 -12450495 -6517469 -3549575 -7491949 -11099913 -8123807 -1906474 1579031
35301 1579031 1374949 -1105765 -4957378 -6637615 -1316189 8740907 14325416 12221519
35293 12221519 10629462 16101337 22460298 20568828 13232842 10681507 14493639 16454693
35285 16454693 12875844 9485558 9471544 6421535 -4733467 -16820062 -18712573 -10918484
35277 -10918484 -4162003 -3213129 -1238352 7079202 15061615 12948147 2183747 -6686508
35269 -6686508 -8122900 -6187230 -5556629 -5500892 -4529181 -4392381 -6111166 -6975068 -5105337
35260e105337J891392j310275l704001l639882k932390j592315J889795N270133
35252i232880M494800J136156Q82792M059824M915540J413965j723082j480586
35244D466529p09141j608702k193008j701356k411255l489757n86225N323098
35236b909817O652570R31957m025210j826693L008615L188988n18180l112326
35228A389904l890847m254923k499526K037462M557133J762720j434973M22578
35220a910472L741063K161649k024942k101404J071010J677638J123107N850557
35212I588206J3108673J1186910k866644j6362873j7051142p729828R12927M696916
35204d516855O135418N810834K017459l092668m426227j264089J655341J152254
$$ plain form
35260 -5105337 -3213945 -4524220 -8228221 -11868103 -14800493 -16392808 -14503013 -9232880
35252 -9232880 -4738080 -3601924 -2719132 1340692 6256232 7670197 5947115 4466529
35244 4466529 3757388 2148686 -44322 -1745678 -4156933 -7646690 -8232915 -2909817
35236 -2909817 3742753 4674710 649500 -1177193 1831422 5020410 4502230 1389904
35228 1389904 -2500943 -6755866 -9255392 -7217930 -2660797 -898077 -2333050 -1910472
35220 -1910472 1830591 3992240 1967298 -134106 936904 2614542 3737649 9588206
35212 9588206 22696879 33883789 31017145 14654272 -2396870 -10126698 -9213771 -4516855
35204 -4516855 1618563 7429397 9446856 6354188 1927961 663872 2319213 3471467
35196C471467m24366N39211L786655N917903M483235J53459m267528o445329o593924
35187F20783o546709o175802k523070N106902J0856070P698665k408952q830018
35179b202131n230528K411222M828982K044810O73075J882245N29658m074734
35171H62599n538221q98571M205778M544345K193375J05869l641330r185078r746113
35162a7097347j253768Q526760R454272L414941J7166J297543R05109l233805
35154B030871n866587m132368j012242J567035M522470N983939K466366l448549
35146B110935m922845j221686J899520K420557L523692M432730L04838o878891
35138A668850q138829j470435M269591L193543k1895m78165n97161k359206k256683
$$ plain form
35196 3471467 3047101 3586312 7372967 13290870 17774105 17927564 13660036 7214707 620783
35187 620783 -5925926 -12101728 -14624798 -9517896 1338174 9036839 6627887 -2202131
35179 -2202131 -7432659 -5021437 -192455 1852355 2525430 4407675 4937333 862599
35171 862599 -4675622 -5574193 -1368415 3175930 5369305 5475174 1833844 -7351234 -17097347
35162 -17097347 -18351115 -9824355 -370083 3044858 3062024 4359567 5264676 2030871
35154 2030871 -3835716 -7968084 -8980326 -7413291 -2890821 3093118 5559484 2110935
35146 2110935 -2811910 -4033596 -2134076 286481 3810173 8242903 8547741 1668850
35138 1668850 -6469979 -7940414 -3670823 -477280 -499175 -977340 -1574501 -3933707 -6190390
35129f190390M18099L54235k903918j603242N937295R069222J425359p342048
35121h35388o760974j955685k661362n219936l370R742897J1684541L777562l933205
35112C835080n290909l488933j545945J179704L077802J076048k536312k744969
35104f438434m30965j05792r48263J001625L872734K763405m87175l00603J857763
35095G84295L68333k702973m59133N081707M852735j148745k856093K519582N357910
35086A1797618Q6573n559135l706264J801343L405324Q86584k096994m884652
35078A730397p068470n714905j001563J742009O03092Q95801N332380P753266
35070D272007K949201l978844n110347r76785K538481L458305K904962j54499
$$ plain form
35129 -6190390 -5772291 -5418056 -8321974 -9925216 -3987921 5081301 6506660 -835388
35121 -835388 -7596362 -9552047 -12213409 -17433345 -17436715 -7693818 3990723 7768285 3835080
35112 3835080 -1455829 -4944762 -6490707 -5311003 -2233201 -1157153 -3693465 -6438434
35104 -6438434 -6869399 -6975191 -7923454 -6921829 -3049095 -285690 -772865 -1073468 784295
35095 784295 1152628 -1550345 -2009478 3072229 7924964 6776219 3920126 6439708 11797618
35086 11797618 11884191 6325056 2618792 4420135 7825459 8712043 6615049 1730397
35078 1730397 -5338073 -11052978 -12054541 -10312532 -9709440 -8813639 -3481259 4272007
35070 4272007 7221208 3242364 -1867983 -2844768 -306287 3152018 6056980 5902481
35062E902481n840226q913623m970115J913401M833183M286702N071470N803492
35054H086765Q89406p525747r263311m68874R413069R503596J264861m542431
35046G357334k027252L513226L431162l449605r772698q649652j547733M313606
35038f831612N084480L720159M187466N979847O226173M084980M83467l848179
35030A9086781p260789o731647j961018K376733K399100R34044K914759O452078
35022A8210041M576330l840605j1044707j0292718l499068L666512Q931342J1459817
35014A8166944P894977k761743j2885012j2610847k739852N660077N929360L047729
35006I701633L185354L430983j754536r102826r881500k828602M054603M855098
$$ plain form
35062 5902481 62255 -8851368 -13821483 -11908082 -7074899 -2788197 2283273 8086765
35054 8086765 8976171 1450424 -7812887 -8281761 1131308 10634904 11899765 7357334
35046 7357334 5330082 8843308 12274470 8824865 -947833 -9597485 -11145218 -6831612
35038 -6831612 -1747132 1973027 6160493 12140340 18366513 22451493 22934960 19086781
35030 19086781 11825992 5094345 3133327 5510060 7909160 8843204 11757963 18210041
35022 18210041 22786371 18945766 7901059 -2391659 -5890727 -2224215 6707127 18166944
35014 18166944 26061921 23300178 10415166 -2195681 -4935533 724544 6653904 9701633
35006 9701633 12886987 16317970 14563434 5460608 -4420892 -7249494 -3194891 1660207
34998A660207K146081Q29946J599462K657526L058254K026197j112416m459314
34990H405943m613661j575838J019723J315075P17026l32877k784219m539980
34982b388808j916662K969470L190303k219518n727190k780677J713572K463957
34974d695553J474035J591946N59202k211546j216025N131214Q289092K481641
34966A1404006m289797k969727O16699m000459j1959143r329450L423785J0916554
34958f187532O420515O8159K98703J892111j748488o845071o881598k585038J993866
34949a3574373N600704P112724M345544l94504j281578J192668Q710n546398p007383
34940i543886j209629L261645M03093l206784o73983L237050J942517n52905J824792
$$ plain form
34998 1660207 3806288 4636234 6235696 8893222 11951476 13977673 12865257 8405943
34990 8405943 3792282 2216444 3236167 4551242 5268268 4935391 2151172 -2388808
34982 -2388808 -4305470 -1336000 1854303 -365215 -6092405 -8873082 -7159510 -4695553
34974 -4695553 -3221518 -1629572 -1070370 -3281916 -4497941 633273 8922365 11404006
34966 11404006 7114209 4144482 4761181 760722 -11198421 -20527871 -17104086 -6187532
34958 -6187532 232983 301142 599845 2491956 743468 -6101603 -12983201 -15568239 -13574373
34949 -13574373 -7973669 -860945 3484599 3090095 1808517 3001185 3009895 -2536503 -9543886
34940 -9543886 -10753515 -7491870 -7088777 -10295561 -10969544 -7732494 -5789977 -6342882 -4518090
34931d518090M380862j61789o795982m938258L766552P604392L005960j941391
34923D02256j807444K37010J470062L269653M046478n87527p844629q277618r5136
34914i186895O595417M530779p16794j229533J185301P84443j168463N2597K807704
34905C654556J861676j496382q63859M313871P165667L686706k228820n644411
34897A0449004o323584n461556k563196J219495J853230j426012l199026K55209
34889e196436M268977K750973j558610j091450M026286N758904R58650m062113
34881E855181m346803l486743n139076m692331L095775J2809644J3348030K857192
34873B0300869q678268j2027509p812292k142749J273225K394089K100526J046598
$$ plain form
34931 -4518090 -137228 -299017 -7094999 -12033257 -8266705 -662313 2343647 402256
34923 402256 -1405188 -1168178 301884 3571537 7618015 7030488 -814141 -9091759 -9186895
34914 -9186895 -2591478 1939301 1222507 -7026 1178275 1962718 794255 846852 3654556
34905 3654556 5516232 4019850 3155991 7469862 14635529 18322235 16093415 10449004
34897 10449004 4125420 -1336136 -3899332 -2679837 -826607 -2252619 -5451645 -5196436
34889 -5196436 -927459 1823514 264904 -826546 3199740 8958644 9917294 5855181
34881 5855181 1508378 -1978365 -7117441 -11809772 -8713997 4095647 17443677 20300869
34873 20300869 11622601 -404908 -8217200 -10359949 -9086724 -6692635 -4592109 -3545511
34865c545511j68903j128235j419603m46093J813458M293771N524098M102927
34857I025909o89474o435531p305491j132823M306848k63770j0230828j0278026
34849b3003186L199455J4367738J0430583M16492m73477M627979J690291q372071
34841B883804j0314821l80580P146032L066447l548050k089644L492251L943119
34833D198558n72673l878919m187599l310114j413524J199475K130285J170197
34825d664314J346019K754944J674461j822284k864497p20511j96437j644001
34817f136620N38319O114122O761804M10188l679846m53197K012829k837849p764232
34808e034482m061051L566459N197830P24768l564926n847786o204457j000038
$$ plain form
34865 -3545511 -3714414 -4842649 -6262252 -6708345 -4894887 -601116 4922982 9025909
34857 9025909 8336435 1900904 -5404587 -6537410 -2230562 -2494332 -12725160 -23003186
34849 -23003186 -19803731 -5435993 4994590 5411082 4937605 9565584 11255875 2883804
34841 2883804 -7431017 -7811597 -665565 2400882 -1147168 -3236812 255439 4198558
34833 4198558 3625885 -253034 -4440633 -7750747 -9164271 -7964796 -5834511 -4664314
34825 -4664314 -3318295 -563351 1111110 -711174 -3575671 -4296182 -4492619 -6136620
34817 -6136620 -5598301 515821 7277625 7687813 4007967 3554770 5567599 2729750 -5034482
34808 -5034482 -9095533 -5529074 -331244 393524 -3171402 -9019188 -15223645 -16223683
34800a6223683R477336J5096380Q711632j811434n222303l224490l544211m483533
34792a224306j96905N049317K847939l700260n051404k042031k602828n044146
34784a1964624q27560P690596Q978700K065746j701134J662520L245527j373218
34776G776553m519187j197776K371062J019520p98312Q74374J706922j839882
34768E393274n006377k924790J455304L338760L107088K657666J160025j609645
34760G571305l525321m172576m775855l507081J709748O057807K968363l758273
34752a431883m174116J195184K201488k033245q31388P065493P512204n190193
34744D313544j4737204o059675J0944210J5805312N872263n049950r154523r742412
$$ plain form
34800 -16223683 -6746347 8350033 17061665 15250231 10027928 6803438 3259227 -1224306
34792 -1224306 -1421211 3628106 6476045 2775785 -2275619 -4317650 -6920478 -11964624
34784 -11964624 -12792184 -5101588 3877112 5942858 4241724 5904244 9149771 7776553
34776 7776553 3257366 2059590 4430652 5450172 4651860 5526234 7233156 5393274
34768 5393274 386897 -2537893 -1082589 2256171 5363259 8020925 9180950 7571305
34760 7571305 4045984 -126592 -4902447 -8409528 -6699780 -641973 2326390 -1431883
34752 -1431883 -5605999 -4410815 -2209327 -4242572 -5073960 1991533 9503737 4313544
34744 4313544 -10423660 -16483335 -5539125 10266187 16138450 11088500 1933977 -7808435
34736g808435q156551j497404P138684R556810M857824M36180j56607o35118k405751
34727A329632j300941L473815N283048r29228j0664930j4593996q890917J010698
34719b5282819O132684L494316l27941K136737P740247O391012k305743n573885
34711g595392L459247J2785262P918315n921794j1198300l850932K844895L26674
34703a232025l839227q96511N064221N375404M52762k971221k884387k642365
34695c573349l560887l410851j183777J460722L080814L521207K710085Q63218
34687i2818r00290k007736l209132m203279k575105K228430N839058L746565j714620
34678b888927l563290K33431M067607L441544J454785K572455M356104J825567
$$ plain form
34736 -7808435 -15964986 -17462390 -10323706 -766896 4090928 4527108 4370501 3735383 1329632
34727 1329632 28691 3502506 8785554 7856326 -2808604 -17402600 -26293517 -25282819
34719 -25282819 -19150135 -15655819 -15983760 -13847023 -6106776 284236 -2021507 -7595392
34711 -7595392 -4136145 8649117 16567432 10645638 -552662 -4403594 -1558699 -1232025
34703 -1232025 -5071252 -5967763 -903542 4471862 4924624 1953403 -930984 -3573349
34695 -3573349 -7134236 -10545087 -11728864 -10268142 -7187328 -3666121 -956036 -92818
34687 -92818 -993108 -3000844 -6209976 -10413255 -12988360 -10759930 -4920872 -1174307 -2888927
34678 -2888927 -6452217 -6218786 -2151179 1290365 2745150 5317605 9673709 11499276
34670A1499276k689269k354138J972622J871916m184806o815476j220881L792193
34662A871437N68664l641402M57918O149747J067458r912383j0509923k43155
34654a4191639M170476k604558n318057M550374J2202422L699972r659655q380061
34646a5530726N163891J2007581N225392m208504o746015l577647J881411P548598
34638A763981Q238280P09132p022503l904657O546645R574138J121730o505911
34630A0520835l744199L686278N838298J573013m669847j0034577j1657817n808984
34622a4297000N344574J2136241Q206778j354450o894401n426513j580085o67263
34614d532119l612347o582814m771580J279325M594501R33083l532435j3089R459556
$$ plain form
34670 11499276 8810007 6455869 8428491 10300407 6115601 -699875 -1920756 1871437
34662 1871437 2440101 -1201301 -743383 5406364 6473822 -3438561 -13948484 -14191639
34654 -14191639 -10021163 -12625721 -17943778 -13393404 -1190982 2508990 -7150665 -15530726
34646 -15530726 -10366835 1640746 6866138 2657634 -4088381 -7666028 -5784617 1763981
34638 1763981 10002261 10711393 3688890 -215767 6330878 15905016 17026746 10520835
34630 10520835 6776636 10462914 16301212 17874225 13204378 3169801 -8488016 -14297000
34622 -14297000 -8952426 3183815 11390593 10036143 3141742 -2284771 -3864856 -4532119
34614 -4532119 -8144466 -14727280 -19498860 -18219535 -13625034 -12691951 -16224386 -16237475 -6777919
34605f777919J4242560R768928J618820m644850q480584q921291m238849J322628
34597f110557O66411l941766k411494O194925R902971K570311n191352k175106
34589d95657O084869O411710k365993r461721q043066j749666K971652L674427
34581b973445J666346q4501O25121K542213K753903J776807K350029K970329l16969
34572A1309833m815793l146753L389530M536081j485328k955930N478063J1167125
34564B3476828L008267r188830r296233M31789N364105K324933r775j83956m773197
34555A1153931j1057590p567467N301815J2216881N571921l732973m537632p76046
34547F572840n80283j962163P80677N079329M513293k95202l579313l409494k218638
$$ plain form
34605 -6777919 7464641 17233569 18852389 14207539 5726955 -3194336 -7433185 -6110557
34597 -6110557 -5444146 -9385912 -11797406 -5602481 4300490 6870801 1679449 -495657
34589 -495657 5589212 12000922 9634929 173208 -7869858 -9619524 -6647872 -2973445
34581 -2973445 -1307099 -1391600 -766479 1775734 4529637 6306444 8656473 11626802 11309833
34572 11309833 6494040 3347287 6736817 11272898 9787570 6831640 12309703 23476828
34564 23476828 26485095 17296265 8000032 8431821 13795926 16120859 16111084 15927128 11153931
34555 11153931 96341 -7471126 -2169311 10047570 15619491 11886518 7348886 6572840
34547 6572840 5992557 4030394 4811071 9890400 14403693 14108491 10529178 7119684 4901046
34538D901046j470073q18361J77864K594924O699532Q251087K132781p993424
34530A4475376j1070396l706144L813583K190731l622758l323042K699384N329024
34522F785758J332216l043366k404240J063396K003036j561635o621345p813829
34514a0260009k851673L328060L230689k583509m848977J055847P468118N856856
34506C95402k38439j596719K137277L720336J268184j32919J078070Q28400j292005
34497F167587j35199N108749P658175L422926k707965m856108l973389l385217
34489G299559k533980j97026J136632m70167j812280M80892L826310L711193O48040
34480A2089173k027614l892937n168586k408749N864162J1770405N787132q038274
$$ plain form
34538 4901046 3430973 2612612 2790476 5385400 12084932 20336019 22468800 14475376
34530 14475376 3404980 -301164 3512419 5703150 2080392 -1242650 1456734 6785758
34522 6785758 8117974 5074608 2670368 3733764 5736800 4175165 -2446180 -10260009
34514 -10260009 -13111682 -9783622 -6552933 -9136442 -13985419 -12929572 -5461454 395402
34506 395402 156963 -1439756 697521 4417857 5686041 5553122 6631192 7459592 6167587
34497 6167587 6032388 11141137 18799312 22222238 19514273 14658165 10684776 7299559
34489 7299559 4765579 4568553 5705185 5235018 3422738 3903630 7729940 11441133 12089173
34480 12089173 10061559 6168622 1000036 -1408713 4455449 16225854 22012986 13974712
34472A3974712j4232845n846299O524559R762922M002544k448308o215815q541694
34464c020224p461673l34179Q189126J0155022N585204J184376j559589p063451
34456E674612j3384187j0573732L583230J5703685J2554690j438666j0391892
34449A727740o789738K330715O701814L569933k087927l208749K654645R192706
34441A4091139O685651n090246j3701892r105884K574132P424635K391745l069921
34433B199359k396318L18465q68126m946408o773995l739183K328532O641940
34425g235734M927304j251383m278866K08878O503670O773182K452222L70841
34417H470114O93132j933154o926027p828031l776087o34045J79679L534440R424435
$$ plain form
34472 13974712 -258133 -6104432 420127 10183049 14185593 11737285 5521470 -3020224
34464 -3020224 -10481897 -10816076 -2626950 7528072 13113276 14297652 12738063 5674612
34456 5674612 -7709575 -18283307 -14700077 1003608 13558298 12119632 1727740
34449 1727740 -5061998 -2731283 3970531 7540464 5452537 2243788 4898433 14091139
34441 14091139 20776790 15686544 1984652 -7121232 -4547100 2877535 5269280 2199359
34433 2199359 -196959 121506 -746620 -5693028 -12467023 -16206206 -13877674 -7235734
34425 -7235734 -2308430 -3559813 -7838679 -7629801 -1126131 5647051 8099273 8470114
34417 8470114 9163246 7230092 304065 -7523966 -11300053 -11934098 -11754419 -8219979 1204456
34408A204456J0466042L710478m443589q218306q462417o467284j546149K884903
34400a0871866J377672k833397o64535O564906P006605j579898o519592j369068
34392h889173L453600J54799k446852L470144Q486659K495732n870674l607253
34384b753018M099894M293505k04796K025073P329525K501517r381301j0893885
34376b983486J292009J0471748N814514m051533q136848p344194n651378j505480
34368a2094648M931860P515418L622398j137222k201529j656373j783196j663442
34360d466734j966768m170585m476707J418149P775103N067218l166807l737147
34352g724278M418993P451512l74475o928728k663050M145742K575293k919616
$$ plain form
34408 1204456 11670498 15380976 10937387 2719081 -5743336 -12210620 -13756769 -10871866
34400 -10871866 -9494194 -12327591 -12992126 -6427220 579385 -1000513 -7520105 -8889173
34392 -8889173 -5435573 -5280774 -7727626 -4257482 4229177 6724909 854235 -2753018
34384 -2753018 1346876 5640381 5435585 7460658 14790183 17291700 7910399 -2983486
34376 -2983486 -1691477 8780271 14594785 10543252 2406404 -4937790 -10589168 -12094648
34368 -12094648 -7162788 352630 3975028 2837806 636277 -1020096 -2803292 -4466734
34360 -4466734 -6433502 -10604087 -15080794 -13662645 -5887542 -820324 -3987131 -7724278
34352 -7724278 -3305285 4146227 3771752 -3156976 -5820026 -1674284 901009 -2018607
34344b018607j407590O305548R936579N168000k456689o145069m084609N16843
34336E814406K211878q73260l315794N29434O590280N869806j506280o482438
34328H838032n194628k291391J26329M947796J0163339R057909K462041j491727
34320B6617700j588106m372130r392943q385303j282416K599251J505278K433562
34312H134893L847029k654470j0856016m136759J3160061J5492681k710370j4385313
34304E891736l451876Q545314P46844j0786992l397423J0453245N686804r868755
34296C818897r470558N061501P801881m874766r405454K833119J2538864O851192
34288A5154676k782161m446098k365207k073239n27313K219013K49434m578317
$$ plain form
34344 -2018607 -3426197 2879351 12815930 17983930 15527241 9382172 5297563 5814406
34336 5814406 8026284 7153024 3837230 4366664 10956944 16826750 15320470 8838032
34328 8838032 3643404 1352013 1478342 6426138 16589477 25647386 28109427 26617700
34320 26617700 25029594 20657464 11264521 2879218 1596802 4196053 5701331 8134893
34312 8134893 11981922 9327452 -1528564 -5665323 7494738 22987419 20277049 5891736
34304 5891736 2439860 10985174 11732018 945026 -2452397 8000848 13687652 3818897
34296 3818897 -5651661 -590160 7211721 2336955 -7068499 -4235380 8303484 15154676
34288 15154676 12372515 7926417 5561210 3487971 2960658 5179671 5429105 850788
34280H50788l652851J582807J737968j560046J296089O595354J603080r661759
34272a208570r611423K106742P105708R97051l04453P098131O313999o751563
34264E745622j1294337K117355J1924090J158929j3458516j0232242K515783M933233
34256f590083Q8327L111923J0115083N497933q218414j3346772n470186K907530
34248a1904659M406502L436750K783467L86975j685077O75859M084045K223259
34240D407121k901904n041022m500625m297064j592926N539783R483641L694806
34232D791810m668504n715198l234299n642808p759366R98452J4749685J6147633
34224I667405K704398q897295o726178K671614P334113M409214j742491o347183
$$ plain form
34280 850788 -2802063 -1219256 518712 -1041334 254755 6850109 8453189 -1208570
34272 -1208570 -10819993 -8713251 -1607543 -610492 -914945 6183186 12497185 5745622
34264 5745622 -5548715 -3431360 8492730 9651659 -3806857 -14039099 -11523316 -6590083
34256 -6590083 -6501756 -3389833 6725250 12223183 4004769 -9342003 -14812189 -11904659
34248 -11904659 -7498157 -4061407 -1277940 -890965 -2576042 -1900183 2183862 4407121
34240 4407121 1505217 -3535805 -8036430 -12333494 -13926420 -8386637 1097004 4791810
34232 4791810 123306 -5591892 -8826191 -14468999 -22228365 -21229913 -6480228 9667405
34224 9667405 12371803 3474508 -3251670 -580056 6754057 11163271 9420780 3073597
34216C073597o306975k333122N48754J8929R11196O033264Q067747K39661j0249756
34207C295j1126387l381362J628965L17460p74639J298324K867276L475280O165433
34198D73645Q294300M219322k925401m122964P16910K769973m59579j976316J419669
34189H409559M281436K757776p69840m456929q260463q295413j026164O827848
34181e32190M773590m338025o727184R83086O643971K436964l850598l243720
34173c854106J047482K043431O21250Q72724J672253J64554k107640k240865m58900
34164b239817K034283M863757O127607L748168J14173r43299j610595o533322
34156E560955j2173364r567848J371689J0350385J0796465N601978j521282q787300
$$ plain form
34216 3073597 -3233378 -5566500 -5017746 -4998817 -4087621 1945643 10013390 10253051 3295
34207 3295 -11123092 -14504454 -12875489 -12558029 -13332668 -12034344 -9167068 -5691788 473645
34198 473645 8767945 12987267 10061866 5938902 6655812 9425785 8966206 6989890 8409559
34189 8409559 12690995 15448771 14678931 10222002 1961539 -6333874 -7360038 -532190
34181 -532190 4241400 -96625 -6823809 -5840723 803248 3240212 -610386 -3854106
34173 -3854106 -2806624 -763193 -141943 730781 2403034 2567588 459948 -1780917 -2239817
34164 -2239817 -205534 4658223 10785830 14533998 14648171 13704872 12094277 5560955
34156 5560955 -6612409 -16180257 -14808568 -4458183 6338282 11940260 10418978 1631678
34148A631678j0089629k9516J2719127J2300872m35758p450148k115956O98868
34140G229538p487924j1161395K815860J8556647J2502548r598031k0389335j0572562
34132a8104654K082774L604325J817246P133599J3137365P770370o216881j3548468
34124b324324n970234Q213007J4187683O412145o645481j2546030q041846k89420
34116g004500L647258L409806J024710k936505n665439j938576O835195J0063956
34108G435905J707613q929259q521814K061521R659524O745260r49873m191311
34100E017566o78900M552384M600810k607582j0224501q573875J498365P485319
34092A069586K564427l797107r64719N267038K574078o352071p423538J839629
$$ plain form
34148 1631678 -8457951 -8487467 4231660 16532532 16096774 8646626 6530670 7229538
34140 7229538 -258386 -11419781 -8603921 9952726 22455274 12857243 -7532092 -18104654
34132 -18104654 -16021880 -12417555 -10600309 -3466710 9670655 17441025 11224144 -2324324
34124 -2324324 -8294558 -81551 14106132 20518277 13872796 1326766 -6715080 -7004500
34116 -7004500 -3357242 52564 1077274 -1859231 -7524670 -9463246 -2628051 7435905
34108 7435905 9143518 214259 -8307555 -6246034 3413490 10158750 9208877 5017566
34100 5017566 4338666 8891050 13491860 10884278 659777 -7914098 -6415733 1069586
34092 1069586 3634013 -163094 -1127813 4139225 6713303 361232 -7062306 -5222677
34084e222677Q809734O471521K326434K736507K788891j822817n433998k956487
34076G697108P23854L21074k88893K896753M223892j793245q179687n037979L679600
34067D242477N672438j18891k555630K954209P515996L717880l434312n726386
34059A2267781l167020k92648J814438L297893J250541m943989q399472k931613
34051a104089O195328Q092459J691209l421888k278485j190209n394798q809319
34043f219792l459849O529560R408802K306737n343903n546299j196497R70810
34035b550431L96768Q03885K459070K182127k67697j108602J400237L792058K312805
34026I420220j505435k924367o50874J640022J053960j45648J727716N560411
$$ plain form
34084 -5222677 3587057 10058578 12385012 15121519 17910410 16087593 10653595 7697108
34076 7697108 8420962 8742036 8453143 11349896 15573788 13780543 5600856 562877 4242477
34067 4242477 9914915 9796024 7240394 10194603 17710599 21428479 17994167 12267781
34059 12267781 9100761 8808113 10622551 13920444 15170985 10226996 1827524 -1104089
34051 -1104089 5091239 13183698 14874907 11453019 9174534 7984325 2589527 -6219792
34043 -6219792 -9679641 -3150081 6258721 8565458 3221555 -2324744 -3521241 -2550431
34035 -2550431 -2153663 -1349778 1109292 3291419 3023722 1915120 3315357 7107415 9420220
34026 9420220 7914785 4990418 4339544 5979566 7033526 6887878 8615594 14176005
34018A4176005O470772K575811l035558p327351r982942r981969m806336L886029
34010h025539Q731680N327896j506613m815760m533499l714140p80580N967027
34002c349528R993483L753041o926714p970324J749938P157858j37205q252590
33994c982041l264336R271822J3192527N697744j190810r94362p97209o218780
33986A1714555j0218090m141365P135065J0150710J345317p346179m143438O577578
33978A1074153R812752K18352j0243342q198136L582959J1093743P881927N04307
33970B5726715l546345l984653k569561Q33598L704584J033795n429332o308318
33962I460483J386609P344262K249881p984630j0733013m023865L311985M829029
$$ plain form
34018 14176005 20646777 23222588 20187030 12859679 2876737 -7105232 -11911568 -8025539
34010 -8025539 706141 6034037 4527424 -288336 -4821835 -8535975 -9316555 -3349528
34002 -3349528 6643955 10396996 3470282 -4500042 -2750104 4407754 4270549 -3982041
33994 -3982041 -7246377 2025445 15217972 20915716 19724906 18730544 17933335 11714555
33986 11714555 1496465 -2644900 4490165 14640875 15986192 8640013 4496575 11074153
33978 11074153 20886905 21105257 10861915 2663779 6246738 17340481 25222408 25726715
33970 25726715 22180370 18195717 15626156 16459754 20164338 21198133 15768801 9460483
33962 9460483 10847092 18191354 20441235 12456605 1723592 -2300273 1011712 5840741
33954E840741J486109l156643n058685o08772P080141P431989l335659j2556306
33946b877085o844043P184931J1705251M521812P60867O638370R358664l4190
33938C0414577r798839n281924P888199J2365323M264758m307300n377290m186278
33930B5981226o407422p863994k757585N220252P364209K551707j499986L14705
33922B2903112L870099L569018J748720M221584Q697619O073664m873831j2504464
33914C3705521p536159L478235P553665L123181p94645j26790K81097k070617
33906C7613488k804421J73129K174907J20554k230117j481221l43163j852252
33898C1370904l639519k390978P35003L024171M230633M477396K572283o21649
$$ plain form
33954 5840741 7326850 4170207 -888478 -1497250 5582891 13014880 9679221 -2877085
33946 -2877085 -9721128 -2536197 9169054 13690866 14451733 21090103 30448767 30414577
33938 30414577 20615738 15333814 23222013 35587336 39852094 35544794 30167504 25981226
33930 25981226 19573804 11709810 8952225 14172477 21536686 24088393 22588407 22903112
33922 22903112 26773211 30342229 32090949 36312533 45010152 51083816 46209985 33705521
33914 33705521 26169362 29647597 37201262 40324443 39529798 39403008 39684105 37613488
33906 37613488 34809067 34982196 37157103 37277657 35047540 33566319 33223156 31370904
33898 31370904 27731385 25340407 26075410 29099581 33330214 37807610 40379893 39758244
33890C9758244j617203L28328K065955K780026N292088Q582570O269749l033885
33882F0425872j0641170q640858k41464O031724O954730M127538j073439n801454
33874E1141479m781533J983143N910767J537475m070253j986436M056862M184482
33866E7975986q01409j253120M103174N318753k445265j0558429r185674j68980
33858D2985036O821970N869659p88747o294066n224980J131452N607165L981074
33850E4088563O70642J247837K908711m79878o701371p531559j607590M271464
33842D6866819O342962O793669N509427k66608o730844n630816J314423J937493
33834E6136525p569937j5060457j0342277L23156N800098N773376N109350K173478
$$ plain form
33890 39758244 38141041 38469369 40535324 43315350 48607438 57190008 63459757 60425872
33882 60425872 49784702 41143844 40902380 46934104 53888834 58016372 56942933 51141479
33874 51141479 46359946 48343089 54253856 55791331 51721078 49734642 53791504 57975986
33866 57975986 57174577 55921457 60024631 65343384 62898119 52339690 43154016 42985036
33858 42985036 49807006 55676665 54887918 48593852 43368872 44500324 50107489 54088563
33850 54088563 54759205 56007042 58915753 58435875 51734504 44202945 42595355 46866819
33842 46866819 53209781 60003450 65512877 65246269 58515425 52884609 54199032 56136525
33834 56136525 48566588 33506131 23163854 23487010 29287108 35060484 40169834 42343312
33826D2343312n223815r748561l825586N725056N714088l328165q079294k651598
33818B0925437M591967N464882J776392j694725m067629m987269k742078J073429
33810B0340406K055002M16508R75393M039162M023585o29173m233726l555911
33802B3431246k555280l563927k045007M359089R040488N556291k205064n965161
33794B6052675m463517j897245Q57694N426894Q791601N359990l736337j0337808
33786B6053947r499885m652376j076318Q45374L195175M918658K619808l568266
33778A8836117p967450n107392L118499Q387993N335367j962891n342551k752190
33770A2545502N34925J30405k366026k986341m10793L415915M912294J555484
$$ plain form
33826 42343312 37119497 27370936 23545350 29270406 34984494 31656329 23577035 20925437
33818 20925437 25517404 30982286 32758678 31063953 26996324 22009055 19266977 20340406
33810 20340406 22395408 22811916 23787309 27826471 31850056 31220883 26987157 23431246
33802 23431246 20875966 17312039 15267032 19626121 28666609 34222900 32017836 26052675
33794 26052675 21589158 19691913 20549607 25976501 34768102 40128092 36391755 26053947
33786 26053947 16554062 11901686 10825368 11670742 14865917 19784575 22404383 18836117
33778 18836117 10868667 5761275 8879774 17267767 22603134 20640243 15297692 12545502
33770 12545502 13080427 13210832 10844806 7858465 7447672 10863587 15775881 17331365
33762A7331365l977969m373867K768592Q669813M028300o315181r295815l314222
33754E521016L82538k499844k660364M345092Q137365J459428n844063l353598
33746E487570J860488j017919n596230M88971J1314500J0504292q61438o147400
33738A6032834k192816l278688j2552495j3180284K564640J6636352J1762454
33731A5791997k197573m931878L857892Q427387L273613k438567l197471l629551
33723A4955849o358625o576602j471051M114008M449697j75251m783665m666790
33715e12430K86849M067202N19518p004742p716897J296455R337221P566076J999608
33706I838860K469475O386242M874925p67963j875446J561424J125927m586897
$$ plain form
33762 17331365 13353396 8979529 11748121 20417934 24446234 18131053 8835238 5521016
33754 5521016 5903554 3403710 743346 5088438 13225803 14685231 8841168 5487570
33746 5487570 7348058 6330139 733909 1222880 12537380 23041672 22180234 16032834
33738 16032834 13840018 10561330 -1991165 -15171449 -12606809 4029543 15791997
33731 15791997 13594424 8662546 12520438 20947825 24221438 21782871 18585400 14955849
33723 14955849 8597224 2020622 549571 4663579 9113276 8938025 4154360 -512430
33715 -512430 -225581 3841621 4361139 -2643603 -10360500 -9064045 273176 7839252 9838860
33706 9838860 12308335 18694577 23569502 22801539 20926093 22487517 23613444 19026547
33698A9026547p577821m341286m67275J80967J4202p8112k091849k775151L968908
33689E859130J3557500J2208438k703184j5682829j3830271l939575j66136l769336
33681h466263n459490j377926L776821N689218L658750j881806p512744o277533
33673a7850973L246942J1233127Q420223J7213j783162L539113M730688k871762
33665H681409j0028946p489386J846280Q676711Q381540K631340m260662p060720
33657A377566k814578M332997O137454R77560l307708m71831N444323O690991
33649A8366774K439007k261785m562234n312815m766455k235717P78903J488252
33641C933930l15902k159953j969561P19151M875469P449746N467080O66488j760184
$$ plain form
33698 19026547 11448726 7107440 6640165 6821132 6835334 6757222 4665373 1890222 5859130
33689 5859130 19416630 31625068 28921884 13239055 -591216 -4530791 -4696927 -8466263
33681 -8466263 -13925753 -15303679 -11526858 -5837640 -2178890 -4060696 -11573440 -17850973
33673 -17850973 -14604031 -3370904 5049319 5066532 3283370 6822483 11553171 8681409
33665 8681409 -1347537 -8836923 -6990643 1686068 10067608 12698948 8438286 1377566
33657 1377566 -1437012 2895985 9033439 10010999 6703291 6231460 11675783 18366774
33649 18366774 20805781 18543996 13981762 8668947 3902492 1666775 2445678 3933930
33641 3933930 3618028 1458075 -511486 207665 5083134 12532880 17999960 18666448 16906264
33632A6906264j394038l856795r824106j0272895m43688Q693202M649587n896277
33624a438746n504014O399291J1334665N58838j1248266r442361j006211l6195
33616a0382999m011856n27531R834734J4231307Q399603J478792j60569m78099
33608A8383382l066874m338139j065905L556090M559768K93472p670546j4330610
33600c679362j2770722k726843N183812K164566n337336n216922J195167K940406
33592a8247234m34049J145558Q047936Q626904P28294k679329L858827P711361
33584H758268l1965q682511o327712M38578m02104n623096m862305J43460N71841
33575a6017546k193627Q2551O624677R297728O395197K509718r74469l817559
$$ plain form
33632 16906264 15512226 11655431 1831325 -8441570 -8885258 -192056 4457531 -1438746
33624 -1438746 -6942760 -543469 10791196 11350034 101768 -9340593 -10346804 -10382999
33616 -10382999 -14394855 -14922386 -5087652 9143655 17543258 19022050 18861481 18383382
33608 18383382 15316508 10978369 9912464 13468554 18028322 18321794 10651248 -3679362
33600 -3679362 -16450084 -19176927 -13993115 -11828549 -17165885 -22382807 -21187640 -18247234
33592 -18247234 -18681283 -17535725 -9487789 -860885 -132591 -2811920 1046907 8758268
33584 8758268 8726303 43792 -6283920 -5845342 -6247446 -11870542 -16732847 -16589387 -16017546
33575 -16017546 -18211173 -18128622 -11503945 -2206217 4188980 6698698 5724229 1906670
33567A906670j248933P388723J1086917K044133q865436p032419K324648L482275
33559A1086578k784151k465570M484937L393916p337517j0882837j43284J0006125
33551E358197P223601l74648j156118J738353Q07802j108741J014007K795094
33543A6297547r72297n303284l616469N51128N31268j941037j676820k5890r46348
33534B897798k776322k060154m64685q82490j743936j157889j206444k998350
33526a0392472l574027k001713j278707o18289M702740J1757324J0071081o01246
$$ plain form
33567 1906670 657737 8046460 19133377 21177510 12312074 5279655 7604303 11086578
33559 11086578 8302427 5836857 10321794 13715710 6378193 -4504644 -4647928 5358197
33551 5358197 12581798 12207150 11051032 12789385 13597187 12488446 13502453 16297547
33543 16297547 15325250 10021966 6405497 6956625 7487893 5546856 3870036 3844146 2897798
33534 2897798 121476 -1938678 -2403363 -3285853 -5029789 -6187678 -7394122 -10392472
33526 -10392472 -13966499 -15968212 -17246919 -17865208 -13162468 -1405144 8665937 8064691
$$ [...]
##END NTUPLES=NMR SPECTRUM
##END=
