##TITLE=31Pdec_LR-738-B-CR7C
 D2O, 24 sc
 19.11.2021
##JCAMPDX= 6.0         $$ Bruker NMR JCAMP-DX V2.0
##DATA TYPE= NMR SPECTRUM
##DATA CLASS= NTUPLES
##ORIGIN= UXNMR, Bruker Analytische Messtechnik GmbH
##OWNER= root
$$ XWIN-NMR		Version 3.5
$$ Fri Nov 19 11:49:25 2021 Russian Standard Time (UT+4h)  she@DPX200
##.OBSERVE FREQUENCY= 81.013821
##.OBSERVE NUCLEUS= ^31P
##.ACQUISITION MODE= SIMULTANEOUS
##.ACQUISITION SCHEME= undefined
##.AVERAGES= 24
##.DIGITISER RES= 16
##SPECTROMETER/DATA SYSTEM= spect
##.PULSE SEQUENCE= zgpg30
##.SOLVENT NAME= CDCl3
##.SHIFT REFERENCE= (INTERNAL, CDCl3, 0, 248.564)
##AUDIT TRAIL= $$ (NUMBER, WHEN, WHO, WHERE, WHAT)
$$ ##TITLE= Audit trail, XWIN-NMR		Version 3.5
$$ ##JCAMPDX= 5.01
$$ ##ORIGIN= Bruker BioSpin GmbH
$$ ##OWNER= she
$$ F:/spectra/data/she/nmr/P31/1/pdata/1/auditp.txt
$$ ##AUDIT TRAIL=  $$ (NUMBER, WHEN, WHO, WHERE, WHAT)
(   1,<2021-11-19 11:48:11.48 +0400>,<she>,<DPX200>,
      <created by zg, POWCHK disabled, PULCHK disabled
       configuration hash MD5:
       00 E9 B6 7A A2 85 ED C7 34 08 36 98 17 FE 4E 26
       data hash MD5: 32K
       80 3D 83 20 21 8A E5 72 AF BB 9D DD 91 A4 C9 6F>)
(   2,<2021-11-19 11:48:17.00 +0400>,<she>,<DPX200>,
      <Start of raw data processing
       efp BC_mod = 2 LB = 1 FT_mod = 6 PKNL = 1 PHC0 = -9101.42 PHC1 = -108.3308 SI = 64K 
       data hash MD5: 64K
       4B C6 02 54 44 F1 CC D1 68 39 38 C0 5C 49 F3 54>)
(   3,<2021-11-19 11:48:45.18 +0400>,<she>,<DPX200>,
      <pk PHC0 = -134.7428 PHC1 = 269.8002 
       data hash MD5: 64K
       87 B4 A1 11 78 BF E7 E7 33 FF CA E6 A2 62 92 19>)
(   4,<2021-11-19 11:48:48.50 +0400>,<she>,<DPX200>,
      <abs ABSG = 5 
       data hash MD5: 64K
       BE 4B D0 B5 B9 2F AD AF 1E 73 37 AD 88 EC 74 E9>)
$$ ##END=
$$ 
$$ hash MD5
$$ 63 DF E7 1B B6 9D 7C 42 16 37 18 C9 1A F7 43 49
##$RELAX= 
##$RELAX= 
##$RELAX= 
##$RELAX= 
##$RELAX= 
##$RELAX= 
##$RELAX= 
##$RELAX= 
$$ Bruker specific parameters
$$ --------------------------
##$DU= <F:/spectra>
##$EXPNO= 1
##$NAME= <P31>
##$PROCNO= 1
##$TYPE= <nmr>
##$USER= <she>
##$AMP= (0..31)
100 100 100 100 100 100 100 100 100 100 100 100 100 100 100 100 100 100 
100 100 100 100 100 100 100 100 100 100 100 100 100 100 
##$AQSEQ= 0
##$AQ_mod= 1
##$AUNM= <au_zg>
##$AUTOPOS= <>
##$BF1= 81.014009
##$BF2= 200.13
##$BF3= 200.13
##$BF4= 200.13
##$BF5= 200.13
##$BF6= 200.13
##$BF7= 200.13
##$BF8= 200.13
##$BYTORDA= 1
##$CFDGTYP= 0
##$CFRGTYP= 5
##$CHEMSTR= <none>
##$CNST= (0..31)
1 1 145 1 1 1 1 1 1 1 1 1 1 1 1 1 1 1 1 1 1 1 1 1 1 1 1 1 1 1 1 1 
##$CPDPRG= <waltz16>
##$CPDPRG1= <>
##$CPDPRG2= <waltz16>
##$CPDPRG3= <>
##$CPDPRG4= <mlev>
##$CPDPRG5= <mlev>
##$CPDPRG6= <mlev>
##$CPDPRG7= <mlev>
##$CPDPRG8= <mlev>
##$CPDPRGB= <>
##$CPDPRGT= <>
##$D= (0..31)
0 1 0 0 0 0 0 0 0 0 0 0.03 2e-05 3e-06 0 0 0 0 0 0 0 0 0 0 0 0 0 0 0 0 
0 0 
##$DATE= 1637308090
##$DBL= (0..7)
120 120 120 11 120 120 24 19 
##$DBP= (0..7)
150 150 150 150 150 150 150 150 
##$DBP07= 0
##$DBPNAM0= <>
##$DBPNAM1= <>
$$ [...]
##$SUBNAM3= <"">
##$SUBNAM4= <"">
##$SUBNAM5= <"">
##$SUBNAM6= <"">
##$SUBNAM7= <"">
##$SUBNAM8= <"">
##$SUBNAM9= <"">
##$SW= 501.771253377433
##$SWIBOX= (0..15)
0 1 3 0 0 0 0 0 0 0 0 0 0 0 0 0 
##$SW_h= 40650.406504065
##$TD= 32768
##$TD0= 1
##$TE= 0
##$TE2= 300
##$TE3= 300
##$TEG= 300
##$TL= (0..7)
0 120 53 12 22 120 120 120 
##$TP= (0..7)
150 150 150 150 150 150 150 150 
##$TP07= 0
##$TPNAME0= <>
##$TPNAME1= <>
##$TPNAME2= <>
##$TPNAME3= <>
##$TPNAME4= <>
##$TPNAME5= <>
##$TPNAME6= <>
##$TPNAME7= <>
##$TPOAL= (0..7)
0.5 0.5 0.5 0.5 0.5 0.5 0.5 0.5 
##$TPOFFS= (0..7)
0 0 0 0 0 0 0 0 
##$TUNHIN= 0
##$TUNHOUT= 0
##$TUNXOUT= 0
##$USERA1= <user>
##$USERA2= <user>
##$USERA3= <user>
##$USERA4= <user>
##$USERA5= <user>
##$V9= 5
##$VALIST= <valist>
##$VCLIST= <CCCCCCCCCCCCCCC>
##$VD= 0
##$VDLIST= <DDDDDDDDDDDDDDD>
##$VPLIST= <PPPPPPPPPPPPPPP>
##$VTLIST= <TTTTTTTTTTTTTTT>
##$WBST= 1024
##$WBSW= 4
##$XGAIN= (0..3)
0 0 0 0 
##$XL= 0
##$YL= 0
##$YMAX_a= 4727
##$YMIN_a= -5030
##$ZGOPTNS= <>
##$ZL1= 120
##$ZL2= 120
##$ZL3= 120
##$ZL4= 120
##$ABSF1= 248.5645
##$ABSF2= -253.2056
##$ABSG= 5
##$ABSL= 3
##$ALPHA= 0
##$AQORDER= 0
##$ASSFAC= 0
##$ASSFACI= 0
##$ASSFACX= 0
##$ASSWID= 0
##$AUNMP= <proc_1d>
##$AZFE= 0.1
##$AZFW= 0.5
##$BCFW= 0
##$BC_mod= 2
##$BYTORDP= 0
##$COROFFS= 0
##$CY= -3
##$DATMOD= 1
##$DC= 0
##$DFILT= <>
##$DTYPP= 0
##$F1P= 0
##$F2P= 0
##$FCOR= 1
##$FTSIZE= 65536
##$FT_mod= 6
##$GAMMA= 0
##$GB= 0
##$INTBC= 1
##$INTSCL= 5.30512e-09
##$ISEN= 30
##$LB= 1
##$LEV0= 0
##$LPBIN= 0
##$MAXI= 10000
##$MC2= 0
##$MEAN= 0
##$ME_mod= 0
##$MI= 50
##$NCOEF= 0
##$NC_proc= -7
##$NLEV= 6
##$NOISF1= 182.463
##$NOISF2= 159.3651
##$NSP= 0
##$NTH_PI= 0
##$NZP= 0
##$OFFSET= 248.5645
##$PC= 4
##$PHC0= -9236.163
##$PHC1= 161.4694
##$PH_mod= 1
##$PKNL= yes
##$PPARMOD= 0
##$PSCAL= 0
##$PSIGN= 0
##$REVERSE= no
##$SF= 81.014009
##$SI= 65536
##$SIGF1= 159.3651
##$SIGF2= -187.1042
##$SINO= 113.3802
##$SIOLD= 16384
##$SREGLST= <1H.CDCl3>
##$SSB= 0
##$STSI= 65536
##$STSR= 0
##$SW_p= 40650.406504065
##$SYMM= 0
##$S_DEV= 0
##$TDeff= 32768
##$TDoff= 0
##$TI= <>
##$TILT= no
##$TM1= 0
##$TM2= 0
##$TOPLEV= 0
##$USERP1= <user>
##$USERP2= <user>
##$USERP3= <user>
##$USERP4= <user>
##$USERP5= <user>
##$WDW= 1
##$XDIM= 65536
##$YMAX_p= 385410459
##$YMIN_p= -34608097
$$ End of Bruker specific parameters
$$ ---------------------------------
##NTUPLES= NMR SPECTRUM
##VAR_NAME=  FREQUENCY,     SPECTRUM/REAL,   SPECTRUM/IMAG
##SYMBOL=    X,             R,               I
##VAR_TYPE=  INDEPENDENT,   DEPENDENT,       DEPENDENT
##VAR_FORM=  AFFN,          ASDF,            ASDF
##VAR_DIM=   65536,         65536,           65536
##UNITS=     HZ,            ARBITRARY UNITS, ARBITRARY UNITS
##FACTOR=    0.620285442955139, 1,           1
##FIRST=     20137.2065510759, 0,            0
##LAST=      -20513.1999529892, 0,           0
##MIN=       -20513.1999529892, -34608097,   0
##MAX=       20137.2065510759, 385410459,    0
$$ Real data points
##PAGE= N=1
##DATA TABLE= (X++(R..R)), XYDATA
$$ [...]
38416A449397o6153J360217N09438j092634j139518l40674n69705j251652o07443
$$ 1449397 1383244 2743461 3252899 2160265 1020747 680073 110368 -1141284 -1748727
38407a748727Q77510J209925K65899l49768k68635n59611j242867j090308M4821
$$ -1748727 -871217 338708 604607 254839 -13796 -573407 -1816274 -2906582 -2861761
38398b861761Q54381O67281Q4942m35920q44689n21382R98994K437955J995977
$$ -2861761 -2007380 -1340099 -1255157 -1691077 -2535766 -3057148 -2058154 379801 2375778
38389B375778J84617p28804k13349j8821q57922j181826j98992M78610k95310
$$ 2375778 2560395 1831591 1618242 1599421 741499 -440327 -639319 -160709 -456019
38380d56019j015874j84657Q12040n9703j731916j337764J236391K896627J797088
$$ -456019 -1471893 -1656550 -844510 -904213 -2636129 -3973893 -2737502 159125 1956213
38371A956213k07694o38230M2941k91309j686229j838695K86067K500845K197232
$$ 1956213 1748519 1110289 1153230 861921 -824308 -2663003 -2376936 123909 2321141
38362B321141j08643j656577j313735o06539p46174q10206P0213O98789k04729
$$ 2321141 2212498 555921 -757814 -1364353 -2110527 -2920733 -2850520 -2151731 -2356460
38353b356460j453304r94886Q39392J939951J683939J270594J161691O67118J750
$$ -2356460 -3809764 -4804650 -3965258 -2025307 -341368 929226 2090917 2758035 2759785
38344B759785J73800O44067k19171j930519k006538j02228R75219k62309j438733
$$ 2759785 2933585 3577652 3358481 1427962 -578576 -680804 294415 32106 -1406627
38335a406627j72225K125713K660682J359427R0018n16329r85380j124877o24637
$$ -1406627 -1578852 546861 3207543 4566970 4656988 4140659 3155279 2030402 1405765
38326A405765m01152j168673j785204j038262K20885P64356J214273K221894K198420
$$ 1405765 1004613 -164060 -1949264 -2987526 -2766641 -2002285 -788012 1433882 3632302
38317C632302j57032k603047k086878L79431J276668K31341M5434J320220J438197
$$ 3632302 3475270 872223 -1214655 -835224 441444 672785 718219 2038439 3476636
38308C476636m45254j619575m11703J185898J225166P43609R55797O57418j060056
$$ 3476636 3031382 1411807 1000104 2186002 3411168 4154777 5110574 5767992 4707936
38299D707936k176121p14450J599051J588873p29735k498585k210512j032632
$$ 4707936 2531815 1817365 3416416 5005289 4275554 1776969 -433543 -1466175
38291a466175k97106O2429M41802O88836O97611P84040J137550J480521J368484
$$ -1466175 -1763281 -1700852 -1259050 -570214 127397 911437 2048987 3529508 4897992
38282D897992N87301n64651j360577j434782j297696j346311q27822Q87453K402452
$$ 4897992 5485293 4920642 3560065 2125283 827587 -518724 -1346546 -459093 1943359
38273A943359J628378q79640k146341r41301N53007K95020o49660l37032P46008
$$ 1943359 3571737 2692097 545756 -395545 157462 452482 -197178 -534210 211798
38264B11798O86258o93302j672720j121885L32513J330611J046674j84618j049271
$$ 211798 898056 204754 -1467966 -2589851 -2257338 -926727 119947 -64671 -1113942
38255a113942o83526Q2929O1449n9435J124486K483823J278695j994818l167244
$$ -1113942 -1797468 -1714539 -1653090 -1712525 -588039 1895784 3174479 1179661 -1987583
38246a987583n23123K073864Q48731k133412k340620L90216K258277J373280m92841
$$ -1987583 -2510706 -436842 411889 -1721523 -4062143 -3671927 -1413650 -40370 -533211
38237e33211j317212p46640Q49454K413400K035162n19275k214847o80143J638997
$$ -533211 -1850423 -2597063 -1747609 665791 2700953 2181678 -33169 -713312 925685
38228I25685R02307j818086k076294P39487K618160J552254K8891k7161M295p21457
$$ 925685 1827992 9906 -2066388 -1326901 1291259 2843513 2872404 2845243 2849538 2128081
38218B128081n28558R04997J034232q21424j477769N79787J879413l18241k944389
$$ 2128081 1599523 2504520 3538752 2717328 1239559 1819346 3698759 3380518 436129
38209D36129k043193O45231R81808l77408L21780K668379K464838r22043l243059
$$ 436129 -1607064 -961833 19975 -357433 -35653 2632726 5097564 4175521 932462
38200I32462k136239j34985L97031N99592J449135J113820j354063l277595k287855
$$ 932462 -1203777 -1338762 -941731 -342139 1106996 2220816 866753 -2410842 -4698697
38191d698697m5061R63346J495616K928559L211034j8116l896498l159277J640989
$$ -4698697 -4743758 -3780412 -2284796 643763 3854797 3836681 -59817 -3219094 -1578105
38182a578105M023070R84879k496947j183852K490703K533558j313420l611954
$$ -1578105 2444965 3429844 932897 -250955 2239748 4773306 3459886 -152068
38174a52068j747770Q12101P28082l71773L53788J916686J550380l76581j100771
$$ -152068 -1899838 -1087737 -359655 -731428 -377640 1539046 3089426 2712845 1612074
38165A612074j42822K03438r80070j701044m06027J595258K152116R48542q17339
$$ 1612074 1469252 1672690 692620 -1008424 -1414451 180807 2332923 3281465 2464126
38156B464126j961986j727654j23836J355554Q54144j171305k026385n47951J040745
$$ 2464126 502140 -1225514 -1349350 6204 860348 -310957 -2337342 -2885293 -1844548
38147a844548N50310p55882l92627J116909J086344q09512j844884m63022J453033
$$ -1844548 -1294238 -2050120 -2442747 -1325838 -239494 -1049006 -2893890 -3356912 -1903879
38138a903879J552225J58018q97404r75811o76472l18104J14365K38234j46372
$$ -1903879 -351654 -193636 -1091040 -2066851 -2743323 -3061427 -2947062 -2708828 -2855200
38129b855200k69723N63961J604859J603677P40554K00484Q7362n49491j510618
$$ -2855200 -3124923 -2560962 -956103 647574 1388128 1588612 1675974 1126483 -384135
38120c84135j221951N06202J386456j34484k029709j246632J608976K724313M78109
$$ -384135 -1606086 -1099884 286572 152088 -1877621 -3124253 -1515277 1209036 1687145
38111A687145k156296j846940N55034J729393P62194k72704k19145n44590k288125
$$ 1687145 -469151 -2316091 -1761057 -31664 730530 457826 238681 -305909 -2594034
38102b594034l576774k026165J535081L746803K921453Q40949k5599L83571M12648
$$ -2594034 -6170808 -8196973 -6661892 -2915089 6364 847313 821714 1205285 1617933
38093A617933n03383j225852r75162m73537m13100j01339J108056J978924Q51798
$$ 1617933 1114550 -111302 -1086464 -1560001 -1973101 -2074440 -966384 1012540 1864338
38084A864338j336775j708525L39504J823064M34279j908816j898945K90293J661485
$$ 1864338 527563 -1180962 -841458 981606 1415885 -492931 -2391876 -2101583 -440098
38075d40098J087311L23383M02723J71191q00915q08857R25180K210186R56046
$$ -440098 647213 970596 1373319 1544510 743595 -65262 859918 3070104 4026150
38066D026150j464219k114537o15015P54257M23435q71837j613919j193761j94259
$$ 4026150 2561931 447394 -167621 586636 1010071 138234 -1475685 -2669446 -2863705
38057b863705J82214n89096j223327o922K146764K079305q27720k712133n77966
$$ -2863705 -2681491 -3270587 -4493914 -4500836 -2354072 -274767 -1102487 -3814620 -4392586
38048d392586K656205K082560j651816l139787l41679K706822K360179K05604
$$ -4392586 -1736381 346179 -1305637 -4445424 -4787103 -2080281 279898 485502
38040D85502o80167o08974j390937k226348r56200J915401L514811K440626P6469
$$ 485502 -194665 -803639 -2194576 -4420924 -5377124 -3461723 53088 2493714 2570183
38031B570183j542294j430448K29025K083477K307744O76051q22187o68239P2552
$$ 2570183 1027889 -402559 -173534 1909943 4217687 4893738 4071551 3403312 3475864
38022C475864j64014p05448j10883Q87194M84440r48373j405297n86436j0074
$$ 3475864 3311850 2606402 2495519 3382713 3867153 2918780 1513483 927047 916973
38013I16973l8399L88891J040208M09542j117359j170798N95272J373551m66570
$$ 916973 878574 1267465 2307673 2717215 1599856 429058 1024330 2397881 1931311
38004A931311k634077k413160n83190M25480M43979J037220K187894K135040K81665
$$ 1931311 -702766 -3115926 -3699116 -3273636 -2829657 -1792437 395457 2530497 2812162
37995B812162j787277k349604j263274L92800J381857J076806o4268q97155q61044
$$ 2812162 1024885 -1324719 -2587993 -2195193 -813336 263470 199202 -697953 -1558997
37986a558997m21275l7765M21495Q74595P61105J42163j31761N4933j93729q32400
$$ -1558997 -1980272 -2018037 -1596542 -721947 39158 181321 49560 104493 -89236 -921636
37976i21636m06875J324127K196462P69846j075403q35847P02034P78680r43330
$$ -921636 -1328511 -4384 2192078 2961924 1886521 1050674 1752708 2531388 1588058
37967A588058j972362q42071R86333J434790K87666j053359j181534K4394J035503
$$ 1588058 -384304 -1226375 -240042 1194748 1482414 429055 -752479 -728085 307418
37958C07418J81101j784023j912969R16732L834085L664493J179230o87427j313616
$$ 307418 488519 -1295504 -3208473 -2291741 1542344 5206837 6386067 5698640 4385024
37949D385024k133029l097750k790953j491112p86173m75889Q15117K285254J856616
$$ 4385024 2251995 -845755 -3636708 -5127820 -5913993 -6389882 -5574765 -3289511 -1432895
37940a432895K61718K50413J572187J097921j437086k480928p12390P48799P0290
$$ -1432895 -1171177 -920764 651423 1749344 312258 -2168670 -2881060 -2132261 -2061971
37931b061971k34470J378099J972088m52191k466163n49440K825745L322665J771151
$$ -2061971 -2296441 -918342 1053746 601555 -1864608 -2414048 411697 3734362 5505513
37922E505513J711408K486083P59883k605277l406171j404705p47604k605376
$$ 5505513 7216921 9703004 10462887 7857610 4451439 3046734 2299130 -306246
37914c06246l181554m91745K150485J672968j72126m33926M59112N96721J74419
$$ -306246 -3487800 -3979545 -1829060 -156092 -328218 -762144 -303032 293689 468108
37905D68108L18988N13109j54099q39100l78483N31623O41526L18093M67757N31334
$$ 468108 787096 1300205 1146106 307006 -71477 460146 1101672 1419765 1887522 2418856
37895B418856m50545j753660j895860r37550q8208L96434J178553K041500J818338
$$ 2418856 1968311 214651 -1681209 -2618759 -2706967 -2310533 -1131980 909520 2727858
37886B727858K17191j529334k081849j304836j02138N12844K56994j30232L34261
$$ 2727858 2945049 1415715 -666134 -1970970 -2073108 -1560264 -1303270 -1433502 -1099241
37877a099241J535382K172247J390473p1058r06484q69051o60533o14326m13446
$$ -1099241 436141 2608388 3998861 3927803 3021319 2152268 1491735 877409 463963
37868D63963p6296k32881q94318p06569J386291L805515L314545n79305l703431
$$ 463963 387667 154786 -739532 -1446101 -59810 3745705 7060250 6480945 2777514
37859B777514j979785K629962M042055K37073m015389m117563j634352m79715
$$ 2777514 797729 3427691 7469746 7706819 3691430 -426133 -2060485 -2540200
37851b540200n19292P33686K415093J530878j097341j496099P37743J678882n0630
$$ -2540200 -3059492 -2325806 89287 1620165 522824 -973275 -235532 1443350 1392720
37842A392720r69147Q52456K232287O00001j379238o00173J031627K57619j633932
$$ 1392720 423573 1276029 3508316 4108317 2729079 2128906 3160533 3418152 1784220
37833A784220j349741L33080J30301j551066j196151J468989K748480J095190
$$ 1784220 434479 767559 897860 -653206 -1849357 -380368 2368112 3463302
37825C463302o26699k11624O07749k00684j390958q43591P77733J105878n53109
$$ 3463302 2836603 2624979 3232728 3032044 1641086 797495 1575228 2681106 2127997
37816B127997k690757l513156k243853M93262K727496K670982R09662j56630L44663
$$ 2127997 -562760 -4075916 -6319769 -5826507 -3099011 -428029 481633 325003 669666
37807F69666N99008p60921k154010j350705J024786K293924J398200j44010p87859
$$ 669666 1268674 507753 -1646257 -2996962 -1972176 321748 1719948 1575938 788079
37798G88079o75706n27082l76615r1936J0813j10979K12379J142285J468419K77735
$$ 788079 112373 -414709 -791324 -883260 -872447 -983426 -771047 371238 1839657 2117392
37788B117392j020729j61154K306536K942931K05053k704947k029877R25301J544179
$$ 2117392 1096663 935509 3242045 6184976 6390029 3685082 1655205 2580506 4124685
37779D124685j117396k848991q18804K063753J745290q69952j747405R2331J842962
$$ 4124685 3007289 158298 -660506 1403247 3148537 2278585 531180 623511 2466473
37770B466473J657976O36273J2449m69439q20597k37587R11211R89483j44497
$$ 2466473 4124449 4760722 4773171 4303732 3483135 3245548 4156759 5146242 5001745
37761E001745o58292N512p8482j861641l103435j610857J273586K671441K112355
$$ 5001745 4343453 4348965 4270483 2408842 -694593 -2305450 -1031864 1639577 3751932
37752C751932J131568K36819j036143j842688p30868J419363J894326Q0211j555590
$$ 3751932 4883500 5120319 4084176 2241488 1510620 2929983 4824309 4904520 3348930
37743C348930j253829l83461o79254j147091J19214K287692K481613k1706k518165
$$ 3348930 2095101 1711640 1032386 -114705 4509 2292201 4773814 4752108 2233943
37734B233943k461067o51785K77130m85071j202024k52501J723150K699100J617295
$$ 2233943 -227124 -878909 -601779 -1086850 -2288874 -2541375 -818225 1880875 3498170
37725C498170n57592j869217j252058M29379J197045P3554j712251k088323o13972
$$ 3498170 2940578 1071361 -180697 248682 1445727 1519281 -192970 -2281293 -2895265
37716b895265J132048J708965J359807R34000L89569n56110j117541l04779J175986
$$ -2895265 -1763217 -54252 1305555 2239555 2629124 2073014 955473 650694 1826680
37707A826680J461206J50701j073969r19168j70919j40806p14122j099472j473890
$$ 1826680 3287886 3438587 2364618 1445450 1274531 1133725 419603 -679869 -2153759
37698b153759k342952k837707j425442J545932L579787K965009Q55253m18601
$$ -2153759 -4496711 -7334418 -8759860 -7213928 -3634141 -669132 186121 -232480
37690b32480k34580K38679L05554N77978J298807J304201k17756j859061j573543
$$ -232480 -467060 -228381 77173 655151 1953958 3258159 3040403 1181342 -392201
37681c92201O7855K51328j724880k648055P5065L731679L315777j135697l898694
$$ -392201 -324346 -73018 -1797898 -4445953 -4370888 -639209 2676568 1540871 -2357823
37672b357823j417995K686194L036852J29213j244014L44309J386799l22713k264997
$$ -2357823 -3775818 -1089624 1947228 2076441 832427 1176736 2563535 2240822 -24175
37663b4175j640288L12574R19848L64866N00498J197682R30783r4451l99677j89234
$$ -24175 -1664463 -1351889 -432041 -67175 433323 1631005 2561788 2467337 2067660 1878426
37653A878426q61722j854217j145039Q35076J113141r98507k228801l56060J989042
$$ 1878426 1016704 -837513 -1982552 -1147476 -34335 -1032842 -3261643 -3617703 -1628661
37644a628661J223777j618071k503923m47238J557194J512501R12335J331815
$$ -1628661 -404884 -2022955 -4526878 -4974116 -3416922 -1904421 -992086 339729
37636C39729J507615k40650k633287k852354n60108J630845J686319M26039j94947
$$ 339729 1847344 1606694 -1026593 -3878947 -4439055 -2808210 -1121891 -695852 -890799
37627h90799K54390O54874K50250m76664p82793o93427p10539r35369r13366k31096
$$ -890799 -636409 18465 268715 -207949 -990742 -1684169 -2394708 -3330077 -4243443 -4474539
37617d474539J001233K175180K540760J779675M70610l37087l92429o64877j843129
$$ -4474539 -3473306 -1298126 1242634 3022309 3492919 3155832 2763403 2098526 255397
37608B55397k837492j905323P13171K539276J775398m89504j704395p58947J248535
$$ 255397 -2582095 -4487418 -3774247 -1234971 540427 50923 -1653472 -2412419 -1163884
37599a163884K512199K031996J55480j609324j722148k61752R41733M96988p28362
$$ -1163884 1348315 3380311 3535791 1926467 204319 -57433 884300 1381288 652926
37590F52926q52794L66240J253959O03589p10381r62775J80421J278244R71469
$$ 652926 -199868 166372 1420331 2023920 1313539 350764 531185 1809429 2780898
37581B780898k19289n11484O17660J386472J00211k060906k248665M6888J989338
$$ 2780898 2561609 2050125 2667785 4054257 4154468 2093562 -155103 -108215 1881123
37572A881123J068518j736048l410218k334834N88506L101357L155178N84912
$$ 1881123 2949641 1213593 -2196625 -4531459 -3942953 -841596 2313582 2898494
37564B898494k130540k249894l87946L10339q27263q74218J339824K412057j23191
$$ 2898494 767954 -1481940 -1869886 -1559547 -2386810 -3261028 -1921204 490853 367662
37555C67662k878271j521301J968901K196038r78563k426942j68621K102122J815380
$$ 367662 -2510609 -4031910 -2063009 133029 -845534 -3272476 -3441097 -1338975 476405
37546D76405J135069J796401J630527q13661k722610j632155J71058k98914j449847
$$ 476405 1611474 3407875 5038402 4224741 1502131 -130024 41034 -257880 -1707727
37537a707727j44400K386117K277030n62124k186737n80766J842937K167869N10446
$$ -1707727 -1852127 533990 2811020 2248896 62159 -518607 1324330 3492199 4002645
37528D002645j121277j484982q86911m39203q11624j271115n74973Q20676R39635
$$ 4002645 2881368 1396386 509475 70272 -741352 -2012467 -2587440 -1766764 -827129
37519h27129n20105j186518L09294J785758P86528j480455k046929n34835J065080
$$ -827129 -1347234 -2533752 -2224458 -438700 347828 -1132627 -3179556 -3714391 -2649311
37510b649311J685396J526918L47424j617881k111106M58967L494895K902334
$$ -2649311 -963915 563003 910427 -707454 -2818560 -2359593 1135302 4037636
37502D037636r29258l387172k077540N08710J419998R10698M73868K44821p318
$$ 4037636 3108378 -278794 -2356334 -1847624 -427626 483072 956940 1201761 1194443
37493A194443K85268J033622Q57754o14416j621288q86939L04513J81566q02927
$$ 1194443 1479711 2513333 3371087 2756671 1135383 248444 552957 734523 -68404
37484f8404r43172R2085J128983J316977Q42438K44839p8191r649J13293j42718
$$ -68404 -1011576 -919491 209492 1526469 2368907 2613746 2535555 2525906 2639199 2496481
37474B496481n61831n07147J7592L45230K40487P2058j34736p03908j298351j155563
$$ 2496481 1934650 1427503 1445095 1790325 2030812 2102870 1968134 1264226 -34125 -1189688
37464a189688m98445l60919p25906l06918J269385K480015J918719J53018j275007
$$ -1189688 -1688133 -2049052 -2774958 -3081876 -1812491 667524 2586243 2739261 1464254
37455A464254j747839j608136j088001j78526P88990J204615Q49406K29079J57499
$$ 1464254 -283585 -1891721 -2979722 -3158248 -2369258 -1164643 -315237 -86158 71341
37446G1341Q41254J377667P16985p26279j374454q12909m67200j095042j261743
$$ 71341 912595 2290262 3007247 2280968 906514 93605 -373595 -1468637 -2730380
37437b730380J62664J678262J477695N33473O40008P71755j104173l423380k408014
$$ -2730380 -2567716 -889454 588241 1121714 1761722 2533477 1429304 -1994076 -4402090
37428d402090J757961M361243K820053n2591j033114q74015j412417j811593p18317
$$ -4402090 -2644129 1717114 4537167 4484576 3451462 2577447 1165030 -646563 -1364880
37419a364880N47131J96442o74527j13613R61289L08612j530038j890298j64411
$$ -1364880 -817749 -621307 -1295834 -1409447 -448158 -139546 -1669584 -3559882 -3724293
37410c724293J560280J771145R51318o5768r26391j100409l63843L17045J20525
$$ -3724293 -2164013 -392868 558450 492682 -433709 -1534118 -1897961 -1580916 -1460391
37401a460391l4279Q82217J702001P95374o99336l32140J337402J199223j288080
$$ -1460391 -1494670 -612453 1089548 1884922 1185586 853446 2190848 3390071 2101991
37392B101991k825691j238943J385119K223309J639146J325614P97401j338031
$$ 2101991 -723700 -1962643 -577524 1645785 3284931 4610545 5407946 4069915
37384D069915l877100l899856j055734J611285J678123K00440l45997N01503J067070
$$ 4069915 192815 -3707041 -4762775 -3151490 -1473367 -1272927 -1618924 -1117421 -50351
37375e0351J16049j622344k452927j536999L76866J685266J357158j32024j261098
$$ -50351 65698 -1556646 -4009573 -5546572 -5169706 -3484440 -2127282 -2259306 -3520404
37366c520404r51345M93777J950240K587588K161068P55200r81286j675887m98609
$$ -3520404 -4471749 -3977972 -2027732 559856 2720924 3476124 2494838 818951 320342
37357C20342J242029J071549j411678l492244k628565K47348K159947J994049
$$ 320342 1562371 2633920 1222242 -2270002 -4898567 -4651219 -2491272 -497223
37349d97223J156092P94814M94792r6247l92618k27120k90836n16443J80027J643425
$$ -497223 658869 1453683 1948475 1852228 1459610 1232490 941654 425211 605238 2248663
37339B248663J862508m1416j950969j636789o4413K61238q08168j197499j47212
$$ 2248663 4111171 4069755 2118786 481997 417584 678822 -129346 -1326845 -1474057
37330a474057Q25202O65475K79098O10461R94118M06483q50193j670981j552325
$$ -1474057 -648855 16620 295718 906179 1900297 2306780 1456587 -214394 -1766719
37321a766719p45891K85773R27219O07007l73212q08189j38845N32315m2886j118273
$$ -1766719 -2512610 -2226837 -1299618 -692611 -1065823 -1874012 -2012857 -1480542 -1523428 -2641701
37311b641701p04477J322935K383185N79748k178383k334068L25390K135569P34392
$$ -2641701 -3346178 -2023243 359942 939690 -1238693 -3572761 -3247371 -1111802 -377410
37302c77410j578091j462369M70087J106676O5724q7640J243311J444441n08554
$$ -377410 -1955501 -3417870 -2947783 -1841107 -1775383 -1863023 -619712 824729 316175
37293C16175j744648k31815J435918J55414k300282j923604J013777K377573O91099
$$ 316175 -1428473 -1660288 -224370 -68956 -2369238 -4292842 -3279065 -901492 -210393
37284b10393j026877n16430O22099M81530l8177K76029L27630q96520j727430
$$ -210393 -1237270 -1753700 -1131601 -650071 -688248 -412219 -84589 -981109 -2708539
37275b708539m72913J182533N72901j447210j752828J1955J202710Q91825J011844
$$ -2708539 -3181452 -1998919 -1426018 -2873228 -4626056 -4614101 -3411391 -2519566 -1507722
37266a507722K022142J378570j718620l641558j496362J822388J681450j027344
$$ -1507722 514420 1892990 174370 -3467188 -4963550 -3141162 -1459712 -2487056
37258b487056j357514J524032K815676r8712l185621j940115J778510K918321
$$ -2487056 -3844570 -2320538 495138 396426 -2789195 -4729310 -2950800 -32479
37250c2479P24717j196315r86195l60819n11703k58254R08235J370676K98138
$$ -32479 692238 -504077 -1490272 -1851091 -2362794 -2621048 -1712813 -342137 -43999
37241d3999p28921l98214L90005O33590R94280J832728J621632o35886l031561
$$ -43999 -772920 -1171134 -781129 -147539 846741 2679469 4301101 3665215 633654
37232F33654k969681p22367J159906J237836K78755m64693n61287l05428l13438
$$ 633654 -2336027 -3058394 -1898488 -660652 -381897 -846590 -1407877 -1713305 -2026743
37223b026743p72331o49365J177455L484445L279426k7787l088233k967946r72211
$$ -2026743 -2799074 -3448439 -2270984 1213461 4492887 4465100 1376867 -1591079 -2563290
37214b563290R9813L70934J473463K479071J177694j335272j523704R34367K351296
$$ -2563290 -2463477 -2092543 -619080 1859991 3037685 1702413 178709 1113076 3464372
37205C464372P64046j333512j478059q79422j379234j856779n05994J544335J896817
$$ 3464372 4228418 2894906 1416847 537425 -841809 -2698588 -3204582 -1660247 236570
37196B36570P10257M5957M23979O93556N83428P53599P62710m15849j998328k046434
$$ 236570 946827 992784 1416763 2110319 2693747 3447346 4210056 3794207 1795879 -250555
37186b50555o28360J81351j97995p056J358464J721162l35979k546557j905775
$$ -250555 -878915 -697564 -895559 -902615 455849 2177011 1841032 -705525 -2611300
37177b611300Q56631K226677P13922j602224k279759j232253J16602P30995M31524
$$ -2611300 -1754669 472008 1185930 -416294 -2696053 -3928306 -3811704 -3080709 -2649185
37168b649185l04410n13179L02148J186670Q55288j15914J66415J745854K143934
$$ -2649185 -2953595 -3466774 -3164626 -1977956 -1122668 -1238582 -1072167 673687 2817621
37159B817621K4693k277921j793708P32086J789373l5671k375785k496851n32867
$$ 2817621 2842314 564393 -1229315 -497229 1292144 1256473 -1119312 -3616163 -4149030
37150d149030J365978J770263J003771J94041R973J65588L2281k43860J94284
$$ -4149030 -2783052 -1012789 -9018 185023 194996 360584 392865 149005 343289
37141C43289J333831J713897L99089j369243j826709j166917p44610n88876K21604
$$ 343289 1677120 3391017 3790106 2420863 594154 -572763 -1317373 -1906249 -1684645
37132a684645J215126R61697k35618n64387J81159K79867o49700p82290O18220
$$ -1684645 -469519 492178 256560 -307827 -126668 153199 -496501 -1278791 -660571
37123f60571J716373J182329K25323R0028N227o75373p69453K78755O51292p70737
$$ -660571 1055802 2238131 2463454 2553482 2558709 1883336 1113883 1392638 2043930 1273193
37113A273193j865800n49384J446426J191382o92781j259215L907J094292J307063
$$ 1273193 -592607 -1141991 304435 1495817 803036 -456179 -452272 642020 1949083
37104A949083J560716J414479n30304l182275l497224j025874J277818J475855
$$ 1949083 3509799 4924278 4393974 1211699 -2285525 -3311399 -2033581 -557726
37096e57726Q26071P70129Q25584N85580Q69547J494879O83364j682504k864103
$$ -557726 268345 1038474 1864058 2449638 3319185 4814064 5497428 3814924 950821
37087I50821j297704N87021n2181k030820j992750N26894K639837K294629N73189
$$ 950821 -346883 240138 187957 -1842863 -3835613 -3308719 -668882 1625747 2198936
37078B198936m01097j18731L28859J9207o26021m80250M66130N76539j139427
$$ 2198936 1797839 1679108 2007967 2027174 1401153 920903 1387033 1963572 824145
37069H24145k826787j805837J266749K713823R76097j237407j328209n90707j293083
$$ 824145 -2002642 -3808479 -2541730 172093 1148190 -89217 -1417426 -2008133 -3301216
37060c301216k376184j311905J223006K151219R50543K20520J076076J499904
$$ -3301216 -5677400 -6989305 -5766299 -3615080 -2664537 -2444017 -1367941 131963
37052A31963L23880m43957P97545K029586O64421j953642k190185M13234K410149
$$ 131963 455843 11886 809431 2839017 3503438 1549796 -640389 -227155 2182994
37043B182994J516273m47083r51115o88385j811390l684722l369939l19590K278567
$$ 2182994 3699267 3252184 2301069 1612684 -198706 -3883428 -7253367 -7572957 -5294390
37034e294390J953664L57929L06111J290560P36299j197883j420310J070066L108361
$$ -5294390 -3340726 -2982797 -2676686 -1386126 -649827 -1847710 -3268020 -2197954 910407
37025I10407J878491r28544j691513J8059J419751Q61067l69818o37112k09462
$$ 910407 2788898 1860354 168841 186900 1606651 2467718 2097900 1460788 1251326
37016A251326k44705r59562j563210j228211K08002J869313K243433Q32806q05194
$$ 1251326 1006621 47059 -1516151 -2744362 -2536360 -667047 1576386 2409192 1603998
37007A603998q25244L13505N55762m69273q56813L06929J209341J87437j472848
$$ 1603998 778754 1092259 1648021 1178748 321935 628864 1838205 2025642 552794
36998E52794j518313j98491M81199J91466M92108J732702K194522Q97810p95226
$$ 552794 -965519 -1164010 -682811 -491345 763 1733465 3927987 4825797 4030571
36989D030571j284210p72265k43138J06089L30786j6462r09602j291916p04282
$$ 4030571 2746361 1974096 1730958 1837047 2167833 2151371 1241769 -50147 -754429
36980g54429k96543q69066j145803K42684K072244J961220k1339j406423r38650
$$ -754429 -1050972 -1920038 -3065841 -2823157 -750913 1210307 1188968 -217455 -1156105
36971a156105J7790O8625k07379K90780J212976J291236P7390j519180k021976
$$ -1156105 -1138315 -1069690 -1277069 -986289 226687 1517923 1595313 76133 -1945843
36962a945843o87409J410708J998784K74618j619492j205042Q44425J726009O36992
$$ -1945843 -2633252 -1222544 776240 1050858 -568634 -1773676 -929251 796758 1433750
36953A433750m68916l34731k9679m52668o80042L2013O85877K94478n13509p78447
$$ 1433750 964834 630103 600424 147756 -532286 -500273 185604 480082 -33427 -811874
36943h11874n16024J32101J290934K146079J419063j71486l71193P58474M12818
$$ -811874 -1327898 -1195797 95137 2241216 3660279 3488793 3117600 3876074 4288892
36934D288892k100689l432792j372629J363096J511054L27747O27687J559232
$$ 4288892 2188203 -1244589 -2617218 -1254122 256932 584679 1212366 2771598
36926B771598P07826q02513k41460J179108J0709k819676k684665J038488L400490
$$ 2771598 3479424 2676911 2435451 3614559 3625268 805592 -1879073 -840585 2559905
36917B559905J478104j438305j550956j29821l40514j813040j854037j14765J132210
$$ 2559905 4038009 2599704 1048748 918927 578413 -1234627 -3088664 -3203429 -2071219
36908b071219N57009o80676p05463R53874K757661K467989j21145k195600j301664
$$ -2071219 -1514210 -2194886 -2900349 -1946475 811186 3279175 3158030 962430 -339234
36899c39234R16761R29392j123503j558101P64693K442758J126771p36445k43102
$$ -339234 577527 1506919 383416 -1174685 -409992 2032766 3159537 2423092 2179990
36890B179990J160812L94411k107220l302827k111512p9875J413934J964995J151553
$$ 2179990 3340802 3735213 1627993 -1674834 -3786346 -3866221 -2452287 -487292 664261
36881F64261p00958j613401k61885J576832J316473m58690r74657K25961O84601
$$ 664261 -36697 -1650098 -1911983 -335151 981322 522632 -452025 -226064 458537
36872D58537q04286k167482j223726J137474K304417J316166l46574q94455k75138
$$ 458537 -345749 -2513231 -3736957 -2599483 -295066 1021100 674526 -219929 -495067
36863d95067N7040p95196j745676j029919J100984K193475P53291j568702k119893
$$ -495067 -438027 -1233223 -2978899 -4008818 -2907834 -714359 38932 -1529770 -3649663
36854c649663p25034M27841l2204j116603j245687k94356O90894J063162J102781
$$ -3649663 -4374697 -3946856 -3979060 -5095663 -6341350 -6635706 -5944812 -4881650 -3778869
36845c778869J101710O36954o47353j798255j202687J058424K687094K041604
$$ -3778869 -2677159 -2040205 -2687558 -4485813 -5688500 -4630076 -1942982 98622
36837I8622M07090r7847K76774l8119o36107J89305J774584J456907q41851j811843
$$ 98622 505712 407865 684639 646520 10413 199718 1974302 3431209 2589358 777515
36827G77515J57374K268773J597296p11093j790556j245086n29967j12687K36739
$$ 777515 934889 3203662 4800958 4089865 2299309 1054223 524256 411569 648308
36818F48308m6166j090121j334323J47896J535496Q79437o34008o55846M47764
$$ 648308 602142 -487979 -1822302 -1674406 -138910 740527 106519 -549327 -101563
36809a01563N61864m02761p31045k30800l42605j207230j385249m43674N93472
$$ -101563 460301 57540 -673505 -904305 -1246910 -2454140 -3839389 -4283063 -3689591
36800c689591J224940J642938J298054k96735j718611j174356M09640N47357p72943
$$ -3689591 -2464651 -821713 476341 179606 -1539005 -2713361 -2303721 -1756364 -2529307
36791b529307j163037K2825P87805K30728N216J023524J645846O13998p12184
$$ -2529307 -3692344 -3669519 -2881714 -2650986 -2645770 -1622246 23600 637598 -74586
36782g4586o93103P9657K50348n9343p6385L954k65516m44813j26687P0314l55155
$$ -74586 -767689 -688032 -437684 -497027 -573412 -569458 -834974 -1279787 -1406474 -1336160 -1691315
36771a691315o33557J16996J376757J882998J173670k23258j443935j649885o04447
$$ -1691315 -2324872 -2207876 -831119 1051879 2225549 2002291 558356 -1091529 -1695976
36762a695976O88036Q76380J01424k22407K75338L45853n87896j248661o01288
$$ -1695976 -1007940 -131560 -30136 -252543 22795 368648 -219248 -1467909 -2069197
36753b069197L75120K78621n40460p40334o2991N95865N92885M5838n06147k90467
$$ -2069197 -1694077 -1415456 -1955916 -2696250 -2759241 -2163376 -1570491 -1524653 -2030800 -2321267
36743b321267J046430K385381J880260l98446j871790p59952J221780J144849
$$ -2321267 -1274837 1110544 2990804 2592358 720568 -39384 1182396 2327245
36735B327245r82285k277313r82325J417155K410726J411047j64848r15625q07220
$$ 2327245 1344960 -932353 -1914678 -497523 1913203 3324250 3159402 2243777 1436557
36726A436557o68775q04410n73038L22792O98503p33525k887008k949646k54674
$$ 1436557 767782 -36628 -609666 -286874 411629 -321896 -3208904 -6158550 -6413224
36717f413224K287901K053270L32076K0710J064424J060672k25417l32679J434112
$$ -6413224 -4125323 -2072053 -1739977 -1719267 -654843 405829 180412 -152267 1281845
36708A281845K355749O39608j454132j108974O53519Q77503n65927j289062o86657
$$ 1281845 3637594 4277202 2823070 1714096 2367615 3245118 2679191 1390129 703472
36699G03472n54276j341561j144224O18142J560611N6936j860737j451585P37354
$$ 703472 149196 -1192365 -2336589 -1718447 -157836 -100900 -1961637 -3413222 -2675868
36690b675868K109181J841224J053674J89876j140639k164116j419291O03998
$$ -2675868 -566687 1274537 2328211 2518087 1377448 -786668 -2205959 -1601961
36682a601961J559280M30786j219465j623005p57257M65807J352454J331658K08828
$$ -1601961 -42681 388105 -831360 -2454365 -3211622 -2745815 -1393361 -61703 147125
36673A47125j049939j122328j38805O56087R34083J250816J201885j16095j745572
$$ 147125 -902814 -2025142 -2163947 -1507860 -573777 677039 1878924 1762829 17257
36664A7257j607004j9089M12422p81583q48906J383147K945868J278642j586620
$$ 17257 -1589747 -1608836 -1196414 -1977997 -2826903 -1443756 1502112 2780754 1194134
36655A194134k228471p85617L86076Q80268J618974J748703o9706k269129k018790
$$ 1194134 -1034337 -1819954 -1433878 -553610 1065364 2814067 2744361 475232 -1543558
36646a543558J86555J108316k02994j364547q18924K34437N46016M44057J31819
$$ -1543558 -1357003 -248687 -451681 -1816228 -2635152 -2400715 -1854699 -1410642 -1278823
36637a278823q35599j707933r27278Q80644J080869q20369j969679m46944J852699
$$ -1278823 -2114422 -3822355 -4749633 -3868989 -2788120 -3608489 -5578168 -6025112 -4172413
36628d172413K313138J298657P81301J066329J003346K80964l99945p18269q19486
$$ -4172413 -1859275 -560618 220683 1287012 2290358 2571322 2171377 1453108 633622
36619F33622o19627j66193m8249m91416p53226k81258K92176J60044m04094o24376
$$ 633622 13995 -152198 -200447 -691863 -1445089 -1726347 -1434171 -1274127 -1678221 -2302597
36609b302597l57323J14081P31590J352507J416461O68612k55158n63926k44160
$$ -2302597 -2659920 -2545839 -1814249 -461742 954719 1623331 1368173 804247 560087
36600E60087J34261J27064k99494p25965m69802N73301J343174P06978q56542
$$ 560087 694348 821412 521918 -204047 -673849 -100548 1242626 1949604 1093062
36591A093062j608883p27017P52184J331546O50452l94954n44459N92609J665289
$$ 1093062 -515821 -1242838 -490654 840892 1491344 1096390 551931 1144540 2809829
36582B809829O87518k108322l675395j938787J021752J745075K80040n47978p4423
$$ 2809829 3497347 1389025 -2286370 -4225157 -3203405 -1458330 -1178290 -1726268 -1800691
36573a800691m17698j964453k117504J39305J994135J234347j03396Q12668K854327
$$ -1800691 -2218389 -4182842 -6300346 -6161041 -4166906 -2932559 -3035955 -2223287 631040
36564F31040K714714K8466k306255k358802j153154m42443m83081l76878N42352
$$ 631040 3345754 3374220 1067965 -1290837 -2443991 -2886434 -3369515 -3746393 -3204041
36555c204041J923184K570416J708871K12782l17542J27588n4136j389211k327663
$$ -3204041 -1280857 1289559 2998430 3211212 2893670 3021258 2967122 1577911 -749752
36546g49752j711433m81761J42077M57266R75214R93963l7314j151348j285437
$$ -749752 -2461185 -2942946 -2800869 -2343603 -1368389 -374426 -411740 -1563088 -2848525
36537b848525p60373j58092P12660J554340J176280k56006o91374M24227O49730
$$ -2848525 -3608898 -3766990 -3054330 -1499990 -323710 -579716 -1271090 -846863 -197133
36528a97133j372923k894547j098411K047682K579086N77706m62734O48931J683221
$$ -197133 -1570056 -4464603 -5563014 -3515332 -936246 -358540 -821274 -172343 1510878
36519A510878J236872L17085l87058j302435j787833n19478J519004J662154k89545
$$ 1510878 2747750 3064835 2677777 1375342 -412491 -931969 587035 2249189 1959644
36510A959644j648596j082636j20581J46288N35989J147931O64372o77906q16319
$$ 1959644 311048 -771588 -892169 -745881 -209892 938039 1602411 924505 108186
36501A08186L00412K35203j202881q30088K164099L540060K67048m200077m750240
$$ 108186 408598 643801 -559080 -1389168 774931 4314991 4582039 381962 -4368278
36492d368278j762894P06282J393319J907221K136494M92171j980153k312582
$$ -4368278 -6131172 -5424890 -4031571 -2124350 12144 504315 -1475838 -3788420
36484c788420l86971R97418Q09977O60997R36515J36020j428109j318123O71400
$$ -3788420 -4175391 -3177973 -2367996 -1706999 -770484 -634464 -2062573 -3380696 -2709296
36475b709296J666383M65161n59332J73746Q25732j74639j217616o04872M46407
$$ -2709296 -1042913 -577752 -1137084 -963338 -137606 -312245 -1529861 -2134733 -1688326
36466a688326L30383j26695K08359M76350J07608O19533K397421K618601k98379
$$ -1688326 -1357943 -1484638 -1276279 -799929 -692321 -72788 2324633 4943234 4644855
36457D644855l034324k104428L71177K73234j372873m01611K629663K773391r57451
$$ 4644855 1610531 -493897 -122720 150514 -1222359 -1623970 1005693 3779084 2821633
36448B821633l651625k297579M0806R0390o05635M12664J800678J216976k83388
$$ 2821633 -829992 -3127571 -3086765 -2996375 -3602010 -3189346 -1388668 -171692 -455080
36439d55080l02361P49897R14233K81972K29375N29779J19358m50275M4580J121853
$$ -455080 -757441 -7544 906689 1188661 1418036 1947815 2067173 1616898 1661478 2783331
36429B783331J461046J094931O80755j18516j430307j835015n27474P10758J79639
$$ 2783331 4244377 5339308 6020063 5901547 4471240 2636225 2108751 2819509 2999148
36420B999148p16013L7294J130405m9975k556518k846260k89539J971599J896714
$$ 2999148 2283135 2320429 3450834 3400859 844341 -2001919 -2291458 -319859 1576855
36411A576855Q45716L99323P4784p35567j227866q09124j83249J20469M44300
$$ 1576855 2422571 2821894 2896678 2161111 933245 124121 -59128 61341 505641
36402E05641N82991l43701j907105k276811r70987J89645j54962r24337m70069
$$ 505641 1088632 744931 -1162174 -3438985 -4409972 -4220327 -4375289 -5299626 -5769695
36393e769695J057657K345227K711356K172833O70759j614612l564757l583759
$$ -5769695 -4712038 -2366811 344545 2517378 3188137 1573525 -1991232 -5574991
36385e574991r96820K875291N116566L603476m16668l121217k345499P6453J167059
$$ -5574991 -6571811 -3696520 1420046 5023522 4606854 1485637 -859862 -783409 383650
36376C83650M85408n04760j057067j078871J9190J996600K678358Q01929j370647
$$ 383650 869058 364298 -692769 -1771640 -1752450 244150 2922508 3724437 2353790
36367B353790j144969L45545K93180q33574n17203P51466K92279j393910j111029
$$ 2353790 1208821 1554366 1847546 1013972 496769 1248235 1540514 146604 -964425
36358i64425R94445J140221j419052k726185q30581R66847K005j388751m48791
$$ -964425 30020 1170241 -248811 -2974996 -3805577 -2838730 -2836725 -4225476 -4674267
36349d674267J250458J105318K3918J27877Q15482N39837K9314N19850R96884
$$ -4674267 -3423809 -2318491 -2294573 -2166696 -1351214 -811377 -782063 -262213 734671
36340G34671J57906r92072j173609j173155j576074p66494J913766L623767J874626
$$ 734671 892577 -99495 -1273104 -2446259 -4022333 -4788827 -2875061 748706 2623332
36331B623332j409496k881989k477491j847164o59131J678394K892378Q13854
$$ 2623332 1213836 -1668153 -4145644 -5992808 -6651939 -4973545 -2081167 -1267313
36323a267313k124595j724558J666804L749234K425672l87676k394235k776830
$$ -1267313 -3391908 -5116466 -3449662 299572 2725244 2337568 -56667 -2833497
36315b833497j175888J642567K830958O46852k257066k252004l11752j35087j729802
$$ -2833497 -4009385 -2366818 464140 1110992 -1146074 -3398078 -3709830 -3844917 -5574719
36306e574719j616704Q39824K264163J067671j79805N69261J785026J518508K67601
$$ -5574719 -7191423 -6351599 -4087436 -3019765 -3199570 -2630309 -845283 673225 940826
36297I40826p65377j408746j368698n7937J526218J456607Q5976k55588O96137
$$ 940826 175449 -1233297 -2601995 -2659932 -1133714 322893 408869 153281 849418
36288H49418O62761q39974j284615L72049J485360J539k087274j864991L32214
$$ 849418 1512179 672205 -612410 -240361 1244999 1246538 -840736 -2705727 -2373513
36279b373513K092874K328677J453429j56810j951673k720157j854450j29503
$$ -2373513 -280639 2048038 3501467 3344657 1392984 -1327173 -3181623 -3311126
36271c311126J544119K781300K797235R20048j406222j621111P3150N80597j122184
$$ -3311126 -1767007 1014293 3811528 4731576 3325354 1704243 1777393 2357990 1235806
36262A235806j969875K69160L023986K643131k46251k216245k182181j801178
$$ 1235806 -734069 -464909 2559077 5202208 4955957 2739712 557531 -1243647
36254a243647j767037j007066O10630J580490J104950R2694m43165l73891J74654
$$ -1243647 -3010684 -4017750 -3407120 -1826630 -721680 -628986 -1072151 -1446042 -1271388
36245a271388R18053R41809l59450j892309j860044j83603J409602J709146J072852
$$ -1271388 -353335 588474 229024 -1663285 -3523329 -3706932 -2297330 -588184 484668
36236D84668J62619q35916j460731r67106L26976R93979N15803J27424P35925
$$ 484668 647287 -188629 -1649360 -2616466 -2289490 -1295511 -779708 -652284 83641
36227H3641J232376K87827j097969p78435J046538J674417j65915k238950j991266
$$ 83641 1316017 1603844 505875 -272560 773978 2448395 2282480 43530 -1947736
36218a947736j58364P24872K14659n3226L30877K9635j062122j104305N16412
$$ -1947736 -2106100 -1381228 -1166569 -1219795 -888918 -859283 -1921405 -3025710 -2509298
36209b509298J826793J398176M97212M40918Q1144j786567l354348j951157J712975
$$ -2509298 -682505 715671 1212883 1653801 1734945 -51622 -3405970 -5357127 -3644152
36200c644152M111224L340570Q07468j259268j978378j569059o41280J28600O15961
$$ -3644152 467072 3807642 4615110 3355842 1377464 -191595 -832875 -704275 -88314
36191h8314J230096J666447Q20555j126186k134473j175154J26064L46011N93040
$$ -88314 1141782 2808229 3628784 2502598 368125 -807029 -680965 -334954 258086
36182B58086J756651J850749p14337l260902k143945J403431K821412Q69297j370561
$$ 258086 2014737 3865486 3151149 -109753 -2253698 -850267 1971145 2840442 1469881
36173A469881j749342j180057n08065O45886J516363N44263j327261j354915N02851
$$ 1469881 -279461 -1459518 -1967583 -1321697 194666 738929 -588332 -1943247 -1440396
36164a440396J442600N88716J301L99126J05005q98071l13219J778708K083537
$$ -1440396 2204 590920 592221 991347 1096352 198281 -114938 1663770 3747307
36155C747307l19021k007391r36088L08491m98801j343038j93171R47560j60904
$$ 3747307 3428286 1420895 484807 793298 294497 -1048541 -1241712 -294152 -455056
36146d55056j627480p14299J382421J826519P77292J31247j37081r01575j260256
$$ -455056 -2082536 -2796835 -1414414 412105 1189397 1320644 1183563 281988 -978268
36137i78268l72526J19193j160332k191817n86499K218384L183112K162908Q86209
$$ -978268 -1350794 -1231601 -2391933 -4583750 -5170249 -2951865 231247 2394155 3280364
36128C280364l78332j633116j095696J645249K949943K76973k456894k75561M079494
$$ 3280364 2902032 1268916 173220 1818469 4768412 5045385 2588491 2312930 6392424
36119F392424L461733k311970n663984k767542J217338R20153j583490j750655
$$ 6392424 9854157 7542187 1878203 -889339 327999 1248152 -335338 -2085993
36111b085993p7301J76774p49587k13719J386641J062671j393851k593888o78508
$$ -2085993 -2163294 -1986520 -2736107 -2949826 -1563185 -500514 -1894365 -4488253 -5166761
36102e166761J835937J613133j007433k568148q40480K585255M228581K592831
$$ -5166761 -3330824 -1717691 -2725124 -5293272 -6133752 -3548497 680084 3272915
36094C272915n40028k528351k542587j369152K26487J713443K219122J285834
$$ 3272915 2732887 204536 -2338051 -3707203 -3480716 -1767273 451849 1737683
36086A737683j60426r08235j079076j338425j192884J75186J877737K108966P79823
$$ 1737683 1577257 669022 -410054 -1748479 -2941363 -2766177 -888440 1220526 2000349
36077B000349n29837j078485j427402j546958p17376N24571O35816l43266o94469
$$ 2000349 1470512 392027 -1035375 -2582333 -3299709 -2775138 -2139322 -2482588 -3177057
36068c177057J0565K34687n27045o25120O93875J588316O16926p61684o51575
$$ -3177057 -3166492 -2931805 -3458850 -4083970 -3390095 -1801779 -1184853 -1946537 -2598112
36059b598112K15843J32212m47005M720R27450M38443j140294j347466N01210
$$ -2598112 -2382269 -2250057 -2697062 -2692342 -1764892 -1326449 -2466743 -3814209 -3312999
36050c312999K029099J351677k41158n38151L20012N69468k18058q16850n79343
$$ -3312999 -1283900 67777 -173381 -711532 -391520 177948 -40110 -856960 -1436303
36041a436303j38817J76839Q47555J611881J206861l47320r15414O57317K062581
$$ -1436303 -1575120 -1398281 -550726 1061155 2268016 1920696 1005282 1662599 3725180
36032C725180N18243k583161l006814J43218K734917J451640j475858j733402
$$ 3725180 4243423 1660262 -1346552 -1203334 1531583 2983223 1507365 -226037
36024b26037Q64129K602530J441396o76627j300091o73688m50852r42007j006379
$$ -226037 638092 3240622 4682018 4005391 2705300 2031612 1580760 638753 -367626
36015c67626N2128J542645K241425J699118O11500m6572j06536j32555m23514
$$ -367626 -315498 1227147 3468572 5167690 5779190 5732618 5626082 5493527 5070013
36006E070013p58425j088224j495187j375663k1059J599696J334187r59416k482654
$$ 5070013 4311588 3223364 1728177 352514 331455 1931151 3265338 2305922 -176732
35997a76732j221154J041489J352208j84966j165254q17688m47477m23193L59392
$$ -176732 -1397886 -356397 995811 810845 -354409 -1172097 -1619574 -2042767 -1683375
35988a683375J781245K036887O65573l70299K12332R47288J55708j195426j100687
$$ -1683375 97870 2134757 2800330 2430031 2642363 3589651 3745359 2549933 1449246
35979A449246J08373J61712j564125k849125j713673P02001J657283N89231l20787
$$ 1449246 1557619 1719331 155206 -2693919 -4407592 -3705591 -2048308 -1459077 -1779864
35970a779864L58385J113211J99934j022571j0454K437829K802890L35352j546384
$$ -1779864 -1421479 -308268 -108334 -1130905 -1141359 1296470 4099360 4434712 2888328
35961B888328o76352N48854m07390j825800j092263L77898k12545j562197l42195
$$ 2888328 2211976 2760830 2353440 527640 -564623 -186725 -399270 -1961467 -2303662
35952b303662K407900K345184p35022k058327L53228K409604Q05147j660930j042146
$$ -2303662 104238 2449422 1714400 -343927 9301 2418905 3224052 1563122 520976
35943E20976J315771J452770o73160j697465n51377M44104j38910r71230p57286
$$ 520976 1836747 3289517 2616357 918892 367515 811619 672709 -298521 -1055807
35934a055807j13164P5456J18020N00904Q08441M48259l34103o86776j06750Q91495
$$ -1055807 -1168971 -1093515 -975495 -474591 333850 782109 448006 -238770 -345520 545975
35924E45975J046471j97306j498909r64254J037453J906676M38479j267498q76282
$$ 545975 1592446 1395140 -103769 -1068023 -30570 1876106 2314585 1047087 170805
35915A70805P81592J262415K31260o10911n62441m65289m53465M13414J931456
$$ 170805 952397 2214812 2446072 1835161 1272720 807431 353966 767380 2698836
35906B698836K328672Q20004j086529j648720r05585Q4605P42541Q98502L54956
$$ 2698836 5027508 5847512 4760983 3112263 2206678 2291283 3033824 3932326 4287282
35897D287282n86636j025459o36923j32035O5989N66268J615361K079873J031535
$$ 4287282 3700646 2675187 2038264 1906229 1972218 2538486 4153847 6233720 7265255
35888G265255n43784j043597n88271m56955o55028j2200J238962J154230q19487
$$ 7265255 6721471 5677874 5089603 4632648 3977620 3965420 5204382 6358612 5539125
35879E539125k354172j324091J019317J772908M23078q55274o53028K5388j5329
$$ 5539125 3184953 1860862 2880179 4653087 5076165 4220891 3567863 3593251 3577922
35870C577922j73577O17932J801616J809003L38641j097142j003877L37876J232626
$$ 3577922 3404345 4022277 5823893 7632896 7971537 6874395 5870518 6208394 7441020
35861G441020N54329q99379j374589m10507O42582O78158L29746M96396N24543
$$ 7441020 7995349 7095970 5721381 5310874 5953456 6631614 6961360 7457756 7982299
35852G982299n14765j584496q67602J134576K024122J093721P0506k8044j09397
$$ 7982299 7467534 5883038 5015436 6150012 8174134 9267855 9338361 9310317 9200920
35843I200920m13648L34416J914157J787009p79417k644125j356353Q44405O30686
$$ 9200920 8787272 9121688 11035845 12822854 12043437 9399312 8042959 8887364 9518050
35834I518050j103389j114622P27893J763081J256430Q37070P82678j50070j305095
$$ 9518050 8414661 7300039 8027932 9791013 11047443 11884513 12667191 12517121 11212026
35825A1212026n48262J528063J772109l21984j407151L96675K573919K389439
$$ 11212026 10663764 12191827 13963936 13641952 12234801 12631476 15205395 17594834
35817A7594834P81180l4213q2550m33422p04098o6201R40424J497803J803618
$$ 17594834 18376014 18341801 18259251 17825829 17121731 17055530 17995954 19493757 21297375
35808B1297375J731279J73524k517054l541039j289670J859328K674432J323097
$$ 21297375 23028654 23202178 20685124 17144085 15854415 17713743 20388175 21711272
35800B1711272J15100l13368p71286q67795K32683J221372O6981k213568k384220
$$ 21711272 21826372 21513004 20741718 19873923 20106606 21327978 21394959 19181391 16797171
35791A6797171J28529K191187J595306J0691L345J356494K108526J726874J367491
$$ 16797171 16925700 19116887 20712193 20722884 20726229 22082723 24191249 25918123 27285614
35782B7285614J695444K052317J677569P13169p1693L713J030384K351780L066736
$$ 27285614 28981058 31033375 32710944 33424113 33352420 33356133 34386517 36738297 39805033
35773C9805033L001925K961882L662232M646172M790255L900333L222371L975670
$$ 39805033 42806958 45768840 49431072 54077244 58867499 62767832 65990203 69965873
35765F9965873N772571P168991P654333Q162811R325721J0290678J0160051R801085
$$ 69965873 75738444 82907435 90561768 98724579 108050300 118340978 128501029 138302114
35757A38302114J1004947J4214282J8173152K1443103K3142094K2786476K0992034
$$ 138302114 149307061 163521343 181694495 203137598 226279692 249066168 270058202
35750B70058202J9885363K0855413K2035006K0182744J5137201R910349N967405
$$ 270058202 289943565 310798978 332833984 353016728 368153929 378064278 384031683
35743C84031683J378776n165105j1547322j5453356j7703754j9776898k0422621
$$ 384031683 385410459 380245354 368698032 353244676 335540922 315764024 295341403
35736B95341403j8066715j4858322j4484533j6657328j7477350j5233170j2341119
$$ 295341403 277274688 262416366 247931833 231274505 213797155 198563985 186222866
35729A86222866j1104559j0898193j0474323r984102r420251p814107n486332
$$ 186222866 175118307 164220114 153745791 143761689 134341438 126527331 121040999
35722A21040999m552303n510467n818374l891571k081864l026059n105975m856783
$$ 121040999 116488696 110978229 105159855 101268284 99186420 96160361 91054386 86197603
35714H6197603k577116j807779l526298m607380k830459j56640N01687p83179
$$ 86197603 83620487 81812708 78286410 73679030 70848571 70691931 71193618 70410439
35706G0410439k109603k853919l482268l577955k298705k57274R21343P46888
$$ 70410439 68300836 65446917 61964649 58386694 56087989 55830715 56752058 57498946
35698E7498946J43199k18966n57155j056962j476700j634377j432879p10596J14565
$$ 57498946 57642145 57423179 56866024 55809062 54332362 52697985 51265106 50554510 50669075
35689E0669075o1279j365428k057829q75443O18633J21835j672067k059186p75098
$$ 50669075 50607796 49242368 47184539 46309096 46927729 47049564 45377497 43318311 42543213
35680D2543213l64423j706556k481694j277998l0374n45584j513975j232353o27677
$$ 42543213 42178790 40472234 37990540 36712542 36682168 36136584 34622609 33390256 32762579
35671C2762579r65285j058667K09224R01659r05831l059793k350983q7693j76351
$$ 32762579 31797294 30738627 30947851 31849510 30943679 27883886 25532903 25445210 25268859
35662B5268859k537107l286219j380407n9122q93271j334405J86610J340110M06491
$$ 25268859 22731752 19445533 18065126 18006004 17112733 15778328 15964938 17305048 17711539
35653A7711539m41951P43328J879641M77405j884814k268308j206435j142586
$$ 17711539 17269588 18012916 19892557 20369962 18485148 16216840 15010405 13867819
35645A3867819j838745j183120N00518P32321q28324j713193n51013J055918J112588
$$ 13867819 12029074 10845954 11346472 12078793 11250469 9537276 8986263 10042181 11154769
35636A1154769k76992j476858j109458P10856K056632Q70951k019971l052931
$$ 11154769 10877777 9400919 8291461 9002317 11058949 11929900 9909929 6856998
35628F856998p03432J745254P54798j902811j727564J347883K711195K96585k289239
$$ 6856998 6153566 7898820 8653618 6750807 5023243 6371126 9082321 9378906 7089667
35619G089667j486555J080458J733452K69140o78515j67746K41527l66325r78992
$$ 7089667 5603112 6683570 8417022 8686162 8007647 7839901 8081428 7715103 6736111
35610F736111p07456j03688J18481K57189Q13931J378507J022000n00203k298542
$$ 6736111 6028655 5924967 6043448 6300637 7114568 8493075 9515075 9014872 6716330
35601F716330l023915k007396O6173J683230J924289J267577P49887N60241N150
$$ 6716330 3692415 1685019 1751192 3434422 5358711 6626288 7376175 7936416 7941566
35592G941566j091931j657308o66591J107665J587006j0102j860962j698018J95429
$$ 7941566 6849635 5192327 4525736 5633401 7220407 7210305 5349343 3651325 3846754
35583C846754J359056N17110q38271q35087J06201K34540o88544j104360j58769
$$ 3846754 5205810 5722920 4884649 4049562 4155763 4390303 3701759 2597399 2438630
35574B438630R87778Q89162k00738q97520o47807k01783k66334n33262l28019
$$ 2438630 3426408 4315570 4114832 3217312 2569505 2367722 2101388 1568126 1240107
35565A240107L45898Q95417R70983O71960P9114p41508j217406n66087R62577
$$ 1240107 1586005 2481422 3452405 4124365 4203479 3461971 2244565 1678478 2641055
35556B641055J832163Q87082j149417k492064k257235r87216L81768J278639J449523
$$ 2641055 4473218 5360300 4210883 1718819 -538416 -1525632 -1143864 134775 1584298
35547A584298R45166J90669l27423k93580N60002K012845K583422O29296k907954
$$ 1584298 2529464 2720133 2392710 2099130 2659132 4671977 7255399 7884695 4976741
35538D976741m503011k405507N16878N28500j655008k215595j91171J405705P01036
$$ 4976741 473730 -1931777 -1414899 -886399 -2541407 -4757002 -4948173 -3542468 -2841432
35529b841432l47339L42405J612184J371794L5786m78700K91707J280912J713380
$$ -2841432 -3188771 -2846366 -1234182 137612 173398 -305302 -13595 1267317 2980697
35520B980697J460107M67252q82530j592638j205168l89169K04313O53780Q97544
$$ 2980697 4440804 4908056 4025526 2432888 1227720 838551 1042864 1696644 2594188
35511B594188M83107k91237l99593K52550O74090N89427O14359M74947o41809
$$ 2594188 3077295 2786058 2386465 2639015 3313105 3902532 4516891 4991838 4350029
35502D350029j678822n46929J897853K028920j011780l391744k227551K62597
$$ 4350029 2671207 2124278 4022131 6051051 5039271 1647527 -580024 -317427
35494c17427Q52806K34359N57913J039108o0914j417778p99264N52499k0003j554461
$$ -317427 535379 769738 1327651 2366759 2305845 888067 88803 641302 621299 -933162
35484i33162r85272J209341J534065n79994j899021q02840O74947R48096R99351
$$ -933162 -1918434 -709093 824972 244978 -1654043 -2456883 -1781936 -833840 165511
35475A65511J312109M55705j732208k822735j381105Q35951J818734J902560J907890
$$ 165511 1477620 1933325 201117 -2621618 -4002723 -3166772 -1348038 554522 2462412
35466B462412J199823n45309j735548j016702M76410P65319k42703j137183j141509
$$ 2462412 3662235 3116926 1381378 364676 841086 1606405 1363702 226519 -914990
35457i14990n86277M8771N80148J031255J530821J886471J444232J45211q32891
$$ -914990 -1501267 -1452496 -872348 158907 1689728 3576199 5020431 5165642 4332751
35448D332751p01638n42425j432749k017751m48015J875921J654153j122090k717116
$$ 4332751 3631113 3088688 1655939 -361812 -809827 1066094 2720247 1598157 -1118959
35439a118959j214573Q05694O70894l92342J07350J725898K135435Q60594m75419
$$ -1118959 -2333532 -1527838 -856944 -1249286 -1141936 583962 2719397 3579991 3104572
35430C104572p93457m55714k5829L29829N10698N46450O12347M99226j49685p89293
$$ 3104572 2311115 1855401 1829572 2159401 2670099 3216549 3828896 4328122 4178437 3389144
35420C389144m08108N91608N18558r47461j943750j234956r1926o8578n17252
$$ 3389144 2981036 3572644 4091202 3143741 1199991 -34965 -126891 -195469 -712721
35411g12721M4455J320918J737638Q14588m34033r81290n91533K90242O31708
$$ -712721 -668266 652652 2390290 3204878 2770845 1789555 1198022 1488264 2119972
35402B119972m07063k012918k078412L8642K240299K328993Q38098j41208r12
$$ 2119972 1712909 -300009 -2378421 -2339779 -99480 2229513 3067611 2926403 2925491
35393B925491J37059l73518r17012r22453o00510k75500J9052J82266M8592j96354
$$ 2925491 3062550 2689032 1772020 849567 249057 -26443 -7391 174875 223467 27113
35383B7113j82604P9990K58679K27728J58127J83905K57111K17004j13984o80909
$$ 27113 -155491 -75501 183178 410906 569033 752938 1010049 1227053 1113069 432160
35373D32160j035987q03218l02428k23030o15280p14466P8341J399837K210895
$$ 432160 -603827 -1407045 -1709473 -1932503 -2547783 -3262249 -3183908 -1784071 426824
35364D26824J748273L83241m28805L21665J559523J107076j146914k496951j030250
$$ 426824 2175097 2558338 2129533 2451198 4010721 5117797 3970883 1473932 443682
35355D43682J421971J701243m18524k429546k690195j606745Q9740J781308K090719
$$ 443682 1865653 3566896 3148372 718826 -1971369 -3578114 -3488374 -1707066 383653
35346C83653J78398k160936k199861p1399J614426J789637J702710J689904N32677
$$ 383653 562051 -1598885 -3798746 -3870145 -2255719 -466082 1236628 2926532 3459209
35337C459209j364880j610971J62003J171737n1718j172532k9894J679873J177377
$$ 3459209 2094329 483358 645361 1817098 1765380 592848 562954 2242827 3420204
35328C420204j061007k273602j318474N36033J705795J536910L44730o91885o26004
$$ 3420204 2359197 85595 -1232879 -696846 1008949 2545859 2890589 2198704 1572700
35319A572700j91113p07419j511058p85054Q98033R53645o47622p77700J572684
$$ 1572700 1381587 674168 -836890 -1621944 -723911 229734 -417888 -1195588 377096
35310C77096L217806J958118L5150j46593J891j291310k296226j127147K23696
$$ 377096 3594902 5553020 5588170 5441577 5443468 4152158 1855932 728785 952481
35301I52481o55383j910957o71490J488780J169208p95741j006844L25907K29552
$$ 952481 297098 -1613859 -2285349 -796569 372639 -423102 -1429946 -1104039 -874487
35292h74487j079957o77630J109927R52362j088049j185640J314100K309809K6227
$$ -874487 -1954444 -2632074 -1522147 -569785 -1657834 -2843474 -1529374 780435 806662
35283H06662j764442j92640J899663R31056j596080j986529j83690R82015M61403
$$ 806662 -957780 -1150420 749243 1680299 84219 -1902310 -2086000 -1103985 -642582
35274f42582l74110n56932l47799l1726K66622L67052O77814J699888K269145
$$ -642582 -1016692 -1573624 -1921423 -1953149 -1686527 -1319475 -641661 1058227 3327372
35265C327372N74087k177560k186465J086804K881228j55175m291452l733738
$$ 3327372 3901459 1723899 -462566 624238 3505466 3350291 -941161 -4674899
35257d674899Q68438L616241K058906k54132k48792M25323n95960k001996j241771
$$ -4674899 -3806461 -190220 1868686 1614554 1365762 1791085 1195125 -806871 -2048642
35248b048642J083431K233072J493245O71000R23178J430479J302581P97689J45169
$$ -2048642 -965211 1267861 2761106 3432106 4355284 5785763 7088344 7886033 8031202
35239H031202j117817k700906k881472p40199J766148J784351m83201j698483
$$ 8031202 6913385 4212479 1331007 590808 2356956 4141307 3658106 1959623
35231A959623Q9354K590199K364705m90947k744012k562493j373046r02428o49881
$$ 1959623 2048977 4639176 7003881 6512934 3768922 1206429 -166617 -1069045 -1718926
35222a718926M50286J599214J256097k04916r37969m73025j90659p03423p28722
$$ -1718926 -1268640 330574 1586671 1381755 443786 -29239 -219898 -923321 -1652043
35213a652043M57738J190526j99086k259155j975580P49985K623422J618437k30810
$$ -1652043 -1194305 -3779 -202865 -2462020 -4437600 -3687615 -1064193 554244 323434
35204C23434j80888J100972J042213n64821j558194j139191p56541j090203q90202
$$ 323434 142546 1243518 2285731 1720910 162716 -976475 -1733016 -2823219 -3713421
35195c713421M19098J395668R19418j63585p83532j069377j014740J32240J892858
$$ -3713421 -3294323 -1898655 -979237 -1142822 -1926354 -2995731 -4010471 -3878231 -1985373
35186a985373K198480N54637o54699J85404J264006N05560q99553p77676K98417
$$ -1985373 213107 767744 113045 298449 1562455 2068015 1168462 390786 689203
35177F89203N87954O18702J642478K285191O00042j728793j443866P24889J036864
$$ 689203 1277157 1895859 3538337 5823528 6423570 4694777 3250911 3975800 5012664
35168E012664r12399j643206j56486K06331k076064l476578j078812K522597L298104
$$ 5012664 4100265 2457059 2300573 2506904 430840 -3045738 -4124550 -1601953 1696151
35159A696151J654192O85074R20247N25751p56591j432863j267467j352952j529476
$$ 1696151 3350343 4035417 4955664 5481415 4724824 3291961 2024494 671542 -857934
35150h57934n37347J227589J579409l53437k684293l016320j041973J407230K228577
$$ -857934 -1395281 -167692 1411717 1058280 -1626013 -4642333 -5684306 -4277076 -2048499
35141b048499R99428n38641l82093J146864J770116N84826o25423l91876O558
$$ -2048499 -1049071 -1587712 -1969805 -822941 947175 1532001 906578 514702 521260
35132E21260j093972k516118j808158P89518K480095J881966N89143M45787J190332
$$ 521260 -572712 -3088830 -4896988 -4107470 -1627375 254591 843734 1289521 2479853
35123B479853J471484P92436k93101j032546j003280l56048K56879L90563K98106
$$ 2479853 3951337 4743773 4450672 3418126 2414846 2058798 2315677 2706240 3004346
35114C004346L03551J59131l49907p58113o72802n10553n57730j01312J263157
$$ 3004346 3307897 3467028 3117121 2359008 1686206 1175653 617923 516611 1779768
35105A779768K231264J307751p33954j640317p76375K63091K07338l84844m83175
$$ 1779768 4011032 5318783 4584829 2944512 2168137 2431228 2638566 2253722 1770547
35096A770547L7977Q18306J528403J557395L74826j371407k187815j533268l38255
$$ 1770547 1808524 2626830 4155233 5712628 6087454 4716047 2528232 994964 656709
35087F56709M13033N49495J47527n92678q48640l5760P60760k0967j609606j461826
$$ 656709 1069742 1619237 1766764 1174086 325446 289686 1050446 1029479 -580127 -2041953
35077b041953P67891K276017J324355j30223R9301P66088l03158j948819j325168
$$ -2041953 -1274062 1001955 2326310 2196087 2295388 3061476 2758318 809499 -515669
35068e15669J166783K158010M45169j473213j471598l63369M38291R52756J156196
$$ -515669 651114 2809124 3254293 1781080 309482 -53887 384404 1337160 2493356
35059B493356J97852j394119j302387Q97939K086051R01k857831k673402n1104
$$ 2493356 2691208 1297089 -5298 892641 2978692 2979593 121762 -2551640 -2602744
35050b602744J070787n46078k010429j016401J200303K369009K007894P75153
$$ -2602744 -1531957 -2078035 -4088464 -5104865 -3904562 -1535553 472341 1247494
35042A247494p61146j673535r85247N41317Q05245m50662r00105O72724K134088
$$ 1247494 486348 -1187187 -2172434 -1631117 -825872 -1276534 -2176639 -1503915 630173
35033F30173J299364n23682p21895M01063M59082q05116j262368k87336K17277
$$ 630173 1929537 1405855 683960 1085023 1544105 738989 -523379 -810715 -593438
35024e93438o00164q89468M91788J550610M47002q35305P45267L849055L788069
$$ -593438 -1193602 -2083070 -1591282 -40672 406330 -428975 316292 4165347 7953416
35015G953416n18097m196548k946296R32432J995813o80010k949464k118303j08057
$$ 7953416 7435319 3238771 292475 1224907 3220720 2540710 -408754 -2527057 -2635114
35006b635114N82567M22652O21116M31385q69966j637955k28477J939240K332888
$$ -2635114 -2052547 -1629895 -1008779 -577394 -1447360 -3085315 -3313792 -1374552 958336
34997I58336R73379l59351j187196j918205j783800j89674J142508N51632l71150
$$ 958336 1931715 1572364 385168 -1533037 -3316837 -3506511 -2364003 -1812371 -2183521
34988b183521N54087J778896O12747j309822l31684K360712K171834p33475j373727
$$ -2183521 -1629434 149462 762209 -547613 -879297 1481415 3653249 2919774 1546047
34979A546047J109161J690554j332956k913551l71808J582877l94779j860311
$$ 1546047 2655208 4345762 3012806 99255 -272553 1310324 915545 -944766
34971i44766J055469L742631J016929l107505k164305J282360N59412k615391
$$ -944766 110703 3853334 4870263 1762758 -401547 880813 1440225 -1175166
34963a175166j281304L444290L640778j266735l231263K12762J920911j598410
$$ -1175166 -2456470 987820 4628598 3361863 130600 343362 2264273 665863
34955F65863l885315l79250L374539J641506j952675j847382j34973j061271k220736
$$ 665863 -3219452 -3598702 -224163 1417343 -535332 -2382714 -2517687 -3578958 -5799694
34946e799694M92474M068954K979774j055299k135010k05718J25655j303905n95545
$$ -5799694 -5307220 -1238266 1741508 686209 -1448801 -1654519 -1528864 -2832769 -3428314
34937c428314J859168J646654j159123j668736R41992J855608n71458j792982
$$ -3428314 -1569146 77508 -1081615 -2750351 -1808359 47249 -524209 -2317191
34929b317191O05378K413192J96593k701626j894643J031255J902032P51550M50722
$$ -2317191 -1711813 701379 897972 -1803654 -3698297 -2667042 -765010 -13460 437262
34920D37262J098327N07521j183534j702370p50690j55807k06951O31544K112999
$$ 437262 1535589 2043110 859576 -842794 -1593484 -1749291 -1956242 -1324698 788301
34911G88301J676075j389827l962849l017432K52008K201424J610835O15695Q97341
$$ 788301 2464376 1074549 -2888300 -5905732 -5653724 -3452300 -1841465 -1225770 -328429
34902c28429J221358q1223j829258j311783J532640L496549K258916o70376k247425
$$ -328429 892929 811706 -1017552 -2329335 -796695 2699854 4958770 4288394 2040969
34893B040969j673412m90042K711j58967m82571n85281k02110L67817K96347m91790
$$ 2040969 367557 -122485 -119774 -278741 -761312 -1346593 -1548703 -1180886 -884539 -1376329
34883a376329q72876k28385M77166L87664K33943P43320R85246Q5161p89546l04635
$$ -1376329 -2249205 -2477590 -2000424 -1612760 -1378817 -635497 349749 434910 -354636 -659271
34873f59271M64865j42777j106902k60562J641962J712211l89310j903978j353520
$$ -659271 -194406 -337183 -1444085 -1704647 -62685 1649526 1260216 -643762 -1997282
34864a997282j76735M72788J135183J487824P4701k088793j517951K037135L757385
$$ -1997282 -2174017 -1701229 -566046 921778 996479 -1092314 -2610265 -573130 3184255
34855C184255O85847l051955k088915J888240K793030l69503k344735k15646K373561
$$ 3184255 3870102 818147 -1270768 617472 3410502 3040999 696264 480618 2854179
34846B854179J525617j006796j389145J86331P62290r2874k77324M65216J24461
$$ 2854179 4379796 3373000 1983855 2170186 2932476 2839602 2562278 3027494 3151955
34837C151955j457367j717537L05926J974669J117804n78577n26044O18927N67508
$$ 3151955 1694588 -22949 282977 2257646 3375450 2796873 2270829 2889756 3457264
34828C457264m58524m86620J87201o05645k464404k149928J172208L862735K863726
$$ 3457264 2998740 2512120 2699321 2093676 -370728 -2520656 -1348448 2514287 5378013
34819E378013m5946j375018q72101n67950p37684l6579J296025J481642K28043
$$ 5378013 5332067 3957049 3084948 2516998 1779314 1742735 3038760 4520402 4748445
34810D748445q80868r78943o39968q7112J058374K138419J737695n9391j503263
$$ 4748445 3867577 2888634 2248666 2161554 3219928 5358347 7096042 7036651 5533388
34801E533388j492140m65186Q40405J714793R67907j600969l526581k234796P25514
$$ 5533388 4041248 3576062 4416467 6131260 7099167 5498198 1971617 -263179 462335
34792D62335J222339j183347k186629N54612L406182K193196j392830k501487
$$ 462335 1684674 501327 -1685302 -1130690 2275492 4468688 3075858 574371
34784E74371l83459J104432k56469k111619j583873O80729J976779J246797k02095
$$ 574371 190912 1295344 1038875 -1072744 -2656617 -1975888 891 1247688 1045593
34775A045593q37453n18993j00039j14712k09886P4106L54458n2078p71919p19835
$$ 1045593 208140 -310853 -410892 -525604 -735490 -661384 -306926 -359004 -1130923 -1850758
34765a850758l1062j58707j340161j673933n6858J644465J369324L83616J292897
$$ -1850758 -1881820 -2040527 -3380688 -5054621 -5111479 -3467014 -2097690 -1714074 -421177
34756d21177L321987K891512p63033l800315k956541J59044J865339J331760K97978
$$ -421177 2900810 5792322 5029289 1228974 -1727567 -1568523 296816 1628576 1926554
34747A926554n12154j737975k753633j736929J128480K984905J923769n23584
$$ 1926554 1414400 -323575 -3077208 -4814137 -3685657 -700752 1223017 699433
34739F99433j727753j299598o36099l19214J89937P88729N62515m61418r59413
$$ 699433 -1028320 -2327918 -2964017 -3283231 -3093294 -2304565 -1742050 -2203468 -3162881
34730c162881k54165O07872M60916k53695l08912L89198Q13738N76629N66005
$$ -3162881 -3417046 -2809174 -2348258 -2601953 -2910865 -2521667 -1707929 -1131300 -565295
34721e65295J448236K331247J724013l60242k070184j817099j57614J012680P89409
$$ -565295 882941 3214188 4938201 4577959 2507775 690676 533062 1545742 2335151
34712B335151n5323n91924q12951q62218l52406P46523J477203J148057M35968
$$ 2335151 2279828 1687904 874953 12735 -339671 406852 1884055 3032112 3468080
34703C468080J75113j13130j128733k020061j428903J73231J057424Q79212P84813
$$ 3468080 3643193 3530063 2401330 381269 -1047634 -874403 183021 1062233 1847046
34694A847046J026026O73847j62508k00910M91463K85660r98158j429399l45227
$$ 1847046 2873072 3546919 3384411 3183501 3674964 3960624 2962466 1533067 1187840
34685A187840K84165o61089j289569l1268J355592O23710j171612j513662m90808
$$ 1187840 1472005 810916 -478653 -509921 845671 1469381 297769 -1215893 -1706701
34676a706701j50115q75033j148516k49622J120108K226674K451303J165207p46748
$$ -1706701 -1856816 -2731849 -3880365 -4129987 -3009879 -783205 1668098 2833305 2086557
34667B086557r19464Q56493J288890j355559l497480j460909K040296J738418
$$ 2086557 1167093 2023586 3312476 1956917 -1540563 -3001472 -961176 777242
34659G77242j601772k469941J28563J301989j044103k757573q32619J803494J981589
$$ 777242 -824530 -3294471 -3165908 -1863919 -2908022 -5665595 -6498214 -4694720 -2713131
34650b713131J349440K008182J965146o42972k924851j746571M48450m58699l072418
$$ -2713131 -1363691 644491 2609637 1966665 -958186 -2704757 -2256307 -2715006 -5787424
34641e787424k686094Q52601K951303J500472o81336r39191j4722N86693Q94920
$$ -5787424 -8473518 -7620917 -4669614 -3169142 -3850478 -4789669 -4804391 -4217698 -3322778
34632c322778J172185J065568P51196O98189K26534j341109k387548p31410K428693
$$ -3322778 -2150593 -1085025 -333829 364360 590894 -750215 -3137763 -3869173 -1440480
34623a440480L453481J497388l69141j3058R30841L63339r72502j240650l91940
$$ -1440480 2013001 3510389 3141248 3128190 4059031 4422370 3449868 2209218 1817278
34614A817278M94710J089733J388093P58924r91910k534972k328391m75548J503512
$$ 1817278 2311988 3401721 4789814 5548738 4556828 2021856 -306535 -782083 721429
34605G21429K168450J062581j007654k319975j842511o09942l51381q83062n37793
$$ 721429 2889879 3952460 2944806 624831 -1217680 -1827622 -2179003 -3062065 -3599858
34596c599858Q20632J402346N88537L2087O59829J017522J68220j67306J338959
$$ -3599858 -2779226 -1376880 -788343 -756256 -96427 921095 1089315 922009 2260968
34587B260968K497350N97733k723068l167879j76241J975741M79252j881871j128779
$$ 2260968 4758318 5356051 2632983 -534896 -711137 1264604 1743856 -138015 -1266794
34578a266794J758806K269780q90825l814946k885348M45765K190110J360982
$$ -1266794 492012 2761792 1870967 -1943979 -4829327 -4383562 -2193452 -832470
34570h32470M52179R98170J457830K77828j249611r34103Q28160J524920Q3743
$$ -832470 -380291 617879 2075709 2353537 1103926 169823 997983 2522903 2606646
34561B606646j794101k017512n19330J083363J364738K90891r08876r37937J63986
$$ 2606646 812545 -1204967 -1724297 -640934 723804 1014695 105819 -832118 -668132
34552f68132J042610Q28940K91046M34222P15465o0158j548851k148897j397656
$$ -668132 374478 1203418 1494464 1928686 2644151 2583993 1035142 -1113755 -2511411
34543b511411n02518k46077Q5249J099887J975751J611895K27007r81856j219011
$$ -2511411 -3013929 -3260006 -3174757 -2074870 -99119 1512776 1739783 757927 -461084
34534d61084o01385K20782N84640L52164M8585P0840n029o39579j255165j024920
$$ -461084 -1062469 -841687 -257047 95117 143702 214542 209513 -430066 -1685231 -2710151
34524b710151m03130m73016r38343m41140J008048J770301J195300N93030Q24226
$$ -2710151 -3113281 -3586297 -4524640 -4965780 -3957732 -2187431 -992131 -399101 425125
34515D25125Q47901j68268j099349p53872L5531k2835l32797L43875J263982O12521
$$ 425125 1273026 1104758 5409 -748463 -712932 -735767 -1068564 -724689 539293 1151814
34505A151814j349993k292892j140274N42544R92136M67082K60271P02789J087782
$$ 1151814 -198179 -2491071 -3631345 -3088801 -2096665 -1629583 -1369312 -666523 421259
34496D21259R03986L14593l40769r43626j439892j518728p25081Q14834J957124
$$ 421259 1325245 1639838 1299069 355443 -1084449 -2603177 -3328258 -2513424 -556300
34487e56300J557615Q3601p06302j51329L15820n47220j591898q49748J309745
$$ -556300 1001315 1084916 378614 227285 543105 -4115 -1596013 -2445761 -1136016
34478a136016K364014J023766j140963j892480q69033O72975J609016J617840
$$ -1136016 1227998 2251764 1110801 -781679 -1650712 -977737 631279 2249119
34470B249119Q05674l98859j173815q81576J15463O25118p0189j192662j189419
$$ 2249119 3054793 2655934 1482119 600543 716006 1341124 1270935 78273 -1111146
34461a111146K93722J644429J160160o46458j669453j067779j34140J0712j8902
$$ -1111146 -817424 827005 1987165 1340707 -328746 -1396525 -1530665 -1519953 -1538855
34452a538855M94294P53425q7072j098685r73385k90708m62491j125716p36651
$$ -1538855 -1044561 -291136 -378208 -1476893 -2450278 -2740986 -3203477 -4329193 -5065844
34443e065844O08195J220739O96070M79156J236194J845244J573089J134417Q19218
$$ -5065844 -4457649 -3236910 -2540840 -2061684 -825490 1019754 2592843 3727260 4546478
34434D546478k85660k112181k722299j089773J001079J507052J008145J147281
$$ 4546478 4260818 2148637 -573662 -1663435 -662356 844696 1852841 3000122
34426C000122J555151O33625j334615k212116j095816N33420R59217J1282j485730
$$ 3000122 4555273 5188898 3854283 1642167 546351 1079771 2038988 2050270 564540
34417E64540k636185k554071q38652J474075K406924J125785j003857j845569
$$ 564540 -2071645 -4625716 -5464368 -3990293 -1583369 -457584 -1461441 -3307010
34409c307010o25255J527685K809620K373473R34565k19503p28064j175488j591550
$$ -3307010 -3932265 -2404580 405040 2778513 3713078 3493575 2765511 1590023 -1527
34400a527r87589Q94900K356528J566601q29503k300489j571999Q8474R08413
$$ -1527 -989116 -94216 2262312 3828913 2999410 698921 -873078 -784604 123809
34391A23809P02857L79073L18386J56707j92497j65668N80919J384003J159396
$$ 123809 826666 1205739 1524125 1680832 1488335 1322667 1903586 3287589 4446985
34382D446985j97512j503883j716237j144083o40142k24291L99480N61184m41373
$$ 4446985 4249473 2745590 1029353 -114730 -754872 -979163 -579683 -18499 -459872
34373d59872j404960m51160J550222J472602j113493k414483N6134L135461K373695
$$ -459872 -1864832 -2315992 -765770 706832 -406661 -2821144 -2765010 370451 2744146
34364B744146j206412k609064k71609K134295J586715m12406j051116j67124P26254
$$ 2744146 1537734 -1071330 -1342939 791356 2378071 1965665 914549 747425 1473679
34355A473679J070818J134006Q31283J79352k14767j68003l66152j093308j673040
$$ 1473679 2544497 3678503 4509786 4689138 4474371 4306368 3940216 2846908 1173868
34346A173868j679643j417082q45771M28590J741801J707694M50881l35826p5061
$$ 1173868 -505775 -1922857 -2768628 -2340038 -598237 1109457 1560338 1224512 1149451
34337A149451j8785o57119o88717M38853J214876N55767m56520o27856m49640
$$ 1149451 1130666 473547 -215170 223683 1438559 1994326 1537806 909950 460310
34328D60310n73582n26152j81309l49991p53095L3638J393839O53864j984209
$$ 460310 -113272 -639424 -820733 -1170724 -1923819 -1890181 -496342 157522 -1826687
34319a826687k318069J204626L682520P94402l819386l595492R24097L253036
$$ -1826687 -4144756 -2940130 742390 1536792 -2282594 -5878086 -4953989 -1700953
34311a700953J091412j154343l72117R68083L05821o61387J45882J282561Q20169
$$ -1700953 -609541 -1763884 -2136001 -1167918 -862097 -1523484 -1377602 -95041 725128
34302G25128n4107M67170J359549P43433p64164j373201j080927q54628m28613
$$ 725128 671021 1138191 2497740 3241173 2477009 1103808 22881 -831747 -1260360
34293a260360O66771J262748K09281j188154q24964Q38998J450511M54739j70674
$$ -1260360 -593589 669159 878440 -309714 -1134678 -295680 1154831 1609570 1438896
34284A438896Q98529K285668J805158o23882k741324k473041l84567P83467n79412
$$ 1438896 2337425 4623093 6428251 5804369 3063045 590004 205437 988904 409492
34275D09492k662544k373319N18225L001227K799023R30823l81427o01109m98549
$$ 409492 -2253052 -4626371 -4108146 -1106919 1692104 2622927 2241500 1640391 1141842
34266A141842l17103J94390P19928O15592j77602j172248j794378j457984k1631
$$ 1141842 824739 1019129 1739057 2354649 2177047 1004799 -789579 -2247563 -2269194
34257b269194J482817J609154M02283n28173k15519N58816P11333J02135r83582
$$ -2269194 -786377 822777 1225060 696887 481368 1040184 1751517 1853652 870070
34248H70070k132241k295512p30692J174015J044205r17571j784097k15228J549814
$$ 870070 -1262171 -3557683 -4288375 -3114360 -2070155 -2987726 -4771823 -4987051 -3437237
34239c437237J335839J45372j76488R714l19102l64247Q51662K043150J521971
$$ -3437237 -2101398 -1956026 -2132514 -2122800 -2441902 -2806149 -1954487 88663 1610634
34230A610634J29748k77925L7040k13313m14089P04814J862435O76392k062667
$$ 1610634 1740382 1462457 1499497 1286184 872095 1576909 3439344 4115736 2053069
34221B053069k987255j178687O66897O40943J3770J69935J30263j128139k203452
$$ 2053069 -934186 -2112873 -1445976 -805033 -791263 -621328 -491065 -1619204 -3822656
34212c822656j260781R39028K048850J421258N70022N62402N56663n66257k123581
$$ -3822656 -5083437 -4144409 -2095559 -674301 -104279 458123 1014786 448529 -1675052
34203a675052k195283k08150J991266K311420J006755j3723j4045L9710l17486
$$ -1675052 -3870335 -4078485 -2087219 224201 1230956 1217233 1203188 1242898 925412
34194I25412l36851M4914k11165r61350n44822J079402J450417m28653j951782
$$ 925412 588561 633475 422310 -539040 -1083862 -4460 1445957 1017304 -934478
34185i34478j028298M17789K9904o21231Q88649K713418J398343j779735k285778
$$ -934478 -1962776 -1544987 -1515083 -2136314 -1247665 1465753 2864096 1084361 -1201417
34176a201417L72166K052309R45005j35351N33065P57035p39766j444734K75720
$$ -1201417 -829251 1223058 2168063 2032712 2565777 3322812 2583046 1138312 1414032
34167A414032J744804M00874j705939j269678J007985J916506O23471j040874
$$ 1414032 3158836 3559710 1853771 584093 1592078 3508584 4132055 3091181
34159C091181j781688j623799o64702O60997J157395N36354J53410N24717Q0571
$$ 3091181 1309493 -314306 -979008 -318011 839384 1375738 1529148 2053865 2134436
34150B134436j712960k354387q6242K469840J732755j335302k674005j128072
$$ 2134436 421476 -1932911 -2019153 450687 2183442 848140 -1825865 -2953937
34142b953937N91592O28375J42475L60021N67269L7266m03319J02415R64981J190416
$$ -2953937 -2362345 -1733970 -1591495 -1231474 -664205 -626939 -1030258 -927843 37138 1227554
34132A227554Q29511O57802J032070J436718R50463o20603j989344j594281K24916
$$ 1227554 2057065 2714867 3746937 5183655 6134118 5513515 3524171 1929890 2154806
34123B154806J529116J573139J497172J682210Q71131q97225j322689K68136J062592
$$ 2154806 3683922 5257061 6754233 8436443 9307574 8410349 7087660 7355796 8418388
34114H418388n79390j734902K69782K698396J673023r78882q08958J108768k00209
$$ 8418388 7838998 6104096 6373878 9072274 10745297 9766415 8957457 10066225 9866016
34105I866016m293182m903201j64965L822636K487284n71670m26490J288974M34812
$$ 9866016 5572834 669633 504668 4327304 6814588 6242918 5816428 7105402 7540214
34096G540214k003352k072060R9800R56868l10379j179544n08135M36840J000449
$$ 7540214 5536862 3464802 3564602 4521470 4211091 3031547 2523412 2960252 3960701
34087C960701J410364P75981j527518l280704j962245Q60897J516822r1256q94858
$$ 3960701 5371065 6147046 4619528 1338824 -623421 237476 1754298 1663042 768184
34078G68184j98451k11532j070194l01611J916249J951305j117959l182509j359166
$$ 768184 569733 358201 -711993 -1013604 902645 2853950 1735991 -1446518 -2805684
34069b805684J560297J801455J50537m40842K30377N64513N84278R38536M92004
$$ -2805684 -1245387 556068 706605 265763 496140 1060653 1644931 2583467 3075471
34060C075471j626473l272724k098986L04803O83064o42563o46063J017476J584227
$$ 3075471 1448998 -1823726 -3922712 -3617909 -2934845 -3577408 -4223471 -3205995 -1621768
34051a621768J44133r39945k50343O59858N68780O31302J599522J863147J68699
$$ -1621768 -1477635 -2417580 -2667923 -2008065 -1439285 -807983 791539 2654686 2823385
34042B823385j918821k179053o68542J132611K462570K916137J584145j380565
$$ 2823385 904564 -1274489 -1943031 -810420 1652150 4568287 6152432 4771867
34034D771867l480486k387866O91364K117871L28899k300486k484935J32178K735198
$$ 4771867 1291381 -1096485 -405121 1712750 2041649 -258837 -2743772 -2611594 123604
34025A23604K522608k85469k750960k493834k31821J404005J078680j83287q39480
$$ 123604 2646212 2360743 -390217 -2884051 -3115872 -1711867 -633187 -816474 -1655954
34016a655954m46047O15404J691233J841753N47434j156541j455894j12274J126787
$$ -1655954 -2102001 -1486597 204636 2046389 2593823 1437282 -18612 -130886 995901
34007I95901Q79217l41679j335061j580032r44993M62030J564913J010360p32472
$$ 995901 1875118 1533439 198378 -1381654 -2326647 -1864617 -299704 710656 -21816
33998b1816j594282r05773k68953n73645m30261R95803J937302Q74044o47691
$$ -21816 -1616098 -2521871 -2790824 -3364469 -3794730 -2798927 -861625 12419 -635272
33989f35272n25833L41143j35626j274387p16887J309909K200660J267786N18880
$$ -635272 -1161105 -819962 -955588 -2229975 -2946862 -1636953 563707 1831493 2350373
33980B350373P80773L01676j690501k901058j247625J708919K578212M39365k219859
$$ 2350373 3131146 3432822 1742321 -1158737 -2406362 -697443 1880769 2320134 100275
33971A00275k535316l04595J978141J869661k29305j491707k70646J679467J691856
$$ 100275 -2435041 -2739636 -761495 1108166 878861 -612846 -883492 795975 2487831
33962B487831q4356j190768n05046O37969Q27912J30378q24469j491895j077118
$$ 2487831 2403475 1212707 707661 1345630 2173542 2303920 1479451 -12444 -1089562
33953a089562O10000J911037R47958j333968j960931j78621J455095J006615k10667
$$ -1089562 -479562 1431475 2379433 1045465 -915466 -1094087 361008 1367623 1156956
33944A156956k51544L89965J12333r72508j470731j023146n19786n18228p16402
$$ 1156956 905412 1295377 1407710 435202 -1035529 -2058675 -2578461 -3096689 -3813091
33935c813091o54888r1516R07703J677172J356572J05447p59465l32287Q14135
$$ -3813091 -4467979 -4559495 -3651792 -1974620 -618048 -512601 -1272066 -1604353 -790218
33926g90218J498197J225532L71476l00721k32934K33372O1487q54850j067970
$$ -790218 707979 1933511 2304987 2004266 1771332 2004704 2066191 1211341 143371
33917A43371J64745J069875j62664k016856j494351J155553K706551J960593J011764
$$ 143371 308116 1377991 1215327 -801529 -2295880 -1140327 1566224 3526817 4538581
33908D538581J005153M30710j101452j244509Q45031K166406M33395k048069k002050
$$ 4538581 5543734 5974444 4872992 3628483 4473514 6639920 7073315 5025246 3023196
33899C023196n2426J145561J277751J493394J181955o85510k425852j551005J037449
$$ 3023196 2970770 4116331 5394082 6887476 8069431 7383921 4958069 3407064 4444513
33890D444513K114022P76534j000435j797040j778877r66211N80476J468579O84920
$$ 4444513 6558535 7335069 6334634 4537594 2758717 1792506 2372982 3841561 4526481
33881D526481k56111K25930M98705j455861l305237j217768L101669L721203m21705
$$ 4526481 4270370 4496300 4995005 3539144 233907 -983861 2117808 5839011 5417306
33872E417306l304935p70280L450175L868687J085115o04117k59606l35352j437770
$$ 5417306 2112371 1342091 4792266 8660953 9746068 9141951 8882345 8546993 7109223
33863G109223j588839k70172O33245K10630k13762K59627P42094N81060N15039
$$ 7109223 5520384 5250212 5883457 6094087 5880325 6139952 6882046 7463106 7978145
33854G978145Q08280J98281j806938l032393j078851K774349M253100J402659
$$ 7978145 8786425 8984706 7177768 4145375 3066524 5840873 10093973 11496632
33846A1496632k467180k801571J74031J838596k34591k808752j753976J940570
$$ 11496632 9029452 6227881 6401912 8240508 8005917 5197165 3443189 5383759
33838E383759L736883K049465n7913J84045J633454J728577L28952o17112p793
$$ 5383759 9120642 11170107 11112194 11296239 12929693 14658270 14987222 14370110 14362317
33829A4362317J274121J671719O48411n90666o4491K516512M590812L527565M20425
$$ 14362317 15636438 17308157 17956568 17365902 17301411 19817923 24408735 27936300 28356725
33820B8356725q88907J078118L548065L702977K536200K709634M279471M978151
$$ 28356725 27467818 28545936 32094001 35796978 38333178 41042812 45322283 50300434
33812E0300434M050424L384740M507450O279342O511934M850207K916792J872307
$$ 50300434 54350858 57735598 62243048 68522390 75034324 79884531 82801323 84673630
33804H4673630J004130p09798k536233k860556j968990k179637m461987o625736
$$ 84673630 85677760 84967962 82431729 79571173 77602183 75422546 70960559 64334823
33796F4334823o290239m258576l103455l461618l823925l293428k391816j561660
$$ 64334823 58044584 53786008 50682553 47220935 43397010 40103582 37711766 36150106
33788C6150106q99011r46250j836399k363048j919857k120276l821446m166043
$$ 36150106 35251095 34304845 32468446 30105398 28185541 26065265 22243819 18077776
33780A8077776n22746L827533L047020k297755n283703k765469L92947l86533
$$ 18077776 17555030 21382563 24429583 22131828 16848125 14082656 14475603 14089070
33772A4089070k596660j915835O65703J687492J279652J361707R59490j390176
$$ 14089070 11492410 9576575 10242278 11929770 13209422 14571129 15530619 14140443
33764A4140443l113432j098359K091115J327536k759023m470546j885997Q13510
$$ 14140443 11027011 9928652 12019767 13347303 10588280 6117734 4231737 5045247
33756E045247N85458m74930k8746N71602l23037j292379n84917P43947R23447
$$ 5045247 5630705 5155775 5127029 5698631 5375594 4083215 3498298 4242245 5165692
33747E165692L48161J64713j6016r10565j646347r51743P82037J995807J742334
$$ 5165692 5513853 5678566 5662550 4751985 3105638 2153895 2935932 4931739 6674073
33738F674073K88517j155033j140101L79033J334872J06901j722613j447891M42172
$$ 6674073 6962590 5807557 4667456 5046489 6381361 6488262 4765649 3317758 3759930
33729C759930J017030j77475n23207Q42690J431536j10511j630197j366028p10686
$$ 3759930 4776960 4599485 4076278 4918968 6350504 6239993 4609796 3243768 2533082
33720B533082r51207p01362Q21960J300964p33132k471861j055443J339066Q55842
$$ 2533082 1581875 880513 1702473 3003437 2270305 -201556 -1256999 82067 937909
33711I37909j515656j462320J531414L339962J655822r95770j678843q80872m49897
$$ 937909 -577747 -2040067 -508653 2831309 4487131 3491361 1812518 931646 481749
33702D81749n23494k34319M54135J088716J548436J525869M52403j222357j870036
$$ 481749 -41745 -276064 178071 1266787 2815223 4341092 4793495 3571138 1701102
33693A701102o73680J109338J609968M70959r75753j247258k13414P29445K01992
$$ 1701102 1027422 2136760 3746728 4217687 3241934 1994676 1781262 2510707 2712699
33684B712699j293302j806893o14178P36001Q03009K11607K2730j78531q12650
$$ 2712699 1419397 -387496 -1001674 -265673 537336 748943 771673 593142 -219508
33675b19508o71309Q51431J537115n45778l005822k000094J525396K809100O65938
$$ -219508 -890817 -39386 1497729 951951 -2053871 -4053965 -2528569 280531 946469
33666I46469q11699P75007K222367L91399k375647k173755K11096J097757q1032
$$ 946469 134770 909777 3132144 3523543 1147896 -1025859 -814763 282994 201962
33657B01962p88520k31623m6483n46477k26828P68329L66490j500096k066122
$$ 201962 -586558 -818181 -864664 -1411141 -1637969 -869640 -503150 -2003246 -4069368
33648d069368o2277K140889K289059J431340J412100J595975N42729r08686j011855
$$ -4069368 -4131645 -1990756 298303 1729643 3141743 4737718 5280447 4371761 3359906
33639C359906l61807q68269k119864j807766K05153J311241L98182k94883R15729
$$ 3359906 2998099 2129830 9966 -1797800 -1592647 -281406 116776 -178107 737622
33630G37622K065228P36893j653847j817797K24503J241880k6132j118989j27675
$$ 737622 2802850 3539743 1885896 68099 292602 1534482 1508350 389361 261686
33621B61686J326905J044410l05278q23486n47079n41544l25244J025153K139929
$$ 261686 1588591 2633001 2327723 1504237 957158 415614 90370 1115523 3255452
33612C255452P91994k121582l076078r12384J450996J334688j78572o00434J41451
$$ 3255452 4047446 1925864 -1150214 -2062598 -611602 723086 544514 -55920 85531
33603H5531K85797o27346j307284r28830r7014L82141N11452P51483J339569J997520
$$ 85531 371328 -256018 -1563302 -2492132 -2589146 -2207005 -1695553 -944070 395499 2393019
33593B393019K033381R87717o69138j936861k398614k237011j289718O54306K486963
$$ 2393019 4426400 5414117 4744979 2808118 409504 -1827507 -3117225 -2462919 24044
33584B4044K362226L60008j018685j34601J420986J153957p83718k015545j204547
$$ 24044 2386270 2746278 1727593 1592992 3013978 4167935 3384217 1368672 164125
33575A64125O40950J708431R94352j149167k984724k553308k2165J905299J235808
$$ 164125 805075 2513506 3507858 2358691 -626033 -3179341 -3201506 -1296207 -60399
33566f0399n49328o33266J035919J883904O36313j112339j529814p92189m4331
$$ -60399 -609727 -1242993 -207074 1676830 2313143 1200804 -329010 -1121199 -1165530
33557a165530L53101O95288J014015R71065K48243j028963j904103j206047O98832
$$ -1165530 -812429 -117141 896874 1867939 2116182 1087219 -816884 -2022931 -1324099
33548a324099J678317N81008q50884n64091M42951j53052j720474j369995J070647
$$ -1324099 354218 935226 84342 -479749 -36798 -189850 -1910324 -3280319 -2209672
33539b209672K339750R05657o23784P3678J408590J033665j43271j6995Q06381
$$ -2209672 130078 1035735 411951 485629 1894219 2927884 2784613 2767618 3573999
33530C573999M18118o29873m53143K43952q84286l114270k709354J361315N007962
$$ 3573999 3992117 3362244 2909101 3153053 2268767 -845503 -3554857 -2193542 2814420
33521B814420M093665l03177l582158l137415m48748J471830J200912k65240r12661
$$ 2814420 6908085 6604908 3022750 -114665 -563413 908417 2109329 1844089 931428
33512I31428k7647Q23842j77776k247327k633176m82467J718386J634777L17904
$$ 931428 903781 1727623 1549847 -697480 -3330656 -3813123 -2094737 -459960 -142056
33503a42056K14790J256521J278796j68711j010187p3463R82701L72672r61169
$$ -142056 72734 1329255 2608051 2439340 1429153 1355690 2338391 2711063 1749894
33494A749894r29843L49192Q07044k45781j066950k99887Q57763N51967p26532
$$ 1749894 820051 1169243 1976287 1730506 663556 363669 1221432 1773399 1046867
33485A046867p43248J057433K444745J412704r80228k057262j134398q1062k62217
$$ 1046867 303619 1361052 3805797 5218501 4238273 2181011 1046613 965551 703334
33476G03334o73080J4578J046378Q41884k35455m13829L97670L49058r99892j459665
$$ 703334 30254 44832 1091210 1933094 1697639 1283810 1681480 2030538 1030646 -429019
33466d29019K38933J804477N74155k131955k680352m89932J343201R50893J33836
$$ -429019 -190086 1614391 2188546 56591 -2623761 -3113693 -1770492 -819599 -685763
33457f85763Q59336K063162J714430M5913j259521j698850j870062j786713j021352
$$ -685763 173573 2236735 3951165 3997078 2737557 1038707 -831355 -2618068 -3639420
33448c639420J46435J066060J496596J150725k91617j738229j070426J524035
$$ -3639420 -3492985 -2426925 -930329 220396 -71221 -1809450 -2879876 -1355841
33440a355841K685180N14466k033784j303199J410077K040597K49020o18466M06289
$$ -1355841 1329339 1843805 -189979 -1493178 -83101 1957496 2206516 1588050 1994339
33431A994339O02333j092156k021684o56235O28203j99688j322820l68741J712238
$$ 1994339 2596672 1504516 -517168 -1173403 -545200 -744888 -2067708 -2436449 -724211
33422g24211K664090K326660J531115J7177j930273k125610L05693K457318J518933
$$ -724211 1939879 4266539 5797654 5814831 3884558 1758948 2064641 4521959 6040892
33413F040892p59030r01888N95140L16575k186933l597671k019470N46812J537622
$$ 6040892 5281862 4379974 4975114 5291689 3104756 -492915 -2512385 -1965573 -427951
33404d27951Q14609l55318r95027n51465P35512J382197L50902j039705q75773
$$ -427951 386658 31340 -963687 -1515152 -779640 602557 953459 -86246 -962019
33395i62019K12364J19045j057013j333301n48224l95632o86823O39281L053760
$$ -962019 -749655 -630610 -1687623 -3020924 -3569148 -3964780 -4651603 -4012322 -958562
33386i58562L021965l27170k943986j652081J175508J631009L0640p26501j85899
$$ -958562 2063403 1736233 -1207753 -2859834 -1684326 -53317 -22677 -749178 -935077
33377i35077O6952J73475J372333K539294J371379j213720j744779M02325J966441
$$ -935077 -868125 -694650 677683 3216977 4588356 3374636 1629857 2032182 3998623
33368C998623R70586o47887r16929q77410j694701j832790O9152J892164R11982
$$ 3998623 4969209 4321322 3404393 2526983 832282 -1000508 -931356 960808 1872790
33359A872790j572167j964531O7624J325807L31449p14971n2553Q35682J77513
$$ 1872790 300623 -1663908 -1596284 -270477 60972 -653999 -706552 129130 306643
33350C06643r78715p42420M40831Q17869J84596l96300o35361p14688J2625J771887
$$ 306643 -672072 -1414492 -973661 -155792 28804 -367496 -1002857 -1717545 -1704920 66967
33340F6967K705827J007926j830273k616901j074054N2953l79823m25687R57187
$$ 66967 2772794 3780720 1950447 -666454 -1740508 -1687555 -2067378 -2493065 -1535878
33331a535878J683761P6362k092367k316814r99443L434P16935K229737L676562
$$ -1535878 147883 224245 -1868122 -4184936 -5184379 -5180945 -4464010 -2234273 1442289
33322A442289K876684k30977l048240l365904j415406J026274K255856J625330
$$ 1442289 4318973 4087996 1039756 -2326148 -3741554 -2715280 -459424 1165906
33314A165906J34675l00564P82768J475258J67473j849545k187797r15753j35823
$$ 1165906 1300581 1000017 1782785 3258043 3425516 1575971 -611826 -1527579 -1663402
33305a663402m38282k43963J033392J578452O9401j754826j102050J943787M059848
$$ -1663402 -2101684 -2345647 -1312255 266197 335598 -1419228 -2521278 -577491 3482357
33296C482357K612605r82007k842518j456072M96053O9704j684257j565774N72649
$$ 3482357 6094962 5112955 2270437 814365 1310418 1380122 -304135 -1869909 -1297260
33287a297260J587717J47730j377101j197679p74404j316563j046172J305484
$$ -1297260 290457 438187 -938914 -2136593 -2910997 -4227560 -5273732 -3968248
33279c968248L287937K318115j2905o86477l1639o4756k87228O93367J362590
$$ -3968248 -680311 1637804 1624899 938422 906783 842027 554799 1248166 2610756
33270B610756k18702j829225j38535K934757K578634q92348k467786q92519j90879
$$ 2610756 2392054 562829 424294 3359051 5937685 5045337 2577551 1685032 1494153
33261A494153j829072k113082M41516J662205j033604l695571k190926J347627
$$ 1494153 -334919 -2448001 -2006485 -344280 -1377884 -5073455 -7264381 -5916754
33253e916754K705633K013153J580985J081975m59295j119406O69655K066015
$$ -5916754 -3211121 -1197968 383017 1464992 1005697 -113709 555946 2621961
33245B621961q1309l365799l089489L29543K261894J051578n96112p94063l89251
$$ 2621961 2540652 -825147 -3914636 -3585093 -1323199 -271621 -867733 -1661796 -2051047
33236b051047J13585J222474J956317O61779j436126j269280J136659K383842
$$ -2051047 -1937462 -714988 1241329 1903108 466982 -802298 334361 2718203
33228B718203Q74994j208594j788103j412016r90992j50444R74492J070604L8950
$$ 2718203 3593197 2384603 596500 -815516 -1806508 -1956952 -982460 88144 127094
33219A27094l65882N22779R99968p3565j198245o52856P11475P90596o55592j677586
$$ 127094 -238788 283991 1283959 1210394 12149 -640707 70768 861364 205772 -1471814
33209a471814o52483J656418K677180Q65659j990878k388109L12132K553238J384073
$$ -1471814 -2124297 -467879 2209301 3074960 1084082 -1304027 -991895 1561343 2945416
33200B945416j207229j304588J016178K128582N80297j299445j698695j572245
$$ 2945416 1738187 433599 1449777 3578359 4158656 2859211 1160516 -411729
33192d11729j700972r43638J018385K106451R22612q93964j251221n65341k88777
$$ -411729 -2112701 -3056339 -2037954 68497 991109 97145 -1154076 -1719417 -2008194
33183b008194k73285L58134J056350O04901p57151j611656j224964j6872J153501
$$ -2008194 -2281479 -1923345 -866995 -262094 -1019245 -2630901 -3855865 -3872737 -2719236
33174b719236J357356K30767j018302n34953J406701K197512O71831q13765J2331
$$ -2719236 -1361880 -1131113 -2149415 -2684368 -1277667 919845 1591676 777911 790242
33165G90242J458917M03306k370713k776141M55028L528264K805996k91017j661787
$$ 790242 2249159 2652465 281752 -2494389 -2039361 1488903 4294899 4003882 2342095
33156B342095j35010J721403J686329L44422p29985j145981j213552q73882k53195
$$ 2342095 2207085 3928488 5614817 5959239 5229254 4083273 2869721 1995839 1742644
33147A742644j34904o75632o50921O48051J729131Q74823r48945j337957j89006
$$ 1742644 1607740 932108 281187 929238 2658369 3533192 2584247 1246290 1057284
33138A057284L94665k7245M66374K131778K159238p19701l216982k024128R14225
$$ 1057284 1451949 1424704 1891078 4022856 6182094 5462393 2245411 221283 1135508
33129A135508J226693j230351k500120q35770J145827J163905L98678N00430O22691
$$ 1135508 2362201 1131850 -1368270 -2204040 -1058213 105692 504370 1004800 1627491
33120A627491m66556j609001r60073R34585J957899J470621N83089o9054q52937
$$ 1627491 1160935 -448066 -1408139 -473554 1484345 2954966 3538055 3469001 2616064
33111B616064j529828j056665M25224J002972m45471k163296j587043R04075K240796
$$ 2616064 1086236 29571 454795 1457767 1012296 -1151000 -2738043 -1833968 406828
33102D06828J056942k88136N03494J827912P20303j959087k330617M75855K698247
$$ 406828 1463770 1175634 1679128 3507040 4227343 2268256 -62361 413494 3111741
33093C111741J491566j176308k052086j173505n40021n31813k76855J70947M51043
$$ 3111741 4603307 3426999 1374913 201408 -338613 -870426 -1147281 -976334 -525291
33084e25291J080985J862804J084845j324101k220446J65201K496475R77021k399344
$$ -525291 555694 2418498 3503343 2179242 -41204 123997 2620472 3597493 1198149
$$ [...]
##END NTUPLES=NMR SPECTRUM
##END=
