##TITLE=31Pdec_LR-738-B-CR7
 , 24 sc
 17.11.2021
##JCAMPDX= 6.0         $$ Bruker NMR JCAMP-DX V2.0
##DATA TYPE= NMR SPECTRUM
##DATA CLASS= NTUPLES
##ORIGIN= UXNMR, Bruker Analytische Messtechnik GmbH
##OWNER= root
$$ XWIN-NMR		Version 3.5
$$ Wed Nov 17 13:05:38 2021 Russian Standard Time (UT+4h)  she@DPX200
##.OBSERVE FREQUENCY= 81.013821
##.OBSERVE NUCLEUS= ^31P
##.ACQUISITION MODE= SIMULTANEOUS
##.ACQUISITION SCHEME= undefined
##.AVERAGES= 24
##.DIGITISER RES= 16
##SPECTROMETER/DATA SYSTEM= spect
##.PULSE SEQUENCE= zgpg30
##.SOLVENT NAME= CDCl3
##.SHIFT REFERENCE= (INTERNAL, CDCl3, 0, 248.564)
##AUDIT TRAIL= $$ (NUMBER, WHEN, WHO, WHERE, WHAT)
$$ ##TITLE= Audit trail, XWIN-NMR		Version 3.5
$$ ##JCAMPDX= 5.01
$$ ##ORIGIN= Bruker BioSpin GmbH
$$ ##OWNER= she
$$ F:/spectra/data/she/nmr/P31/1/pdata/1/auditp.txt
$$ ##AUDIT TRAIL=  $$ (NUMBER, WHEN, WHO, WHERE, WHAT)
(   1,<2021-11-17 13:04:42.51 +0400>,<she>,<DPX200>,
      <created by zg, POWCHK disabled, PULCHK disabled
       configuration hash MD5:
       00 E9 B6 7A A2 85 ED C7 34 08 36 98 17 FE 4E 26
       data hash MD5: 32K
       13 F4 58 13 CA A4 08 B4 D0 78 63 97 21 C1 72 9A>)
(   2,<2021-11-17 13:04:47.67 +0400>,<she>,<DPX200>,
      <Start of raw data processing
       efp BC_mod = 2 LB = 1 FT_mod = 6 PKNL = 1 PHC0 = -9205.716 PHC1 = 149.2695 SI = 64K 
       data hash MD5: 64K
       F1 4D CF 78 A7 34 60 E9 9E 6D EB 7E B3 1F 1A 4B>)
(   3,<2021-11-17 13:05:10.00 +0400>,<she>,<DPX200>,
      <pk PHC0 = 27.47179 PHC1 = -53 
       data hash MD5: 64K
       B7 05 2D C7 CC 77 F8 36 A9 62 35 5E 03 15 86 B2>)
(   4,<2021-11-17 13:05:13.35 +0400>,<she>,<DPX200>,
      <abs ABSG = 5 
       data hash MD5: 64K
       66 3C 97 82 AE 42 77 95 AD 7C EF CD 1A 01 42 B2>)
$$ ##END=
$$ 
$$ hash MD5
$$ 76 A0 A8 F9 8B 39 AA 65 DF 59 23 B0 A6 20 70 3D
##$RELAX= 
##$RELAX= 
##$RELAX= 
##$RELAX= 
##$RELAX= 
##$RELAX= 
##$RELAX= 
##$RELAX= 
$$ Bruker specific parameters
$$ --------------------------
##$DU= <F:/spectra>
##$EXPNO= 1
##$NAME= <P31>
##$PROCNO= 1
##$TYPE= <nmr>
##$USER= <she>
##$AMP= (0..31)
100 100 100 100 100 100 100 100 100 100 100 100 100 100 100 100 100 100 
100 100 100 100 100 100 100 100 100 100 100 100 100 100 
##$AQSEQ= 0
##$AQ_mod= 1
##$AUNM= <au_zg>
##$AUTOPOS= <>
##$BF1= 81.014009
##$BF2= 200.13
##$BF3= 200.13
##$BF4= 200.13
##$BF5= 200.13
##$BF6= 200.13
##$BF7= 200.13
##$BF8= 200.13
##$BYTORDA= 1
##$CFDGTYP= 0
##$CFRGTYP= 5
##$CHEMSTR= <none>
##$CNST= (0..31)
1 1 145 1 1 1 1 1 1 1 1 1 1 1 1 1 1 1 1 1 1 1 1 1 1 1 1 1 1 1 1 1 
##$CPDPRG= <waltz16>
##$CPDPRG1= <>
##$CPDPRG2= <waltz16>
##$CPDPRG3= <>
##$CPDPRG4= <mlev>
##$CPDPRG5= <mlev>
##$CPDPRG6= <mlev>
##$CPDPRG7= <mlev>
##$CPDPRG8= <mlev>
##$CPDPRGB= <>
##$CPDPRGT= <>
##$D= (0..31)
0 1 0 0 0 0 0 0 0 0 0 0.03 2e-05 3e-06 0 0 0 0 0 0 0 0 0 0 0 0 0 0 0 0 
0 0 
##$DATE= 1637139881
##$DBL= (0..7)
120 120 120 11 120 120 24 19 
##$DBP= (0..7)
150 150 150 150 150 150 150 150 
##$DBP07= 0
##$DBPNAM0= <>
##$DBPNAM1= <>
##$DBPNAM2= <>
$$ [...]
##$SUBNAM3= <"">
##$SUBNAM4= <"">
##$SUBNAM5= <"">
##$SUBNAM6= <"">
##$SUBNAM7= <"">
##$SUBNAM8= <"">
##$SUBNAM9= <"">
##$SW= 501.771253377433
##$SWIBOX= (0..15)
0 1 3 0 0 0 0 0 0 0 0 0 0 0 0 0 
##$SW_h= 40650.406504065
##$TD= 32768
##$TD0= 1
##$TE= 0
##$TE2= 300
##$TE3= 300
##$TEG= 300
##$TL= (0..7)
0 120 53 12 22 120 120 120 
##$TP= (0..7)
150 150 150 150 150 150 150 150 
##$TP07= 0
##$TPNAME0= <>
##$TPNAME1= <>
##$TPNAME2= <>
##$TPNAME3= <>
##$TPNAME4= <>
##$TPNAME5= <>
##$TPNAME6= <>
##$TPNAME7= <>
##$TPOAL= (0..7)
0.5 0.5 0.5 0.5 0.5 0.5 0.5 0.5 
##$TPOFFS= (0..7)
0 0 0 0 0 0 0 0 
##$TUNHIN= 0
##$TUNHOUT= 0
##$TUNXOUT= 0
##$USERA1= <user>
##$USERA2= <user>
##$USERA3= <user>
##$USERA4= <user>
##$USERA5= <user>
##$V9= 5
##$VALIST= <valist>
##$VCLIST= <CCCCCCCCCCCCCCC>
##$VD= 0
##$VDLIST= <DDDDDDDDDDDDDDD>
##$VPLIST= <PPPPPPPPPPPPPPP>
##$VTLIST= <TTTTTTTTTTTTTTT>
##$WBST= 1024
##$WBSW= 4
##$XGAIN= (0..3)
0 0 0 0 
##$XL= 0
##$YL= 0
##$YMAX_a= 1195
##$YMIN_a= -1648
##$ZGOPTNS= <>
##$ZL1= 120
##$ZL2= 120
##$ZL3= 120
##$ZL4= 120
##$ABSF1= 248.5645
##$ABSF2= -253.2056
##$ABSG= 5
##$ABSL= 3
##$ALPHA= 0
##$AQORDER= 0
##$ASSFAC= 0
##$ASSFACI= 0
##$ASSFACX= 0
##$ASSWID= 0
##$AUNMP= <proc_1d>
##$AZFE= 0.1
##$AZFW= 0.5
##$BCFW= 0
##$BC_mod= 2
##$BYTORDP= 0
##$COROFFS= 0
##$CY= -3
##$DATMOD= 1
##$DC= 0
##$DFILT= <>
##$DTYPP= 0
##$F1P= 0
##$F2P= 0
##$FCOR= 1
##$FTSIZE= 65536
##$FT_mod= 6
##$GAMMA= 0
##$GB= 0
##$INTBC= 1
##$INTSCL= 5.30512e-09
##$ISEN= 30
##$LB= 1
##$LEV0= 0
##$LPBIN= 0
##$MAXI= 10000
##$MC2= 0
##$MEAN= 0
##$ME_mod= 0
##$MI= 50
##$NCOEF= 0
##$NC_proc= -9
##$NLEV= 6
##$NOISF1= 182.463
##$NOISF2= 159.3651
##$NSP= 0
##$NTH_PI= 0
##$NZP= 0
##$OFFSET= 248.5645
##$PC= 4
##$PHC0= -9178.244
##$PHC1= 96.2695
##$PH_mod= 1
##$PKNL= yes
##$PPARMOD= 0
##$PSCAL= 0
##$PSIGN= 0
##$REVERSE= no
##$SF= 81.014009
##$SI= 65536
##$SIGF1= 159.3651
##$SIGF2= -187.1042
##$SINO= 113.3802
##$SIOLD= 16384
##$SREGLST= <1H.CDCl3>
##$SSB= 0
##$STSI= 65536
##$STSR= 0
##$SW_p= 40650.406504065
##$SYMM= 0
##$S_DEV= 0
##$TDeff= 32768
##$TDoff= 0
##$TI= <>
##$TILT= no
##$TM1= 0
##$TM2= 0
##$TOPLEV= 0
##$USERP1= <user>
##$USERP2= <user>
##$USERP3= <user>
##$USERP4= <user>
##$USERP5= <user>
##$WDW= 1
##$XDIM= 65536
##$YMAX_p= 412097694
##$YMIN_p= -39767601
$$ End of Bruker specific parameters
$$ ---------------------------------
##NTUPLES= NMR SPECTRUM
##VAR_NAME=  FREQUENCY,     SPECTRUM/REAL,   SPECTRUM/IMAG
##SYMBOL=    X,             R,               I
##VAR_TYPE=  INDEPENDENT,   DEPENDENT,       DEPENDENT
##VAR_FORM=  AFFN,          ASDF,            ASDF
##VAR_DIM=   65536,         65536,           65536
##UNITS=     HZ,            ARBITRARY UNITS, ARBITRARY UNITS
##FACTOR=    0.620285442955139, 1,           1
##FIRST=     20137.2065510759, 0,            0
##LAST=      -20513.1999529892, 0,           0
##MIN=       -20513.1999529892, -39767601,   0
##MAX=       20137.2065510759, 412097694,    0
$$ Real data points
##PAGE= N=1
##DATA TABLE= (X++(R..R)), XYDATA
$$ [...]
##PAGE= N=2
##DATA TABLE= (X++(I..I)), XYDATA
$$ plain form
12938 6004884 -2742152 -6041183 -5302674 -2698773 618571 3482751 5262210 6112406
12930 6112406 5192458 1353886 -2862482 -2139386 3465719 5777520 -629424 -8385686
12922 -8385686 -5876704 5373032 11085621 4299455 -4129001 -1299460 8677575 10773187
12914 10773187 517157 -11254154 -14930978 -12567815 -8783321 -1894935 8902246 16042841
12906 16042841 13189879 7168882 9385463 17718603 18529761 7176376 -5091228 -8070607
12898 -8070607 -5487336 -4729729 -3370191 4509148 14627091 16058172 6691305 -4188402
12890 -4188402 -8874671 -8628523 -6849595 -2878191 3460840 7061975 3166467 -4387718
12882 -4387718 -5728713 3521772 16199552 20704379 13109591 518950 -7646967 -9424479
$$ packed form
12938F004884q747036l299031P38509K603901L317344K864180J779459Q50196
12930F112406r19948l838572m216368P23096N605105K311801o406944p756262
12922h385686K508982J1249736N712589o786166q428456K829541R977035K095612
12914A0773187j0256030j1771311l676824K363163L784494O888386J0797181P140595
12906A6042841k852962o020997K216581Q333140Q11158j1353385j2267604k979379
12898h070607K583271P57607J359538P879339J0117943J431081r366867j0879707
12890d188402m686269K46148J778928L971404O339031L601135l895508p554185
12882d387718j340995R250485J2677780M504827p594788j2590641q165917j777512
$$ plain form
12874 -9424479 -9366930 -9767212 -7423859 -216893 7530169 9804315 6798782 4364936 6063753
12865 6063753 8523513 5372147 -4957540 -15553966 -16372324 -5335309 7224790 9337727
12857 9337727 2106409 -2086662 3160316 10159092 9518468 2899871 -2625968 -6297560
12849 -6297560 -11658209 -17572940 -20116473 -20472931 -22275606 -23325180 -18880951 -11513035
12841 -11513035 -8182308 -8440951 -5702751 -231546 288201 -5193347 -8039061 -4540145
12833 -4540145 -2199092 -6011607 -9603387 -7578270 -6313836 -12483946 -19482937 -17418259
12825 -17418259 -10690812 -12098828 -21842283 -25969676 -17062329 -4595857 -692349 -4876403
12817 -4876403 -8390605 -6864046 -2727748 630875 1416161 -1655687 -8282077 -15102527
$$ packed form
12874i424479N7549m00282K343353P206966P747062K274146l005533k433846J698817
12865F063753K459760l151366j0329687j0596426q18358J1037015J2560099K112937
12857I337727p231318m193071N246978O998776o40624o618597n525839l671592
12849f297560n360649n914731k543533l56458j802675j049574M444229P367916
12841a1513035L330727k58643K738200N471205N19747n481548k845714L498916
12833d540145K341053l812515l591780K025117J264434o170110o998991K064678
12825a7418259O727447j408016r743455m127393Q907347J2466472L903508m184054
12817d876403l514202J526559M136298L358623P85286l071848o626390o820450
$$ plain form
12809 -15102527 -18400946 -17850380 -15530560 -12195451 -7019535 -815982 3019968 1809222
12801 1809222 -3502712 -9697022 -14375689 -16303433 -13924014 -6627123 2046775 5942008
12793 5942008 3181830 -1390800 -3425304 -5345432 -11009388 -17239709 -17197282 -10765075
12785 -10765075 -4396183 -959416 2468878 6237711 6589943 4631324 7056179 13716757
12777 13716757 14374876 4139155 -7382270 -10403543 -9272881 -12468174 -16965140 -15253984
12769 -15253984 -11020219 -13007165 -17711860 -14281263 -4535278 -991929 -4682300 -3327300
12761 -3327300 4846705 4820279 -9414097 -20807116 -13740258 2213721 8198764 3877618
12753 3877618 1932944 3373027 -1914329 -13172708 -16787347 -8136160 1046232 1361111
$$ packed form
12809a5102527l298419N50566K319820L335109N175916O203553L835950j210746
12801A809222n311934o194310m678667j927744K379419P296891Q673898L895233
12793E942008k760178m572630k034504j920128n663956o230321M2427O432207
12785a0765075O368892L436767L428294L768833L52232j958619K424855O660578
12777A3716757O58119j0235721j1521425l021273J130662l195293m496966J711156
12769a5253984M233765j986946m704695L430597R745985L543349l690371J355000
12761c327300Q174005k6426j4234376j1393019P066858J5953979N985043m321146
12753C877618j944674J440083n287356j1258379l614639Q651187R182392L14879
$$ plain form
12745 1361111 -2160757 -2008026 204555 874116 2522581 6812207 8035885 2152863
12737 2152863 -4307769 -3090549 3024838 4940979 1008036 -2749666 -3919497 -6120924
12729 -6120924 -10191832 -11263365 -6504838 758006 6934244 12388235 16942464 16811838
12721 16811838 10794815 5573232 8593935 16710063 18063340 7000383 -7794368 -13856158
12713 -13856158 -10463502 -8012473 -12358624 -16396328 -10691852 2533027 12072843 12071732
12705 12071732 7033759 2899689 267187 -1640739 -1054605 2365424 4989806 5195033
12697 5195033 7204361 13819857 19722791 18406379 12367668 9186379 9919941 9459609
12689 9459609 7116784 7778116 11789930 12786904 8300332 4253151 4951413 6082062 2566923
$$ packed form
12745A361111l521868J52731K212581O69561J648465M289626J223678n883022
12737B152863o460632J217220O115387J916141l932943l757702j169831k201427
12729f120924m070908j071533M758527P262844O176238N453991M554229j30626
12721A6811838o017023n221583L020703Q116128J353277j1062957j4794751o061790
12713a3856158L392656K451029m346151m037704N704476J3224879R539816j111
12705A2071732n037973m134070k632502j907926N86134L420029K624382K05227
12697E195033K009328O615496N902934j316412o038711l181289P33562m60332
12689I459609k342825O61332M011814R96974m486572m047181O98262J130649l515139
$$ plain form
12680 2566923 -3284607 -6978870 -9045253 -10830095 -8863239 -944801 6608789 5941569
12672 5941569 -1089823 -6347957 -7350970 -7645216 -7702669 -4737251 -565140 -34964 -1459870
12663 -1459870 1682670 8545187 10666108 6035394 2465728 3276549 1610700 -4477969
12655 -4477969 -3733246 10470816 24081962 18956479 127852 -9360822 12638 13262922
12647 13262922 14388020 6639569 2366948 3964322 5010125 3560332 3476536 4872677
12639 4872677 2751877 -3796586 -7856674 -2936235 8478245 16878989 15038263 4771341
12631 4771341 -4775951 -5995107 -688162 2252909 -1995027 -7922611 -7236944 -231801
12623 -231801 4912286 3464508 -370312 -563260 2875070 6112953 7914479 9498436
$$ packed form
12680B566923n851530l694263k066383j784842J966856P918438P553590o67220
12672E941569p031392n258134j003013k94246n7453K965418M172111N30176j424906
12663a459870L142540O862517K120921m630714l569666Q10821j665849o088669
12655d477969P44723J4204062J3611146n125483j8828627r488674R373460J3250284
12647A3262922J125098p748451m272621J597374J045803j449793q3796J396141
12639D872677k120800o548463m060088M920439J1414480Q400744j840726j0266922
12631D771341r547292j219156N306945K941071m247936n927584O85667P005143
12623b31801N144087j447778l834820j92948L438330L237883J801526J583957
$$ plain form
12615 9498436 9898521 6405732 -191953 -5225240 -6623328 -8275879 -14349679 -22760525
12607 -22760525 -27502565 -26007706 -20713521 -14018681 -5884228 2513702 6806065 4313281
12599 4313281 -1162178 -3080468 -385667 1250027 -2787031 -9767124 -13061433 -10182867
12591 -10182867 -4881615 -1791421 -1695258 -2606548 -2754222 -630310 5605763 15473776 23766101
12582 23766101 24467368 17715157 9907240 6238731 6446782 8786348 13413838 18667775
12574 18667775 18525841 9420913 -2565526 -7297625 -3141424 1253564 -1701083 -9929946
12566 -9929946 -15418106 -12699775 -2779815 7828915 11253983 4860886 -5727450 -12935486
12558 -12935486 -15293830 -15170215 -11374477 -1947840 6833709 4896867 -5804253 -10890501
$$ packed form
12615I498436M00085l492789o597685n033287j398088j652551o073800q410846
12607b2760525m742040J494859N294185O694840Q134453Q397930M292363k492784
12599D313281n475459j918290K694801J635694m037058o980093l294309K878566
12591a0182867N301252L090194R6163r11290j47674K123912O236073R868013Q292325
12582B3766101P01267o752211p807917l668509K08051K339566M627490N253937
12574A8667775j41934r104928j1986439m732099M156201M394988k954647q228863
12566i929946n488160K718331R919960J0608730L425068o393097j0588336p208036
12558a2935486k358344J23615L795738R426637Q781549j936842j0701120n086248
$$ plain form
12550 -10890501 -4228378 1876656 -4492358 -15664457 -15658912 -3794381 6174011 6698051
12542 6698051 2705001 -1307206 -6570090 -11019062 -8205328 496401 3781965 -3736914
12534 -3736914 -12572317 -11315524 -1283920 7490178 8574634 2179971 -7998640 -15596393
12526 -15596393 -14893507 -8679236 -7549435 -16330592 -26661987 -28040788 -20153015 -8943175
12518 -8943175 2216473 10312598 9376704 -837130 -8943124 -5603417 1696708 -737673
12510 -737673 -11609644 -17528788 -14413423 -10566955 -8568926 -1289020 10269347 12706642
12502 12706642 2178373 -5138522 3540515 16803595 16184134 4064880 -2062981 3227823
12494 3227823 9284212 9517452 7854829 4651109 -6160146 -21258567 -25224432 -11845648
$$ packed form
12550a0890501O662123O105034o369014j1172099N545J1864531R968392N24040
12542F698051l993050m012207n262884m448972K813734Q701729L285564p518879
12534c736914q835403J256793J0031604Q774098J084456o394663j0178611p597753
12526a5596393P02886O214271J129801q781157j0331395j378801P887773J1209840
12518h943175J1159648Q096125r35894j0213834q105994L339707P300125k434381
12510g37673j0871971n919144L115365L846468J998029P279906J1558367K437295
12502A2706642j0528269p316895Q679037J3263080o19461j2119254o127861N290804
12494C227823O056389K33240j662623l203720j0811255j5098421l965865J3378784
$$ plain form
12486 -11845648 4230772 6522354 -2275830 -8053478 -6135136 -3458200 -4849717 -7892159
12478 -7892159 -9792083 -10900405 -11793974 -12652950 -14352595 -15904059 -13881797 -8935564
12470 -8935564 -8185721 -14908188 -20861929 -17036816 -7720194 -4160296 -7329421 -7986766
12462 -7986766 -2612839 2349575 2930334 2933604 4393366 3486339 -323318 -1029797 3437754
12453 3437754 6626979 4417343 1694635 2851365 4484853 3725429 4791704 9586454
12445 9586454 10459534 1835571 -8318524 -9330932 -4211395 -3596756 -7750212 -7480076
12437 -7480076 -1252316 1767910 -2759583 -7390326 -5169347 402364 2451287 893450
12429 893450 472921 3108740 6531413 8142147 7537199 6471676 6909243 7724269 4554302
$$ packed form
12486a1845648J6076420K291582q798184n777648J918342K676936j391517l042442
12478g892159j899924j108322q93569q58976j699645j551464K022262M946233
12470h935564P49843o722467n953741L825113R316622L559898l169125o57345
12462g986766N373927M962414N80759L270J459762r07027l809657p06479M467551
12453C437754L189225k209636k722708J156730J633488p59424J066275M794750
12445I586454Q73080q623963j0154095j012408N119537O14639m153456K70136
12437g480076O227760L020226m527493m630743K220979N571711K048923j557837
12429H93450m20529K635819L422673J610734o04948j065523M37567Q15026l169967
$$ plain form
12420 4554302 -4442112 -14308884 -18167509 -14896466 -8828538 -4175698 -3188700 -6230939
12412 -6230939 -8985773 -4015515 8363367 15261110 6000011 -11523369 -19274665 -12090091
12404 -12090091 -1647085 1711559 -696184 -4855676 -10958237 -17355826 -18414208 -13662444
12396 -13662444 -10265847 -11799446 -13209968 -11136830 -9556100 -9954041 -6373877 2439611
12388 2439611 6162464 -2096975 -12306122 -10291498 1929417 10087206 7852089 1460949
12380 1460949 -3723800 -9576938 -17167999 -21911668 -19570758 -11205089 -766990 7606296
12372 7606296 10049563 5754345 -671836 -3870013 -4071557 -4861839 -6457036 -6154055 -3915511
12363 -3915511 -2307632 -2101979 -2687253 -4869549 -7963733 -6727184 1917576 10988153
$$ packed form
12420D554302q996414r866772l858625L271043O067928M652840R86998l042239
12412f230939k754834M970258J2378882O897743r261099j7523380p751296P184574
12404a2090091J0443006L358644k407743m159492o102561o397589j058382M751764
12396a3662444L396597j533599j410522K073138J580730l97941L580164Q813488
12388B439611L722853q259439j0209147K014624J2220915Q157789k235117o391140
12380A460949n184749n853138p591061m743669K340910Q365669J0438099Q373286
12372G606296K443267m295218o426181l198177k01544p90282j595197L02981K238544
12363c915511J607879K05653n85274k182296l094184J236549Q644760R070577
$$ plain form
12355 10988153 10240993 392879 -7534752 -7436904 -4012404 -1678623 2940481 12396892
12347 12396892 19895948 16811066 4939023 -5428158 -8105443 -6306301 -6004527 -9010571
12339 -9010571 -13604808 -18093843 -21156114 -20583909 -14950608 -6879045 -1758445 -1248367
12331 -1248367 -632860 3710751 6569041 234285 -11377054 -13676318 -759206 14110898
12323 14110898 14762545 2819256 -7062785 -8219114 -6856634 -7427435 -5806454 116682
12315 116682 4222943 2280994 -198212 3104920 8979148 10324558 7223161 4876662
12307 4876662 3678309 -877859 -9276296 -15889317 -16761435 -14349995 -12956537 -13205702
12299 -13205702 -12859073 -10513213 -6640072 -2381742 1195019 3223782 3518892 3157458
$$ packed form
12355A0988153p47160r848114p927631R7848L424500K333781M619104R456411
12347A2396892P499056l084882j1872043j0367181k677285J799142L01774l006044
12339i010571m594237m489035l062271N72205N633301Q071563N120600N10078
12331a248367O15507M343611K858290o334756j1611339k299264J2917112J4870104
12323A4110898O51647j1943289r882041j156329J362480n70801J620981N923136
12315A16682M106261j941949k479206L303132N874228J345410l101397k346499
12307D876662j198353m556168q398437o613021q72118K411440J393458k49165
12299a3205702L46629K345860L873141M258330L576761K028763K95110l61434
$$ plain form
12291 3157458 4057386 6957377 9372151 7105068 -352315 -7329552 -8148624 -5149065
12283 -5149065 -5999855 -12253775 -16273854 -12907720 -8686986 -12838555 -22224993 -23767899
12275 -23767899 -12718890 -521770 -255833 -10052749 -17214569 -15659702 -11864113 -13172094
12267 -13172094 -17120306 -16162209 -8983709 -2135161 -1252113 -4640357 -6472704 -3863617
12259 -3863617 771178 3328394 2424968 -223986 -3111129 -6936907 -11947774 -14661470
12251 -14661470 -10638700 -1129559 6645983 7980185 6362614 7880621 12892362 17026761
12243 17026761 17961300 16635344 13543654 8868116 5127219 4481896 4310371 1051173
12235 1051173 -2331854 821851 10622463 20051724 25005860 27359640 27153219 20850252
$$ packed form
12291C157458Q99928K899991K414774k267083p457383o977237q19072K999559
12283e149065q50790o253920m020079L366134M220734m151569r386438j542906
12275b3767899J1049009J2197120K65937r796916p161820J554867L795589j307981
12267a3172094l948212R58097P178500O848548Q83048l388244j832347K609087
12259c863617M634795K557216r03426k648954k887143l825778n010867k713696
12251a4661470M022770R509141P775542J334202j617571J518007N011741M134399
12243A7026761R34539j325956l091690m675538l740897o45323j71525l259198
12235A051173l383027L153705R800612R429261M954136K353780k06421o302967
$$ plain form
12227 20850252 10457617 5198591 8870805 13376790 10539697 2976631 -2786603 -6244072
12219 -6244072 -8775552 -7506475 -2241654 -1253801 -9466462 -16884389 -10948179 3902209
12211 3902209 12143396 10123313 9071922 15203041 21039728 19633849 14661683 11279340
12203 11279340 7741167 2274319 -638937 2326710 6214258 4208882 -3628478 -12392409
12195 -12392409 -18097970 -17885790 -10282963 519608 5981993 3137526 -1391673 -721375
12187 -721375 4192843 9210442 13589787 17132113 16548588 10690069 5041288 4977864 7794846
12178 7794846 6916453 1203141 -5095087 -9082256 -10774818 -9941507 -6402437 -2537386
12170 -2537386 -1633267 -4286205 -8586749 -12195031 -12734968 -9222481 -4985337 -5252660 -9469271
$$ packed form
12227B0850252j0392635n259026L672214M505985k837093p563066n763234l457469
12219f244072k531480J269077N264821R87853q212661p417927N936210J4850388
12211C902209Q241187k020083j051391O131119N836687j405879m972166l382343
12203A1279340l538173n466848k913256K965647L887548k005376p837360q763931
12195a2392409n705561K12180P602827J0802571N462385k844467m529199O70298
12187g21375M914218N017599M379345L542326n83525n858519n648781o3424K816982
12178G794846q78393n713312o298228l987169j692562Q33311L539070L865051
12170b537386R04119k652938m300544l608282n39937L512487M237144k67323m216611
$$ plain form
12161 -9469271 -10627859 -5348134 657466 1472709 -267375 448894 1156478 -3621554 -10904937
12152 -10904937 -11239690 -2417378 6300585 5733069 -2624564 -9706064 -9139362 -2770421
12144 -2770421 1968921 -471044 -7798997 -12282350 -10180552 -6227977 -6509491 -10229794
12136 -10229794 -12326936 -11171087 -8764220 -5661784 -1340974 1702813 28652 -4834284
12128 -4834284 -7665512 -6572199 -3807778 -100904 5833869 11486652 10660135 2054101
12120 2054101 -7160705 -9564898 -5734005 -1311125 1042533 3246095 7038767 10912178
12112 10912178 11845324 8665077 3675436 1074344 2881879 6475634 7374517 4287177
12104 4287177 -29714 -2462529 -2080091 702654 4922906 8449878 8720561 5245584
$$ packed form
12161i469271j158588N279725O005600Q15243j740084P16269P07584m778032p283383
12152a0904937l34753Q822312Q717963n67516q357633p081500N66702O368941
12144b770421M739342k439965p327953m483353K101798L952575k81514l720303
12136a0229794k097142J155849K406867L102436M320810L043787j674161m862936
12128d834284k831228J093313K764421L706874N934773N652783q26517q606034
12120B054101r214806k404193L830893M422880K353658K203562L792672L873411
12112A0912178R33146l180247m989641k601092J807535L593755Q98883l087340
12104D287177m316891k432815L82438K782745M220252L526972K70683l474977
$$ plain form
12096 5245584 506629 -1824770 997001 9080531 18235382 21364307 15066473 4969262
12088 4969262 915591 5624298 11176872 8663982 -1127756 -9151785 -8736804 -2047203
12080 -2047203 3806288 4582735 1763764 -914944 -1827449 -2134727 -3624829 -6998493 -11349895
12071 -11349895 -13951734 -11616826 -4629781 1283148 188155 -6350117 -10143144 -6108081
12063 -6108081 2257517 8572614 10744657 10056949 7480343 4786033 5490485 9858321
12055 9858321 12222368 8699387 4359697 5946142 10139321 7728660 -1429104 -7577098
12047 -7577098 -6694309 -6301721 -11000181 -12682660 -3814049 7586574 7915060 -1186055
12039 -1186055 -4811195 2447244 8574187 3194478 -6799854 -8939514 -4384753 -4439441
$$ packed form
12096E245584m738955k331399K821771Q083530R154851L128925o297834j0097211
12088D969262m053671M708707N552574k512890r791738q024029M14981O689601
12080b047203N853491P76447k818971k678708r12505l07278j490102l373664m351402
12071a1349895k601839K334908O987045N912929j094993o538272l793027M035063
12063f108081Q365598O315097K172043o87708k576606k694310P04452M367836
12055I858321K364047l522981m339690J586445M193179k410661r157764o147994
12047g577098Q82789L92588m698460j682479Q868611J1400623L28486r101115
12039a186055l625140P258439O126943n379709r994332k139660M554761n4688
$$ plain form
12031 -4439441 -11564449 -15750042 -10849262 -3967321 -3992607 -8782658 -10200175 -6314102
12023 -6314102 -1302593 3089438 8059092 11615932 10209453 6262017 5671674 6662842
12015 6662842 352309 -13830806 -22390341 -14440505 2633203 12674312 11258379 7415905
12007 7415905 7838221 9909233 10455479 10983742 11301874 6911445 -2492900 -9128177 -7413693
11998 -7413693 -2551293 -2691081 -6956703 -8011778 -3502369 2228413 6386866 10495610
11990 10495610 14636373 15453664 11642848 6322559 2066125 -1857242 -5330013 -5281689
11982 -5281689 -822006 3595182 3857807 1799097 1343717 2260624 2283162 2480024 4711580
11973 4711580 5689730 417033 -8831802 -14177511 -13752648 -13974233 -17482647 -16873054 -6106152
$$ packed form
12031d439441p125008m185593M900780O881941k5286m790051j417517L886073
12023f314102N011509M392031M969654L556840j406479l947436n90343R91168
12015F662842o310533j4183115q559535P949836J7073708J0041109j415933l842474
12007G415905M22316K071012N46246N28263L18132m390429r404345o635277J714484
11998g413693M862400j39788m265622j055075M509409N730782M158453M108744
11990A0495610M140763Q17291l810816n320289m256434l923367l472771M8324
11982e281689M459683M417188K62625k058710m55380R16907K2538J96862K231556
11973D711580R78150n272697r248835n345709M24863k21585l508414O09593J0766902
$$ plain form
11964 -6106152 8306058 14952980 12159539 7379009 5074139 3465962 1724224 1773076
11956 1773076 2879034 2458313 2725509 8017224 14215319 10638553 -3514642 -13959533
11948 -13959533 -9221575 3643412 9241552 4260637 -1343441 -359236 4083627 6853270
11940 6853270 8410320 11516978 15503669 16470320 10918631 -1284933 -15452916 -24259494
11932 -24259494 -23859431 -16987898 -8321143 344502 7443749 8760585 3407144 -426125
11924 -426125 6129558 18993828 24210943 16158488 4867865 2002160 6636040 9879005
11916 9879005 7896924 3894430 498367 -2956551 -6103150 -6191340 -2489702 1457178
11908 1457178 1890787 -443077 -1264108 1705592 5183329 3562597 -3770730 -10108013
$$ packed form
11964f106152J4412210O646922k793441m780530k304870j608177j741738M8852
11956A773076J105958m20721K67196N291715O198095l576766j4153195j0444891
11948a3959533M737958J2864987N598140m980915n604078R84205M442863K769643
11940F853270J557050L106658L986691R66651n551689j2203564j4167983q806578
11932b4259494M00063O871533Q666755Q665645P099247J316836n353441l833269
11924d26125O555683J2864270N217115q052455j1290623k865705M633880L242965
11916I879005j982081m002494l396063l454918l146599q8190L701638L946880
11908A457178M33609k333864q21031K969700L477737j620732p333327o337283
$$ plain form
11900 -10108013 -8801398 -2075269 995178 -4311365 -12835706 -16664394 -14260000 -10028353
11892 -10028353 -7878019 -8704436 -12224785 -17190007 -20222441 -18014783 -11239069 -3898127
11884 -3898127 1340189 4789503 6769960 6137440 2986444 133227 -145957 884466
11876 884466 768069 -167522 370225 2628969 4350894 4304272 3556538 2660228 448194
11867 448194 -2892312 -4278394 -1761782 1977397 3293754 3223378 5551212 9775382 10648203
11858 10648203 5945049 327349 -1320673 -982943 -3878669 -9484017 -10808981 -3258168
11850 -3258168 9124373 17800782 18063367 11674644 3024382 -4634083 -9305308 -9624640
11842 -9624640 -6237289 -2574274 -1794351 -3094348 -3320976 -2185454 -2800098 -6194044 -8835083
$$ packed form
11900a0108013J306615O726129L070447n306543q524341l828688K404394M231647
11892a0028353K150334q26417l520349m965222l032434K207658O775714P340942
11884c898127N238316L449314J980457o32520l150996k853217k79184J030423
11876H84466j16397r35591N37747K258744J721925m6622p47734q96310k212034
11867D48194l340506j386082K516612L739179J316357p0376K327834M224170Q72821
11858A0648203m703154n617700j648022L37730k895726n605348j324964P550813
11850c258168J2382541Q676409K62585o388723q650262p658465m671225l19332
11842i624640L387351L663015P79923j299997k26628J135522o14644l393946k641039
$$ plain form
11833 -8835083 -7647656 -4169789 -1067892 1993674 5541317 7062658 5197928 3569560
11825 3569560 4773811 4274293 -2305174 -9113446 -6972355 1291363 3750706 -1740976
11817 -1740976 -4007945 2663474 9010772 6909412 3294927 8052696 17038598 18609010
11809 18609010 11050798 2436933 -2463682 -4526122 -3258433 1715988 4769652 483555
11801 483555 -6168089 -6267295 -1644715 -1731276 -6950158 -8140673 -3537682 -2876779 -10707348
11792 -10707348 -18144334 -17472027 -14149013 -16339275 -21069437 -19663315 -11018121 -1089788
11784 -1089788 6638164 12521313 15697180 14783367 11817559 9620947 6761779 287272
11776 287272 -8086597 -13569966 -14928260 -14631545 -13096097 -7909891 376254 5966363
$$ packed form
11833h835083J187427L477867L101897L061566L547643J521341j864730j628368
11825C569560J204251m99518o579467o808272K141091Q263718K459343n491682
11817a740976k266969O671419O347298k101360l614485M757769Q985902J570412
11809A8609010p558212q613865m900615k062440J267689M974421L053664m286097
11801D83555o651644r9206M622580q6561n218882j190515M602991O60903p830569
11792a0707348p436986O72307L323014k190262m730162J406122Q645194R928333
11784a089788P727952N883149L175867r13813k965808k196612k859168o474507
11776B87272q373869n483369j358294K96715J535448N186206Q286145N590109
$$ plain form
11768 5966363 3866609 -3324140 -6849520 -938556 9691611 13341686 4293333 -9411182
11760 -9411182 -14918008 -10381027 -6267173 -9855930 -15130130 -12434214 -2855429 3758019
11752 3758019 2726993 -608967 -321610 2074285 1752591 -1425743 -2949890 -51297
11744 -51297 5430818 10359832 13376352 13834654 10746147 5279311 2107566 4530718 9236329
11735 9236329 10182931 7261272 5579850 5537115 1044218 -8726794 -13502782 -5006772 9642354
11726 9642354 16534189 13612070 10979843 14033494 16873112 13961360 8552364 5852637
11718 5852637 5690234 6205025 7975181 9680505 5683323 -6174201 -18342518 -20898031
11710 -20898031 -13226130 -4232862 -2269939 -7900882 -15397121 -18758809 -16572060 -12029461
$$ packed form
11768E966363k099754p190749l525380N910964J0630167L650075r048353j3704515
11760i411182n506826M536981M113854l588757n274200K695916R578785O613448
11752C758019j031026l335960K87357K395895l21694l178334j524147K898593
11744e1297N482115M929014L016520M58302l088507n466836l171745K423152M705611
11735I236329R46602k921659j681422m2735m492897r771012m775988Q496010J4649126
11726I642354O891835k922119k632227L053651K839618k911752n408996k699727
11718E852637j62403N14791J770156J705324l997182j1857524j2168317k555513
11710b0898031P671901Q993268J962923n630943p496239l361688K186749M542599
$$ plain form
11702 -12029461 -8229355 -4899161 -1456177 -682101 -5213998 -12173976 -16178883 -16136676
11694 -16136676 -13738116 -7673891 2967255 11160553 7641652 -4898015 -13027236 -10237937
11686 -10237937 -3658179 -77579 3759971 10984937 15062891 9416114 -529482 -4204370
11678 -4204370 -260424 4090570 4586964 3178470 2087940 1070171 -760876 -4660044
11670 -4660044 -11474046 -17866488 -17161760 -7751495 3301130 8513596 7378418 2737421
11662 2737421 -3894140 -9400396 -8453828 -1160114 5038046 6026630 6399072 9295106 10101528
11653 10101528 7014404 7350899 13756035 14723940 1602919 -14193877 -16112609 -7225079
11645 -7225079 -3077474 -5248451 -1541873 9063398 12246831 2528115 -6890476 -4975404
$$ packed form
11702a2029461L800106L330194L442984P74076m531897o959978m004907M2207
11694a6136676K398560O064225J0641146Q193298l518901j2539667q129221K789299
11686a0237937O579758L580600L837550P224966M077954n646777r945596l674888
11678d204370L943946M350994M96394j408494j090530j017769j831047l899168
11670d660044o814002o392442P04728R410265J1052625N212466j135178m640997
11662B737421o631561n506256R46568P293714O198160R88584L72442K896034Q06422
11653A0101528l087124L36495O405136R67905j3121021j5796796j918732Q887530
11645g225079M147605k170977L706578J0605271L183433r718716r418591J915072
$$ plain form
11637 -4975404 2059509 4205261 2561421 2114636 1299251 -1803661 -2335580 2828479 7039027
11628 7039027 3373327 -3811558 -5090077 975848 8083919 11378888 10395379 6824932
11620 6824932 4468284 7210021 12622870 12497213 4151028 -4290398 -4815649 -136413
11612 -136413 2003883 -261480 -3413669 -4914654 -3399694 2545854 10210841 12652190
11604 12652190 8628071 6802732 13252049 20892442 19680547 11779185 6778125 6209182
11596 6209182 3932328 -425749 -59223 6734361 13141832 14179840 11749061 8205554
11588 8205554 3619934 1039006 5500776 14866393 19668735 15409674 7646055 1841159
11580 1841159 -3605778 -9872843 -11726048 -5772754 1667175 2232298 -3480332 -9141076
$$ packed form
11637d975404P034913K145752j643840m46785q15385l102912n31919N164059M210548
11628G039027l665700p184885j278519O065925P108071L294969r83509l570447
11620F824932k356648K741737N412849j25657q346185q441426n25251M679236
11612a36413K140296k265363l152189j500985J514960N945548P664987K441349
11604A2652190m024119j825339O449317P640393j211895p901362n001060n68943
11596F209182k276854m358077L66526O793584O407471J038008k430779l543507
11588H205554m585620k580928M461770R365617M802342m259061p763619n804896
11580A841159n446937o267065j853205N953294P439929N65123n712630n660744
$$ plain form
11572 -9141076 -12480469 -14813806 -14745567 -10367889 -5285842 -4533207 -6091672 -4400460 -1139732
11563 -1139732 -3700465 -12542388 -19100945 -18374499 -15015718 -13512290 -10660313 -3118488
11555 -3118488 4579085 6162739 2731550 -662774 -3247806 -6772419 -9209262 -7401896
11547 -7401896 -3628321 -2692936 -4294822 -4779841 -4424411 -5797243 -6693339 -2946322 2473365
11538 2473365 1984442 -4493059 -8788845 -7151811 -4519051 -3848949 -948842 5882114
11530 5882114 10471395 9024147 7567396 12160519 18558404 19085657 14153984 9630634
11522 9630634 7656831 6930514 7224164 7031548 2169314 -6473856 -10259727 -5800184 -3204675
11513 -3204675 -11050715 -20429189 -17155616 -4243482 3128042 1691740 2254885 8427140
$$ packed form
11572i141076l339393k333337O8239M377678N082047P52635j558465J691212L260728
11563a139732k560733q841923o558557P26446L358781J503428K851977P541825
11555c118488P697573J583654l431189l394324k585032l524613k436843J807366
11547g401896L773575R35385j601886m85019L55430j372832q96096L747017N419687
11538B473365m88923o477501m295786J637034K632760O70102K900107O830956
11530E882114M589281j447248j456751M593123O397885N27253m931673m523350
11522I630634j973803p26317K93650j92616m862234q643170l785871M459543K595509
11513c204675p846040r378474L273573J2912134P371524j436302N63145O172255
$$ plain form
11505 8427140 10983859 6148844 2120925 2165218 -1836160 -11284334 -12926707 -40649
11497 -40649 13095617 11517299 2333605 1945974 10069134 13448057 9370468 7786353
11489 7786353 12051375 14124368 10122234 6482022 7943909 11250556 13457108 15540675
11481 15540675 15039577 6266165 -8015182 -15506314 -10353434 -1288934 1778959 817144
11473 817144 2699976 6802130 7533579 3916234 -961105 -5900980 -10020754 -9226128 -1762990
11464 -1762990 5839774 6072095 1302533 -531265 961482 -1074128 -7799667 -12033688
11456 -12033688 -10553178 -9338747 -12230371 -13331427 -7501058 -1049944 -2990806 -10371300
11448 -10371300 -12502692 -7888348 -6196522 -12011833 -16844224 -12121287 -2216116 2328340
$$ packed form
11505H427140K556719m835015m027919M4293m001378r448174j642373J2886058
11497d0649J3136266j578318r183694l87631Q123160L378923m077589j584115
11489G786353M265022K072993m002134l640212J461887L306647K206552K083567
11481A5540675n01098q773412j4281347p491132N152880R064500L067893r61815
11473H17144J882832M102154P31449l617345m877339m939875m119774P94626P463138
11464a762990P602764K32321m769562j833798J492747k035610o725539m234021
11456a2033688J480510J214431k891624j101056N830369O451114j940862p380494
11448a0371300k131392M614344J691826n815311m832391M722937R905171M544456
$$ plain form
11440 2328340 -492591 -3631064 -2522886 242573 1359487 1246970 651882 -1816502
11432 -1816502 -6125948 -8470270 -5477169 1180106 6647114 8125430 6678464 5024467
11424 5024467 5040789 6536541 7071134 3623157 -4080707 -11936395 -14482252 -10432922 -4811715
11415 -4811715 -4332692 -10029662 -15676772 -15028856 -9363285 -4952546 -3817461 -1644883
11407 -1644883 3972620 8626024 7939339 4603881 3358522 2634744 -2225268 -9574048
11399 -9574048 -12467303 -8512558 -1932754 4005238 9344310 11878921 7753870 -16528
11391 -16528 -2061043 4213113 9721638 6982306 614357 -2034907 -3291969 -9088914
11383 -9088914 -16115987 -15908884 -9052132 -4398504 -4736048 -3860163 1018067 4389935 2862521
$$ packed form
11440B328340k820931l138473J108178K765459J116914j12517n95088k468384
11432a816502m309446k344322K993101O657275N467008J478316j446966j653997
11424E024467J6322J495752N34593l447977p703864p855688k545857M049330N621207
11415d811715M79023n696970n647110O47916N665571M410739J135085K172578
11407a644883N617503M653404o86685l335458j245359p23778m860012p348780
11399i574048k893255L954745O579804N937992N339072K534611m125051p770398
11391a6528k044515O274156N508525k739332o367949k649264j257062n796945
11383i088914p027073K07103O856752M653628l37544Q75885M878230L371868j527414
$$ plain form
11374 2862521 715871 690056 -1648424 -8289345 -11745950 -5641159 3795483 5534191
11366 5534191 -1307248 -9083175 -14405046 -19138138 -20829966 -14042611 -2461517 1988588
11358 1988588 -3672884 -7681957 -1350158 6707787 3272860 -9578075 -18167904 -16705316
11350 -16705316 -11539999 -7548544 -2439642 3657834 4401723 -2168436 -8421048 -8514829
11342 -8514829 -7417584 -11676413 -17576421 -16767717 -9471574 -3418466 -1700426 96071
11334 96071 5027908 10386221 12962702 12817820 10861912 7724610 5652342 6642077 8227001
11325 8227001 6191344 1895160 1098306 4357511 5041801 -364812 -6133165 -5736759 -1338550
11316 -1338550 636292 -149018 1756515 8484518 16075540 20953786 23643577 24381235
$$ packed form
11374B862521k146650k5815k338480o640921l456605O104791R436642J738708
11366E534191o841439p775927n321871m733092j691828O787355J1581094M450105
11358A988588n661472m009073O331799Q057945l434927j2850935q589829J462588
11350a6705316N165317L991455N108902O097476P43889o570159o252612r3781
11342h514829J097245m258829n900008Q08704P296143O053108J718040J796497
11334I6071M931837N358313K576481j44882j955908l137302k072268R89735J584924
11325H227001k035657m296184p96854L259205O84290n406613n768353L96406M398209
11316a338550J974842p85310J905533O728003P591022M878246K689791P37658
$$ plain form
11308 24381235 20121524 9908059 80943 -1580519 3076354 3134694 -6794663 -17390542
11300 -17390542 -15764867 -2871395 8034873 9973952 9892251 14589062 18725875 14386148
11292 14386148 5211924 1015213 2711783 3310901 1538040 3058278 8131165 9434494
11284 9434494 4497893 -2684 321611 1694637 1892906 5654326 13967520 17236980
11276 17236980 7976209 -6136038 -10975207 -3514401 7520461 14847336 17901467 17177951
11268 17177951 12129084 5188496 1384898 2675943 6399939 9005300 8289550 3778966
11260 3778966 -1621805 -2739965 1399018 5220789 4777833 4251165 8684824 14239837
11252 14239837 13131263 5782840 125621 -97263 1325459 948889 -624778 -3009305
$$ packed form
11308B4381235m259711j0213465r827116j661462M656873N8340r929357j0595879
11300a7390542J625675J2893472J0906268J939079q1701M696811M136813m339727
11292A4386148r174224m196711J696570N99118j772861J520238N072887J303329
11284I434494m936601m500577L24295J373026J98269L761420Q313194L269460
11276A7236980r260771j4112247m839169P460806J1034862P326875L054131p23516
11268A7177951n048867o940588l803598J291045L723996K605361p15750m510584
11260C778966n400771j118160M138983L821771m42956n26668M433659N555013
11252A4239837j108574p348423n657219k22884J422722l76570j573667k384527
$$ plain form
11244 -3009305 -6635572 -8619459 -5392017 -244641 -592784 -6316065 -8808596 -4014839
11236 -4014839 1637591 1805353 -1040426 -2041888 -1989289 -3455465 -5157874 -6031852 -9057724
11227 -9057724 -14557550 -15391923 -6684778 4357366 7209058 3079716 1327284 3000782
11219 3000782 -531741 -11554387 -20118191 -18504368 -11861422 -8189031 -5938769 67144
11211 67144 6273902 4186708 -5308585 -10929196 -5800730 3679919 6421447 -606529
11203 -606529 -10730881 -15580547 -12798150 -7642940 -7474909 -13136017 -17289277 -14273745
11195 -14273745 -8824637 -9057625 -12700093 -9005704 4629731 17342091 19677889 14746216
11187 14746216 9092754 1802134 -8701312 -15024535 -9662568 1081766 4176703 -1176877
$$ packed form
11244c009305l626267j983887L227442N147376l48143n723281k492531M793757
11236d014839N652430J67762k845779j001462N2599j466176j702409q73978l025872
11227i057724n499826q34373Q707145J1042144K851692m129342j752432J673498
11219C000782l532523j1022646q563804J613823O642946L672391K250262O005913
11211F7144O206758k087194r495293n620611N128466R480649K741528p027976
11203f06529j0124352m849666K782397N155210J68031n661108m153260L015532
11195a4273745N449108k32988l642468L694389J3635435J2712360K335798m931673
11187A4746216n653462p290620j0503446o323223N361967J0744334L094937n353580
$$ plain form
11179 -1176877 -3523012 2361103 8957606 9579615 7039202 5375840 3089632 -893325
11171 -893325 -3059851 -1615180 245786 647177 1270615 1201435 -2502409 -6052329 -1869081
11162 -1869081 6472534 5559821 -5749590 -10401213 937610 12939439 8731166 -3193386
11154 -3193386 -3332780 7243450 10661439 2532236 -3335782 91166 4466710 5184336
11146 5184336 8971700 16533887 16414963 5073147 -3453228 1165419 8967985 6927220
11138 6927220 315536 2076354 10051031 11309009 4781877 3545634 13996215 25556174
11130 25556174 24708378 11263297 -2732880 -5948955 1803064 9666567 7208765 -2645012
11122 -2645012 -6216402 2432215 12028505 9570846 -751766 -3907187 3873713 10431605
$$ packed form
11179a176877k346135N884115O596503O22009k540413j663362k286208l982957
11171h93325k166526J444671J860966M01391O23438o9180l703844l549920M183248
11162a869081Q341615r12713j1309411m651623J1338823J2001829m208273j1924552
11154c193386j39394J0576230L417989q129203n868018L426948M375544P17626
11146E184336L787364P562187j18924j1341816q526375M618647P802566k040765
11138F927220o611684J760818P974677J257978o527132j236243J0450581J1559959
11130B5556174q47796j3445081j3996177l216075P752019P863503k457802r853777
11122b645012l571390Q648617R596290k457659j0322612l155421P780900O557892
$$ plain form
11114 10431605 5650316 -5789105 -12643816 -10597589 -3709817 2270442 4270959 2816044
11106 2816044 1134887 1519098 2417456 1718671 1446402 4506977 8035135 6576252 2233604
11097 2233604 4195223 15608805 27766455 31378762 27733923 23587728 20096596 13608772
11089 13608772 4731543 -484471 1412876 7104782 11231628 11762892 9916150 7571737
11081 7571737 5763023 4123215 1520927 -1849163 -4055320 -4643839 -6476241 -11420391
11073 -11420391 -15535832 -12714974 -3396342 4471269 4859998 764256 -655827 2301504
11065 2301504 4305052 232506 -8934828 -17915008 -22806855 -23848943 -23420489 -22576734
11057 -22576734 -19962455 -13740236 -3905257 7347601 16504591 19515308 13719925 1530747
$$ packed form
11114A0431605m781289j1439421o854711K046227O887772N980259K000517j454915
11106B816044j681157L84211Q98358o98785k72269L060575L528158j458883m342648
11097B233604J961619J1413582J2157650L612307l644839m146195l491132o487824
11089A3608772q877229n216014J897347N691906M126846N31264j846742k344413
11081G571737j808714j639808k602288l370090k206157n88519j832402m944150
11073a1420391m115441K820858R318632P867611L88729m095742j420083K957331
11065B301504K003548m072546r167334q980180m891847j042088M28454Q43755
11057b2576734K614279O222219R834979J1252858R156990L010717n795383j2189178
$$ plain form
11049 1530747 -8898520 -10595611 -6109652 -4908475 -10403408 -14062392 -7020165 5873675
11041 5873675 10666000 2616948 -7522464 -8111554 -938107 3921419 2511140 -469187
11033 -469187 -877535 570354 2933479 6716000 9332161 5868816 -2132491 -4951633
11025 -4951633 2783584 12821024 13707561 7262423 5802273 13400283 19696407 15732681
11017 15732681 7208798 5259477 10130361 12621729 8760205 3838221 1881449 -90295
11009 -90295 -4588723 -7803346 -5770866 -1044722 1956456 4213501 8878614 13477841
11001 13477841 12011494 4431354 -2241021 -3703806 -3920890 -7863181 -12798244 -11574636
10993 -11574636 -3271899 4263382 4018947 -1321410 -3259280 1094478 5470642 3247587
$$ packed form
11049A530747j0429267j697091M485959J201177n494933l658984P042227J2893840
11041E873675M792325q049052j0139412n89090P173447M859526j410279k980327
11033d69187m08348J447889K363125L782521K616161l463345q001307k819142
11025d951633P735217J0037440Q86537o445138j460150P598010O296124l963726
11017A5732681q523883j949321M870884K491368l861524m921984j956772j971744
11009i0295m498428l214623K032480M726144L001178K257045M665113M599227
11001A3477841j466347p580140o672375j462785k17084l942291m935063J223608
10993a1574636Q302737P535281k44435n340357j937870M353758M376164k223055
$$ plain form
10985 3247587 -4020924 -9779664 -11217326 -10489016 -8886396 -5101585 572973 5145585
10977 5145585 6790651 5674477 1067568 -7041158 -13614290 -12883354 -7818340 -6965242
10969 -6965242 -10124421 -7763902 1097849 3054729 -8875474 -20847395 -17903663 -8014735
10961 -8014735 -9260734 -19677772 -20323554 -7031200 2393168 -2884498 -10462458 -6448831
10953 -6448831 3190583 5116261 -227375 -3162439 -1576920 -330664 72960 2468800
10945 2468800 4721272 2627671 -1807619 -3466410 -2468078 -1958227 -1080200 2427835 6035091
10936 6035091 5881874 2966701 -501055 -6175989 -13734726 -15360469 -5265381 9307124
10928 9307124 16107926 13720564 9881792 7119374 948589 -8772504 -15463473 -15716791
$$ packed form
10985C247587p268511n758740j437662P28310J602620L784811N674558M572612
10977E145585J645066j116174m606909q108726o573132P30936N065014Q53098
10969f965242l159179K360519Q861751J956880j1930203j1971921K943732R888928
10961h014735j245999j0417038o45782J3292354R424368n277666p577960M013627
10953f448831R639414J925678n343636k935064J585519J246256M03624K395840
10945B468800K252472k093601m435290j658791R98332N09851Q78027L508035L607256
10936F035091j53217k915173l467756n674934p558737j625743J0095088J4572505
10928I307124O800802k387362l838772k762418o170785r721093o690969k53318
$$ plain form
10920 -15716791 -12814469 -9606903 -5805889 -2829249 -3609745 -6896287 -8674944 -9211103
10912 -9211103 -11597954 -13862235 -10540540 -2392817 3282767 2773700 -704829 -3907643
10904 -3907643 -6358921 -6208746 -1180804 5847495 9843953 12242926 18246765 25438424
10896 25438424 24714734 14331694 3816598 1205499 4627342 8968773 12504573 14170585
10888 14170585 12543962 10595261 13570945 19462427 19863094 13029927 7213649 7839606
10880 7839606 10774878 12052020 14101419 17338632 16091053 9494141 6248631 10633975
10872 10633975 13713686 8022739 1632001 5643556 15017547 15616624 6328247 268595
10864 268595 4707678 12421846 14666370 11958189 8598862 5005267 -89569 -5342570
$$ packed form
10920a5716791K902322L207566L801014K976640p80496l286542j778657n36159
10912i211103k386851k264281L321695Q147723N675584n09067l478529l202814
10904c907643k451278J50175N027942P028299L996458K398973O003839P191659
10896B5438424p23690j0383040j0515096k611099L421843M341431L535800J666012
10888A4170585j626623j948701K975684N891482M00667o833167n816278O25957
10880G839606K935272J277142K049399L237213j247579o596912l245510M385344
10872A0633975L079711n690947o390738M011555R373991N99077r288377o059652
10864B68595M439083P714168K244524k708181l359327l593595n094836n253001
$$ plain form
10856 -5342570 -8388427 -8368419 -5214200 333938 5341349 6970151 6647355 8147693 11108815
10847 11108815 10785570 5554555 516231 1105819 5903424 8659521 6188623 1735196
10839 1735196 490805 3457282 6614579 5535260 -245654 -7415544 -12105298 -12480267
10831 -12480267 -9732858 -7414918 -8022398 -9383814 -7121798 -1752197 1133136 285535
10823 285535 2299061 10275612 15398313 8687884 -3690845 -8102234 -3522553 -971411
10815 -971411 -3624497 -2277119 6618031 13327445 11237107 7140906 7150402 5229666 -3970150
10806 -3970150 -12273782 -10190841 -2851758 -861630 -2626043 657738 7975369 10510759
10798 10510759 7379281 5974500 8318667 9375251 7942379 7601421 7455236 3184223
$$ packed form
10856e342570l045857K0008L154219N548138N007411J628802l22796J500338K961122
10847A1108815l23245n231015n038324N89588M797605K756097k470898m453427
10839A735196j244391K966477L157297j079319n780914p169890m689754l74969
10831a2480267K747409K317940o07480j361416K262016N369601K885333q47601
10823B85535K013526P976551N122701o710429j2378729m411389M579681K551142
10815i71411k653086J347378Q895150O709414k090338m096201R496j920736r199816
10806c970150q303632K082941P339083J990128j764413L283781P317631K535390
10798A0510759l131478j404781K344167J056584j432872l40958j46185m271013
$$ plain form
10790 3184223 -3012402 -4654592 -3018733 -5531530 -11651870 -12196340 -4656146 2151048
10782 2151048 1635998 -2743303 -6158994 -8568577 -8787258 -2969886 6276166 9179076
10774 9179076 2916924 -2467940 1446529 9074665 9893692 3391768 -2041268 -437070
10766 -437070 7132867 15046003 16263326 8047809 -2282099 -3796745 2799371 5008790
10758 5008790 -1826426 -5391234 4776611 19397792 22309401 13827897 7432399 7542340
10750 7542340 5645024 -2103272 -8072473 -6838517 -3314677 -2666183 -2348133 601956
10742 601956 3074782 2191560 517734 -293459 -3426371 -8442464 -6832141 5594292
10734 5594292 18238334 17777522 6943005 719798 5337184 11688017 10504042 3838410
$$ packed form
10790C184223o196625j642190J635859k512797o120340n44470P540194O807194
10782B151048n15050m379301l415691k409583k18681N817372R246052K902910
10774I179076o262152n384864L914469P628136Q19027o501924n433036J604198
10766d37070P569937P913136J217323q215517j0329908j514646O596116K209419
10758E008790o835216l564808J0167845J4621181K911609q481504o395498J09941
10750G542340j897316p748296n969201J233956L523840O48494L18050K950089
10742F01956K472826q83222j673826q11193l132912n016093J610323J2426433
10734E594292J2644042m60812j0834517o223207M617386O350833j183975o665632
$$ plain form
10726 3838410 -1916500 -5610584 -8594573 -9034377 -5331073 -1245637 -1762682 -5968281
10718 -5968281 -8575287 -7022585 -3634900 -2232982 -5021297 -10594227 -13125275 -7245868
10710 -7245868 3617332 8523654 2679156 -5368652 -5788113 -1152781 -3072 -1586697
10702 -1586697 1854529 9486300 11033191 3110448 -5383427 -7941102 -9253926 -13606166
10694 -13606166 -15305438 -9270592 -2279187 -3122687 -7826451 -5988459 2112722 6361881
10686 6361881 3022247 -1299980 -2173706 -2912675 -5552744 -6484683 -4890280 -6187025 -11515716
10677 -11515716 -12012280 -1242046 12433198 14810483 4611864 -5073044 -3962935 4132162
10669 4132162 8988119 6997078 2968801 2286730 5067584 7395154 6220173 2798181
$$ packed form
10726C838410n754910l694084k983989m39804L703304M085436n17045m205599
10718e968281k607006J552702L387685J401918k788315n572930k531048N879407
10710g245868J0863200M906322n844498q047808m19461M635332J149709j583625
10702a586697L441226P631771J546891p922743q493875k557675j312824m352240
10694a3606166j699272O034846O991405q43500m703764J837992Q101181M249159
10686F361881l339634m322227q73726p38969k640069r31939J594403j296745n328691
10677a1515716m96564J0770234J3675244K377285j0198619r684908J110109Q095097
10669D132162M855957j991041m028277o82071K780854K327570j174981l421992
$$ plain form
10661 2798181 1266824 3090752 4087186 -199166 -6704353 -7119687 429753 7198534
10653 7198534 5393652 -693882 -1453178 3522384 6192055 4224305 4164103 8179403 8165197
10644 8165197 -892523 -10569985 -10545731 -3761214 -183266 -449193 2773827 9551075 11181360
10635 11181360 4880350 -1244702 -964476 1864964 1832287 323503 506572 892203 -914768
10626 -914768 -3265997 -3625198 -2218354 608287 5774788 11518588 13627283 12376970
10618 12376970 13070100 16682320 17140608 12015387 8258921 11559779 17174964 18253090
10610 18253090 16577640 16776127 15635899 7118613 -5381303 -11866295 -9702269 -5757199
10602 -5757199 -4575268 -2822003 2903053 9726693 12764705 11203689 7949991 6125289
$$ packed form
10661B798181j531357J823928R96434m286352o505187m15334P549440O768781
10653G198534j804882o087534p59296M975562K669671j967750o0202M015300j4206
10644H165197r057720r677462K4254O784517L577948k65927L223020O777248J630285
10635A1181360o301010o125052K80226K829440l2677j508784J83069L85631j806971
10626i14768k351229l59201J406844K826641N166501N743800K108695j250313
10618A2376970O93130L612220M58288n125221l756466L300858N615185J078126
10610A8253090j675450J98487j140228q517286j2499916o484992K164026L945070
10602e757199J181931J753265N725056O823640L038012j561016l253698j824702
$$ plain form
10594 6125289 6862027 8364317 7510147 4610397 4828283 11300901 18622582 18141165 9372216
10585 9372216 1048564 -237109 2108388 677075 -5062278 -7416150 96669 14222483
10577 14222483 24427801 23595487 14781245 6832218 5164779 8277941 11249722 10217882
10569 10217882 5188766 1054289 3753121 12689297 20112721 21487465 21667272 25010559
10561 25010559 25074350 13751614 -3037376 -10533866 -5227743 1811744 2162556 -1184960
10553 -1184960 -3844261 -6501972 -8053451 -4052295 3539412 5936150 1471905 -610355
10545 -610355 5009457 11677710 12488277 9786080 8337134 9281051 14546746 25706889
10537 25706889 35036686 31144166 17622846 11274989 17064650 21668013 17901575 16020592
$$ packed form
10594F125289P36738J502290q54170k899750K17886O472618P321681m81417q768949
10585I372216q323652j285673K345497j431313n739353k353872P512819J4125814
10577A4222483J0205318q32314q814242p949027j667439L113162K971781j031840
10569A0217882n029116m134477K698832Q936176P423424J374744J79807L343287
10561B5010559O3791j1322736j6788990p496490N306123P039487L50812l347516
10553a184960k659301k657711j551479M001156P591707K396738m464245k082260
10545f10355N619812O668253Q10567k702197j448946R43917N265695J1160143
10537B5706889R329797l892520j3521320o347857N789661M603363l766438j880983
$$ plain form
10529 16020592 21296160 21015267 7617976 -4406324 -1402836 6561237 3654719 -5741650
10521 -5741650 -7518489 -1303387 4499529 9024660 13326524 10894651 314407 -5656207
10513 -5656207 491536 7368570 6079145 7119410 18290627 26533866 22429540 20102864
10505 20102864 29034130 31336330 15531571 5781093 23024392 44605349 42981622 36450347
10497 36450347 53532779 74969299 68372925 54500599 71458466 96790496 87966907
10490 87966907 82812379 152882649 248931142 214907407 6876335 -209103829 -256421305
10483 -256421305 -162307756 -82935751 -82224856 -94854012 -72166646 -47121049 -50278031
10476 -50278031 -57887964 -47955162 -38039355 -42303669 -44973718 -37463423 -35848426 -43916762
$$ packed form
10529A6020592N275568k80893j3397291j2024300L003488P964073k906518r396369
10521e741650j776839O215102N802916M525131M301864k431873j0580244n970614
10513e656207O147743O877034j289425J040265J1171217Q243239m104326k326676
10505B0102864Q931266K302200j5804759r750478J7243299K1580957j623727o531275
10497C6450347J7082432K1436520o596374j3872326J6957867K5332030q823589
10490H7966907n154528P0070270R6048493l4023735k08031072k15980164m7317476
10483b56421305R4113549P9372005P10895j2629156K2687366K5045597l156982
10476e0278031p609933R932802R915807m264314k670049P510295J614997q068336
$$ plain form
10468 -43916762 -41291278 -24373861 -18400872 -32018199 -38895065 -23395124 -8115379
10461 -8115379 -14515498 -28540562 -28637940 -20331704 -19278517 -22952323 -22102478 -21337152 -26885102
10452 -26885102 -29816437 -21078409 -9683168 -8347173 -13252487 -14116558 -12784261 -16125619
10444 -16125619 -20640575 -19443607 -16408524 -19158949 -24308221 -22516465 -13854608 -7406488
10436 -7406488 -8394435 -13452670 -16238460 -12940418 -5411316 -1214344 -5909587 -14585856
10428 -14585856 -17461088 -13560759 -10427596 -10844862 -10284070 -7759656 -7690374 -9756236 -8547533
10419 -8547533 -4641152 -4014656 -5403797 -1522461 5651581 5452624 -2894785 -7643291
10411 -7643291 -4662166 -4525787 -13511928 -22645927 -23039997 -18241316 -13812871 -8231320
$$ packed form
10468d3916762K625484J6917417N972989j3617327o876866J5499941J5279745
10461h115379o400119j4025064r7378Q306236J053187l673806Q49845P65326n547950
10452b6885102k931335Q738028J1395241J335995m905314q64071J332297l341358
10444a6125619m514956J196968L035083k750425n149272J791756Q661857O448120
10436g406488r87947n058235k785790L298042P529102M196972m695243q676269
10428a4585856k875232L900329L133163m17266N60792K524414O9282k065862J208703
10419h547533L906381O26496j389141L881336P174042j98957q347409m748506
10411g643291K981125J36379q986141r133999l94070M798681M428445N581551
$$ plain form
10403 -8231320 -1968922 -1947899 -8270369 -9844359 -2496077 1879308 -5465976 -14940526
10395 -14940526 -14454907 -8156907 -6008725 -5573505 787208 8783343 7790071 -1389137
10387 -1389137 -8293298 -9040886 -8386807 -8041650 -4677731 1082413 3427628 -435169 -7378311
10378 -7378311 -12934055 -14172343 -10732285 -7182659 -9989255 -17552808 -18839881 -7549908
10370 -7549908 8145813 16183187 14852231 9706110 2949864 -5327682 -10872214 -10206044
10362 -10206044 -8408849 -12338449 -18349040 -16321075 -5266144 4093327 3624730 -2511087
10354 -2511087 -4966440 -1332423 1676041 -3413177 -15587454 -25129371 -24078731 -15900264
10346 -15900264 -11026426 -13402551 -17112348 -16870658 -14713677 -13665661 -11881642 -7530483
$$ packed form
10403h231320O262398K1023o322470j573990P348282M375385p345284r474550
10395a4940526M85619O298000K148182M35220O360713P996135r93272r179208
10387a389137o904161p47588O54079L45157L363919N760144K345215l862797o943142
10378g378311n555744j238288L440058L549626k806596p563553j287073J1289973
10370g549908J5695721Q037374j330956n146121o756246q277546n544532O66170
10362a0206044J797195l929600o010591K027965J1054931R359471m68597o135817
10354b511087k455353L634017L008464n089218j2174277r541917J050640Q178467
10346a5900264M873838k376125l709797K41690K156981J048016J784019M351159
$$ plain form
10338 -7530483 -3826899 -4386178 -7626765 -9379669 -7395516 -1370746 6645957 10715772
10330 10715772 6334587 -1414918 -2844760 1644101 1527848 -6316055 -11512556 -7280939
10322 -7280939 -1979031 -4957711 -11152630 -10467983 -4407517 -1721753 -3350378 -3314046 -680826
10313 -680826 200268 -1273378 -2470218 -4775739 -11074075 -17745373 -17955498 -11919126 -6261973
10304 -6261973 -4346738 -4216404 -4582622 -5893255 -6811519 -6065417 -6228950 -9735500 -13473488
10295 -13473488 -13567514 -12654411 -15276952 -18692681 -16375434 -9237573 -5143134 -7182101
10287 -7182101 -9684182 -6867713 313039 7017454 10019698 9921008 10497913 14583837 18668227
10278 18668227 15296923 3857803 -6189133 -7399717 -3849753 -2622907 -2371348 1345191
$$ packed form
10338g530483L703584n59279l240587j752904J984153O024770Q016703M069815
10330A0715772m381185p749505j429842M488861j16253p843903n196501M231617
10322g280939N301908k978680o194919O84647O060466K685764j628625L6332K633220
10313f80826Q81094j473646j196840k305521o298336o671298k10125O036372N657153
10304f261973J915235J30334l66218j310633r18264P46102j63533l506550l737988
10295a3473488r4026R13103k622541l415729K317247P137861M094439k038967
10287g182101k502081K816469P180752O704415L002244r8690N76905M085924M084390
10278A8668227l371304j1439120j0046936j210584L549964J226846K51559L716539
$$ plain form
10270 1345191 5527029 5344560 5692729 14419153 26013149 25755835 11462199 -1782403
10262 -1782403 -2203179 5042259 10025712 12600572 16475843 17604469 9775298 -2061303
10254 -2061303 -5218935 3262709 11450326 8321648 -1689819 -5665986 -178920 5146583
10246 5146583 2371029 -4157856 -6303716 -4945202 -6645502 -11247249 -12398198 -9649264
10238 -9649264 -9655691 -13478479 -13125843 -4978382 3218407 4852000 4702760 8795562 12231194
10229 12231194 7188402 -2684589 -6519732 -1664412 4816340 8070145 9846087 11692955
10221 11692955 11662203 8158750 1579374 -7231741 -15860157 -19896007 -18052280 -14761671
10213 -14761671 -13592977 -12396734 -9315591 -7556304 -8440474 -6765040 -524104 2395028
$$ packed form
10270A345191M181838j82469L48169Q726424J1593996k57314j4293636j3244602
10262a782403m20776P245438M983453K574860L875271J128626p829171j1836601
10254b061303l157632Q481644Q187617l128678j0011467l976167N487066N325503
10246E146583k775554o528885k145860J358514j700300m601747j150949K748934
10238i649264o427l822788L52636Q147461Q196789J633593j49240M092802L435632
10229A2231194n042792r872991l835143M855320O480752L253805J775942J846868
10221A1692955l0752l503453o579376q811115q628416m035850J843727L290609
10213a4761671J168694J196243L081143J759287q84170J675434O240936K919132
$$ plain form
10205 2395028 -3232824 -8315583 -2350396 8282666 8730063 -1895287 -10896161 -12015576
10197 -12015576 -10144983 -7517437 -1002441 6054795 4776417 -3856453 -8775323 -6829561
10189 -6829561 -6770765 -11858319 -13543558 -7826732 -3083428 -4426736 -4427202 1663325 4628566
10180 4628566 -3842871 -15953806 -19171770 -14085309 -9485167 -7258284 -4038023 -1836482
10172 -1836482 -4925647 -9994793 -10310177 -6758562 -5041268 -4967886 -2305601 1564074 2111489
10163 2111489 1721816 6428700 13226059 12074503 2466776 -2895386 4170856 14543996
10155 14543996 13783478 1845116 -6895311 -2389371 8732960 12288118 4801808 -2227731
10147 -2227731 2269927 13414774 15602192 2383664 -15314430 -22887816 -17961015 -8661363
$$ packed form
10205B395028n627852n082759N965187J0633062M47397j0625350r000874j119415
10197a2015576J870593K627546O514996P057236j278378q632870m918870J945762
10189f829561N8796n087554j685239N716826M743304j343308m66O090527K965241
10180D628566q471437j2110935l217964N086461M600142K226883L220261K201541
10172a836482l089165n069146l15384L551615J717294P3382K662285L869675N47415
10163B111489l89673M706884O797359j151556r607727n362162P066242J0373140
10155A4543996p60518j1938362q740427M505940J1122331L555158p486310p029539
10147b227731M497658J1144847K187418j3218528j7698094p573386M926801R299652
$$ plain form
10139 -8661363 -1495441 2771830 4392918 2966451 162962 -1406355 -2396421 -5327390
10131 -5327390 -8739071 -7460813 -204885 6997583 7540541 2366162 -1138778 2110638
10123 2110638 8996249 11767154 6981670 -516347 -3499554 -788676 2665969 3277034
10115 3277034 2444272 1809564 -701781 -6874945 -13194272 -14199073 -10063593 -6825513
10107 -6825513 -8129665 -9773427 -5080626 5040799 10572847 3351561 -11779392 -20967820
10099 -20967820 -17689302 -10569961 -11515270 -20357673 -27064838 -26123756 -21047581 -15481738
10091 -15481738 -8416516 -143017 4683015 3673999 925476 1304528 4979301 9514731
10083 9514731 12006218 7775587 -5581359 -20108563 -22245108 -10773237 -1240650 -5322327
$$ packed form
10139h661363P165922M267271J621088j426467k803489j569317r90066k930969
10131e327390l411681J278258P255928P202468N42958n174379l504940L249416
10123B110638O885611K770905m785484p498017k983207K710878L454645O11065
10115C277034q32762o34708k511345o173164o319327j004801M135480L238080
10107f825513j304152j643762M692801J0121425N532048p221286j5130953r188428
10099b0967820L278518P119341r45309q842403o707165R41082N076175N565843
10091a5481738P065222Q273499M826032j009016k748523L79052L674773M535430
10083I514731K491487m230631j3356946j4527204k136545J1471871R532587m081677
$$ plain form
10075 -5322327 -14346110 -13008475 -1829752 6644398 8912286 13000089 20994056 24021843
10067 24021843 17530157 8474269 2383850 -4875211 -15551736 -20881952 -13136215 536784
10059 536784 6500981 2306286 -3567475 -6067593 -7223998 -6840531 -648110 10007951
10051 10007951 16045947 12790268 7380577 8815989 15686306 19458278 16353683 9954976
10043 9954976 4153469 -163451 -1695883 1914594 9428414 14942281 13969400 8062751
10035 8062751 1651246 -3217145 -6943135 -9426205 -9886616 -8976711 -8915057 -11155684 -14485583
10026 -14485583 -15342368 -10476880 -604276 8867714 12566651 10500905 6848983 4387513
10018 4387513 3299767 4315226 7684436 9006271 3163398 -5370211 -4248827 9479279
$$ packed form
10075e322327r023783J337635J1178723Q474150K267888M087803P993967L027787
10067B4021843o491686r055888o090419p259061j0676525n330216P745737J3672999
10059E36784N964197m194695n873761k500118j156405L83467O192421J0656061
10051A0007951O037996l255679n409691J435412O870317L771972l104595o398707
10043I954976n801507m316920j532432L610477P513820N513867r72881n906649
10035H062751o411505m868391l725990k483070m60411R09905O1654k240627l329899
10026a4485583q56785M865488R872604R471990L698937k065746l651922k461470
10018D387513j087746J015459L369210J321835n842873q533609J121384J3728106
$$ plain form
10010 9479279 21476048 17654726 3744879 -2817125 3166620 10387901 9613504 4185195
10002 4185195 -272407 -4985831 -11481212 -15003813 -11291068 -3925698 807991 1500710
9994 1500710 -563281 -5735980 -12872388 -16623025 -13425674 -6741021 -2067939 -698141
9986 -698141 -2003631 -6448439 -11662584 -11511684 -4960982 63967 -1640671 -3425830 2236383
9977 2236383 10001658 9770252 3610599 1622438 3705392 232012 -8604158 -9683212
9969 -9683212 2027219 13200896 10605721 -1296672 -9833206 -11543471 -10267345 -6109039
9961 -6109039 1907958 7561723 4062602 -3639788 -4690043 621474 1089286 -7358190
9953 -7358190 -15176246 -14058922 -8168988 -5133410 -4091904 165570 6720371 9832400
$$ packed form
10010I479279J1996769l821322j3909847o562004N983745P221281p74397n428309
10002D185195m457602m713424o495381l522601L712745P365370M733689O92719
9994A500710k063991n172699p136408l750637L197351O684653M673082J369798
9986f98141j305490m444808n214145J50900O550702N024949j704638j785159N662213
9977B236383P765275k31406o159653j988161K082954l473380q836170j079054
9969i683212J1710431J1173677k595175j1902393q536534j710265J276126M158306
9961f109039Q016997N653765l499121p702390j050255N311517M67812q447476
9953g358190p818056J117324N889934L035578J041506M257474O554801L112029
$$ plain form
9945 9832400 8043441 5339787 4084548 2157058 -2382682 -7370884 -8318883 -2937913
9937 -2937913 5668320 10076358 5295381 -4354336 -8362494 -2150388 7508420 11977317
9929 11977317 11159613 9688950 7334399 952998 -6253321 -6809714 -1415467 -371855
9921 -371855 -8725078 -17662096 -16836954 -9589570 -7972370 -15216717 -21372770 -17065682 -4805004
9912 -4805004 6061660 10533642 9975934 6225751 -649056 -8409100 -11356582 -6316973
9904 -6316973 2194516 6505493 4953450 2701977 3168500 3559609 1182564 -1058377 -240911
9895 -240911 -203997 -5905143 -13419327 -13588749 -5494755 1729468 2042745 -238281 881902
9886 881902 4385416 6298683 6157599 4724069 567179 -6277178 -11711669 -12732169 -10614655
$$ packed form
9945I832400j788959k703654j255239j927490m539740m988202r47999N380970
9937b937913Q606233M408038m780977r649717m008158O212106R658808M468897
9929A1977317q17704j470663k354551o381401p206319n56393N394247J043612
9921c71855q353223q937018Q25142P247384J617200p244347o156053M307088J2260678
9912d805004J0866664M471982n57708l750183o874807p760044k947482N039609
9904f316973Q511489M310977j552043k251473M66523L91109k377045k240941Q17466
9895b40911L6914n701146p514184j69422Q093994P224223L13277k281026J120183
9886H81902L503514J913267j41084j433530m156890o844357n434491j020500K117514
$$ plain form
9877 -10614655 -5979215 2531197 10429402 6962085 -9772266 -24946248 -24145707 -12541558
9869 -12541558 -6323830 -10111619 -15017668 -15463222 -14198856 -11872471 -5697530 479570
9861 479570 -1580514 -9677783 -11663343 -4138821 2574234 2518083 2936950 8367655 10499150
9852 10499150 3789358 -2476885 -526405 -175103 -12460578 -26850215 -24069114 -6548444
9844 -6548444 4466176 1484904 -671542 6889906 11176422 272162 -14750689 -16198113
9836 -16198113 -6790248 -3460508 -10342703 -15232947 -11511676 -6734136 -6095266 -2469966
9828 -2469966 9246176 19370336 15715277 1935243 -7124857 -4948120 1769900 5999001
9820 5999001 7892089 8673820 6673267 2637360 1142443 2746485 1636878 -4328694
$$ packed form
9877a0614655M635440Q510412P898205l467317j6734351j5173982Q00541J1604149
9869a2541558O217728l787789m906049m45554J264366K326385O174941O177100
9861D79570k060084q097269j985560P524522O713055n6151M18867N430705K131495
9852A0499150o709792o266243J950480L51302j2285475j4389637K781101J7520670
9844f548444J1014620k981272k156446P561448M286516j0904260j5022851j447424
9836a6198113R407865L329740o882195m890244L721271M777540O38870L625300
9828b469966J1716142J0124160l655059j3780034r060100K176737O718020M229101
9820E999001J893088P81731k000553m035907j494917J604042j109607n965572
$$ plain form
9812 -4328694 -7816141 -2263890 7256984 10181566 4018791 -4311993 -7748758 -4126418
9804 -4126418 4524132 11451143 7616714 -7774608 -21897427 -21469442 -9156678 1468362
9796 1468362 4805952 6551799 9252661 7322863 -594091 -6159093 -3992557 -165512
9788 -165512 -1347936 -3702637 -334827 6665793 9925730 8048659 5241768 2781601
9780 2781601 -1449931 -6304600 -7070262 -2210765 4117479 6819238 4707039 1023219
9772 1023219 286751 3065344 3839888 -2395871 -11456827 -13615573 -7089061 -723456 -434067
9763 -434067 -1182729 2426570 6015137 3941231 1069521 5931889 16247471 21529960
9755 21529960 18109700 11961385 7616131 3775042 174361 -461523 858608 -1230200
$$ packed form
9812d328694l487447N552251R520874K924582o162775q330784l436765L622340
9804d126418Q650550O927011l834429j5391322j4122819M27985J2312764J0625040
9796A468362L337590J745847K700862j929798p916954n565002K166536L827045
9788a65512j182424k354701L367810P000620L259937j877071k806891k460167
9780B781601m231532m854669p65662M859497O328244K701759k112199l683820
9772A023219p36468K778593P74544o235759r060956k158746O526512O365605K89389
9763d34067p48662L609299L588567k073906k871710M862368J0315582N282489
9755B1529960l420260o148315m345254l841089l600681o35884J320131k088808
$$ plain form
9747 -1230200 -7759250 -12814490 -12117831 -8159513 -4402831 -506105 3612199 4774779
9739 4774779 1810143 -657851 1810189 6763074 8286564 5019915 990905 -213146
9731 -213146 1244136 3360890 4670841 4519126 2922206 767932 -733628 -1211936 -1429832
9722 -1429832 -2240377 -3438541 -4088311 -4193739 -5197279 -7731241 -9671680 -8320161 -4003866
9713 -4003866 906833 5890770 11454156 14545897 10251160 245692 -5852915 -1873932
9705 -1873932 6145841 7557052 586549 -6999425 -8741755 -5562142 -1874815 -781309
9697 -781309 -3266560 -7882968 -10687117 -8816565 -4460487 -2563736 -4724638 -7903577
9689 -7903577 -8689742 -6289773 -1956371 1898871 2585984 -433747 -4422830 -6272308 -5347274
$$ packed form
9747a230200o529050n055240O96659L958318L756682L896726M118304J162580
9739D774779k964636k467994K468040M952885J523490l266649m029010j204051
9731b13146J457282K116754J309951j51715j596920k154274j501560m78308k17896
9722a429832q10545j198164o49770j05428j003540k533962j940439J351519M316295
9713d003866M910699M983937N563386L091741m294737j0005468o098607L978983
9705a873932Q019773J411211o970503p585974j742330L179613L687327J093506
9697g81309k485251m616408k804149J870552M356078J896751k160902l178939
9689g903577p86165K399969M333402L855242O87113l019731l989083j849478R25034
$$ plain form
9680 -5347274 -2294608 2356315 6466143 6464073 2159403 -1886507 -2916326 -3893611 -6791254
9671 -6791254 -6711544 974935 11185141 14347520 9306741 3725277 2559729 3414508 3207159
9662 3207159 2186542 439846 -2971096 -6042080 -5031298 -1102300 31848 -3057283
9654 -3057283 -4552081 114284 7148540 8644193 1496952 -9310705 -14781970 -10060765
9646 -10060765 -615234 2326495 -4153551 -9460465 -4063028 5969908 8258684 3587197
9638 3587197 3244260 8356921 7262227 -3406969 -10620725 -5473824 2057113 -262052
9630 -262052 -6957792 -5042659 3941034 7353398 2918775 1289182 7053436 11296304
9622 11296304 6751100 -877342 -2229814 3027921 8217913 8520811 3244752 -5715133
$$ packed form
9680e347274L052666M650923M109828k070m304670m045910j029819r77285k897643
9671f791254P9710P686479J0210206L162379n040779n581464j165548Q54779k07349
9662C207159j020617j746696l410942l070984J010782L928998J134148l089131
9654c057283j494798M666365P034256J495653p147241j0807657n471265M721205
9646a0060765R445531K941729o480046n306914N397437J0032936K288776m671487
9638C587197l42937N112661j094694j0669196p213756N146901P530937k319165
9630b62052o695740J915133Q983693L412364m434623j629593N764254M242868
9622A1296304m545204p628442j352472N257735N189992L02898n276059q959885
$$ plain form
9614 -5715133 -13154967 -12626112 -3897787 4970033 7107993 4738218 2928858 -200155
9606 -200155 -9317091 -19898858 -20190980 -7725191 4758229 5659240 -18261 186853
9598 186853 6402386 7178954 -519391 -4921416 1900676 10185835 6915602 -3423070
9590 -3423070 -4757791 6757973 17318817 15113422 4562808 -2926518 -3592980 -1115108
9582 -1115108 1764110 4954141 7824552 9556984 10879083 12229433 12337684 10880701
9574 10880701 9588643 8568518 5277403 -198443 -3169427 -1423832 -132811 -4697426
9566 -4697426 -11899109 -13858806 -8806098 -2077336 2456372 5618733 7295197 4255261
9558 4255261 -3426283 -8884499 -6319021 -2747 -77159 -8834304 -15891524 -10327690 4921868
$$ packed form
9614e715133p439834N28855Q728325Q867820K137960k369775j809360l129013
9606b00155r116936j0581767k92122J2465789J2483420R01011n677501K05114
9598A86853O215533P76568p698345m402025O822092Q285159l270233j0338672
9590c423070j334721J1515764J0560844k205395j0550614p489326o66462K477872
9582a115108K879218L190031K870411J732432J322099J350350J08251j456983
9574A0880701j292058j020125l291115n475846k970984J745595J291021m564615
9566d697426p201683j959697N052708O728762M533708L162361J676464l039936
9558D255261p681544n458216K565478O316274p4412q757145p057220N563834J5249558
$$ plain form
9549 4921868 15582311 12985653 3404859 -1960169 -1449105 -2233247 -8142745 -14985602
9541 -14985602 -17812355 -16505225 -12769519 -7286984 -2319404 -2114546 -7292080 -12566299
9533 -12566299 -13382175 -11629615 -11497340 -12769316 -12267345 -9836153 -8536260 -9383469 -9393473
9524 -9393473 -5491783 1508041 7511653 9301553 8048433 8149710 11806272 15976676
9516 15976676 16474326 13456457 10034414 7355669 5247229 5944565 11300222 16858645
9508 16858645 15407290 7233805 273766 -1186950 -960227 -2464437 -3762769 -4080900
9500 -4080900 -6876812 -11796437 -11754816 -4027644 3407800 3565533 1093713 3073020 6260565
9491 6260565 3574232 -2266682 -2890606 1454770 3268348 1554268 2791996 8456702
$$ packed form
9549D921868J0660443k596658r580794n365028N11064p84142n909498o842857
9541a4985602k826753J307130L735706N482535M967580K04858n177534n274219
9533a2566299q15876J752560J32275j271976N01971K431192J299893q47209j0004
9524i393473L901690O999824O003612J789900j253120J01277L656562M170404
9516A5976676M97650l017869l422043k678745k108440O97336N355657N558423
9508A6858645j451355q173485o960039j460716K26723j504210j298332l18131
9500d080900k795912m919625M1621P727172P435444J57733k471820J979307L187545
9491F260565k686333n840914o23924M345376J813578j714080J237728N664706
$$ plain form
9483 8456702 12439738 11749644 9643748 6854633 -37926 -9093626 -11891199 -5906887
9475 -5906887 428653 -700226 -7095705 -12440328 -14391424 -12802884 -6933948 739322
9467 739322 3771460 -601248 -7737753 -12407760 -13688237 -10923565 -2706371 6168364
9459 6168364 5271939 -7655566 -20661672 -22200691 -15297461 -9942461 -8053132 -4922962
9451 -4922962 -289130 1948891 1681335 1071319 -1829412 -8586088 -12503727 -6034280 5147926
9442 5147926 6554669 -5831757 -20676823 -26971167 -24824334 -18920585 -11665350 -6416906
9434 -6416906 -7692585 -13039528 -13092734 -5023390 2049646 814595 -3175056 -1549564 2951257
9425 2951257 1699696 -5483721 -10625252 -9929776 -7686550 -8828522 -13843645 -19773751
$$ packed form
9483H456702L983036o90094k105896k789115o892559r055700k797573N984312
9475e906887O335540j128879o395479n344623j951096J588540N868936P673270
9467G39322L032138m372708p136505m670007j280477K764672Q217194Q874735
9459F168364q96425j2927505j3006106j539019O903230N355000J889329L130170
9451d922962M633832K238021k67556o10016k900731o756676l917639O469447J1182206
9442E147926J406743j2386426j4845066o294344K146833N903749P255235N248444
9434f416906j275679n346943n3206Q069344P073036j235051l989651J625492M500821
9425B951257j251561p183417n141531O95476K243226j141972n015123n930106
$$ plain form
9417 -19773751 -21099336 -12324670 4405162 17368448 17846457 11691163 10535370 14476302
9409 14476302 13512930 5019094 -1847837 -1425509 -333601 -5839113 -14012115 -16029470
9401 -16029470 -10440813 -2901511 2214071 4357934 4008981 2335767 1805778 3405683
9393 3405683 4692494 2924957 -1758998 -7551275 -12333594 -12843255 -6924507 1351249
9385 1351249 3483502 -3598164 -13472148 -18566486 -18160012 -15562501 -12740430 -11438448
9377 -11438448 -14183378 -19344574 -19986489 -12866319 -4262160 -1524302 -3133707 -2942981
9369 -2942981 -51276 2140105 3119911 4568963 5353882 3958516 3100147 5098038 5775720
9360 5775720 708657 -5363513 -4260163 2393727 5154729 1249357 -2767342 -3198673
$$ packed form
9417a9773751j325585Q774666J6729832J2963286M78009o155294j155793L940932
9409A4476302r63372q493836o866931M22328J091908n505512q173002k017355
9401a6029470N588657P539302N115582K143863l48953j673214n29989J599905
9393C405683J286811j767537m683955n792277m782319n09661N918748Q275756
9385A351249K132253p081666r873984n094338M06474K597511K822071J301982
9377a1438448k744930n161196o41915P120170Q604159K737858j609405J90726
9369b942981K891705K191381R79806J449052P84919j395366q58369J997891O77682
9360E775720n067063o072170J103350O653890K761002l905372m016699m31331
$$ plain form
9352 -3198673 -3780017 -6040215 -5228037 99502 3326978 4997 -4364523 -2721310 2884389
9343 2884389 5102727 2041143 -1346176 -506391 4445622 10670662 15938204 20265800
9335 20265800 24774852 28122098 25889315 16751544 7076812 4050540 5752161 4772813
9327 4772813 708566 419832 4933650 5883722 -995506 -7640233 -5130447 3329231 7952316
9318 7952316 6181774 3695839 4167840 4713093 1346347 -5490011 -11596293 -13505409 -12299657
9309 -12299657 -12600712 -16263013 -18881529 -16296479 -12263733 -13301506 -17336182 -15934261
9301 -15934261 -8204321 -2897157 -4320145 -6132861 -3435295 -1201505 -4498222 -9182451
9293 -9182451 -9715371 -8485302 -9502673 -10001066 -6814368 -4486773 -7769984 -11863448 -9852079
$$ packed form
9352c198673n81344k260198Q12178N327539L227476l321981m369520J643213N605699
9343B884389K218338l061584l387319Q39785M952013O225040N267542M327596
9335B0265800M509052L347246k232783r137771r674732l026272J701621r79348
9327D772813m064247k88734M513818R50072o879228o644727K509786Q459678M623085
9318G952316j770542k485935M72001N45253l366746o836358o106282j909116J205752
9309a2299657l01055l662301k618516K585050M032746j037773m034676J401921
9301a5934261P729940N307164j422988j812716K697566K233790l296717m684229
9293i182451n32920J230069j017371m98393L186698K327595l283211m093464K011369
$$ plain form
9284 -9852079 -4623946 -3099219 -3468856 353982 5511601 4258929 -949479 -229195 5701533
9275 5701533 4537214 -7271562 -16689828 -13075325 -3763729 -2120307 -8455030 -12706587
9267 -12706587 -10828275 -8125993 -8076107 -7401689 -3700502 -386290 -419261 -361067 4215160
9258 4215160 10041670 8875018 -708635 -9800903 -10240869 -4641456 -1000293 -1324941 -1923395
9249 -1923395 -1978597 -3382428 -3139419 4035334 14082242 15167271 4855981 -4716435
9241 -4716435 -4826041 -2819869 -8184596 -15852272 -15325335 -9087915 -7885633 -11690732 -10137840
9232 -10137840 -1322725 4125613 363038 -4727387 -2729552 3109497 4712668 737105
9224 737105 -4682292 -9477205 -14149203 -17473692 -16096948 -8081105 3955223 12383798
$$ packed form
9284i852079N228133J524727l69637L822838N157619j252672n208408P20284N930728
9275E701533j164319j1808776r418266L614503R311596J643422o334723m251557
9267a2706587J878312K702282M9886O74418L701187L314212l2971N8194M576227
9258D215160N826510j166652r583653r092268m39966N599413L641163l24648n98454
9249a923395n5202j403831K43009P174753J0046908J085029j0311290r572416
9241d716435j09606K006172n364727p667676N26937O237420J202282l805099J552892
9232a0137840Q815115N448338l762575n090425J997835N839049J603171l975563
9224G37105n419397m794913m671998l324489J376744Q015843J2036328Q428575
$$ plain form
9216 12383798 9355122 -4320368 -17038229 -18082693 -9929448 -3630591 -4136140 -7218372
9208 -7218372 -9296797 -11366436 -12677106 -9807136 -4703875 -5219582 -13426859 -20294576
9200 -20294576 -16853209 -5425207 4768103 8822230 8690273 8096508 9080730 11414125
9192 11414125 12562488 9976362 4844206 1255811 958337 1920306 2363411 2475784 1880442
9183 1880442 -247392 -2148312 -1272529 599098 -615379 -3910755 -4453648 -3170244 -6929479
9174 -6929479 -15968463 -19528270 -10032458 5006190 12531014 10543296 7283742 7347772
9166 7347772 7758043 7041375 8803142 13635732 15155821 9160250 1588075 1012339 5793361
9157 5793361 5855387 -2473962 -10582744 -9760401 -3011652 1145975 1884290 4723359 9380436
$$ packed form
9216A2383798l028676j3675490j2717861j044464Q153245O298857n05549l082232
9208g218372k078425k069639j310670K869970N103261n15707q207277o867717
9200b0294576L441367J1428002J0193310M054127j31957n93765R84222K333395
9192A1414125J148363k586126n132156l588395k97474R61969M43105J12373n95342
9183A880442k127834j900920Q75783J871627j214477l295376n42893J283404l759235
9174f929479r038984l559807R495812J5038648P524824j987718l259554O4030
9166G347772M10271p16668J761767M832590J520089n995571p572175n75736M781022
9157E793361O2026q329349q108782Q22343O748749M157627P38315K839069M657077
$$ plain form
9148 9380436 9082454 2911468 -1419885 -561183 -1259191 -7447141 -11409780 -6353162 474806
9139 474806 -2003188 -11100042 -14615302 -9342189 -3687012 -3039744 -3575843 -1337489 1867153
9130 1867153 3015691 1018209 -4836420 -12685786 -15456049 -8284067 2454157 5888679
9122 5888679 1600244 -893565 2943030 7327016 5996262 -933775 -9918342 -16083475
9114 -16083475 -13800128 -3611320 3795469 152843 -7182254 -6167364 -229093 -2501579
9106 -2501579 -12446620 -16079788 -9943607 -5602454 -6929792 -3249356 7812637 10725681
9098 10725681 -3529811 -20867649 -24951843 -19583269 -16431235 -14270616 -6201107 3482833
9090 3482833 5910290 3196469 2881460 3934993 1665979 -829713 412159 -569428 -9323293
$$ packed form
9148I380436k97982o170986m331353Q58702o98008o187950l962639N056618O827968
9139D74806k477994r096854l515260N273113N655177O47268n36099K238354L204642
9130A867153J148538j997482n854629p849366k770263P171982J0738224L434522
9122E888679m288435k493809L836595M383986j330754o930037q984567o165133
9114a6083475K283347J0188808P406789l642626p335097J014890N938271k272486
9106b501579r945041l633168O136181M341153j327338L680436J1061993K913044
9098A0725681j4255492j7337838m084194N368574L152034K160619Q069509R683940
9090C482833K427457k713821l15009J053533k269014k495692J241872r81587q753865
$$ plain form
9081 -9323293 -17046141 -12155086 389497 6875848 6121851 6249378 5447490 -4665533
9073 -4665533 -18377418 -18885996 -4532399 6225044 1172557 -10201315 -13984353 -10387647
9065 -10387647 -7012579 -5327604 -3034256 -1589628 -2897182 -4197883 -2834627 -1285962
9057 -1285962 -2296052 -3862265 -3793147 -4301002 -6976653 -7754825 -2852527 3385682 3013478
9048 3013478 -4092885 -9333162 -7086139 -2145114 -1792450 -3951699 155026 11234011
9040 11234011 17771577 11850240 2312479 2871690 11260372 12313372 1086194 -10507550
9032 -10507550 -12761578 -10357688 -10025968 -9025612 -3918433 743128 1693245 4417575
9024 4417575 11774590 15735335 11121470 6809890 10931757 15616016 10975649 4220961
$$ packed form
9081i323293p722848M891055J2544583O486351p53997J27527q01888j0113023
9073d665533j3711885n08578J4353597J0757443n052487j1373872l783038L596706
9065a0387647L375068J684975K293348J444628j307554j300701J363256J548665
9057a285962j010090j566213O9118n07855k675651p78172M902298O238209l72204
9048C013478p106363n240277K247023M941025L52664k159249M106725J1078985
9040A1234011O537566n921337r537761N59211Q388682J053000j1227178j1593744
9032a0507550k254028K403890L31720J000356N107179M661561R50117K724330
9024D417575P357015L960745m613865m311580M121867M684259m640367o754688
$$ plain form
9016 4220961 7639471 15548172 12511438 -258146 -6396904 -423732 6604533 7606012
9008 7606012 7644067 9664379 8598293 2833601 -2725723 -7330216 -14461880 -20060826 -15323066
8999 -15323066 -3012127 3890948 2007578 950975 4519786 4619814 -2009746 -6919977
8991 -6919977 -5197110 -2693946 -2482016 1119117 8884973 11827600 6965901 3786756
8983 3786756 7719760 11202190 8723665 6253342 7151609 3627565 -7276394 -13422332
8975 -13422332 -5667760 6134416 8258530 3430159 2552456 5432100 3936568 -2228318
8967 -2228318 -6019939 -4821152 -1137579 3796615 8009936 5733702 -4960267 -16635369
8959 -16635369 -21967324 -22672474 -22575740 -19839791 -13459236 -8768305 -8345486 -6276020 441524
$$ packed form
9016D220961L418510P908701l036734j2769584o138758N973172P028265J001479
9008G606012L8055K020312j066086n764692n559324m604493p131664n598946M737760
8999a5323066J2310939O903075j883370j056603L568811J00028o629560m910231
8991f919977J722867K503164K11930L601133P765856K942627m861699l179145
8983C786756L933004L482430k478525k470323Q98267l524044j0903959o145938
8975a3422332P754572J1802176K124114m828371q77703K879644j495532o164886
8967b228318l791621J198787L683573M934194M213321k276234j0693969j1675102
8959a6635369n331955p05150R6734K735949O380555M690931M22819K069466O717544
$$ plain form
8950 441524 4723762 2383903 1049716 5727364 7442874 -989270 -9545946 -6294398
8942 -6294398 2357091 3118181 -1788302 -1515459 2039603 -1000532 -8160184 -8804124 -4678962
8933 -4678962 -6169876 -10389808 -3806127 12965089 23219587 19473559 11844069 7807498
8925 7807498 2307496 -6637008 -10249415 -4456407 2050463 2711012 2479982 5282780 5525525
8916 5525525 99632 -3478124 515719 6259256 7141483 5941554 6174614 3514915 -4976534
8907 -4976534 -11968143 -9696688 -1464051 5165904 9454675 13287495 13277776 7007905 1390477
8898 1390477 4323240 11629076 12198967 4148272 -3146388 -2484404 3526637 8727783 10723842
8889 10723842 10277951 8012019 4169885 -83281 -2711750 -2543748 -1056706 -1022565 -1917258
$$ packed form
8950D41524M282238k339859j334187M677648J715510q432144q556676L251548
8942f294398Q651489P61090m906483K72843L555062l040135p159652o43940M125162
8933d678962j490914m219932O583681J6771216J0254498l746028p629490m036571
8925G807498n500002q944504l612407N793008O506870O60549k31030K802798K42745
8916E525525n425893l577756L993843N743537Q82227j199929K33060k659699q491449
8907d976534o991609K271455Q232637O629955M288771L832820r719o269871n617428
8898A390477K932763P305836N69891q050695p294660O61984O011041N201146J996059
8889A0723842m45891k265932l842134m253166k628469J68002J487042L4141q94693
$$ plain form
8880 -1917258 897364 9153553 16743588 17107176 12937905 11420982 11864631 7323246 -1768441
8871 -1768441 -6184086 -2248789 2882359 4036701 5617678 10657308 12328182 4759528
8863 4759528 -5306169 -7133017 -1517463 1165827 -4229921 -12432242 -16224278 -14162560
8855 -14162560 -10000705 -8023965 -8663196 -7730055 -2215206 3414581 1578683 -7234872
8847 -7234872 -13783763 -12013183 -5297047 565520 3202218 1118997 -5937626 -12026150
8839 -12026150 -10234663 -5083415 -7716102 -15468387 -11676381 6739374 18433575 7389427
8831 7389427 -11639164 -14724990 -3623018 1563162 -3749217 -5231868 2656255 8555807
8823 8555807 6051089 3020752 3929061 1031583 -9315095 -17188045 -14634767 -7911728
$$ packed form
8880a917258K814622Q256189P590035L63588m169271j516923M43649m541385r091687
8871a768441m415645L935297N131148J154342J580977N039630J670874p568654
8863D759528j0065697j826848N615554K683290n395748q202321l792036K061718
8855a4162560M161855J976740o39231R33141N514849N629787j835898q813555
8847g234872o548891J770580O716136N862567K636698k083221p056623o088524
8839a2026150J791487N151248k632687p752285L792006J8415755J1694201j1044148
8831G389427j9028591l085826J1101972N186180n312379j482651P888123N899552
8823H555807k504718l030337R08309k897478j0346678p872950K553278O723039
$$ plain form
8815 -7911728 -5734198 -6457817 -5294348 -4236785 -6278722 -8318149 -7582327 -7019776 -7227031
8806 -7227031 -1885689 10703534 20317841 18385713 11101994 9057146 11000672 9084579
8798 9084579 4108257 2883350 4441103 2209098 -1768152 1566552 11306700 14148543
8790 14148543 3104227 -11999377 -18429708 -16440870 -14633352 -16126666 -17256672 -16300525
8782 -16300525 -15583722 -15598664 -13325400 -7338321 -83723 6145493 11595143 15518439 14056151
8773 14056151 5551539 -4043619 -6206147 -726863 3542941 1246023 -1244458 4702978
8765 4702978 15805056 19657452 11437421 318715 -3156383 331890 3100601 2339444
8757 2339444 2014619 4895267 7922608 6316051 -77422 -5587833 -4338733 2207927
$$ packed form
8815g911728K177530p23619J163469J057563k041937k039427P35822N62551k07255
8806g227031N341342J2589223R614307j932128p283719k044848J943526j916093
8798I084579m976322j224907J557753k232005l977250L334704R740148K841843
8790A4148543j1044316j5103604o430331J988838J807518j493314j130006R56147
8782a6300525P16803j4942K273264N987079P254598O229216N449650L923296j462288
8773A4056151q504612r595158k162528N479284M269804k296918k490481N947436
8765D702978J1102078L852396q220031j1118706l475098L488273K768711p61157
8757B339444l24825K880648L027341j606557o393473n510411J249100O546660
$$ plain form
8749 2207927 5223551 -698330 -8556620 -6475336 6178014 17387848 18498014 13530001
8741 13530001 9361472 5435826 -828396 -6449243 -8778104 -12405266 -20867650 -26759556
8733 -26759556 -20717821 -6821591 2150046 3109816 4888866 12109958 18330858 17450312
8725 17450312 11719886 5257412 -1256039 -5980437 -4790380 1212511 5015342 4359692
8717 4359692 4988770 9277914 10659291 4929036 -1802904 -3486121 -4068663 -8706281 -12838986
8708 -12838986 -10212596 -5511870 -7488758 -13877933 -15432787 -12346272 -13302767 -18168450
8700 -18168450 -15516040 -1145395 13278652 16509060 12451094 10425452 9087507 1028432
8692 1028432 -10869405 -13790533 -2986116 10083934 12158605 4695980 159370 4942715
$$ packed form
8749B207927L015624n921881p858290K081284J2653350J1209834J110166m968013
8741A3530001m168529l925646o264222n620847k328861l627162q462384n891906
8733b6759556O041735J3896230Q971637R59770J779050P221092O220900q80546
8725A7450312n730426o462474o513451m724398J190057O002891L802831o55650
8717D359692O29078M289144J381377n730255o731940j683217n82542m637618m132705
8708a2838986K626390M700726j976888o389175j554854L086515r56495m865683
8700a8168450K652410J4370645J4424047L230408m057966k025642j337945q059075
8692A028432j1897837k921128J0804417J3070050K074671p462625m536610M783345
$$ plain form
8684 4942715 12736826 15090706 11903589 7618010 2138109 -7256767 -16508410 -15908332
8676 -15908332 -3541587 9376690 11982649 7737756 8450871 17338635 25285075 23405599
8668 23405599 12813668 850555 -7201730 -10820949 -12181742 -12918589 -11197176 -2909022
8660 -2909022 11315653 22179391 20006829 6896747 -4426729 -4838565 2148951 6156065
8652 6156065 848622 -11233220 -20787371 -18631264 -4691497 9953833 14197913 9010949
8644 9010949 3325284 307161 -3667947 -7313855 -3468983 6737195 10360959 687902
8636 687902 -10382697 -7383407 7753183 19625732 19775729 13153320 7058205 4017394
8628 4017394 5183509 11149229 17611011 17593008 10032036 645157 -6509016 -12429757 -17309914
$$ packed form
8684D942715P794111K353880l187117m285579n479901r394876r251643O00078
8676a5908332J2366745J2918277K605959m244893P13115Q887764P946440j879476
8668B3405599j0591931j1963113q052285l619219j360793p36847J721413Q288154
8660b909022J4224675J0863738k172562j3110082j1323476m11836O987516M007114
8652F156065n307443j2081842r554151K156107J3939767J4645330M244080n186964
8644I010949n685665l018123l975108l645908L844872J0206178L623764r673057
8636F87902j1070599K999290J5136590J1872549J49997o622409o095115l040811
8628D017394J166115N965720O461782j8003p560972r386879p154173n920741m880157
$$ plain form
8619 -17309914 -17830190 -12986294 -7805020 -8317845 -15378753 -24169035 -27040995 -18090176
8611 -18090176 -128209 13438758 10508139 -4556626 -14381573 -9704460 -121904 504558
8603 504558 -7336592 -11879955 -7770605 -2266451 -3737231 -10741153 -15064707 -11593076
8595 -11593076 -2156193 8378304 16649600 21383237 22005491 18839798 14163135 10525310
8587 10525310 7032835 -279326 -12271873 -23015359 -25462025 -19673018 -12186742 -8146610
8579 -8146610 -7621192 -8860807 -10656444 -11197501 -9090524 -6547707 -7395049 -10546526 -9554781
8570 -9554781 -686477 11819656 20291646 20614768 13981382 5451571 1577859 4839257
8562 4839257 9106384 5882357 -3123128 -6051321 2997560 14712801 17161849 11597381
$$ packed form
8619a7309914n20276M843896N181274n12825p060908q790282k871960Q950819
8611a8090176J7961967J3566967k930619j5064765r824947M677113R582556O26462
8603E04558p841150m543363M109350N504154j470780p003922m323554L471631
8595a1593076R436883J0534497Q271296M733637O22254l165693m676663l637825
8587A0525310l492475p312161j1992547j0743486k446666N789007P486276M040132
8579h146610N25418j239615j795637n41057K106977K542817q47342l151477R91745
8570i554781Q868304J2506133Q471990L23122o633386q529811l873712L261398
8562D839257M267127l224027r005485k928193R048881J1715241K449048n564468
$$ plain form
8554 11597381 7877822 8436590 6399567 -1498781 -9601016 -12744372 -13355055 -15683388
8546 -15683388 -18406107 -17180393 -11809739 -7603461 -10418124 -21249299 -34523707 -41887653
8538 -41887653 -39500707 -31204572 -22973626 -16230747 -9634595 -4804350 -4793922 -7846539
8530 -7846539 -8682425 -6329133 -4737437 -4758216 -2165820 4016908 8060527 6669772 5688242
8521 5688242 11731160 21086456 23499873 15307200 3241897 -4019766 -3528184 1756609
8513 1756609 5796515 3111980 -5657859 -11986161 -8185144 1660258 4926542 -3479461
8505 -3479461 -13626611 -13040265 -2662029 5236550 3485818 -1911555 -1732467 3694759
8497 3694759 6247710 2256781 -2762944 -2836676 18017 74801 -2459802 -2000796 2496548
$$ packed form
8554A1597381l719559N58768k037023p898348q102235l143356o10683k328333
8546a5683388k722719J225714N370654M206278k814663j0831175j3274408p363946
8538d1887653K386946Q296135Q230946O742879O596152M830245J0428l052617
8530g846539q35886K353292J591696k0779K592396O182728M043619j390755r81530
8521E688242O042918R355296K413417q192673j2065303p261663M91582N284793
8513A756609M039906k684535q769839o328302L801017R845402L266284q406003
8505c479461j0147150N86346J0378236P898579j750732n397373J79088N427226
8497C694759K552951l990929n019725p3732K854693N6784k534603M59006M497344
$$ plain form
8488 2496548 4561494 -153293 -6590033 -7458649 -4038561 -3542942 -7225000 -8309266 -3203303
8479 -3203303 1846106 -469976 -7467873 -9821485 -4302385 2461622 3671194 993764
8471 993764 755512 4496452 7274875 4937939 -291910 -2689974 469698 6588785 10550143
8462 10550143 8730458 1898960 -4172444 -2902547 5295645 10729932 4250107 -10476013
8454 -10476013 -19392775 -14768802 -4805376 -2679198 -9622213 -14461648 -8723208 3375574
8446 3375574 10876880 7976390 -1512558 -8977250 -9079286 -4433722 -2223384 -5175494
8438 -5175494 -8149824 -6468224 -4138546 -7465987 -12424018 -7673693 7729217 19026100
8430 19026100 14060930 -459709 -8991389 -7909398 -6153461 -7943581 -6843173 940362
$$ packed form
8488B496548K064946m714787o436740q68616L420088M95619l682058j084266N105963
8479c203303N049409k316082o997897k353612N519100O764007J209572k677430
8471I93764k38252L740940K778423k336936n229849k398064L159672O119087L961358
8462A0550143j819685o831498o071404J269897Q198192N434287o479825j4726120
8454a0476013q916762M623973R963426K126178o943015m839435N738440J2098782
8446C375574P501306k900490r488948p464692j02036M645564K210338k952110
8438e175494k974330J681600K329678l327441m958031M750325J5402910J1296883
8430A9026100m965170j4520639q531680J081991J755937j790120J100408P783535
$$ plain form
8422 940362 8252769 7975959 4467108 6100855 11210686 10574047 2615904 -2890513 1293538
8413 1293538 9269175 9944859 1343985 -8302865 -11568070 -8466179 -2659163 3151370
8405 3151370 6331591 3950053 -2996305 -8415519 -8464431 -7609706 -12391909 -20713127 -23396672
8396 -23396672 -16685490 -7014432 -1475998 465623 2297210 3052332 73589 -4336302
8388 -4336302 -5047743 -1448422 2281944 3079804 680248 -5024533 -12888236 -17694259 -14592601
8379 -14592601 -6779277 -2793162 -5008830 -6914546 -3878856 -58624 -533436 -2363246
8371 -2363246 458557 6744056 9445931 5905203 762084 -1378118 -850862 474409
8363 474409 2627702 5239551 5511152 1760699 -2995362 -4288449 -2339799 -1908482 -5564899
$$ packed form
8422I40362P312407k76810l508851J633747N109831o36639p958143n506417M184051
8413A293538P975637O75684q600874r646850l265205L101891N807016N810533
8405C151370L180221k381538o946358n419214m8912Q54725m782203q321218k683545
8396b3396672O711182R671058N538434J941621J831587P55122k978743m409891
8388d336302p11441L599321L730366P97860k399556n704781p863703m806023L101658
8379a4592601P813324L986115k215668j905716L035690L820232m74812j829810
8371b363246K821803O285499K701875l540728n143119k140202N27256J325271
8363D74409K153293K611849K71601l750453m756061j293087J948650M31317l656417
$$ plain form
8354 -5564899 -9875454 -10045972 -6413852 -3434572 -2922088 -2031941 993274 3010614 975941
8345 975941 -2338287 -2206463 235993 -439945 -4891747 -7599408 -5819347 -3701416 -4508609
8336 -4508609 -4789221 -1104876 2657244 1116181 -3306879 -4461191 -3408627 -6550142
8328 -6550142 -13131155 -14184327 -6688609 62241 -2373123 -9113537 -9690741 -3115986
8320 -3115986 2933366 4787914 5571220 6166380 2929977 -3494938 -5757866 -636884 4771354
8311 4771354 3538213 -230399 1543688 7019678 6604630 -2084205 -10494412 -11996241
8303 -11996241 -10294426 -11296357 -13579873 -12712534 -10205076 -11182194 -15132032 -15611868 -9660857
8294 -9660857 -2523615 -1249859 -6561877 -12847440 -14741296 -12277912 -9611987 -9340469
$$ packed form
8354e564899m310555j70518L632120K979280N12484Q90147L025215K017340k034673
8345I75941l314228J31824K442456o75938m451802k707661J780061K117931q07193
8336d508609k80612L684345L762120j541063m423060j154312J052564l141515
8328f550142o581013j053172P495718O750850k435364o740414n77204O574755
8320c115986O049352J854548P83306N95160l236403o424915k262928N120982N408238
8311D771354j233141l768612J774087N475990m15048q688835q410207j501829
8303a1996241J701815j001931k283516Q67339K507458r77118l949838m79836N951011
8294i660857P137242J273756n312018o285563j893856K463384K665925K71518
$$ plain form
8286 -9340469 -9706994 -8970954 -10306605 -17381101 -25234937 -22730371 -7680872 6962189
8278 6962189 8173455 -862075 -6969953 -5412303 -2476115 -1380284 3033163 12744529
8270 12744529 19381772 14593442 1938332 -7148407 -6096092 1859111 8563853 7689341
8262 7689341 -820366 -10466804 -14320800 -12469649 -10682579 -11750875 -12712809 -11155796
8254 -11155796 -8560255 -5844617 -1682994 2432241 1931767 -2779905 -4587161 -79539
8246 -79539 4886908 4878575 3133708 3840436 3209620 -3239203 -10093009 -8734545 -1136650
8237 -1136650 3260487 2524876 3578259 8793093 11905951 9572728 7587756 11389172
8229 11389172 17460911 18840401 14247172 7786253 3355159 2532392 4892472 7857490
$$ packed form
8286i340469l66525P36040j335651p074496p853836K504566J5049499J4643061
8278F962189J211266r035530o107878J557650K936188J095831M413447R711366
8270A2744529O637243m788330j2655110r086739J052315P955203O704742q74512
8262G689341q509707r646438l853996J851151J787070j068296r61934J557013
8254a1155796K595541K715638M161623M115235n00474m711672j807256M507622
8246g9539M966447q333j744867P06728o30816o448823o853806J358464P597895
8237a136650M397137p35611J053383N214834L112858k333223j984972L801416
8229A1389172O071739J379490m593229o460919m431094q22767K360080K965018
$$ plain form
8221 7857490 8724610 8200716 9040415 10579833 8801442 3332919 -32725 3382670 10557118
8212 10557118 14415775 11877046 5626967 -537963 -5342461 -9013581 -10455692 -7216914
8204 -7216914 449311 6523572 4013339 -5712529 -12520426 -9709229 -2595887 -227561
8196 -227561 -2475039 -2141999 2651848 6321543 5635800 3732349 3178491 2195639 -307395
8187 -307395 -2422984 -4092345 -8050305 -13436360 -14428841 -8345542 -79621 4189587 2958750
8178 2958750 -2604537 -10481952 -15114319 -9836283 3626762 13994924 13613548 7588524
8170 7588524 4873215 5688073 4123415 -970581 -4848322 -4590875 -1968929 275335 434815
8161 434815 -2365872 -6349443 -7050877 -3141060 -6675 -3159102 -10282069 -14472510 -13412118
$$ packed form
8221G857490Q67120n23894Q39699J539418j778391n468523l365644L415395P174448
8212A0557118L858657k538729o250079o164930m804498l671120j442111L238778
8204g216914P666225O074261k510233r725868o807897K811197P113342K368326
8196b27561k247478L33040M793847L669695o85743j903451n53858r82852k503034
8187c07395k115589j669361l957960n386055r92481O083299Q265921M269208j230837
8178B958750n563287p877415m632367N278036J3463045J0368162l81376o025024
8170G588524k715309Q14858j564658n093996l877741K57447K621946K244264J59480
8161D34815k800687l983571p01434L909817L134385l152427p122967m190441J060392
$$ plain form
8152 -13412118 -10515344 -8736619 -8325428 -9431845 -11780933 -12565111 -9688345 -6525139
8144 -6525139 -8190707 -12975583 -12825209 -3716341 8683739 15448931 13334510 5788365
8136 5788365 -2304372 -8885401 -14611584 -19534378 -20785425 -15742871 -7959948 -5924047
8128 -5924047 -12813640 -21107733 -22026834 -17189327 -14554458 -14843814 -10406987 1208017
8120 1208017 10777466 9005623 -917218 -7846226 -6678376 -2471292 -1776813 -4679597
8112 -4679597 -6250266 -2972266 3579951 8373298 7764662 3143365 -648718 -789312 1030608
8103 1030608 2560183 5307619 11939461 20211470 23575716 19312942 12653225 9948113
8095 9948113 10408110 8739377 4180335 1147439 768146 -1412966 -6477085 -7575308 145721
$$ packed form
8152a3412118K896774J778725M11191j106417k349088p84178K876766L163206
8144f525139j665568m784876J50374R108868J2400080O765192k114421p546145
8136E788365q092737o581029n726183m922794j251047N042554P782923K035901
8128e924047o889593q294093r19101M837507K634869k89356M436827J1615004
8120A208017R569449j771843r922841o929008J167850M207084O94479k902784
8112d679597j570669L278000O552217M793347o08636m621297l792083j40594J819920
8103A030608J529575K747436O631842Q272009L364246m262774o659717k705112
8095I948113M59997j668733m559042l032896l79293k181112n064119j098223P721029
$$ plain form
8086 145721 10375892 13706540 11030739 10125285 11176103 6418083 -4913603 -12236245
8078 -12236245 -8462977 -48567 3483208 2299381 2009682 3521691 4833767 7502400
8070 7502400 12967536 16438704 12963046 6698945 5591834 8903913 8927357 4012222 551502
8061 551502 1521279 2235692 -365383 -2567598 -1341562 234062 -1058634 -3247635 -3811204
8052 -3811204 -4125800 -5040919 -3273537 2750636 7939433 7075560 2874870 1566433 3023400
8043 3023400 1826822 -3029800 -6205487 -4264813 126123 3637702 6257871 7533804
8035 7533804 4523829 -2362675 -6228333 -2128619 4542303 4791960 -784719 -3617287
8027 -3617287 -1818668 -3369384 -11109461 -14649987 -5321099 8586410 12618985 7584804
$$ packed form
8086A45721J0230171L330648k675801r05454J050818m758020j1331686p322642
8078a2236245L773268Q414410L531775j183827k89699J512009J312076K668633
8070G502400N465136L471168l475658o264101j107111L312079K3444m915135l460720
8061E51502R69777P14413k601075k202215J226036J575624j292696k189001n63569
8052c811204l14596r15119J767382O024173N188797q63873m200690j308437J456967
8043C023400j196578m856622l175687J940674M390936L511579K620169J275933
8035G533804l009975o886504l865658M099714O670922K49657n576679k832568
8027c617287J798619j550716p740077l540526R328888J3907509M032575n034181
$$ plain form
8019 7584804 7245736 15664592 20727472 13478401 1233274 -4894024 -4900451 -4349491 -3000227
8010 -3000227 1320461 4326179 1272119 -3298177 -2264655 905604 -3428426 -14927177
8002 -14927177 -22261148 -18882075 -10273632 -3855716 -397426 1851350 2202341 443308
7994 443308 -1063746 -1604400 -3914751 -9068316 -13532436 -13705451 -10288871 -6719635 -6024818
7985 -6024818 -9471577 -15038977 -17482482 -13563705 -6506789 -1448407 1642446 5351759
$$ packed form
8019G584804l39068Q418856N062880p249071j2245127o127298o427N50960J349264
8010c000227M320688L005718l054060m570296J033522L170259m334030j1498751
8002a4927177p333971L379073Q608443O417916L458290K248776L50991j759033
7994D43308j507054n40654k310351n153565m464120j73015L416580L569236O94817
7985f024818l446759n567400k443505L918777P056916N058382L090853L709313
$$ [...]
##END NTUPLES=NMR SPECTRUM
##END=
