##TITLE=31Pdec_LR-738-B-CR3
 , 124 sc
 17.11.2021
##JCAMPDX= 6.0         $$ Bruker NMR JCAMP-DX V2.0
##DATA TYPE= NMR SPECTRUM
##DATA CLASS= NTUPLES
##ORIGIN= UXNMR, Bruker Analytische Messtechnik GmbH
##OWNER= root
$$ XWIN-NMR		Version 3.5
$$ Wed Nov 17 13:13:10 2021 Russian Standard Time (UT+4h)  she@DPX200
##.OBSERVE FREQUENCY= 81.013821
##.OBSERVE NUCLEUS= ^31P
##.ACQUISITION MODE= SIMULTANEOUS
##.ACQUISITION SCHEME= undefined
##.AVERAGES= 124
##.DIGITISER RES= 16
##SPECTROMETER/DATA SYSTEM= spect
##.PULSE SEQUENCE= zgpg30
##.SOLVENT NAME= CDCl3
##.SHIFT REFERENCE= (INTERNAL, CDCl3, 0, 248.564)
##AUDIT TRAIL= $$ (NUMBER, WHEN, WHO, WHERE, WHAT)
$$ ##TITLE= Audit trail, XWIN-NMR		Version 3.5
$$ ##JCAMPDX= 5.01
$$ ##ORIGIN= Bruker BioSpin GmbH
$$ ##OWNER= she
$$ F:/spectra/data/she/nmr/P31/1/pdata/1/auditp.txt
$$ ##AUDIT TRAIL=  $$ (NUMBER, WHEN, WHO, WHERE, WHAT)
(   1,<2021-11-17 13:12:17.29 +0400>,<she>,<DPX200>,
      <continue with go, POWCHK disabled, PULCHK disabled
       configuration hash MD5:
       00 E9 B6 7A A2 85 ED C7 34 08 36 98 17 FE 4E 26
       data hash MD5: 32K
       C7 DF 1F DE 1B C7 A5 CE 12 72 0A 48 D8 95 8D 8D>)
(   2,<2021-11-17 13:12:20.00 +0400>,<she>,<DPX200>,
      <Start of raw data processing
       efp BC_mod = 2 LB = 1 FT_mod = 6 PKNL = 1 PHC0 = -9178.244 PHC1 = 96.2695 SI = 64K 
       data hash MD5: 64K
       B4 60 B3 E7 66 17 D1 F2 EE 79 BF ED FA 7F 35 1E>)
(   3,<2021-11-17 13:12:36.00 +0400>,<she>,<DPX200>,
      <pk PHC0 = -5.775129 PHC1 = 0 
       data hash MD5: 64K
       54 FD 73 36 7A 8C 5B A7 8A 9F 8F 03 4B C2 13 A2>)
(   4,<2021-11-17 13:12:38.71 +0400>,<she>,<DPX200>,
      <abs ABSG = 5 
       data hash MD5: 64K
       38 70 FB 41 85 5B 1F 0E 44 E9 4C 1D E0 18 BF 7E>)
$$ ##END=
$$ 
$$ hash MD5
$$ 9B 35 83 F9 2F 12 0D 0B 63 1F 9F 6B 0B 8F 1E 58
##$RELAX= 
##$RELAX= 
##$RELAX= 
##$RELAX= 
##$RELAX= 
##$RELAX= 
##$RELAX= 
##$RELAX= 
$$ Bruker specific parameters
$$ --------------------------
##$DU= <F:/spectra>
##$EXPNO= 1
##$NAME= <P31>
##$PROCNO= 1
##$TYPE= <nmr>
##$USER= <she>
##$AMP= (0..31)
100 100 100 100 100 100 100 100 100 100 100 100 100 100 100 100 100 100 
100 100 100 100 100 100 100 100 100 100 100 100 100 100 
##$AQSEQ= 0
##$AQ_mod= 1
##$AUNM= <au_zg>
##$AUTOPOS= <>
##$BF1= 81.014009
##$BF2= 200.13
##$BF3= 200.13
##$BF4= 200.13
##$BF5= 200.13
##$BF6= 200.13
##$BF7= 200.13
##$BF8= 200.13
##$BYTORDA= 1
##$CFDGTYP= 0
##$CFRGTYP= 5
##$CHEMSTR= <none>
##$CNST= (0..31)
1 1 145 1 1 1 1 1 1 1 1 1 1 1 1 1 1 1 1 1 1 1 1 1 1 1 1 1 1 1 1 1 
##$CPDPRG= <waltz16>
##$CPDPRG1= <>
##$CPDPRG2= <waltz16>
##$CPDPRG3= <>
##$CPDPRG4= <mlev>
##$CPDPRG5= <mlev>
##$CPDPRG6= <mlev>
##$CPDPRG7= <mlev>
##$CPDPRG8= <mlev>
##$CPDPRGB= <>
##$CPDPRGT= <>
##$D= (0..31)
0 1 0 0 0 0 0 0 0 0 0 0.03 2e-05 3e-06 0 0 0 0 0 0 0 0 0 0 0 0 0 0 0 0 
0 0 
##$DATE= 1637140154
##$DBL= (0..7)
120 120 120 11 120 120 24 19 
##$DBP= (0..7)
150 150 150 150 150 150 150 150 
##$DBP07= 0
##$DBPNAM0= <>
##$DBPNAM1= <>
##$DBPNAM2= <>
$$ [...]
##$SUBNAM3= <"">
##$SUBNAM4= <"">
##$SUBNAM5= <"">
##$SUBNAM6= <"">
##$SUBNAM7= <"">
##$SUBNAM8= <"">
##$SUBNAM9= <"">
##$SW= 501.771253377433
##$SWIBOX= (0..15)
0 1 3 0 0 0 0 0 0 0 0 0 0 0 0 0 
##$SW_h= 40650.406504065
##$TD= 32768
##$TD0= 1
##$TE= 0
##$TE2= 300
##$TE3= 300
##$TEG= 300
##$TL= (0..7)
0 120 53 12 22 120 120 120 
##$TP= (0..7)
150 150 150 150 150 150 150 150 
##$TP07= 0
##$TPNAME0= <>
##$TPNAME1= <>
##$TPNAME2= <>
##$TPNAME3= <>
##$TPNAME4= <>
##$TPNAME5= <>
##$TPNAME6= <>
##$TPNAME7= <>
##$TPOAL= (0..7)
0.5 0.5 0.5 0.5 0.5 0.5 0.5 0.5 
##$TPOFFS= (0..7)
0 0 0 0 0 0 0 0 
##$TUNHIN= 0
##$TUNHOUT= 0
##$TUNXOUT= 0
##$USERA1= <user>
##$USERA2= <user>
##$USERA3= <user>
##$USERA4= <user>
##$USERA5= <user>
##$V9= 5
##$VALIST= <valist>
##$VCLIST= <CCCCCCCCCCCCCCC>
##$VD= 0
##$VDLIST= <DDDDDDDDDDDDDDD>
##$VPLIST= <PPPPPPPPPPPPPPP>
##$VTLIST= <TTTTTTTTTTTTTTT>
##$WBST= 1024
##$WBSW= 4
##$XGAIN= (0..3)
0 0 0 0 
##$XL= 0
##$YL= 0
##$YMAX_a= 5004
##$YMIN_a= -7355
##$ZGOPTNS= <>
##$ZL1= 120
##$ZL2= 120
##$ZL3= 120
##$ZL4= 120
##$ABSF1= 248.5645
##$ABSF2= -253.2056
##$ABSG= 5
##$ABSL= 3
##$ALPHA= 0
##$AQORDER= 0
##$ASSFAC= 0
##$ASSFACI= 0
##$ASSFACX= 0
##$ASSWID= 0
##$AUNMP= <proc_1d>
##$AZFE= 0.1
##$AZFW= 0.5
##$BCFW= 0
##$BC_mod= 2
##$BYTORDP= 0
##$COROFFS= 0
##$CY= -3
##$DATMOD= 1
##$DC= 0
##$DFILT= <>
##$DTYPP= 0
##$F1P= 0
##$F2P= 0
##$FCOR= 1
##$FTSIZE= 65536
##$FT_mod= 6
##$GAMMA= 0
##$GB= 0
##$INTBC= 1
##$INTSCL= 5.30512e-09
##$ISEN= 30
##$LB= 1
##$LEV0= 0
##$LPBIN= 0
##$MAXI= 10000
##$MC2= 0
##$MEAN= 0
##$ME_mod= 0
##$MI= 50
##$NCOEF= 0
##$NC_proc= -10
##$NLEV= 6
##$NOISF1= 182.463
##$NOISF2= 159.3651
##$NSP= 0
##$NTH_PI= 0
##$NZP= 0
##$OFFSET= 248.5645
##$PC= 4
##$PHC0= -9184.02
##$PHC1= 96.2695
##$PH_mod= 1
##$PKNL= yes
##$PPARMOD= 0
##$PSCAL= 0
##$PSIGN= 0
##$REVERSE= no
##$SF= 81.014009
##$SI= 65536
##$SIGF1= 159.3651
##$SIGF2= -187.1042
##$SINO= 113.3802
##$SIOLD= 16384
##$SREGLST= <1H.CDCl3>
##$SSB= 0
##$STSI= 65536
##$STSR= 0
##$SW_p= 40650.406504065
##$SYMM= 0
##$S_DEV= 0
##$TDeff= 32768
##$TDoff= 0
##$TI= <>
##$TILT= no
##$TM1= 0
##$TM2= 0
##$TOPLEV= 0
##$USERP1= <user>
##$USERP2= <user>
##$USERP3= <user>
##$USERP4= <user>
##$USERP5= <user>
##$WDW= 1
##$XDIM= 65536
##$YMAX_p= 435942873
##$YMIN_p= -192185492
$$ End of Bruker specific parameters
$$ ---------------------------------
##NTUPLES= NMR SPECTRUM
##VAR_NAME=  FREQUENCY,     SPECTRUM/REAL,   SPECTRUM/IMAG
##SYMBOL=    X,             R,               I
##VAR_TYPE=  INDEPENDENT,   DEPENDENT,       DEPENDENT
##VAR_FORM=  AFFN,          ASDF,            ASDF
##VAR_DIM=   65536,         65536,           65536
##UNITS=     HZ,            ARBITRARY UNITS, ARBITRARY UNITS
##FACTOR=    0.620285442955139, 1,           1
##FIRST=     20137.2065510759, 0,            0
##LAST=      -20513.1999529892, 0,           0
##MIN=       -20513.1999529892, -192185492,  0
##MAX=       20137.2065510759, 435942873,    0
$$ Real data points
##PAGE= N=1
##DATA TABLE= (X++(R..R)), XYDATA
$$ [...]
12707B7321312J4551492j9653812l4253331k8100563r024216J6087847L0489844
$$ 27321312 41872804 22218992 -12034339 -40134902 -49159118 -33071271 -2581427
12700b581427K1865372N424265L369251Q914949J729273j1502307p976116Q775721
$$ -2581427 19283945 24708210 28077461 36992410 38721683 27219376 19243260 28018981
12692B8018981J5964005J3491921J7435973J8643698m470752l4159950k8048426
$$ 28018981 43982986 57474907 74910880 93554578 89083826 54923876 26875450
12685B6875450Q149248J8827799j4888687m3074084k6935861L778514Q793414
$$ 26875450 35024698 53852497 38963810 -4110274 -31046135 -27267621 -18474207
12678a8474207K031664J2169090K1633517Q73900k7704714k1094938P784322P775552
$$ -18474207 -16442543 -4273453 17360064 18233964 -9470750 -30565688 -22781366 -15005814
12670a5005814k2881730k9912367Q015381M2130357K7573983j1827340k2841251
$$ -15005814 -37887544 -67799911 -59784530 -17654173 9919810 -1907530 -24748781
12663b4748781M779303L5155623L6132477P998834k4895056l4158911j0588121
$$ -24748781 -19969478 15186145 51318622 59317456 34422400 263489 -10324632
12656a0324632K0849679K2995147p036994l0881390j9492353R851019K3326108
$$ -10324632 10525047 33520194 26483200 -4398190 -23890543 -14039524 9286584
12649I286584J7007343J0551649R668354K558577j2255735k0884335j8133302
$$ 9286584 26293927 36845576 46513930 49072507 36816772 15932437 -2200865
12642b200865j5213708j8731269j9234858q022708P141422J1897616M362670k896916
$$ -2200865 -17414573 -36145842 -55380700 -63403408 -56261986 -44364370 -40001700 -42898616
12634d2898616J623904J4419660J9718316P175203j4606418k6656928k0714152
$$ -42898616 -41274712 -26855052 -7136736 38467 -14567951 -41224879 -61939031
12627f1939031m607200J2186391K6528208L3505887K5582957O866920n681854
$$ -61939031 -66546231 -54359840 -27831632 5674255 31257212 38124132 32442278
12620C2442278l723944L336209Q024613J5493986K4177652J8292121l386627j5261252
$$ 32442278 28718334 32054543 40079156 55573142 79750794 98042915 94656288 79395036
12612G9395036m832961L53806k2417371m4213441k6129695J1369853J5111398
$$ 79395036 74562075 74915881 52498510 8285069 -17844626 -6474773 8636625
12605H636625j3610763k0692934P253971J7872999j6128960m4753667j8154140
$$ 8636625 -4974138 -25667072 -18413101 -540102 -16669062 -61422729 -79576869
12598g9576869L5844594N8606448M3850229K3928415O971737j7623178l5114063
$$ -79576869 -43732275 14874173 58724402 82652817 89624554 72001376 36887313
12591C6887313k2922822J250946K39417k2256178k9296391j1099572Q253781J7764871
$$ 36887313 13964491 15215437 15454854 -6801324 -36097715 -47197287 -38943506 -21178635
12583b1178635K6243553K7022298M824614k2701859j8968866J2502784K9062633
$$ -21178635 5064918 32087216 36911830 14209971 -4758895 7743889 36806522
12576C6806522J3336867q498146j7067731k1702048k5949546j8559319o538130
$$ 36806522 50143389 41645243 24577512 2875464 -23074082 -41633401 -48171531
12569d8171531j0075509j8321096j082256K9833108K9457168j002596j0371389
$$ -48171531 -58247040 -76568136 -77650392 -47817284 -18360116 -19362712 -29734101
12562b9734101J0324089P433927l2892340m2702185J5582874P0110654M4031396
$$ -29734101 -19410012 -11976085 -44868425 -87570610 -71987736 -1877082 42154314
12555D2154314k0973041k9281828K1245324M5433920N669137m3691185m7410441
$$ 42154314 21181273 -8100555 13144769 58578689 64247826 20556641 -26853800
12548b6853800j4950026J5399933K4700827J4506535j861315m472980R311523
$$ -26853800 -41803826 -26403893 -1703066 12803469 10942154 6469174 15780697
12541A5780697J4603535j417824j1876529L797774J5752749q323844m0092344
$$ 15780697 30384232 28966408 17089879 20887653 36640402 28316558 -11775786
12534a1775786l1639973M082672J6256055J725039J039483K0184162K4531146
$$ -11775786 -43415759 -39333087 -23077032 -21351993 -20312510 -128348 24402798
12527B4402798O765226n236405o881145j8663381l1516594j7010146R670339P709988
$$ 24402798 31168024 25931619 19050474 387093 -31129501 -48139647 -38469308 -30759320
12519c0759320r493505R125565N2104041M9053237r568023m6010998j7242265
$$ -30759320 -40252825 -31127260 20976781 70030018 60461995 14450997 -2791268
12512b791268K3261497K2873337M878228J226949q004606l3977021l4744796P197309
$$ -2791268 20470229 43343566 48221794 49448743 41444137 7467116 -27277680 -20080371
12504b0080371L3859253M132187k9986980j1205069K3720108J3748515j5701232
$$ -20080371 13778882 17911069 -12075911 -23280980 439128 14187643 -1513589
12497a513589l732362L0772139K3811990j5644778k3160127L717204N938919k4099459
$$ -1513589 -5245951 25526188 49338178 33693400 10533273 14250477 20189396 -3910063
12489c910063k8637064O868434K3440747r730468m3351363k9550685J0383900
$$ -3910063 -32547127 -25678693 -2237946 -11968414 -55319777 -84870462 -74486562
12482g4486562L3140634L3731489K6133437R342879j5202649k7497609j6825190
$$ -74486562 -41345928 -7614439 18518998 27861877 12659228 -14838381 -31663571
12475c1663571J509608J3450365K1870991K4524305Q950290j8378428k8889758
$$ -31663571 -30153963 -16703598 5167393 29691698 38641988 20263560 -8626198
12468h626198j0356509J7627008L2902346K9135709N601048k8634408m2307152
$$ -8626198 -18982707 -1355699 31546647 60682356 66283404 37648996 -4658156
12461d658156j3048837K8552968K9440497p727198k4707089M411993L5719636
$$ -4658156 -17706993 10845975 40286472 32559274 7852185 12264178 47983814
12454D7983814K4545909j4642804m2096373m6004594l4989288j2411546J4144323
$$ 47983814 72529723 57886919 15790546 -30214048 -65203336 -77614882 -63470559
12447f3470559K5976751J9358567J3349352J5011973P006898j3800384k0453382
$$ -63470559 -37493808 -18135241 -4785889 10226084 17232982 3432598 -17020784
12440a7020784n9697K0404124J6605518K546748j024562m31417m016017K378777
$$ -17020784 -17080481 3323643 19929161 22475909 21451347 21019930 17003913 19382690
12432A9382690K2767381K6788801m572129l8014642l3501579o030080K155993
$$ 19382690 42150071 68938872 64366743 26352101 -7149478 -13179558 -11023565
12425a1023565r153292n211152J8652750K8684558R494857j4025253j7835426
$$ -11023565 -20176857 -25388009 -6735259 21949299 31444156 17418903 -416523
12418d16523o568723O617079J7277903J9820792Q200224o490751m906319P619416
$$ -416523 -6985246 -368167 16909736 36730528 44930752 38440001 33533682 41153098
12410D1153098L916680j9991960l0889818o454225K6295828K4939638r530716
$$ 41153098 45069778 25077818 -5812000 -12266225 14029603 38969241 29438525
12403B9438525l3998088k0387870J2009601K7108852J5934095l055492j4638386
$$ 29438525 -4559563 -24947433 -12937832 14171020 30105115 27049623 12411237
12396A2411237j8231488j2568885P286067K9686076K5548565j2907714m7815856
$$ 12411237 -5820251 -18389136 -11103069 18583007 44131572 31223858 -16591998
12389a6591998l6195223J0867217L6937865J0670154l7368983n6199026l1543149
$$ -16591998 -52787221 -41920004 -4982139 5688015 -31680968 -87879994 -119423143
12382a19423143R842074L6030315L6109016J9774689K432744r968275k1086728
$$ -119423143 -109581069 -73550754 -37441738 -17667049 -15234305 -25202580 -46289308
12375d6289308k7398262j3932188J9063946M0052569K3375178o877428m028409
$$ -46289308 -73687570 -87619758 -68555812 -28503243 -5128065 -12005493 -16033902
12368a6033902L2435872N3198659K9475542j2367492l8864299n1757403o0618037
$$ -16033902 16401970 69600629 99076171 86708679 47844380 -3913023 -64531060
12361f4531060n0533588r427103L7412282N2897727L4413280J0132547J600186
$$ -64531060 -115064648 -124491751 -87079469 -34181742 231538 10364085 11964271
12354A1964271R172764K1155595K1138030O05435k3851446k4702240m006230O654144
$$ 11964271 21137035 42292630 63430660 64036095 40184649 15482409 11476179 18130323
12346A8130323k572866m046061J3242194J4876058k1632177n8362887m8089741
$$ 18130323 15557457 11511396 24753590 39629648 17997471 -40365416 -88455157
12339h8455157m854614K2010750K1562308K1149676K9446855K8746443J5159260
$$ -88455157 -93309771 -71299021 -49736713 -28587037 859818 29606261 44765521
12332D4765521J643248j1914663l0056797l3837011p072276K0416281Q320800
$$ 44765521 46408769 34494106 4437309 -29399702 -36471978 -16055697 -7734897
12325g734897k2347095j3458092L1906331M2807475q510979n4839883l1352470
$$ -7734897 -30081992 -43540084 -11633753 31173722 22662743 -32177140 -63529610
12318f3529610K9253895M9898941K0073243m138594O744131K0341369M452944
$$ -63529610 -34275715 15623226 35696469 31557875 38302006 58643375 63096319
12311F3096319k2866186k5840793m841712Q839236J565214m643702J1464820L3765359
$$ 63096319 40230133 14389340 9547628 18386864 19952078 15308376 26773196 60538555
12303F0538555K7015751j2267905m4825802l7108636l220406J6305810M876634
$$ 60538555 87554306 75286401 30460599 -6648037 -9868443 6437367 11314001
12296A1314001j7919127k5287679p923341K2845671M2016846K9914663k220749
$$ 11314001 -6605126 -31892805 -39816146 -16970475 25046371 54961034 52740285
12289E2740285j8442102m713903R152351m913479k7919220k5388994m616310K72476
$$ 52740285 34298183 29584280 38736631 33823152 5903932 -19485062 -24101372 -23828896
12281b3828896j1901765j0549241R394691J8988221Q403153J579933P323733K647516
$$ -23828896 -35730661 -46279902 -36885211 -17896990 -9493837 -7913904 -590171 2057345
12273B057345j7147178j7776042J6393149M3590984K0654254k9947246m9059753
$$ 2057345 -15089833 -32865875 -16472726 27118258 47772512 17825266 -31234487
12266c1234487k1368912J1253663J2644094n014518q877290O839869J6465518
$$ -31234487 -52603399 -41349736 -28705642 -33720160 -42597450 -35757581 -19292063
12259a9292063J539754j9183803j0694490K7049104M8941043K2766417k0237682
$$ -19292063 -17752309 -36936112 -47630602 -20581498 28359545 51125962 30888280
12252C0888280k3177044J6883194M4590878K3984933j8144483l9079700l4464350
$$ 30888280 7711236 24594430 69185308 93170241 75025758 35946058 1481708
12245A481708k4318390j3836362L798707K2420323K7257822J8085153R804858
$$ 1481708 -22836682 -36673044 -32874337 -10454014 16803808 34888961 44693819
12238D4693819J1849579J6473006O492102k5246643n9043837n8859913j3822362
$$ 44693819 56543398 73016404 79508506 54261863 -4781974 -63641887 -77464249
12231g7464249L9094940N3344268K5612030j1349089l5626987m5138492l3271881
$$ -77464249 -38369309 14974959 40586989 29237900 -6389087 -51527579 -84799460
12224h4799460K262169L2489342K5804753K102321P630542L5044678K9382363
$$ -84799460 -82537291 -50047949 -24243196 -22140875 -14510333 20534345 49916708
12217D9916708j5348385l4368090M613165M2633304J8624857l7779860n5308237
$$ 49916708 34568323 200233 4813398 47446702 66071559 28291699 -27016538
12210b7016538k0838379K2095324M0490382K8671792j0159672n1166083m7961178
$$ -27016538 -47854917 -25759593 14730789 43402581 33242909 -17923174 -65884352
12203f5884352N938440M7350444K5351108k1333041k5429535O425525K1167329
$$ -65884352 -59945912 -12595468 12755640 -8577401 -34006936 -27581411 -6414082
12196f414082J8048733L6729503O2894217L7575960l3411969o7369628k6186068
$$ -6414082 11634651 48364154 111258371 148834331 115422362 48052734 21866666
12189B1866666K6716858K5640417p240450j4915591M315186J1121366m545853
$$ 21866666 48583524 74223941 66983491 52067900 56383086 67504452 62958599
12182F2958599j6924365j1918701k390789j861333q168685j1372046o250258o25355
$$ 62958599 46034234 34115533 31724744 29863411 21694726 10322680 4072422 3447067
12174C447067j0225565l3078467l7682437j693941M5169684N1660348J6127422
$$ 3447067 -6778498 -39856965 -77539402 -79233343 -34063659 17596689 33724111
12167C3724111j3171355j1465468m820459j2895022j4342515O346380K2821672
$$ 33724111 20552756 9087288 4266829 -8628193 -22970708 -16624328 6197344
12160F197344J1468996m717285N227016K6672711K4545583O96066j4439453j3544353
$$ 6197344 17666340 12949055 18176071 44848782 69394365 70090431 55650978 42106625
12152D2106625j6010173k6287500k5824305q007377R570673J3518175J1749192
$$ 42106625 26096452 -191048 -26015353 -34022730 -24452057 -10933882 815310
12145H15310J5125516J9571871J4218537l124167k3262943l2448696k2458685
$$ 815310 15940826 35512697 49731234 46607067 23344124 -9104572 -31563257
12138c1563257k58039J4432726P902002j2334237k5052124j5856192J1011948
$$ -31563257 -31821296 -17388570 -9486568 -21820805 -46872929 -62729121 -51717173
12131e1717173L6012912L8581088J5904452j0672985j6218435l96955J4400698
$$ -51717173 -15704261 22876827 38781279 28108294 11889859 11492904 25893602
12124B5893602J3425842M985482K192073L380354j176341j2621119k2113313k1819192
$$ 25893602 39319444 44304926 46496999 49877353 48701012 36079893 13966580 -7852612
12116g852612j3138707o151547r536094j7854583j4729404N629477K8729377L8408649
$$ -7852612 -20991319 -27142866 -36678960 -54533543 -69262947 -63633470 -34904093 3504556
12108C504556L2005656R140630l1533054o6981027n1641703K0133569P9435991
$$ 3504556 35510212 44650842 13117788 -53863239 -105504942 -85371373 -5935382
12101e935382N9872270p086409l2616021M6033J6857466k3787713o3292868l6765677
$$ -5935382 53936888 46850479 14234458 14280491 31137957 7350244 -55942624 -92708301
12093i2708301K6305182M9942887K0042622j2417500j3464457J872722R940973
$$ -92708301 -66403119 -16460232 3582390 -8835110 -22299567 -20426845 -10485872
12086a0485872O542268l476667j2632732r516779N405167J1000290o057539k6239241
$$ -10485872 -3943604 -7420271 -20053003 -29569782 -24164615 -13164325 -19221864 -45461105
12078d5461105k2645787J834171K4090615L1883674K4470825J635281k4276758
$$ -45461105 -68106892 -66272721 -42182106 -10298432 14172393 15807674 -8469084
12071h469084k6749802k009423J5218014J749720j4540980p53941K3239604J8761143
$$ -8469084 -35218886 -37228309 -22010295 -20260575 -34801555 -35555496 -12315892 6445251
12063F445251k969130n38348K3070062K4744110k524898j6979926o7072J3987882
$$ 6445251 3476121 2937773 26007835 50751945 48227047 31247121 31180049 45167931
12055D5167931k343404k8408048l4862937k4983671j4630585m762323N626590
$$ 45167931 42824527 14416479 -20446458 -45430129 -60060714 -64823037 -59196447
12048e9196447Q918344Q215146J7773360L0377605J8619365j4913478k7481748
$$ -59196447 -50278103 -42062957 -24289597 6088008 24707373 9793895 -17687853
12041a7687853k96885K5858682J2124332j6061460j0681590K0106907K4890065
$$ -17687853 -17984738 7873944 19998276 3936816 -6744774 13362133 38252198
12034C8252198q983276l5225970j6891365K3623688L8208496J1987748k7099053
$$ 38252198 29268922 -5957048 -22848413 775275 38983771 50971519 23872466
12027B3872466m3454092k6257847N595706K2752545J2593014r732706j8564622
$$ 23872466 -19581626 -45839473 -40243767 -17491222 -4898208 -14630914 -33195536
12020c3195536m297273J8999715K8254464J1939964j7513946l0660311j0831014
$$ -33195536 -37492809 -18493094 9761370 21701334 4187388 -26472923 -37303937
12013c7303937K0587970K3573583r362674l9282838l0712547K800143K2568566
$$ -37303937 -16715967 6857616 -2505058 -41787896 -72500443 -69700300 -47131734
12006d7131734J8308239J0732503R920139L699144j0625482j4564449R8222J4115493
$$ -47131734 -28823495 -18090992 -8170853 -4471709 -15097191 -29661640 -29563418 -15447925
11998a5447925J1408061N629110J5707918L1208125K6423968j62650k5108674
$$ -15447925 -4039864 1589246 17297164 48505289 74929257 74766607 49657933
11991D9657933l4655517l5971738l4111459k2845718l551034J0492764J7045299
$$ 49657933 15002416 -20969322 -55080781 -77926499 -81477533 -70984769 -53939470
11984e3939470K8805702M3498820L6326239Q73379k8156272k0614764J729647
$$ -53939470 -25133768 18365052 54691291 55564670 27408398 6793634 8523281
11977H523281j910143k5884686k6811827O753495L6472753L2379957R699622m711364
$$ 8523281 6613138 -19271548 -46083375 -39329880 -2857127 29522830 39222452 34511088
11969C4511088p577519n597965J039914M481145j0870089l6246476l6969767k745950
$$ 34511088 26933569 21335604 22375518 26856663 15986574 -20259902 -57229669 -59975619
11961e9975619L1448296L5838680K3768665J4962357r93152l0687549m3496990
$$ -59975619 -28527323 7311357 31080022 46042379 45049227 14361678 -29135312
11954b9135312j5702908K2139112K8783300J6565589K1327759L2711293J3399572
$$ -29135312 -44838220 -22699108 6084192 22649781 43977540 76688833 90088405
11947I0088405k8088745m5677685k8860898p467892R854845L7060679N3646028
$$ 90088405 61999660 16321975 -12538923 -20006815 -10151970 26908709 80554737
11940H0554737J9717536m2138988n4885477M94445N0624114L7406221p440092
$$ 80554737 100272273 58133285 3247808 3742253 54366367 91772588 84332496
11933H4332496l1485643l7732341m4509771l2365300R667989L6645571J1531324
$$ 84332496 52846853 15114512 -29395259 -61760559 -52092570 -15446999 -3915675
11926c915675k4681721j3020597K7564759L3871395J533826j8264679q611726
$$ -3915675 -28597396 -41617993 -14053234 19818161 21351987 3087308 -5524418
11919e524418l56081k893470P022795K5650887J9319548j0867092k4723426j3509651
$$ -5524418 -5880499 -8773969 -1751174 23899713 43219261 32352169 7628743 -5880908
11911e880908j1403193k3458333j0569297K9918252L9020627q932500n0597406
$$ -5880908 -17284101 -40742434 -51311731 -21393479 17627148 8694648 -41902758
11904d1902758k6437397K4811414K9608183l918163r753613J8174874J6452878
$$ -41902758 -68340155 -43528741 -13920558 -17838721 -27592334 -9417460 7035418
11897G035418l5248045p1624582m0912785J6765751L4049677J3166447M926655
$$ 7035418 -28212627 -99837209 -140749994 -123984243 -89934566 -76768119 -71841464
11890g1841464J9601156J9044335q538505k3976450j292373L0473547L4968667
$$ -71841464 -52240308 -33195973 -41734478 -65710928 -67003301 -36529754 -1561087
11883a561087K1256029J5936006J1606019j4113300m4172297l5373525J2986912
$$ -1561087 19694942 35630948 47236967 33123667 -11048630 -46422155 -33435243
11876c3435243M8501632L5904821k00303k0215133k1560921k1089443j6647646
$$ -33435243 15066389 50971210 50770907 30555774 8994853 -12094590 -28742236
11869b8742236M69861J5233121O566045j4382963j5077184J2475344M1509911
$$ -28742236 -28272375 -13039254 -6473209 -20856172 -35933356 -23458012 18051899
11862A8051899M4700129J9771672j4965281l4765335k5659661k304404L196825
$$ 18051899 62752028 82523700 67558419 32793084 7133423 4829019 8025844
11855H025844j4851452k2329063K797915K9040926J5130756k4833084m1679763
$$ 8025844 -6825608 -29154671 -26356756 2684170 17814926 -7018158 -48697921
11848d8697921k3810940l891152M97607M085090J1548595Q161511m34321J0524447
$$ -48697921 -72508861 -76400013 -75902406 -71817316 -60268721 -52107210 -52541531 -42017084
11840d2017084L2321059K3789306j6773018l5299534n662055K4516932J1173232
$$ -42017084 -9696025 14093281 -2679737 -37979271 -43641326 -19124394 -7951162
11833g951162j4288363l319866K2286163P898540l4446840l7058478J6700426
$$ -7951162 -22239525 -25559391 -3273228 4625312 -29821528 -66880006 -50179580
11826e0179580O4294080N5065131J2849734j3808084j7604922k0213970k7799766
$$ -50179580 14114500 69179631 82029365 68221281 50616359 30402389 2602623
11819B602623k9491504k1004039o468248R821195J8408799P601641j4401781j8314410
$$ 2602623 -26888881 -47892920 -54361168 -44539973 -26131174 -18529533 -32931314 -51245724
11811e1245724P920945L5659826L0401207k328992k7391614k7540288j6882186
$$ -51245724 -43324779 -7664953 22736254 20407262 -6984352 -34524640 -51406826
11804e1406826r605335j28178J8058876L2645373K6310860K678528j4755891r553624
$$ -51406826 -61012161 -61140339 -43081463 -10436090 15874770 18553298 3797407 -5756217
11796e756217R990096K1623094J1721464j4724411m0120589m5704558k3954862
$$ -5756217 4233879 25856973 37578437 22854026 -17266563 -62971121 -86925983
11789h6925983J0751554K7775502R816354k2214241k8224746K613206L7943687
$$ -86925983 -76174429 -48398927 -38582573 -60796814 -89021560 -86408354 -48464667
11782d8464667M5257870L1215780K1600774J8145138K080679k5324013l6535546
$$ -48464667 -3206797 28008983 49609757 67754895 69835574 44511561 7976015
11775G976015j9162589J822043j834319k2776651l0971142j5351784N902167J4114601
$$ 7976015 -11186574 -9364531 -11198850 -33975501 -64946643 -80298427 -74396260 -60281659
11767f0281659J2674939J5712356K4208029K3661732O375188j2265933j0403412
$$ -60281659 -47606720 -31894364 -7686335 15975397 22350585 10084652 -318760
11760c18760P224800P968466k4936911n8892543m4163885K0770933P8244518P5055454
$$ -318760 6906040 14874506 -10062405 -68954948 -113118833 -92347900 -14103382 60952072
11752F0952072K1449839k5492004k6992594J638939J5828284p724680m6425061
$$ 60952072 82401911 56909907 29917313 31556252 47384536 39659856 -6765205
11745f765205n6682193k4651883J4955775K1428523P75100o231782J4144103L0355984
$$ -6765205 -63447398 -88099281 -73143506 -51714983 -50939883 -57171665 -43027562 -12671578
11737a2671578J8864438J784951P251863K0722604J1151937j2688509j4168597
$$ -12671578 6192860 7977811 15229674 35952278 47104215 34415706 20247109
11730B0247109Q591165J5485947j2595939m2265663l6832110o681036J2728678
$$ 20247109 28838274 44324221 31728282 -10537381 -47369491 -54050527 -41321849
11723d1321849J1596289Q507634J4383831J8618653R000179j2058371l1974661
$$ -41321849 -29725560 -21217926 -6834095 11784558 20784737 8726366 -23248295
11716b3248295l8017871k4184244K861893K5657797L0747538K1352591J1761393
$$ -23248295 -61266166 -85450410 -82588517 -56930720 -26183182 -4830591 6930802
11709F930802J0995891J4003537O880003j7623550m5305393m7077070j1927761
$$ 6930802 17926693 31930230 38810233 21186683 -24118710 -71195780 -83123541
11702h3123541L1723331M5131476K7436417J2457256J6249312J7006962k237103
$$ -83123541 -51400210 -6268734 21167683 33624939 49874251 66881213 64644110
11695F4644110k1895374j8508065l257099K14873l811370K998675J3868067P361145
$$ 64644110 42748736 24240671 20983572 21198445 17387075 20385750 34253817 41614962
11687D1614962j1280956j5848512l331636M495769M721793J8659265M4364830
$$ 41614962 30334006 14485494 11153858 15649627 20371420 39030685 83395515
11680H3395515M4174733N34309m8487330n6246426k6357151K306831R794470M854475
$$ 83395515 127570248 128104557 79617227 23370801 -2986350 -679519 9114951 13969426
11672A3969426n120629k0660291l0571472j7003166J3488943K7353876M064689
$$ 13969426 8848797 -11811494 -42382966 -59386132 -45897189 -18543313 -14478624
11665a4478624l5160944m9905072k5038898J5989746L9741783L7239499K6491823
$$ -14478624 -49639568 -99544640 -124583538 -108593792 -68852009 -31612510 -5120687
11658e120687K3935243K3036627Q750413j4363802k4518983j3554019J842761
$$ -5120687 18814556 41851183 50601596 36237794 11718811 -1835208 7553
11651G553N790971L477604N363861O678180j640206j2441746j1004783O58114
$$ 7553 5798524 9276128 14639989 21318169 19677963 7236217 -3768566 -3110452
11643c110452M732680p718099k5577436l1210814j5918872J5593223M5704605
$$ -3110452 1622228 -6095871 -31673307 -62884121 -78802993 -63209770 -17505165
11636a7505165N1406439K4309656j5016658l3213137j8356767R434741K4648159
$$ -17505165 33901274 58210930 43194272 9981135 -8375632 1059109 25707268
11629B5707268K5275818K7196990L3944341K5873035j1125435n4247063o1077385
$$ 25707268 50983086 78180076 112124417 137997452 126872017 72624954 11547569
11622A1547569k3798744J4430986J3633607j0621190j4773820O926706K0170929
$$ 11547569 -12251175 2179811 15813418 5192228 -9581592 -2654886 17516043
11615A7516043R369278l195642k986423m275291j0356122K178160L3483144L9080743
$$ 17516043 26885321 23689679 20703256 16427965 6071843 8250003 41733147 80813890
11607H0813890l821887m7531252l8009337M978846K5528015K0666331K6502618
$$ 80813890 76992003 29460751 -8548586 -3569740 21958275 42624606 69127224
11600F9127224L4785450J981293n7361248o8229570r271503M4650580L1831173
$$ 69127224 103912674 105893967 48532719 -19696851 -28968354 15682226 47513399
11593D7513399r339668j2390357J4082879J7908253k165498l982763J6393173
$$ 47513399 38173731 25783374 39866253 57774506 55609008 51626245 68019418
11586F8019418J9392343o136194k7346755k8032010k8310732l3040856j5483521
$$ 68019418 87411761 81275567 53928812 25896802 -2413930 -35454786 -50938307
11579e0938307K6332393M6571578J6827985k4795055k7437947q29769P149070
$$ -50938307 -24605914 21965664 38793649 13998594 -13439353 -14269122 -7120052
11572g120052j2977592k4323572p446280J2166560R742634j578704K497824J8699758
$$ -7120052 -20097644 -44421216 -51867496 -39700936 -29958302 -31537006 -29039182 -10339424
11564a0339424K5664295J6125867j004268j9724693l7078855m0774276j9156153
$$ -10339424 15324871 31450738 30446470 10721777 -26357078 -67131354 -86287507
11557h6287507J6027645L6717284L2623891K0765911J5463113Q323912r392712
$$ -86287507 -70259862 -33542578 -918687 19847224 35310337 43634249 34241537
11550C4241537k1935511p809265K3709301L6576178J1545331k8994618m5466763
$$ 34241537 12306026 4496761 28206062 64782240 76327571 47332953 1866190
11543A866190k2188357J9372478M2230543K6721641j3204526m4505305m7086450
$$ 1866190 -20322167 -949689 41280854 68002495 54797969 10292664 -36793786
11536c6793786k8762516q044745P452350J7740356J7506867L022822j3207216
$$ -36793786 -65556302 -73601047 -66148697 -48408341 -30901474 -27878652 -41085868
11529d1085868j2843469L194086J6227436J7199145J5006832J4564141P086774
$$ -41085868 -53929337 -50735251 -34507815 -17308670 -2301838 12262303 19349077
11522A9349077p937776j0730857J0529870L2146012J9436892k2657695m7011137
$$ 19349077 11411301 680444 11210314 43356326 62793218 40135523 -6875614
11515f875614k2547343K2132303L2492898j561601l3450222k3793217Q906186
$$ -6875614 -29422957 -7290654 25202244 23640643 -9809579 -33602796 -24696610
11508b4696610K2031955J3012202J4439932L1953554L0893635l354903l3456181
$$ -24696610 -2664655 10347547 24787479 56741033 87634668 84279765 50823584
11501E0823584k4692668K344456P188128r552032j9299573j7770177k0443476
$$ 50823584 26130916 28475372 35663500 26111468 6811895 -10958282 -31401758
11494c1401758k1271689l267791J8405257J2961102r973121j1590238Q340707
$$ -31401758 -52673447 -55941238 -37535981 -24574879 -34548000 -46138238 -37797531
11487c7797531R735964j4550092k2148343M937555K7937047J9184859O581183
$$ -37797531 -28061567 -42611659 -64760002 -59822447 -31885400 -12700541 -6119358
11480f119358J5711010K0555244m547602l0916393k3668326l550209o449704j6487911
$$ -6119358 9591652 30146896 25599294 -5317099 -28985425 -32535634 -38985338 -55473249
11472e5473249M37534K5035867J3117068k1983837k4331259J3016695L7960402
$$ -55473249 -55035715 -29999848 -16882780 -38866617 -63197876 -50181181 -12220779
11465a2220779K4590829N403050O406236Q464913o592714k1637588k0263535j5734090
$$ -12220779 12370050 17773100 24179336 32644249 26051535 4413947 -15849588 -31583678
11457c1583678j9837761j7815430K840873K8092902M0826699M1373298L0356566
$$ -31583678 -51421439 -69236869 -66395996 -38303094 2523605 43896903 74253469
11450G4253469J503099l3099395m2078554j7417705J0174349J4716610M969301
$$ 74253469 75756568 42657173 578619 -16839086 -6664737 8051873 13021174
11443A3021174l370747j1858348j7277209j196795L3367354M7581116J7924844
$$ 13021174 9650427 -2207921 -19485130 -20681925 12685429 60266545 78191389
11436G8191389k6214318m3591670l1817066r944396J7136204M2885800M0503388
$$ 78191389 51977071 8385401 -23431665 -33376061 -16239857 26645943 67149331
11429F7149331L412155k2918761Q57844L8709912K3461311m0873253p9760397
$$ 67149331 70561486 47642725 48500569 87210481 110671792 69798539 -9961858
11422i961858n2689595r61092K0981945J1421439j709019p135911p311661l13692
$$ -9961858 -62651453 -63612545 -42630600 -31209161 -32918180 -40054091 -47365752 -47679444
11414d7679444J0726397J2817419N390254M838591J3419534J0759541q335837
$$ -47679444 -36953047 -24135628 -18745374 -13906783 -487249 10272292 1936455
11407A936455j8106320m275730R041081J367725o139000J0297774K6991218O176234
$$ 1936455 -16169865 -20445595 -11404514 -10036789 -16175789 -5878015 21113203 27289437
11399B7289437l6986499m9373375j7186539J8664726K7270718K1314115J5583021
$$ 27289437 -9697062 -59070437 -76256976 -57592250 -30321532 -9007417 6575604
11392F575604q13955k8025719l3174593J659500L9875352L6740025M061609j0944363
$$ 6575604 5761649 -22264070 -55438663 -53779163 -13903811 22836214 26897823 15953460
11384A5953460L036762J3745991L664859p685208n574554m132918j3710741j7665279
$$ 15953460 18990222 32736213 36401072 28715864 23141310 19008392 5297651 -12367628
11376a2367628k347855J5542930J3992952j543216j2134072j5650424k0692049
$$ -12367628 -14715483 827447 14820399 13277183 1143111 -14507313 -35199362
11369c5199362k3454110j3542628N752156K2397170L1992951L2341695J5470728
$$ -35199362 -58653472 -72196100 -66443944 -44046774 -12053823 20287872 35758600
11362C5758600j3606970k6068581o088197J5012862k614613m2897294n0554102
$$ 35758600 22151630 -3916951 -10005148 5007714 2393101 -40504193 -91058295
11355i1058295j2474369K4047327K4558805J0925375J0783696J1443049k183874
$$ -91058295 -103532664 -79485337 -54926532 -44001157 -33217461 -21774412 -23958286
11348b3958286p186599J4222016K7315294l046504l9622475j9973145L5533266
$$ -23958286 -31144885 -16922869 10392425 7345921 -32276554 -52249699 -16716433
11341a6716433M0192251k5114869p3543658m0986156J8807148K2501280j7143218
$$ -16716433 23475818 -1639051 -75182709 -116168865 -97361717 -74860437 -92003655
11334i2003655k6040478P851411K8408167J5572787J1951214L5344822M2274107
$$ -92003655 -118044133 -110192722 -81784555 -66211768 -54260554 -18915732 23358375
11327B3358375P662161k4974030j4023581J2784930R031847j5377323k2277918
$$ 23358375 31020536 6046506 -7977075 4807855 13839702 -1537621 -23815539
11320b3815539j3903513j6235888j9128618N578471M1410230M5390605K1655919
$$ -23815539 -37719052 -53954940 -73083558 -67505087 -26094857 19295748 40951667
11313D0951667J3302867K2273964O855665l1910650l6751657O639313L1298579
$$ 40951667 54254534 76528498 83384163 51473513 14721856 21361169 52659748
11306E2659748n420454m5049639j8777783L8860083M3432888o595922l4325715
$$ 52659748 47239294 2189655 -16588128 22271955 65704843 59108921 24783206
11299B4783206r725400J2753863p455080l4438878k0485769K1379559M4814868
$$ 24783206 15057806 27811669 20356589 -14082289 -34568058 -13188499 31626369
11292C1626369L3301690M096459k4123911l9739017l4457977j4757887j779689
$$ 31626369 64928059 69024518 44900607 5161590 -29296387 -44054274 -45833963
11285d5833963k516102K095986K4155152M2829616L2458670K400125j4636783
$$ -45833963 -48350065 -46254079 -22098927 20730689 53189359 55589484 40952701
11278D0952701p681063O02541j1273513l2164623k9845432Q785793N4814889O1840465
$$ 40952701 33271638 33874179 22600666 -9563957 -39409389 -30623596 24191293 86031758
11270H6031758J6834270m1505801o3467474l9502890k66529K3742452K5238518
$$ 86031758 102866028 61360227 -2107247 -41610137 -41876666 -18134214 7104304
11263G104304J1246724o196637j1904466o52237J0470393Q3095k7138981m3937004
$$ 7104304 18351028 12154391 249925 -402312 10068081 10151176 -16987805 -60924809
11255f0924809l2642465j48994L2592420M1532748J3948592k6959048l0399492
$$ -60924809 -93567274 -93716268 -61123848 -19591100 -5642508 -32601556 -63001048
11248f3001048J8023469N9961139L4954146k7794642m3932576L876018M2845267
$$ -63001048 -44977579 14983560 49937706 22143064 -21789512 -17913494 24931773
11241B4931773K1779766j9865128k5505784n921597m411152k0038989j8151426
$$ 24931773 46711539 26846411 1340627 -4580970 -8992122 -29031111 -47182537
11234d7182537O152197K2859501J5349516k827166j4799788j7336197j3633066
$$ -47182537 -41030340 -18170839 -2821323 -5648489 -20448277 -37784474 -51417540
11227e1417540o182808N207729K2031156L4967819K1519810k0444805m9114606
$$ -51417540 -57600348 -52392619 -30361463 4606356 26126166 5681361 -43433245
11220d3433245k8705709P530448N2295l6417062k9053034K7420145N0463096P045871
$$ -43433245 -72138954 -64608506 -64556211 -100973273 -130026307 -102606162 -52143066 -45097195
11212d5097195k3756467J7194288O6008494M5400500m188319m092097J8838093
$$ -45097195 -68853662 -51659374 14349120 59749620 55561301 51469204 70307297
11205G0307297j2854476p3260325o3978337J8189329P1163052M8253522J0234621
$$ 70307297 57452821 -15807504 -79785841 -61596512 9566540 57820062 68054683
11198F8054683J834513r138092l9860456m5924101q508548K2710298J5953047
$$ 68054683 69889196 60751104 20890648 -25033453 -33542001 -10831703 5121344
11191E121344M656037J0756328M373427k0223446j5656011K4431539L0926955
$$ 5121344 9777381 20533709 24907136 4683690 -10972321 13459218 44386173
11184D4386173k3851059o2582543k5913398K4373824Q566528l8513809l4566425
$$ 44386173 20535114 -42047429 -67960827 -43587003 -35020475 -73534284 -108100709
11177a08100709R345337J9789702o671689q216348K5467692M1425258K3177636
$$ -108100709 -98755372 -78965670 -85637359 -93853707 -68386015 -26960757 -3783121
11170c783121J1924129K3970943K7014117Q389327l370257L252702N223759l424965
$$ -3783121 8141008 32111951 59126068 67515395 64145138 67397840 72621599 69196634
11162F9196634J58023J6648374J5248341j2305660l6114587l6979976k7156275
$$ 69196634 69354657 86003031 101251372 88945712 52831125 15851149 -11305126
11155a1305126j5202388O047191K9057132L1237058J2753938k757867q120319
$$ -11305126 -26507514 -20460323 8596809 39833867 52587805 49829938 41709619
11148D1709619j5588534k1416732r290050J1447918J3678404j937094j1065515
$$ 41709619 26121085 4704353 -4585697 6862221 20540625 18603531 7538016
11141G538016j0679907j4557320j2082765J4746356L9583317J8487703l2227749
$$ 7538016 -3141891 -17699211 -29781976 -15035620 24547697 43035400 10807651
11134A0807651n0649224k6113938j0838165k3925146k0529766J9189460M6296505
$$ 10807651 -39841573 -65955511 -76793676 -100718822 -121248588 -102059128 -55762623
11127e5762623K5336038o864298p090393Q969722J0644502O438249J0630845P710963
$$ -55762623 -30426585 -37290883 -44381276 -35411554 -24767052 -18328803 -7697958 13005
11119A3005p699157p892321J0791859P319872k3668178k0714165L6859202O5403653
$$ 13005 -7686152 -15578473 -4786614 2533258 -21134920 -41849085 -4989883 60413770
11111F0413770K231489p3791103n0569857L7983832N9821992j2328611o9515967
$$ 60413770 62645259 -11145844 -61715701 -23731869 36090123 23761512 -45754455
11104d5754455m0979172J7333435L4174336J9036949N994487j0515597l3645739
$$ -45754455 -86733627 -69400192 -35225856 -16188907 -10194420 -20710017 -54355756
11097e4355756k8723963J7403572N6733450M8001309J7400661P716891J1360073
$$ -54355756 -83079719 -65676147 -8942697 39058612 56459273 64176164 75536237
11090G5536237M6877j7054435j2761604P811937J8112088J0384499o974994k9293263
$$ 75536237 75583114 58528679 45767075 53579012 71691100 82075599 75100605 45807342
11082D5807342m5695325l6576784p294945O552076o125375r260760J6650846L1917903
$$ 45807342 112017 -36464767 -43759712 -37207636 -43333011 -52593771 -35942925 -4025022
11074d025022L676057k7448729o747473L9203924L6901229j7611589m8927957
$$ -4025022 -348965 -27797694 -34545167 4658757 41559986 23948397 -24979560
11067b4979560j4590014L7726595M5302317J0643455k0786929k5199027j3166117
$$ -24979560 -39569574 -1842979 43459338 54102793 33315864 8116837 -5049280
11060e049280q98702N641018Q100528J0872689J3549658Q374892n044586j1454498
$$ -5049280 -5947982 -306964 7793564 18666253 32215911 40590803 35546217 24091719
11052B4091719m165632m189478k7291320m5216751j9567452L1271649M6648751
$$ 24091719 19926087 15736609 -11554711 -56771462 -76338914 -45067265 1581486
11045A581486J1466546j9450983l213762L0392371K9239262o821370l6992959
$$ 1581486 13048032 -6402951 -9616713 20775658 50014920 43193550 6200591
11038F200591l8596532k0335881M417502K4812967K7059847J1340962K055945
$$ 6200591 -32395941 -52731822 -48314320 -23501353 3558494 14899456 16955401
11031A6955401J4350823K4521636L636255l2247406m0152469j2035321J6525717
$$ 16955401 31306224 55827860 59464115 27216709 -12935760 -24971081 -8445364
11024h445364J9105607O504837k369475o513649j0134787r875561o005502n608354
$$ -8445364 10660243 17165080 14795605 8281956 -1852831 -11728392 -17733894 -23342248
11016b3342248n602199O880330K8275639L4606659J5805809o626744j0906610
$$ -23342248 -28944447 -22064117 6211522 40818181 56623990 49997246 39090636
11009C9090636m306847l282787k873955R409798K1473895Q165245k6001350m3591776
$$ 39090636 34783789 31501002 28627047 38036845 59510740 67675985 41674635 -1917141
11001a917141k3240884R018719J3120489j3007916l3990909k5804174k737217
$$ -1917141 -25158025 -16139306 -3018817 -16026733 -50017642 -75821816 -78559033
10994g8559033J2158525K3695842M8648275P1537384N0620117j8149132p3081033
$$ -78559033 -66400508 -42704666 5943609 77480993 128101110 109951978 36870945
10987C6870945n4158538J7006423O1785290M4320873N285465j0097300j1262083
$$ 36870945 -17287593 -281170 61504120 105824993 111110458 101013158 89751075
10980H9751075k5222999m1159915l2199837o781799N705171N632116J5092710
$$ 89751075 64528076 23368161 -8831676 -15613475 -9908304 -4276188 10816522
10973A0816522K7896867J5270033j8258292l3079823j7334454m313754j2356085
$$ 10816522 38713389 53983422 35725130 2645307 -14689147 -19002901 -31358986
10966c1358986j5825127Q02057R304995p507417j4876294J3435517L6579376Q879969
$$ -31358986 -47184113 -46382056 -37077061 -44584478 -59460772 -46025255 -9445879 -565910
10958e65910l3058659j9776355L2838600L9810424j5456683m9077226r715170
$$ -565910 -33624569 -53400924 -20562324 19248100 3791417 -45285809 -55000979
10951e5000979M0249713K7580358j8092230k2514088J1885304K2571463l623047
$$ -55000979 -14751266 12829092 -5263138 -27777226 -15891922 6679541 3056494
10944C056494j8852438l484169R377629L874060N139404J7281794M451858l8191902
$$ 3056494 -15795944 -19280113 -9902484 -6028424 -889020 16392774 20844632 -17347270
10936a7347270n4804752j0228686M7430500N2808112J5382046n647981O671095
$$ -17347270 -72152022 -82380708 -34950208 17857904 33239950 27591969 34263064
10929C4263064J5189493j540009k0469793j9483749q306660k036049K649625J0028773
$$ 34263064 49452557 47912548 27442755 7959006 -347654 -2383703 265922 10294695
10921A0294695J0195850k159601j2717746p355030N744556P982340l872278j5674366
$$ 10294695 20490545 18330944 5613198 -1741832 4002724 11985064 8112786 -7561580
10913g561580j5277433n269716J877767l089403j6408130k3167252j1449316J4976270
$$ -7561580 -22839013 -28108729 -26230962 -29320365 -45728495 -68895747 -80345063 -65368793
10905f5368793L9611799M6859797L2277533O517837p937921M136112K6584365
$$ -65368793 -25756994 21102803 53380336 59898173 51960252 56096364 82680729
10898H2680729K1946811j7914417m7221280k0989794L4739585M7097059l296757
$$ 82680729 104627540 86713123 39491843 18502049 53241634 100338693 97041936
10891I7041936m9975987l3190750J4571494J9611508k1233597l8950752k719579
$$ 97041936 47065949 13875199 28446693 48058201 26824604 -12126148 -14845727
10884a4845727K9844321J501938n3915242n8610313l281687M3314086L4469993
$$ -14845727 14998594 16500532 -37414710 -96025023 -99306710 -55992624 -21522631
10877b1522631K048501l260585J5886781K1840988L981137j3524428j3275371
$$ -21522631 -19474130 -22734715 -6847934 14993054 18974191 5449763 -7825608
10870g825608k548014O313308R009768M825488j769541P99439J4093288J8819003
$$ -7825608 -10373622 -4060314 4949454 9774942 8005401 8804840 22898128 41717131
10862D1717131J650873j7428530j1143615J0283277J2364307r836609k6467877
$$ 41717131 43368004 25939474 14795859 25079136 37443443 27606834 1138957
10855A138957k1890239j1567194n807303L516003J2030966K242386j2939616N415351
$$ 1138957 -20751282 -32318476 -38125779 -34609776 -22578810 -20336424 -33276040 -27860689
10847b7860689N1993864O3341552R854638m8341936m6120712r260161l906978
$$ -27860689 24133175 87474727 97329365 48987429 2866717 -6393444 -10300422
10840a0300422k5585243j4491015L4638230N8514598K6761164j5192009k2995555
$$ -10300422 -35885665 -50376680 -15738450 42776148 69537312 54345303 31349748
10833C1349748r784576n26558J2528560L5022570L9141460O478557l3122955m2401111
$$ 31349748 21565172 21038614 33567174 68589744 107731204 114209761 81086806 38685695
10825C8685695k7606004j5243217n823569J2744013K8006854J7673550j1117695
$$ 38685695 11079691 -4163526 -9987095 2756918 30763772 48437322 37319627
10818C7319627k9416184k4627116o774788J1057870J6347481j810779k9934823
$$ 37319627 7903443 -16723673 -23498461 -12440591 3906890 2096111 -27838712
10811b7838712k7676837K0050627O5071731M8462761j7496990o0226719m0178684
$$ -27838712 -55515549 -35464922 29606809 78069570 60572580 345861 -39832823
10804c9832823N185144J9804532k170759k3724582j8824400J614275J0103404
$$ -39832823 -34647679 -14843147 -17013906 -40738488 -59562888 -57948613 -47845209
10797d7845209l353223j8392766p421420K5929587M3553945K0976143j4691540
$$ -47845209 -51198432 -69591198 -77012618 -51083031 -7529086 13447057 -1244483
10790a244483j7807112J2991498L3912219J7813524j3427935k6552611j9029013
$$ -1244483 -19051595 -6060097 27852122 45665646 32237711 5685100 -13343913
10783a3343913q423903k350580J456851R77836l931297j928920J3944799K8932225
$$ -13343913 -21767816 -24118396 -22661545 -21683709 -25615006 -27543926 -13599127 15333098
10775A5333098K4884803R657934N279197Q981217n725931m0670768n5013755j9429607
$$ 15333098 40217901 49875835 55155032 64136249 58410318 17739550 -37274205 -56703812
10767e6703812L1598803L6080657j1510072m9063241k9338386J9512607L7612506
$$ -56703812 -25105009 10975648 -534424 -49597665 -78936051 -59423444 -21810938
10760b1810938J1824250j9520570k4934567r778664O670738J3565264P327718
$$ -21810938 -9986688 -29507258 -54441825 -64220489 -57549751 -43984487 -36656769
10753c6656769n893994n964247J8436134M4047904L7888453O750493j1152807
$$ -36656769 -42550763 -48515010 -30078876 13969028 51857481 58607974 47455167
10746D7455167n782236o948100k6675924l3316565n338021K8190711L1288191
$$ 47455167 41672931 34724831 8048907 -25267658 -30605679 -2414968 28873223
10739B8873223J3268346M100415N339417K081351L98520J2605902K2152190M823929
$$ 28873223 42141569 46241984 51581401 53662752 54061272 66667174 88819364 93643293
10731I3643293k5183604l0812222r106617N273751o649982k5530191k7283421
$$ 93643293 68459689 37647467 28540850 33814601 27164619 1634428 -25648993
10724b5648993j0370102J3456595L1012255K9222314O472714j9165527l1069057
$$ -25648993 -36019095 -22562500 8449755 37672069 44144783 24979256 -6089801
10717f089801l4021321l3071181j1480195L7557187P5065175N6396183r65917
$$ -6089801 -40111122 -73182303 -84662498 -47105311 27959864 84356047 83390130
10710H3390130l5754809k6320350q165063p329304q498175O72030N433587J883789
$$ 83390130 47635321 21314971 13149908 5820604 -2677571 -2005541 3428046 5311835
10702E311835J0601294L0895957K9008809j847175j7821472M878451K2046112
$$ 5311835 15913129 46809086 75817895 73970720 56149248 61027699 83073811
10695H3073811j0341582n8662234n7297582o654541L2141039K8465061J1085072
$$ 83073811 72732229 14069995 -43227587 -49882128 -17741089 10723972 21809044
10688B1809044N598422k189147k4469084l7179165j5341778K3167774L7500765
$$ 21809044 27407466 25218319 749235 -36429930 -51771708 -28603934 8896831
10681H896831J7062474p844800q349273O645959O009402j7927515l5252335j8991535
$$ 8896831 25959305 18114505 9765232 16411191 22420593 4493078 -30759257 -49750792
10673d9750792J3790737K2805143J246521j6440644p775509P836824O817665q63962
$$ -49750792 -35960055 -13154912 -11908391 -28349035 -36124544 -28287720 -21470055 -22334017
10665b2334017M258835J3665541P948878m766024m22464J8652259K4449832N670293
$$ -22334017 -18075182 -4409641 3539237 -1226787 -1649251 17003008 41452840 47123133
10657D7123133j7255613k2505166j0815267M456225J3335608J1176796j409438
$$ 47123133 29867520 7362354 -3452913 1003312 14338920 25515716 24106278
10650B4106278j6331057k3554649j8508676m19796K6831835M5215329L1222516
$$ 24106278 7775221 -15779428 -34288104 -34707900 -7876065 37339264 68561780
10643F8561780r710592l5265135j7606067J1641251K86739m7218558o8849809
$$ 68561780 58851188 23586053 5979986 17621237 17907976 -29310582 -98160391
10636i8160391k6960150M2612212P7962265O1336195K3269587l803445j2748463
$$ -98160391 -125120541 -82508329 -4546064 56790131 80059718 76256273 63507810
10629F3507810j0010748K028451K3729259M4587569M0246322l749556o0679255
$$ 63507810 53497062 55525513 79254772 123842341 164088663 160339107 99659852
10622I9659852p4481330k4523967L4672296L1142771k9788615o7337977l2530131
$$ 99659852 25178522 654555 35326851 66469622 36681007 -30656970 -63187101
10615f3187101K6517805L3926437j1238627m2150975j8781070K8091223M8312508
$$ -63187101 -36669296 -2742859 -13981486 -56132461 -74913531 -46822308 1490200
10608A490200L0373006k715580k6152808k6586627m438908K0992483K4911162
$$ 1490200 31863206 29147626 2994818 -23591809 -28030717 -7038234 17872928
10601A7872928Q021819l111425K109668O71310k0160066k9293683K689586M5204304
$$ 17872928 25894747 22783322 24892990 25564300 5404234 -23889449 -21199863 24004441
10593B4004441M2114674k765824k7663819o724809J4366012j192093k1132457
$$ 24004441 66119115 63353291 35689472 28964663 43330675 42138582 21006125
10586B1006125n403724J9342940L879393l5232155l6871585O232278L5098749
$$ 21006125 15602401 34945341 38824734 3592579 -33279006 -27046728 8052021
10579H052021J5251130j8701171k4856489r609674J458984O001205J0765558P691340
$$ 8052021 23303151 4601980 -20254509 -29864183 -28405199 -22403994 -11638436 -3947096
10571c947096p877050j8300780o633151J8316737L5102599L0772394J880749m0718618
$$ -3947096 -11824146 -30124926 -36758077 -18441340 16661259 47433653 49314402 8595784
10563H595784o1742466k9211707L4834641O5839314L6588221q559689j9708073
$$ 8595784 -53146682 -82358389 -47523748 18315566 54903787 46344098 26636025
10556B6636025n288903j673499j2216429j3169154Q38254J1525278O110196j0983037
$$ 26636025 21347122 19673623 7457194 -5711960 -4873706 6651572 12761768 1778731
10548A778731k4519642j5346908J9033473M4678554K4478913k0791123k8997461
$$ 1778731 -22740911 -38087819 -19054346 25624208 50103121 29311998 314537
10541C14537J0639050L5689455Q826322k2387120q134195K0157141R589529k0977822
$$ 314537 10953587 46643042 55469364 33082244 24948049 45105190 54694719 33716897
10533C3716897j9848009L047377n81829k4274075j8224823J7237057K8100521
$$ 33716897 13868888 16916265 16334436 -7939639 -26164462 -8927405 19173116
10526A9173116k639813l1296534k7223498q267075N318955J6799414K5413354
$$ 19173116 16533303 -14763231 -41986729 -50253804 -44934849 -28135435 -2722081
10519b722081K1973837J5290748J9042936J8539742l060422k0562055m240578
$$ -2722081 19251756 34542504 53585440 72125182 69064760 48502705 44262127
10512D4262127J7404829p44141l3944643k1916287K1243345K0871381l2676030
$$ 44262127 61666956 60922815 26978172 5061885 26305230 47176611 14500581
10505A4500581o4556941l5510477Q099026K5232402L3710815M5230284L0482335
$$ 14500581 -50056360 -85566837 -77467811 -52235409 -18524594 26705690 57188025
10498E7188025j6810618n3168305m9733438j7819935L5846914R7360759R7601228
$$ 57188025 40377407 -12790898 -62524336 -80344271 -44497357 52863402 150464630
10491A50464630n748320r7653641j4439703J81852687K20479520R87700k27330652
$$ 150464630 144716310 47062669 32622966 214475653 434955173 435942873 208612221
10484B08612221k05020815j9405676O2817074q150087n9807601j5084601K3456864
$$ 208612221 3591406 -15814270 47002804 38852717 -20954884 -36039485 -12582621
10477a2582621k070354j6204728J9202013L2068923p914430k3975207J8301457
$$ -12582621 -14652975 -30857703 -11655690 20413233 12498803 -11476404 6825053
10470F825053L7622243j6244584o7305219m2311851J3015263K6467587J4042600
$$ 6825053 44447296 28202712 -39102507 -81414358 -68399095 -41931508 -27888908
10463b7888908K0543770K6420758k230803l4722644k5635077O766512J9242611
$$ -27888908 -7345138 19075620 16844817 -17877827 -43512904 -36746392 -17503781
10456a7503781J3931386J0782719j851561l0874305m0468811q961380K1980306
$$ -17503781 -3572395 7210324 5358763 -25515542 -65984353 -74945733 -52965427
10449e2965427J2864110m955222J2685602M0917951L0365858l763392j0020609
$$ -52965427 -40101317 -45056539 -32370937 8547014 38912872 35149480 25128871
10442B5128871P907340J510276l3722215m7700919j3768230L6534374N9724536
$$ 25128871 33036211 34546487 824272 -46876647 -60644877 -24110503 35614033
10435C5614033M1730388l800472m4444070m4509683l310696L3342675K8029599
$$ 35614033 77344421 73543949 29099879 -15409804 -18720500 14622175 42651774
10428D2651774Q6326j0409493k762109k543228j0818732q986231J298226L326724
$$ 42651774 42738100 32328607 29566498 27023270 16204538 7218307 8516533 11843257
10420A1843257j850241k934552l872705r116024l593310J7402049K2996170o914161
$$ 11843257 9993016 7058464 3185759 -5930265 -9523575 7878474 30874644 23960483
10412B3960483l5679500j9880041J7248882J9397307j1900564k2677605L599294
$$ 23960483 -11719017 -31599058 -14350176 5047131 -6853433 -29531038 -25931744
10405b5931744K6279236K1522458J2773987J3812549J514931l0375338m2790406
$$ -25931744 347492 21869950 34643937 48456486 49971417 19596079 -23194327
10398b3194327r613289L5236406M3645224J7726412m380080o510769n964591j6597518
$$ -23194327 -32807616 2428790 46074014 63800426 59420346 52909577 46944986 30347468
10390C0347468k7612547k0799676M807878K8564490K6464406l645569l6627011
$$ 30347468 2734921 -18064755 -13256877 15307613 41772019 38126450 1499439
10383A499439m4984274k5712617K501505K0309696J8934269K738082r610735q01081
$$ 1499439 -43484835 -69197452 -66695947 -46386251 -27451982 -24713900 -34324635 -35125716
10375c5125716J8546468J8759105k019550q497106J4650665L1147643J0665087
$$ -35125716 -16579248 2179857 160307 -8336799 6313866 37461509 48126596
10368D8126596j7443495j2774400N700465n143642l1553668k5112338O971669
$$ 48126596 30683101 17908701 23609166 18465524 -13088144 -38200482 -31228813
10361c1228813R424735k1717449k6604175J3462875L6569093J601555m0323545
$$ -31228813 -21804078 -43521527 -70125702 -56662827 -20093734 -18492179 -58815724
10354e8815724k6570001J9887213L3504970Q096751o692588R581004K5069948
$$ -58815724 -85385725 -65498512 -31993542 -23896791 -30589379 -21008375 4061573
10347D061573J3534387j1047312k2683905j4812651J485464J1236568P199534
$$ 4061573 17595960 6548648 -16135257 -30947908 -29462444 -18225876 -11026342
10340a1026342j007960K920791J4851523J0763479j3841037k8263900r424573
$$ -11026342 -12034302 -9113511 5738012 16501491 2660454 -25603446 -35028019
10333c5028019K1820609L0286067J2640298j0002815k5650055l0802733j6117549
$$ -35028019 -13207410 17078657 29718955 19716140 -5933915 -36736648 -52854197
10326e2854197J5667768L3679482J5270348j3657670j0982009J7499739K6031545
$$ -52854197 -37186429 -3506947 11763401 -1894269 -12876278 4623461 30655006
10319C0655006l88187k4672555j6112331P177884J2493950K27628o370558k50749
$$ 30655006 30266819 5594264 -10518067 -3340183 9153767 9381395 3010837 2760088
10311B760088O121835Q079061J5149030K8208342K9662314P617051k0738887k6117135
$$ 2760088 8881923 16960984 32110014 60318356 89980670 97597721 76858834 50741699
10303E0741699o440407Q730367M33322j2486808o572514L701858j2125344m4346184
$$ 50741699 44301292 53031659 53464981 40978173 34405659 38107517 25982173 -18364011
10295a8364011m8336097j1357688K4994709K4654505L707238m639395J094750
$$ -18364011 -66700108 -78057796 -53063087 -28408582 -24701344 -29340739 -28245989
10288b8245989M577116O349425J3497645J7514840J2649606J3878484K6366117
$$ -28245989 -23668873 -17319448 -3821803 13693037 26342643 40221127 66587244
10281F6587244K3514409q141623l1200575j2020821J3567707r731701n7929147
$$ 66587244 90101653 81960030 50759455 38738634 52306341 42574640 -15354507
10274a5354507n2681229J3563451N5765087K3110832k5783489j7903826K5223607
$$ -15354507 -68035736 -54472285 1292802 24403634 -1379855 -19283681 5939926
10267E939926L3655192K335609j1025041J5638529L8779257K2279464j3145898
$$ 5939926 39595118 41930727 30905686 46544215 85323472 107602936 94457038
10260I4457038l0363535k5958197j7530570q740226O266198J7542515N008556
$$ 94457038 64093503 38135306 20604736 11864510 18130708 35673223 40681779
10253D0681779k9498662n3930615m0034499N66505K5914049J2032480j8308199
$$ 40681779 11183117 -42747498 -82781997 -82215492 -56301443 -44268963 -62577162
10246f2577162k4244883L029612L2965684L5782208J3311255j2132179k2977944
$$ -62577162 -86822045 -83792433 -50826749 -15044541 -1733286 -13865465 -36843409
10239c6843409j4938320M472994J8323647J3577583j894701p857131n53213L396696
$$ -36843409 -51781729 -47308735 -28985088 -15407505 -17302206 -25159337 -25712550 -22315854
10231b2315854l982489j0046198o622810l753515n847042J046361K0360349K8734153
$$ -22315854 -26298343 -36344541 -42967351 -46720866 -52567908 -51521547 -31161198 -2427045
10223b427045J2340318m954814L46635Q370788j0541943l7537594k8281019J3060460
$$ -2427045 9913273 4958459 5305094 13675882 3133939 -34403655 -62684674 -49624214
10215d9624214L4621679J6028747n156057j077361M111969j2165643k2251213
$$ -49624214 -15002535 1026212 -4129845 -5207206 -1095237 -13260880 -35512093
10208c5512093L828939L6257698K3484839k5062387m7558223j8940181J7493365
$$ -35512093 -31683154 4574544 28059383 2996996 -44561227 -63501408 -46008043
10201d6008043J7417106q116913k3037597j8950205j0421266o01101J7185571
$$ -46008043 -28590937 -36707850 -59745447 -78695652 -89116918 -89718019 -72532448
10194g2532448L3289337K6675562k145597k5467840k3079882o337543K910861
$$ -72532448 -39243111 -12567549 -14713146 -40180986 -63260868 -69598411 -66687550
10187f6687550M363914J3031366K6264677K0110909j2127432l7504261k1534641
$$ -66687550 -62323636 -49292270 -23027593 -2916684 -15044116 -52548377 -74083018
10180g4083018K0831555L9802731J6807147j3338346j5236045K760494J5126695
$$ -74083018 -53251463 -13448732 3358415 -9979931 -25215976 -22455482 -7328787
10173g328787J9118863J8889405j639846m6908880p0526346k3497851O1461667
$$ -7328787 11790076 30679481 29039635 -17869245 -88395591 -111893442 -50431775
10166e0431775R3052096M1704543k0907632k7963883m675821n493898j7047246
$$ -50431775 42620321 84324864 63417232 35453349 30777528 25283630 8236384
10159H236384Q428889N2888798M5554783k3377482p5319999n2362938M831475
$$ 8236384 16665273 69554071 115108854 91731372 16411373 -35951565 -31120090
10152c1120090K3362537k004747j9332244k717202K1987923K6326062J3714317
$$ -31120090 -7757553 -9762300 -29094544 -31811746 -9823823 16502239 30216556
10145C0216556k929j0963504k1014228k5352035j8795818n602207N909979J3922186
$$ 30216556 30213627 19250123 -1764105 -27116140 -45911958 -51514165 -45604186 -31682000
10137c1682000K1518405K6957889K3029078Q807348l851971l410916L824469M73425
$$ -31682000 -10163595 16794294 39823372 48630720 44778749 41367833 45192302 45665727
10129D5665727j5647760k6294291k0943456j3223218j4780991j0782655J3438671
$$ 45665727 30017967 3723676 -17219780 -30442998 -45223989 -56006644 -42567973
10122d2567973L4815368J7561973k5035637l3604196J6878076P2411250O3183690
$$ -42567973 -7752605 9809368 -15226269 -48830465 -31952389 40458861 103642551
10115A03642551p371152o6641876o0620312j1433616J9002853M920902k0158930
$$ 103642551 96271399 29629523 -30990789 -42424405 -23421552 -18500650 -38659580
10108c8659580j5118828J1831876J7898978p295445k2601519K98772K7499940
$$ -38659580 -53778408 -41946532 -24047554 -31342999 -53944518 -53645746 -26145806
10101b6145806J4471052j9140130j8725511J4338050K4504716j502628r789333
$$ -26145806 -11674754 -30814884 -49540395 -35202345 -10697629 -12200257 -21989590
10094b1989590K5253422M8742556J3049827l9255510l8866262M984983K6982511
$$ -21989590 3263832 52006388 65056215 25800705 -13065557 -8080574 18901937
10087A8901937O847437j6809973j9161258j3439522p655997N980158J8045659
$$ 18901937 25749374 8939401 -10221857 -23661379 -31317376 -25337218 -7291559
10080g291559R229482q972269r244248j372342j7048806m3391258l2945170J2616928
$$ -7291559 1937923 -7034346 -16278594 -17650936 -34699742 -78091000 -111036170 -98419242
10072i8419242L3948678P661615j6072615J499380K7405591K1651217N121508
$$ -98419242 -64470564 -56808949 -72881564 -71382184 -43976593 -22325376 -17203868
10065a7203868J1855438K1981668K684024k0795490k569764L7664310L5939973
$$ -17203868 -5348430 16633238 19317262 -1478228 -4047992 33616318 69556291
10058F9556291j4236348m8368654k7825095R474947J5142610l428130j1862865
$$ 69556291 55319943 6951289 -20873806 -11398859 3743751 315621 -11547244
10051a1547244m898337Q66169M213428J3697265J9307014L633481k3175569k9824067
$$ -11547244 -16445581 -15579412 -11365984 2331281 21638295 25271776 2096207 -27727860
10043b7727860q703038J1317834O707065p741852m706655J2406063J5897098k360842
$$ -27727860 -36430898 -25113064 -18405999 -26147851 -30854506 -18448443 -2551345 -4912187
10035d912187k0306344k2593722k0499358k2079396j0090306K5656433N6086701
$$ -4912187 -25218531 -47812253 -68311611 -90391007 -100481313 -74824880 -18738179
10028a8738179M6899531J1535466p739032m396518r556144k8348969k5109068
$$ -18738179 28161352 39696818 31957786 27561268 18005124 -10343845 -35452913
10021c5452913J0814066L3560041P867554l1930857l2670562l432071M096011
$$ -35452913 -24638847 8921194 16788748 -15142109 -47812671 -51244742 -47148731
10014d7148731j8722122k5603068P578752M2962535L7715604N241662r372427
$$ -47148731 -65870853 -91473921 -83895169 -40932634 -3217030 2024632 -7347795
10007g347795M634715J3963178m877952k9480998k3283775J1342475L4585001
$$ -7347795 -2713080 11250098 6372146 -23108852 -46392627 -35050152 -465151
10000d65151K4073800L233844P84426O300461m923998k0879578r328856K0138347
$$ -465151 23608649 26842493 27626919 33927380 29003382 8123804 -1205052 18933295
9992A8933295K0760680j5350417l7898200j7859069N320570p432169k6856271
$$ 18933295 39693975 24343558 -13554642 -31413711 -26093141 -33525310 -60381581
9985f0381581q170298K6163096K1209226j4463977j8181798K4048375N2386747
$$ -60381581 -68551879 -42388783 -21179557 -35643534 -53825332 -29776957 22609790
9978B2609790K5613801j9536614k7856967k66805K1195086J2237817j7120475
$$ 22609790 48223591 28686977 830010 563205 21758291 33996108 16875633
9971A6875633m3408211m5748457j8028221J9395785L5327810K4331694J0111905
$$ 16875633 -26532578 -72281035 -90309256 -70913471 -35585661 -11253967 -1142062
9964a142062P422942N177801m140977o161269Q728927K3735114J8273096m954498
$$ -1142062 6280880 11458681 7317704 1156435 9885362 33620476 51893572 46939074
9956D6939074k8727772m0178771l0884759J530086L9670842N3452159L3053419
$$ 46939074 18211302 -21967469 -52852228 -51322142 -11651300 41800859 74854278
9949G4854278j617253k9726838m4731398l7380008J484272M7221236M8497661
$$ 74854278 73237025 43510187 -1221211 -38601219 -37116947 10104289 58601950
9942E8601950n756319n8351613n3515318p082578K6148233K8515122K1971828
$$ 58601950 52845631 -5505982 -59021300 -66103878 -39955645 -11440523 10531305
9935A0531305J4874939n182207l1066810l3555973m743069K8748701M0403353
$$ 10531305 25406244 20224037 -10842773 -44398746 -49141815 -20393114 20010239
9928B0010239K5888814o937103m1140903m7956873j5039530K3242392K0254746
$$ 20010239 45899053 38961950 -2178953 -50135826 -65175356 -41932964 -21678218
9921b1678218j5928223k9912123j48117L2064893L1243948J8750340K4899437
$$ -21678218 -37606441 -67518564 -67666681 -35601788 -4357840 14392500 39291937
9914C9291937L1876913Q588568k6662223l0187877n580425J196757k0526409k6358930
$$ 39291937 71168850 79757418 53095195 22907318 17326893 18523650 -2002759 -28361689
9906b8361689Q839106M3023230K5704740k5328870m5600737j1108173L3416738
$$ -28361689 -19522583 23500647 49205387 23876517 -21724220 -32832393 584345
9899E84345L7890436Q799397r741910j030172L409598k6237672o6086005o1190256
$$ 584345 38474781 47274178 37532268 36502096 39911694 13674022 -52411983 -113602239
9891a13602239k583196M6774849K8155133k9623418m4393762M388042M6708052
$$ -113602239 -116185435 -69410586 -41255453 -70878871 -115272633 -110884591 -64176539
9884f4176539K7499223j3186410j0962944J7058706P126038l4573379l6530781
$$ -64176539 -36677316 -49863726 -60826670 -43767964 -36641926 -71215305 -107746086
9877a07746086J2158287L1641611j7328595n6186354o862483P8778647R2058199
$$ -107746086 -95587799 -63946188 -81274783 -137461137 -144323620 -65544973 26513226
9870B6513226K8022009k1198033j4431796l121501j8918151j8965689K1863336
$$ 26513226 54535235 33337202 18905406 15783905 -3134246 -22099935 -236599
9863b36599M9051045J3668865m2908889m9951837q237174K8683296L7893107L1767073
$$ -236599 48814446 62483311 19574422 -30377415 -38614589 -9931293 27961814 59728887
9855E9728887Q717165l4963500o1463701k8154209L4658744M7711023o186946
$$ 59728887 68446052 33482552 -27981149 -56135358 -21476614 26234409 20047463
9848B0047463n4866271l9899100P366526K4212031P233844K354044K8758536N5477106
$$ 20047463 -34818808 -74717908 -67351382 -43139351 -35905507 -33551463 -4792927 50684179
9840E0684179M9081690J3933916j9963694l2294422k8864329k7056104k8251656
$$ 50684179 99765869 113699785 93736091 61441669 32577340 5521236 -22730420
9833b2730420j2869219K6945175N9333055M2459797j5809773n6280246l9837329
$$ -22730420 -35599639 -8654464 50678591 93138388 77328615 21048369 -18788960
9826a8788960L701221J8160085o696022l1262056k3991553M502890K5263432K5800067
$$ -18788960 -15087739 3072346 -3623676 -34885732 -58877285 -54374395 -29110963 -3310896
9818c310896J4048614K768921r44179K125000N423116L828291O6950Q86907P956274
$$ -3310896 10737718 13506639 12562460 14687460 20110576 23938867 24005817 24892724 32848998
9809C2848998J6804516K2958490K4062143J8110501N839285o472669j2722253
$$ 32848998 49653514 72612004 96674147 114784648 120623933 114151264 101429011
9802A01429011j4091775j4321005j1008752j420977M560236q673483l7644957
$$ 101429011 87337236 73016231 62007479 60586502 65146738 56473255 18828298
9795A8828298n5056094m0749655q725907R951554O137375q04853N268320J5970493
$$ 18828298 -36227796 -76977451 -85703358 -75751804 -69614429 -70419282 -65150962 -49180469
9787d9180469J5542772N716103J314773P368359J2528706N495580r044214j4007435
$$ -49180469 -33637697 -27921594 -26606821 -19238462 -6709756 -1214176 -10258390 -24265825
9779b4265825j6590J8593908J5699411j0604453k4885809J720181M1126024L5781646
$$ -24265825 -24282415 -5688507 10010904 -593549 -25479358 -23759177 17366847 53148493
9771E3148493j7555640n3227115k8716418J1873527Q554540j8140907m648853
$$ 53148493 35592853 -17634262 -46350680 -34477153 -25922613 -44063520 -48712373
9764d8712373M2987246N2256443M033490l1457937p034288K7205967J0652271
$$ -48712373 -5725127 46531316 50564806 19106869 12072581 39278548 49930819
9757D9930819k9115467k9512591M57202K722673k5421325k8551870Q704301L4679558
$$ 49930819 20815352 -8697239 -8240037 -5517364 -30938689 -59490559 -50786258 -16106700
9749a6106700J5519781j5876296j9457196m800252J249955K207248J3396028K5347790
$$ -16106700 -586919 -16463215 -35920411 -40720663 -39470708 -37263460 -23867432 1480358
9741A480358J9205077J56286j2607354j6204235k0443832k3504588j2888260J2579997
$$ 1480358 20685435 20841721 8234367 -7969868 -28413700 -51918288 -64806548 -52226551
9733e2226551L6493830M0606650K1697782l896873j3081002j048793J0797132
$$ -52226551 -15732721 24873929 46571711 42674838 29593836 28545043 39342175
9726C9342175M563867n202937N083341K2978749J2408783k5669388m3684259j5174949
$$ 39342175 43906042 38703105 43786446 66765195 79173978 53504590 9820331 -5354618
9718e354618K2812737K2049109q823937k2310540l225586J3812265j837710l3424736
$$ -5354618 17458119 39507228 30683291 8372751 5147165 18959430 17121720 -16303016
9710a6303016l8541303k828858L9003621L9755185l545488m1103039l0176546
$$ -16303016 -54844319 -57673177 -18669556 21085629 17540141 -23562898 -53739444
9703e3739444J0084548K8310062J4567651N153188J3519366O626026k9464708
$$ -53739444 -43654896 -15344834 -777183 4376005 17895371 24521397 -4943311
9696d943311m9566910j4913017L7529946M1503136l299573l4368208j7205289
$$ -4943311 -54510221 -69423238 -31893292 9609844 6310271 -28057937 -45263226
9689d5263226J7056960K8474513J7313216L021524q504399j7267840j5827586
$$ -45263226 -28206266 268247 17581463 20602987 12098588 -5169252 -20996838
9682b0996838l684666L534610l445295j0207334K25326J9320561K1828790j203920
$$ -20996838 -24681504 -21146894 -24592189 -34799523 -34574197 -15253636 6575154 5371234
9674E371234k9754440l6280937j5374624J0220844J5465045L926114L425192K6003854
$$ 5371234 -24383206 -60664143 -76038767 -65817923 -50352878 -46426764 -43001572 -16997718
9666a6997718M5830556L1443999r723628l8588208l2997109r933984K241921l008468
$$ -16997718 28832838 60276837 50553209 11965001 -21032108 -30966092 -28724171 -31732639
9658c1732639r831560j420451K1686196L9038797K9456365l27436j6240616J72749
$$ -31732639 -41564199 -42984650 -21298454 17740343 47196708 46869272 30628656 30801405
9650C0801405K1323538Q817670k8612220m2345397j1162324K9265865L6353241
$$ 30801405 52124943 60942613 32330393 -10015004 -21177328 8088537 44441778
9643D4441778J4654378P02861J0332715K3106548J4365542j4029866l7783271
$$ 44441778 59096156 59799017 70131732 93238280 107603822 93573956 55790685
9636E5790685l7882596k0223283n301245M24858J1174213L1844426L7993862Q389069
$$ 55790685 17908089 -2315194 -7616439 -7191581 3982632 35827058 73820920 82209989
9628H2209989l3220608m1162307j2466392P148403q342091k7528882j3745692
$$ 82209989 48989381 7827074 -4639318 2509085 -5833006 -33361888 -47107580
9621d7107580J7567963K6083770Q256515o144842o355508q955143j6337231p853453
$$ -47107580 -29539617 -3455847 4800668 -1344174 -7699682 -16654825 -32992056 -40845509
9613d0845509J7895891K8537793N972694j9049297p895919K7338106L7117184
$$ -40845509 -22949618 5588175 11560869 -7488428 -15384347 11953759 49070943
9606D9070943K600766l7577117l6518175M040305L9356232L5337091L220574j9556346
$$ 49070943 51671709 14094592 -22423583 -18383278 20972954 56310045 59530619 39974273
9598C9974273j3914099K968424M464565r623422j5555467k569130J0564736N766863
$$ 39974273 26060174 29028598 33493163 23869741 8314274 5745144 16309880 22076743
9590B2076743n260323k881078L040397j1028768l3133897k2282826K4877841N4624554
$$ 22076743 16816420 13935342 16975739 5946971 -27186926 -49469752 -24591911 30032643
9582C0032643L0042576j0767726r300876K6522735L8322158O583730k7979276
$$ 30032643 60075219 49307493 40006617 66529352 104851510 111435240 83455964
9575H3455964l1700819j6487397l041869P382607J0299646r194151m2435375n5424659
$$ 83455964 51755145 35267748 32225879 39608486 49908132 40713981 -1721394 -57146053
9567e7146053l8974883k1155368j3676539O707981M1129885M7487156J1610565
$$ -57146053 -96120936 -117276304 -130952843 -124244862 -83114977 -35627821 -24017256
9560b4017256j4483965P635682L5288637J3896235l1689242m1391954j7191244
$$ -24017256 -38501221 -30865539 4423098 18319333 -13369909 -54761863 -71953107
9553g1953107l073627J50155J9414907L4233575O513332k9733805n747362N7425580
$$ -71953107 -75026734 -74876579 -55461672 -21228097 -14714765 -44448570 -50195932 7229648
9545G229648O4571425j287235m7995300k4040551P222822j0552673l3608731j2848978
$$ 7229648 71801073 70513838 22518538 -1522013 5700809 -4851864 -38460595 -51309573
9537e1309573J0709503j2253418l8678553p411394M4897402M0648112p663651
$$ -51309573 -40600070 -52853488 -91532041 -98943435 -54046033 -13397921 -21061572
9530b1061572k2230121J0507622L1124597J4560720m658305j0451563k2865875
$$ -21061572 -43291693 -32784071 -1659474 12901246 8242941 -2208622 -25074497
9523b5074497l4899964j3178727K8471288L3063169o150147k8305409j616330
$$ -25074497 -59974461 -73153188 -44681900 -11618731 -17768878 -46074287 -47690617
9516d7690617L0380490K5474942L060362m065578k782127q609392q152220J0054524
$$ -47690617 -17310127 8164815 11225177 7159599 4377472 -4231920 -12384140 -2329616
9508b329616K4026735J2317329r709599j6503771r416329l529109k206760m038794
$$ -2329616 21697119 34014448 24304849 7801078 -1615251 -5144360 -7351120 -11389914
9500a1389914r983833q798171J5567534M8144888M7933853N605166l7526122m5870557
$$ -11389914 -21373747 -30171918 -14604384 33540504 81474357 87079523 49553401 3682844
9492C682844k9505624r473480J5902386M3682744M6228255J4389574j2787462
$$ 3682844 -25822780 -35296260 -19393874 24288870 70517125 84906699 72119237
9485G2119237r44955K4029928J4329280k6831532n2911937m1996855j7148535
$$ 72119237 71174282 95204210 109533490 82701958 29790021 -12206834 -29355369
9478b9355369m162868l717411o222255p857463q638349j0267063j4358023j4023685
$$ -29355369 -33518237 -37235648 -43457903 -51315366 -59953715 -70220778 -84578801 -98602486
9470i8602486K239532K8724055M0270510K4176780k204616j7387990j9609153
$$ -98602486 -96362954 -67638899 -27368389 -3191609 -5396225 -22784215 -42393368
9463d2393368j3255161L587323K2338248K1699050J788258p061269Q483865J8867927
$$ -42393368 -55648529 -52061206 -29722958 -8023908 -6235650 -13296919 -4813054 14054873
9455A4054873k655k3759859j9527019q70465j770831j6812592j1656894J8287150
$$ 14054873 14052218 -9707641 -29234660 -30105125 -31875956 -48688548 -60345442 -42058292
9447d2058292M0498013L2154230K877178k3310719k4778453N088740L9043081
$$ -42058292 -1560279 30593951 33471129 10160410 -14618043 -9529303 29513778
9440B9513778L2197273j5692435m3889157j2469559L3541160K9968890r452149
$$ 29513778 61711051 46018616 2129459 -10340100 23201060 53169950 43717801
9433D3717801k3156703l370860M044858j2309760j7856673o529033r247702k0722160
$$ 43717801 20561098 17190238 21235096 8925336 -8931337 -15460370 -24708072 -45430232
9425d5430232K712276N3313564N9423290l938668o3864816n2178187K580712L3056503
$$ -45430232 -42717956 10595608 70018898 66080230 2215414 -49962773 -47382061 -14325558
9417a4325558K7508114J3703680l605324l0184589m2070693j5721167K4079777
$$ -14325558 13182556 26886236 23280912 -6903677 -48974370 -64695537 -40615760
9410d0615760L5485394J9131823M041047l526896j4018284j9175047p065851N912165
$$ -40615760 -5130366 14001457 18042504 14515608 497324 -18677723 -25743574 -19831409
9402a9831409N2999r574454j338943Q687604l485049j7835970r06771K9043877
$$ -19831409 -19778410 -29352864 -30691807 -22004203 -25489252 -43325222 -44231993 -15188116
9394a5188116K5243247q850437k3003473r6558K4836868K7654062K0694008R866816
$$ -15188116 10055131 1204694 -21798779 -21895337 2941531 30595593 51289601 61156417
9386F1156417j5928558m1476669l0204102R228891J9335600j7460894m3535268
$$ 61156417 45227859 3751190 -26452912 -17224021 2111579 -15349315 -58884583
9379e8884583j5061174K7178363K3846082r574872j3685394J7425816L1259535
$$ -58884583 -73945757 -46767394 -22921312 -32496184 -46181578 -28755762 2503773
9372B503773K188792l2628018l0118807N864000M0284692M7370930K4897752j0497322
$$ 2503773 4692565 -27935453 -58054260 -52190260 -11905568 35465362 60363114 49865792
9364D9865792l2491294k4976874q65775R198878q358875l4271662l8206482j0986536
$$ 49865792 17374498 -7602376 -8468151 730727 -7628148 -41899810 -80106292 -91092828
9356i1092828K6383306M4068098L4423464J8391962J4987141J3182006p646469
$$ -91092828 -64709522 -20641424 13782040 32174002 47161143 60343149 52696680
9349E2696680l5818571l6432342o299033J5865295Q581356j085603R588256J4506051
$$ 52696680 16878109 -19554233 -25853266 -9987971 -1406615 -2492218 7096038 21602089
9341B1602089j2495273l8599614j6824890L0890716L8399750k684660l1127319
$$ 21602089 9106816 -29492798 -46317688 -15426972 22972778 20288118 -10839201
9334a0839201j3842155J0328086O079533l329535O470924O377032l0551016o3158754
$$ -10839201 -24681356 -14353270 -8273737 -11603272 -5132348 1244684 -29306332 -92465086
9326i2465086l5317254L0928477N9850459K8794670j0440225j5536314K1520J2624716
$$ -92465086 -127782340 -96853863 -37003404 -8208734 -18648959 -34185273 -34163753 -21539037
9318b1539037K3665687K9546257P252659m0439146o5059618l2050356K7504001
$$ -21539037 2126650 31672907 38925566 -1513580 -66573198 -98623554 -71119553
9311g1119553N6643438M2122847J4067357m834196j6837350k6204085k8600415
$$ -71119553 -14476115 27646732 41714089 36879893 20042543 -6161542 -34761957
9304c4761957k1438743o372114J3351072K6058710J6077522j0058219j9644983
$$ -34761957 -56200700 -62572814 -49221742 -23163032 -7085510 -17143729 -36788712
9297c6788712M259840L5085271L9383684K1581426N264725q970020l1554213m7119723
$$ -36788712 -32528872 2556399 41940083 63521509 68786234 59816214 28262001 -18857722
9289a8857722l1831590J654901J9120517J8632662K4329983L0250643L916559
$$ -18857722 -50689312 -49034411 -29913894 -11281232 13048751 43299394 47215953
9282D7215953m6455045o4230779k5516653K1194345K5698672L513394k027771
$$ 47215953 760908 -63469871 -88986524 -67792179 -42093507 -38580113 -40607884
9275d0607884J1552951J5628095L121596q377790j0148843o679582m79781K388049
$$ -40607884 -29054933 -13426838 -10305242 -18683032 -28831875 -35511457 -35991238 -33603189
9267c3603189r495373k6198132j4871843K6891943M9151266K0208728j4898064
$$ -33603189 -43098562 -69296694 -84168537 -57276594 -8125328 12083400 -2814664
9260b814664M14469L9251731K9489914k7075712n1641784j1518542L0710583J8185704
$$ -2814664 -2400195 36851536 66341450 39265738 -12376046 -23894588 6815995 25001699
9252B5001699j8731928k4634317o456454m046273j3466429j232964K6044144K7191373
$$ 25001699 6269771 -18364546 -24821000 -28867273 -42333702 -43566666 -17522522 9668851
9244I668851k457478j9789342j721019K1980754K0451931P437537R601058J8357974
$$ 9668851 7211373 -12577969 -14298988 7681766 28133697 35571234 45172292 63530266
9236F3530266P315051j7263119k1062128K070086J3926529j1148666m0667490
$$ 63530266 70845317 53582198 32520070 34590156 48516685 37368019 -3299471
9229c299471k5767575K4689923M8913836J4247521m0652453o0208899l7225936
$$ -3299471 -29067046 -4377123 44536713 58784234 18131781 -42077118 -79303054
9222g9303054j234305K9552433N1186952M9821702J6010596k4628763l4426171
$$ -79303054 -80537359 -50984926 202026 50023728 66034324 41405561 6979390
9215F979390j5921557m399890r025165l062007K0926870L0849163Q134107j8562922
$$ 6979390 -8942167 -13342057 -22367222 -25429229 -4502359 26346804 34480911 15917989
9207A5917989j8348254m366212n313620j5886563q511692K0100621M3421619L9761987
$$ 15917989 -2430265 -6796477 -12110097 -27996660 -36508352 -16407731 27013888 66775875
9199F6775875J2811676j6290556k5577615j1211423L558749m708417k0792808
$$ 66775875 79587551 63296995 37719380 26507957 30066706 25358289 4565481
9192D565481p797473K9635368L9696170J528796l5440912k5072891N522264Q032675
$$ 4565481 -3231992 26403376 66099546 67628342 32187430 7114539 12636803 20669478
9184B0669478l552713J3972765M2241060K1272325m3782844p4937541l7023120
$$ 20669478 17116765 31089530 73330590 94602915 50820071 -24117470 -61140590
9177f1140590J0889259J0803671j1297379k722069K7091991L1190401O517032
$$ -61140590 -50251331 -39447660 -50745039 -53467108 -26375117 4815284 11332316
9170A1332316o494956Q746541K7979007L1601969K5132529J4497142k434829j6958882
$$ 11332316 4837360 13583901 41562908 73164877 98297406 112794548 110359719 93400837
9162I3400837j4770221m902356j3709918m2756727n9940162m2734496o809174
$$ 93400837 78630616 73728260 60018342 17261615 -42678547 -85413043 -92222217
9155i2222217J9361463K6731356K0408604L825568j4730256j7585573l64948J3282575
$$ -92222217 -72860754 -46129398 -25720794 -21895226 -36625482 -54211055 -54576003 -41293428
9147d1293428J650819j9089646j4470715J4489923K5424189o712685m8213872
$$ -41293428 -39642609 -58732255 -73202970 -58713047 -33288858 -40001543 -88215415
9140h8215415m5418646N459103N1316793M7406060R639371j0724338O974252L1295814
$$ -88215415 -133634061 -128174958 -76858165 -29452105 -19812734 -30537072 -23562820 7732994
9132G732994K4897808n363079j9673478m21720K4067152J9128708q213055j9033554
$$ 7732994 32630802 27267723 7594245 7172525 31239677 50368385 42155330 23121776
9124B3121776M207100L4531369L6515482R390459j7858819k4883523j9716200
$$ 23121776 27328876 61860245 98375727 107766186 89907367 65023844 45307644
9117D5307644k2293070l7731721m7802871k8828095J7346294N3616419M3996083
$$ 45307644 23014574 -14717147 -62520018 -91348113 -74001819 -20385400 23610683
9110B3610683J649471k1029051j63246K7199669J8497059j2523857k2199437n326903
$$ 23610683 25260154 4231103 4067857 31267526 49764585 37240728 15041291 9714388
9102I714388N621214K37853J479350J5504038J7951674P90458j2490524j3025918
$$ 9714388 15335602 15573455 17052805 32556843 50508517 51298975 38808451 25782533
9094B5782533k1539293l8354044k9419430R088071K5497100o408687l2872567
$$ 25782533 4243240 -34110804 -63530234 -54442163 -28945063 -35353750 -68226317
9087f8226317k464707M3430574L3814714j3334723k1402086J3231309J5731970
$$ -68226317 -70691024 -27260450 6554264 -6780459 -28182545 -14951236 780734
9080G80734l4140196o0642459j7072727L4513365K2988949k1712087k5602779
$$ 780734 -33359462 -94001921 -111074648 -76561283 -53572334 -75284421 -100887200
9073a00887200J1993332L2097644J7212055M476763R641044Q081215m947316J385986
$$ -100887200 -88893868 -56796224 -39584169 -35107406 -25466362 -17385147 -22332463 -20946477
9065b0946477L2363649M4663428J1619662k9563913k9258785L895720J9808775
$$ -20946477 11417172 56080600 67700262 38136349 8877564 12773284 32582059
9058C2582059o97945k6574326k7707328j2621499m274384l568489J693044O312146
$$ 32582059 31884114 5309788 -22397540 -35019039 -39293423 -42861912 -41168868 -34856722
9050c4856722m600342j8677345p75834M9128643P3043174K4528788n5775897p8785502
$$ -34856722 -39457064 -58134409 -58910243 -9781600 63261574 87790362 32014465 -46771037
9042d6771037k1389505M3113913M3362871m047173l4512089k5401793o066600
$$ -46771037 -68160542 -25046629 18316242 14269069 -20243020 -45644813 -51711413
9035e1711413M74137J580091O076036Q956364Q203250Q717272O590213o191088
$$ -51711413 -51237276 -49657185 -43581149 -34624785 -26421535 -17704263 -11114050 -17305138
9027a7305138j9891590j4814185N781763J5561053M442111n719294N168181K6996409
$$ -17305138 -37196728 -52010913 -46229150 -30668097 -26225986 -31945280 -26777099 219310
9019B19310L7293011K9998241J2875643q271093k6638341k8030359p109612J5460950
$$ 219310 37512321 67510562 80386205 72115112 45476771 17446412 10336800 25797750
9011B5797750J2068921j4153450k8817339j1585920J3609440J0564343j5749643
$$ 25797750 37866671 23713221 -5104118 -16690038 -3080598 7483745 -8265898
9004h265898k3618547K392356K2277866j563480l9994064l1777402K3131556N4312483
$$ -8265898 -31884445 -29492089 -7214223 -8777703 -48771767 -80549169 -57417613 -3105130
8996c105130K0347265k9136686k4817402K4946506N4213536L5208245K122089
$$ -3105130 17242135 -11894551 -36711953 -11765447 42448089 77656334 79778423
8989G9778423j4054430k2259492l4690991l8957443k5604969r618407m591360
$$ 79778423 65723993 43464501 8773510 -30183933 -55788902 -65407309 -69998669
8982f9998669j505869R751671K1692288K7285900L1865933L1468231P808333l3381324
$$ -69998669 -71504538 -61752867 -40060579 -12774679 19091254 50559485 58367818 24986494
8974B4986494m8332507j1631055L5806493L4214307j1639880l8500815j3443928
$$ 24986494 -23346013 -34977068 829425 35043732 23403852 -15096963 -28540891
8967b8540891K4997688K7271903q29725j6852799m730780J0690476O268184q293614
$$ -28540891 -3543203 23728700 22898975 6046176 1315396 12005872 18274056 9980442
8959I980442q725782R568352K6310163K0546653p065063l4677644l8131555j2367247
$$ 9980442 1254660 10823012 37133175 57679828 50614765 15937121 -22194434 -34561681
8951c4561681K0912668L0394259Q319607j5682274o510835K9206485M4592505
$$ -34561681 -13649013 16745246 25064853 9382579 2871744 32078229 76670734
8944G6670734J0187207m6201573p2696143n2829431j2745047J8547752L1112049
$$ 76670734 86857941 40656368 -32039775 -84869206 -97614253 -79066501 -47954452
8937d7954452K4882495Q388906M200612K4496255M0398538J0864916n0627745
$$ -47954452 -23071957 -14683051 -10482439 14013816 54412354 65277270 14649525
8930A4649525p6497580k9806263M5072378P8849671N4415589L851849l9867003
$$ 14649525 -61848055 -91654318 -46581940 32267731 86683320 90535169 50668166
8923E0668166n6720523l3820030J4890014M2258030J9804615j9058870k4438607
$$ 50668166 -6052357 -39872387 -24982373 17275657 37080272 18021402 -6417205
8916f417205j506358N826056j1905679k2347158j0558341N159766J5709911K8224875
$$ -6417205 -7923563 -2097507 -14003186 -36350344 -46908685 -41748919 -26039008 2185867
8908B185867K8937863m931058m7957187m1845334J3574717M6536788J9192490
$$ 2185867 31123730 26192672 -21764515 -63609849 -50035132 -3498344 15694146
8901A5694146j5203848k467851K5621866J2647988k4004440k6640041M177480
$$ 15694146 490298 -1977553 23644313 36292301 12287861 -14352180 -10174700
8894a0174700J9105125Q555897O376522J3409794n293065m1534245l8591000J4199688
$$ -10174700 8930425 17486322 23862844 37272638 31979573 -9554672 -48145672 -33945984
8886c3945984N0134686K1511141k9948549l8714777n514535K1103983J8513598
$$ -33945984 16188702 37699843 7751294 -30963483 -36478018 -15374035 3139563
8879C139563L025036o458206j627888J8418951L4959123J8062007k5423329m2224584
$$ 3139563 6164599 -293607 -1921495 16497456 51456579 69518586 44095257 1870673
8871A870673m590131M0494332L7678412Q366019J2301306M4087980L7547268k4678871
$$ 1870673 -2719458 37774874 75453286 83819305 96120611 140208591 177755859 153076988
8863A53076988p4644863n6172071l012586J6569705o208172k4878555j3092203
$$ 153076988 78432125 22260054 19247468 35817173 29609001 4730446 -8361757
8856h361757Q109370J3540834P568496N037638K321220j4598745l9968006m4110654
$$ -8361757 -252387 13288447 20856943 25894581 28215801 13617056 -26350950 -70461604
8848g0461604r553211L6545775M5363314P235575l0591090k2706276J6075694
$$ -70461604 -80014815 -43469040 1894274 9129849 -21461241 -44167517 -28091823
8841b8091823L5708577K0751790K111727K778498Q338128J5933j4677508k0004376
$$ -28091823 7616754 28368544 30480271 33258769 41596897 41612830 26935322 6930946
8833F930946j6681097j1822120l039151J1194703K0164507J4725166J386822p888844
$$ 6930946 -9750151 -21572271 -24611422 -13416719 6747788 21472954 22859776 14970932
8825A4970932q898635j847072J0440683J5228092m03787k4503847k6266767J043543
$$ 14970932 6072297 4225225 14665908 29894000 29490213 4986366 -21280401 -20236858
8817b0236858K4973290J7484132o752366j4650355M31530J8669780K3881834J3702736
$$ -20236858 4736432 22220564 15468198 817843 1249373 19919153 43800987 57503723
8809E7503723o743557k2372985j4251496J1842049K0299932o368310l2816060
$$ 57503723 50760166 28387181 14135685 25977734 46277666 39909356 7093296
8802G093296j6954139K2959112K8463211j4095402n1969355m0593121j090133
$$ 7093296 -9860843 13098269 41561480 27466078 -24503277 -65096398 -66186531
8795f6186531J8958487J1803608N223262R563548N528705j5381012l0226830j8082799
$$ -66186531 -47228044 -35424436 -30201174 -20637626 -15108921 -30489933 -60716763 -78799562
8787g8799562P309735J8318912J3820147J3953582K0213584J2497025q023152
$$ -78799562 -71489827 -53170915 -39350768 -25397186 -5183602 7313423 -709729
8780g09729r190245J7907089L0514573k934039m1710171k7715575J7341697J7072346
$$ -709729 -9899974 8007115 38521688 35587649 -6122522 -33838097 -16496400 575946
8772E75946l7679669o6496190k0391090M6453552O4946610M6328879L6234242
$$ 575946 -37103723 -103599913 -123991003 -77537451 -12590841 33738038 69972280
8765F9972280L0036676Q03383l0201814k4344438J76961k511023k1889779j0723837
$$ 69972280 100008956 100812339 70610525 46266087 46443048 43932025 22042246 11318409
8757A1318409K2640735K0613602k2983696m5960855j6403550K2076075K6762796
$$ 11318409 33959144 54572746 31589050 -14371805 -30775355 -8699280 18063516
8750A8063516J4445699J4425765J7491082N194865j2894986k1493101k4348895
$$ 18063516 32509215 46934980 64426062 69620927 56725941 35232840 10883945
8743A0883945k4421099j3272562L511100O799788J485870J1391048K7250015J2055079
$$ 10883945 -13537154 -26809716 -23298616 -16498828 -15012958 -3621910 23628105 35683184
8735C5683184k6980993l2479150J0566794L8415925M310417m6033707m4215641
$$ 35683184 8702191 -23776959 -13210165 25205760 29516177 -16517530 -60733171
8728f0733171J938101L3069335K6725701Q262022j715033l800561q31755K515139
$$ -60733171 -58795070 -25725735 999966 9261988 7546955 3746394 2914639 5429778
8720E429778j676203n422621P043926J8417373o908588m8733902l7247590L1976475
$$ 5429778 3753575 -1669046 5374880 23792253 16883665 -31850237 -69097827 -37121352
8712c7121352O5020523Q665445n3736089k5806748M8719426N6751156p479535
$$ -37121352 27899171 36564616 -17171473 -42978221 5741205 62492361 55012826
8705E5012826m7650202k2671401J2343719J6952432J2918140J3105118k631708
$$ 55012826 7362624 -15308777 -2965058 13987374 26905514 40010632 37378924
8698C7378924k5436613j5833816J9378278K5956892p519495l2644579k6212223
$$ 37378924 11942311 -3891505 15486773 41443665 33924170 1279591 -24932632
8691b4932632j6438950j3292417P397832L6029246K7909376j1713225k4017031
$$ -24932632 -41371582 -54663999 -47266167 -11236921 16672455 4959230 -19057801
8684a9057801K073443J0747972j6327192k8155602n136250N007471j2001321k018577
$$ -19057801 -16984358 -6236386 -22563578 -50719180 -55855430 -50847959 -62849280 -64867857
8676f4867857M5045024N3479051o165033m8071130j0001880L9460959K1207054
$$ -64867857 -19822833 33656218 27491185 -20579945 -30581825 8879134 30086188
8669C0086188k2493573j8518574L425595j5931153l7077538K965195N1573290
$$ 30086188 7592615 -10925959 -7500364 -23431517 -60509055 -57543860 -5970570
8662e970570J9274678m9807098l8559303L9251475N5539731j3701717m8200936
$$ -5970570 13304108 -36502990 -75062293 -35810818 19728913 6027196 -42173740
8655d2173740J0699564O6095056L2711691l3092096m3052055j0581322M534173
$$ -42173740 -31474176 34620880 67332571 34240475 -8811580 -19392902 -14858729
8648a4858729J916647J1856262K2559363Q211027j4979376j8499745q910829j453518
$$ -14858729 -12942082 -1085820 21473543 29684570 14705194 -3794551 -12705380 -14158898
8640a4158898J2259116L1529646K6245736j2298338m3469266l5370816p606757
$$ -14158898 -1899782 29629864 55875600 43577262 107996 -35262820 -42869577
8633d2869577J3437844L1458850M1947635J5611872m0681306o5019314k8124888
$$ -42869577 -29431733 2027117 43974752 59586624 18905318 -46113996 -74238884
8626g4238884J6484415J7807044L052728J2253509J9226037j1163682m0714544
$$ -74238884 -57754469 -39947425 -36894697 -24641188 -5415151 -16578833 -57293377
8619e7293377j5452388L4436211L8721272L368661n936441J9429131K1398154
$$ -57293377 -72745765 -38309554 411718 3780379 -2156062 17273069 38671223
8612C8671223j7025981m0192572j3091076K5463922K7814581l14630k6423844
$$ 38671223 21645242 -18547330 -31638406 -6174484 21640097 21325467 -5098377
8605e098377l4732206k2852720N730361K8282189J6482525k1181065m0628492
$$ -5098377 -39830583 -62683303 -56952942 -28670753 -12188228 -33369293 -73997785
8598g3997785j7796280K3558754M7369193M2325762J7442776j3567436l5713991
$$ -73997785 -91794065 -68235311 -20866118 21459644 38902420 25334984 -10379007
8591a0379007l9714992k9924972j4361065N139649K1269630J9318547M635239
$$ -10379007 -50093999 -80018971 -94380036 -89240387 -67970757 -48652210 -44016971
8584d4016971N412474K4800127K5432315n888461k1989243Q498685L6679269J1870871
$$ -44016971 -38604497 -13804370 11627945 5739484 -16249759 -7751074 28928195 40799066
8576D0799066k1567113N333832N4487031L0044247n4148374p9936677j2241976
$$ 40799066 19231953 24565785 79052816 109097063 54948689 -24987988 -37229964
8569c7229964M3589348J2550430l9567477k9480275J4719836K7783165K1222766
$$ -37229964 6359384 18909814 -20657663 -50137938 -35418102 -7634937 13587829
8562A3587829L2333902L3171269j0993185n0569437k2106966L3721910K9567618
$$ 13587829 45921731 79093000 68099815 17530378 -4576588 29145322 58712940
8555E8712940k4313187m1099067n371387J0887921j8568774l3638503k115512
$$ 58712940 34399753 -6699314 -12070701 -1182780 -19751554 -53390057 -55505569
8548e5505569K2502242m798611m7079552m9544740j6319126J6785479L5736808
$$ -55505569 -33003327 -37801938 -84881490 -134426230 -150745356 -133959877 -98223069
8541i8223069L9106316K0511269p327617j1405172J1113131K1479199K314420
$$ -98223069 -59116753 -38605484 -45933101 -57338273 -46225142 -24745943 -22431523
8534b2431523j3084425j257892J0237234l096562j4817026K941707K3856695J1546220
$$ -22431523 -35515948 -36773840 -26536606 -29633168 -44450194 -41508487 -17651792 -6105572
8526f105572j4033318q899288J9392100K4397982k763953k2448888j0550399J1556231
$$ -6105572 -20138890 -29038178 -9646078 14751904 11987951 -10460937 -21011336 -9455105
8518i455105J5960486K329068j1946512j0362239J2907684M0381824L7889952
$$ -9455105 6505381 8834449 -3112063 -13474302 -566618 39815206 77705158
8511G7705158j552331l5615554k6156051K482178M50562k6992922k9410909K348509
$$ 77705158 76152827 40537273 14381222 16863400 17313962 -9678960 -39089869 -36741360
8503c6741360K0562590K836322j1089826R113445L1691627J9925804n387821p308328
$$ -36741360 -16178770 -13342448 -24432274 -15318829 16372798 36298602 30910781 23602453
8495B3602453K510654n103899j1653251J8899483O0751329M7213405k4949772
$$ 23602453 26113107 21009208 9355957 28255440 89006769 136220174 111270402
8488A11270402p7824111n8005927k828202K6494231K5463697K1322340J2399268
$$ 111270402 33446291 -24559636 -27387838 -893607 24570090 45892430 58291698
8481E8291698j5666686m1128478k9124263P840412K2715410M180997j2633331
$$ 58291698 42625012 1496534 -27627729 -19787317 2928093 7109090 -5524241
8474e524241p694113r43949m921653R87156K6271866L8703889J0353423l2836819
$$ -5524241 -13218354 -14162303 -19083956 -18096800 8175066 46878955 57232378 24395559
8466B4395559m2331366j2192399J9383626K5169691J4979864P600744L593169
$$ 24395559 -17935807 -30128206 -10744580 14425111 29404975 37005719 40598888
8459D0598888n973114j9886794k5685576j3953019Q937797K2933806J4409946
$$ 40598888 34625774 14738980 -10946596 -24899615 -15961818 6971988 21381934
8452B1381934n760571j4216754o196690j75309q036310j8543379j7626372o190608
$$ 21381934 15621363 1404609 -4792081 -4967390 -13003700 -31547079 -49173451 -55364059
8444e5364059J0676788L0245743L7397125J0834886l7830216n9624350k8747050
$$ -55364059 -44687271 -14441528 22955597 33790483 -4039733 -63664083 -92411133
8437i2411133J7994607L2219645J9094898J4731328K1853659J4391131p266590
$$ -92411133 -74416526 -42196881 -23101983 -8370655 13483004 27874135 20607545
8430B0607545j4657460j255199J0576689J1673275J3045013J2677816r65636j4297211
$$ 20607545 5950085 4694886 15271575 26944850 39989863 52667679 51702043 37404832
8422C7404832m534428J1676543j114000k8040266j8738197K0984838K5565610
$$ 37404832 32870404 44546947 43432947 15392681 -3345516 17639322 43204932
8415D3204932j9283983l9975831P505328N7296083L3180049l2090695n1819990
$$ 43204932 23920949 -16054882 -8549554 48746529 81926578 49835883 -1984107
8408a984107j5569209J5775094J5747765J0990082R711256p061409k5047988n253613
$$ -1984107 -17553316 -1778222 13969543 24959625 34670881 27609472 2561484 -2692129
8400b692129L8225896M0892024j3700075o2527036n3933763j2866253J1837039
$$ -2692129 35533767 76425791 62725716 198680 -53735083 -66601336 -54764297
8393e4764297J3669209J0475181M691568m458384m267135N894945M165781j3137285
$$ -54764297 -41095088 -30619907 -25928339 -30386723 -34653858 -28758913 -24593132 -37730417
8385c7730417j5856385P014782J7291201j2595285m5339116l0990977J2499855
$$ -37730417 -53586802 -46572020 -29280819 -41876104 -87215220 -118206197 -105706342
8378a05706342K3898272q243286l0431188n287219L8606162N3041969L2247776
$$ -105706342 -81808070 -90051356 -120482544 -125769763 -87163601 -34121632 -1873856
8371a873856P667693J203270M705743j006661k0810471l9493762l7004646r508384
$$ -1873856 5793837 6997107 11702850 10696189 -10114282 -49608044 -86612690 -96121074
8363i6121074K4841764M2185280L4016235J2922996P28754Q509881K2854317J6971456
$$ -96121074 -71279310 -29094030 4922205 17845201 18573955 27083836 49938153 66909609
8355F6909609j5157633m3303864l5779030l017715J6013090P212270o488539o641565
$$ 66909609 51751976 8448112 -27330918 -30348633 -14335543 -7123273 -13611812 -20253377
8347b0253377n83008N045044J7004515K8958583J7957734j4148473l0881310j4778995
$$ -20253377 -20836385 -15791341 1213174 30171757 48129491 33981018 3099708 -11679287
8339a1679287N311483O084054P712289K5056337K5529807j3603026m5440295j6501271
$$ -11679287 -6367804 -283750 7428539 32484876 58014683 44411657 -1028638 -17529909
8331a7529909L8398211M0048114j0376172l3245635L26878K7446265L480596k9460463
$$ -17529909 20868302 60916416 50540244 17294609 17621487 45067752 48548348 19087885
8323A9087885k4027789m882536j1547325k4690423j0728687Q847917r17504j6593373
$$ 19087885 -4939904 -9822440 -21369765 -46060188 -56788875 -47940958 -48858462 -65451835
8315f5451835K728795L2226697J6106471l1524070m1362419j764458K4288057
$$ -65451835 -62723040 -30496343 -14389872 -45913942 -87276361 -89040819 -64752762
8308f4752762O675553o873510J9218796M6127161L0707350j864479n905310J0621276
$$ -64752762 -58077209 -64950719 -45731923 395238 31102588 29238109 23332799 33954075
8300C3954075J2489917J366589l39840j214742k0803367l8322905j8102220K5147057
$$ 33954075 46443992 47810581 47470741 46255999 25452632 -12870273 -30972493 -5825436
8292e825436M1121186J9010172m068345p961359j0253852j8581581j5306261q72076
$$ -5825436 35295750 54305922 50237577 42276218 32022366 13440785 -1865476 -2737552
8284b737552j917963j9609759j7901243J5143993L9571579K3545856r428800k1704793
$$ -2737552 -4655515 -24265274 -42166517 -27022524 12549055 36094911 26666111 4961318
8276D961318j2135154L828751K6146467M7902339L8220947j1619517n6505947
$$ 4961318 -7173836 -3345085 22801382 70703721 108924668 97305151 40799204
8269D0799204n4341799k5265200r978850j133475K8159685N4233508K9850612
$$ 40799204 -13542595 -38807795 -48786645 -49920120 -21760435 32473073 62323685
8262F2323685k8433143m9628285j1648570K7186383J6244167k2077713l8096292
$$ 62323685 33890542 -15737743 -27386313 -199930 16044237 -6033476 -44129768
8255d4129768k1755799K387822J5174548J5036184J1123836J6059031K8702805
$$ -44129768 -65885567 -63497745 -48323197 -33287013 -22163177 -6104146 22598659
8248B2598659K7201186K435900j5841134k650023J1766728j1848827m2871783
$$ 22598659 49799845 52235745 36394611 33744588 45511316 33662489 -9209294
8241i209294k0121867L6490142M1308669j7609316m9908888p860241L6695561
$$ -9209294 -29331161 7158981 48467650 30858334 -19050554 -26910795 9784766
8234I784766J6538290k1179516p616960K4104801N413307l5918842k0020739M1649569
$$ 9784766 26323056 5143540 -2473420 21631381 27044688 -8874154 -28894893 12754676
8226A2754676N7328711J047266n2697676m8126752j4890531J054594n64534k452841
$$ 12754676 70083387 71130653 18432977 -29693775 -44584306 -43529712 -44094246 -46547087
8218d6547087q22545Q831171K9428922L9907984K0866067k984259K025861J4339062
$$ -46547087 -47369632 -38538461 -9109539 30798445 51664512 48680253 50706114 65045176
8210F5045176p679494m1328125k9786582J1044235Q524987l7861199m4151348
$$ 65045176 57365682 16037557 -13749025 -2704790 5820197 -32041002 -76192350
$$ [...]
##END NTUPLES=NMR SPECTRUM
##END=
