##TITLE=31Pdec_LR-738-B-CR11
 , 124 sc
 17.11.2021
##JCAMPDX= 6.0         $$ Bruker NMR JCAMP-DX V2.0
##DATA TYPE= NMR SPECTRUM
##DATA CLASS= NTUPLES
##ORIGIN= UXNMR, Bruker Analytische Messtechnik GmbH
##OWNER= root
$$ XWIN-NMR		Version 3.5
$$ Wed Nov 17 13:20:19 2021 Russian Standard Time (UT+4h)  she@DPX200
##.OBSERVE FREQUENCY= 81.013821
##.OBSERVE NUCLEUS= ^31P
##.ACQUISITION MODE= SIMULTANEOUS
##.ACQUISITION SCHEME= undefined
##.AVERAGES= 124
##.DIGITISER RES= 16
##SPECTROMETER/DATA SYSTEM= spect
##.PULSE SEQUENCE= zgpg30
##.SOLVENT NAME= CDCl3
##.SHIFT REFERENCE= (INTERNAL, CDCl3, 0, 248.564)
##AUDIT TRAIL= $$ (NUMBER, WHEN, WHO, WHERE, WHAT)
$$ ##TITLE= Audit trail, XWIN-NMR		Version 3.5
$$ ##JCAMPDX= 5.01
$$ ##ORIGIN= Bruker BioSpin GmbH
$$ ##OWNER= she
$$ F:/spectra/data/she/nmr/P31/1/pdata/1/auditp.txt
$$ ##AUDIT TRAIL=  $$ (NUMBER, WHEN, WHO, WHERE, WHAT)
(   1,<2021-11-17 13:19:24.07 +0400>,<she>,<DPX200>,
      <continue with go, POWCHK disabled, PULCHK disabled
       configuration hash MD5:
       00 E9 B6 7A A2 85 ED C7 34 08 36 98 17 FE 4E 26
       data hash MD5: 32K
       98 FA 8F 44 F8 8F 1F 25 34 7E FF DC D2 9E 9C 31>)
(   2,<2021-11-17 13:19:26.51 +0400>,<she>,<DPX200>,
      <Start of raw data processing
       efp BC_mod = 2 LB = 1 FT_mod = 6 PKNL = 1 PHC0 = -9184.02 PHC1 = 96.2695 SI = 64K 
       data hash MD5: 64K
       C1 35 0A 45 11 36 72 60 CF AC BF C1 34 D5 47 35>)
(   3,<2021-11-17 13:19:42.40 +0400>,<she>,<DPX200>,
      <pk PHC0 = -7.063463 PHC1 = 8.799999 
       data hash MD5: 64K
       3D E9 8D 84 B0 11 19 4B 2A 0B 75 74 D6 F1 15 70>)
(   4,<2021-11-17 13:19:48.45 +0400>,<she>,<DPX200>,
      <abs ABSG = 5 
       data hash MD5: 64K
       DE 24 77 03 ED BC 8F 1E EE 12 FE F4 17 D3 25 43>)
$$ ##END=
$$ 
$$ hash MD5
$$ 38 C2 57 5B 9C E9 A5 06 E0 FF 3F 39 88 7A 4D 15
##$RELAX= 
##$RELAX= 
##$RELAX= 
##$RELAX= 
##$RELAX= 
##$RELAX= 
##$RELAX= 
##$RELAX= 
$$ Bruker specific parameters
$$ --------------------------
##$DU= <F:/spectra>
##$EXPNO= 1
##$NAME= <P31>
##$PROCNO= 1
##$TYPE= <nmr>
##$USER= <she>
##$AMP= (0..31)
100 100 100 100 100 100 100 100 100 100 100 100 100 100 100 100 100 100 
100 100 100 100 100 100 100 100 100 100 100 100 100 100 
##$AQSEQ= 0
##$AQ_mod= 1
##$AUNM= <au_zg>
##$AUTOPOS= <>
##$BF1= 81.014009
##$BF2= 200.13
##$BF3= 200.13
##$BF4= 200.13
##$BF5= 200.13
##$BF6= 200.13
##$BF7= 200.13
##$BF8= 200.13
##$BYTORDA= 1
##$CFDGTYP= 0
##$CFRGTYP= 5
##$CHEMSTR= <none>
##$CNST= (0..31)
1 1 145 1 1 1 1 1 1 1 1 1 1 1 1 1 1 1 1 1 1 1 1 1 1 1 1 1 1 1 1 1 
##$CPDPRG= <waltz16>
##$CPDPRG1= <>
##$CPDPRG2= <waltz16>
##$CPDPRG3= <>
##$CPDPRG4= <mlev>
##$CPDPRG5= <mlev>
##$CPDPRG6= <mlev>
##$CPDPRG7= <mlev>
##$CPDPRG8= <mlev>
##$CPDPRGB= <>
##$CPDPRGT= <>
##$D= (0..31)
0 1 0 0 0 0 0 0 0 0 0 0.03 2e-05 3e-06 0 0 0 0 0 0 0 0 0 0 0 0 0 0 0 0 
0 0 
##$DATE= 1637140603
##$DBL= (0..7)
120 120 120 11 120 120 24 19 
##$DBP= (0..7)
150 150 150 150 150 150 150 150 
##$DBP07= 0
##$DBPNAM0= <>
##$DBPNAM1= <>
$$ [...]
##$SUBNAM3= <"">
##$SUBNAM4= <"">
##$SUBNAM5= <"">
##$SUBNAM6= <"">
##$SUBNAM7= <"">
##$SUBNAM8= <"">
##$SUBNAM9= <"">
##$SW= 501.771253377433
##$SWIBOX= (0..15)
0 1 3 0 0 0 0 0 0 0 0 0 0 0 0 0 
##$SW_h= 40650.406504065
##$TD= 32768
##$TD0= 1
##$TE= 0
##$TE2= 300
##$TE3= 300
##$TEG= 300
##$TL= (0..7)
0 120 53 12 22 120 120 120 
##$TP= (0..7)
150 150 150 150 150 150 150 150 
##$TP07= 0
##$TPNAME0= <>
##$TPNAME1= <>
##$TPNAME2= <>
##$TPNAME3= <>
##$TPNAME4= <>
##$TPNAME5= <>
##$TPNAME6= <>
##$TPNAME7= <>
##$TPOAL= (0..7)
0.5 0.5 0.5 0.5 0.5 0.5 0.5 0.5 
##$TPOFFS= (0..7)
0 0 0 0 0 0 0 0 
##$TUNHIN= 0
##$TUNHOUT= 0
##$TUNXOUT= 0
##$USERA1= <user>
##$USERA2= <user>
##$USERA3= <user>
##$USERA4= <user>
##$USERA5= <user>
##$V9= 5
##$VALIST= <valist>
##$VCLIST= <CCCCCCCCCCCCCCC>
##$VD= 0
##$VDLIST= <DDDDDDDDDDDDDDD>
##$VPLIST= <PPPPPPPPPPPPPPP>
##$VTLIST= <TTTTTTTTTTTTTTT>
##$WBST= 1024
##$WBSW= 4
##$XGAIN= (0..3)
0 0 0 0 
##$XL= 0
##$YL= 0
##$YMAX_a= 3180
##$YMIN_a= -4194
##$ZGOPTNS= <>
##$ZL1= 120
##$ZL2= 120
##$ZL3= 120
##$ZL4= 120
##$ABSF1= 248.5645
##$ABSF2= -253.2056
##$ABSG= 5
##$ABSL= 3
##$ALPHA= 0
##$AQORDER= 0
##$ASSFAC= 0
##$ASSFACI= 0
##$ASSFACX= 0
##$ASSWID= 0
##$AUNMP= <proc_1d>
##$AZFE= 0.1
##$AZFW= 0.5
##$BCFW= 0
##$BC_mod= 2
##$BYTORDP= 0
##$COROFFS= 0
##$CY= -3
##$DATMOD= 1
##$DC= 0
##$DFILT= <>
##$DTYPP= 0
##$F1P= 0
##$F2P= 0
##$FCOR= 1
##$FTSIZE= 65536
##$FT_mod= 6
##$GAMMA= 0
##$GB= 0
##$INTBC= 1
##$INTSCL= 5.30512e-09
##$ISEN= 30
##$LB= 1
##$LEV0= 0
##$LPBIN= 0
##$MAXI= 10000
##$MC2= 0
##$MEAN= 0
##$ME_mod= 0
##$MI= 50
##$NCOEF= 0
##$NC_proc= -8
##$NLEV= 6
##$NOISF1= 182.463
##$NOISF2= 159.3651
##$NSP= 0
##$NTH_PI= 0
##$NZP= 0
##$OFFSET= 248.5645
##$PC= 4
##$PHC0= -9191.083
##$PHC1= 105.0695
##$PH_mod= 1
##$PKNL= yes
##$PPARMOD= 0
##$PSCAL= 0
##$PSIGN= 0
##$REVERSE= no
##$SF= 81.014009
##$SI= 65536
##$SIGF1= 159.3651
##$SIGF2= -187.1042
##$SINO= 113.3802
##$SIOLD= 16384
##$SREGLST= <1H.CDCl3>
##$SSB= 0
##$STSI= 65536
##$STSR= 0
##$SW_p= 40650.406504065
##$SYMM= 0
##$S_DEV= 0
##$TDeff= 32768
##$TDoff= 0
##$TI= <>
##$TILT= no
##$TM1= 0
##$TM2= 0
##$TOPLEV= 0
##$USERP1= <user>
##$USERP2= <user>
##$USERP3= <user>
##$USERP4= <user>
##$USERP5= <user>
##$WDW= 1
##$XDIM= 65536
##$YMAX_p= 410141444
##$YMIN_p= -47763763
$$ End of Bruker specific parameters
$$ ---------------------------------
##NTUPLES= NMR SPECTRUM
##VAR_NAME=  FREQUENCY,     SPECTRUM/REAL,   SPECTRUM/IMAG
##SYMBOL=    X,             R,               I
##VAR_TYPE=  INDEPENDENT,   DEPENDENT,       DEPENDENT
##VAR_FORM=  AFFN,          ASDF,            ASDF
##VAR_DIM=   65536,         65536,           65536
##UNITS=     HZ,            ARBITRARY UNITS, ARBITRARY UNITS
##FACTOR=    0.620285442955139, 1,           1
##FIRST=     20137.2065510759, 0,            0
##LAST=      -20513.1999529892, 0,           0
##MIN=       -20513.1999529892, -47763763,   0
##MAX=       20137.2065510759, 410141444,    0
$$ Real data points
##PAGE= N=1
##DATA TABLE= (X++(R..R)), XYDATA
$$ [...]
38439g209110l759648o610934n206843M74234O665553P668076K756984j656316
$$ -7209110 -10968758 -17579692 -22786535 -22312301 -15646748 -7978672 -5221688 -6878004
38431f878004o43303K236982J347054j940149k707471q06944J500912N802349
$$ -6878004 -7521307 -5284325 -3937271 -5877420 -8584891 -9391835 -7890923 -2088574
38423b088574J2499395J3704051K704446j1516704j2332655J042456J1185100
$$ -2088574 10410821 24114872 26819318 15302614 2969959 4012415 15197515
38416A5197515O794167l445161p003469n347702o760950j0677105r953901l660718
$$ 15197515 21991682 18546521 11543052 6195350 -565600 -11242705 -21196606 -24857324
38408b4857324K164118M232527M805809N794406N921520L805401N34256p99705
$$ -24857324 -22693206 -18460679 -13654870 -7860464 -1938944 1866457 2400713 1601008
38400A601008K307031P607761P740395r85245j0486190r192564J282354P169593
$$ 1601008 3908039 11515800 19256195 18270950 7784760 -1407804 -125450 7044143
38392G044143K313683l873850k750670P40214o02056k515658K351623R871868
$$ 7044143 9357826 5483976 2733306 3473520 2871464 355806 2707429 12579297
38384A2579297R948270K087422n183016p245334o125544l313836O14393J644443
$$ 12579297 22527567 24614989 19431973 12186639 6061095 2747259 3361652 5006095
38376E006095l011431p700921m806698L074934O271369K106674k901127l894137
$$ 5006095 1994664 -5706257 -10512955 -7438021 -1166652 940022 -1961105 -5855242
38368e855242j981874J508791O209891Q554658N316715J031199K735543P514409
$$ -5855242 -7837116 -6328325 -118434 8436224 13752939 14784138 17519681 25034090
38360B5034090N445937m271742j1102092r405591n655131n286042l657756L045853
$$ 25034090 30480027 26208285 15106193 5700602 45471 -5240571 -8898327 -5852474
38352e852474P936959L719342m471589o688006l560730l204033n567765k003849
$$ -5852474 2084485 5803827 1332238 -5355768 -8916498 -12120531 -17688296 -19692145
38344a9692145Q307339J3193441M775784o633573n351890O868326J1860117L76951
$$ -19692145 -11384806 1808635 6584419 -49154 -5401044 1467282 13327399 13704350
38336A3704350j3970013j2962596J311974J0426484N694978k223816k086857K053886
$$ 13704350 -265663 -13228259 -11916285 -1489801 4205177 1981361 -105496 1948390
38328A948390J306995j715523J218743P135264M500662p330245j3941173n621719
$$ 1948390 3255385 1539862 2758605 9893869 14394531 7064286 -6876887 -12498606
38320a2498606Q265409J1771739L251027m488787k707155L003760L108354j788004
$$ -12498606 -4233197 7538542 10789569 6300782 3593627 6597387 9705741 7917737
38312G917737l242652J199914M188224N40542m211900k987603Q47462n98519n179552
$$ 7917737 4675085 5874999 10063223 10603765 6391865 3404262 4251724 3653205 -1526347
38303a526347l102823O241057J1611651O945611l16562k738195l516969o773571
$$ -1526347 -4629170 1611887 13223538 20169149 19852587 17114392 13597423 6823852
38295F823852q009223l391277P68312j738114n167192j295454O150656Q190997
$$ 6823852 -1185371 -4576648 -3808336 -5546450 -10713642 -12009096 -5858440 2332557
38287B332557N621242N006987M994974m2388o647695o366333p96958Q06151k736949
$$ 2332557 7953799 12960786 17955760 17913372 11265677 4899344 4102386 4908537 2171588
38278B171588m327366k630187k852491m410270j574004L859768M359495R68913
$$ 2171588 -2155778 -4785965 -7638456 -12048726 -13622730 -9762962 -5403467 -4434554
38270d434554J482591M450022Q59755p240138p139192K445529P522428K233661
$$ -4434554 -2951963 1498059 2357814 -4882324 -12021516 -9575987 -2053559 180102
38262A80102j916335K356744N289112q54622o556860j882456N572398L956823
$$ 180102 -1736233 620511 5909623 5055001 -1501859 -3384315 2188083 6144906
38254F144906k884240l420817K203031M814635J809417k210832m962489o212584
$$ 6144906 3260666 -160151 2042880 6857515 8666932 6456100 1493611 -4718973
38246d718973l756023J179311J385240m740574p464326q66040O213709N265476
$$ -4718973 -8474996 -7295685 -5910445 -10651019 -18115345 -18981385 -12767676 -7502200
38238g502200K998047P397038J0056112j09211j4228759j4296580j267475P594492
$$ -7502200 -4504153 2892885 12948997 12839786 -1388973 -15685553 -16953028 -9358536
38230i358536O148056L744480L646259j245260r114978p179099N481068J2556072
$$ -9358536 -3210480 534000 4180259 2934999 -6179979 -13359078 -7878010 4678062
38222D678062N635443l057001j996677K361030N64603k807101j54152L669734
$$ 4678062 10313505 7256504 5259827 7620857 8185460 5378359 5224207 8893941
38214H893941Q80739m184192l498712n64650k983637o582231j957882P525240
$$ 8893941 9774680 5590488 2091776 1527126 -1456511 -8038742 -9996624 -2471384
38206b471384R362407J654927m903706m582490k837967l772796l982473j728129
$$ -2471384 6891023 8545950 3642244 -940246 -3778213 -7551009 -11533482 -13261611
38198a3261611r16293k269959q26917L748320M428703p69108l602413J037671
$$ -13261611 -14177904 -16447863 -17274780 -13526460 -9097757 -9866865 -13469278 -12431607
38190a2431607O188516M878621K001932M502418P654651K872583o555252j0328993
$$ -12431607 -6243091 -1364470 637462 5139880 12794531 15667114 9111862 -1217131
38182a217131p847468o460161n584575J886721J2232895J2270101K192448p11464
$$ -1217131 -9064599 -15524760 -21109335 -19222614 -6989719 5280382 7472830 6761366
38174F761366J0198567J6595499K506660j8184712j9975138k770105R389907L453654
$$ 6761366 16959933 33555432 36062092 17877380 -2097758 -4867863 4522044 7975698
38166G975698q169834r694526j597054O174880P294901Q89079q793687j1577435
$$ 7975698 -194136 -9888662 -11485716 -5310836 1984065 2873144 -5920543 -17497978
38158a7497978j016699J3252886J4731201L232439m966178k513990j70769n450690
$$ -17497978 -18514677 -5261791 9469410 12701849 7735671 5221681 5050912 -399778
38150c99778r770704n857985r49530j049294J511582J0730488J3446988R30009
$$ -399778 -10170482 -16028467 -16977997 -18027291 -16515709 -5785221 7661767 8591776
38142H591776j0775630l472693J2115664J2163380j967887q099819j353672J117136
$$ 8591776 -2183854 -5656547 6459117 18622497 16654610 8554791 7201119 8318255
38134H318255n790191o231625M626900Q577214l221621j1932621k424536R589314
$$ 8318255 2528064 -3703561 923339 9500553 6278932 -5653689 -8078225 1511089
38126A511089L346214j1676694j0954265N842536J5959572Q782365l264453p997148
$$ 1511089 4857303 -6819391 -17773656 -11931120 4028452 12810817 9546364 1549216
38118A549216o836543l231404L598263R462003O005395m200111p582032l9456
$$ 1549216 -5287327 -8518731 -4920468 4541535 10546930 6346819 -1235213 -1274669
38110a274669N909523J028348o326446m522252L452164O815005L921561J468586
$$ -1274669 4634854 5663202 -663244 -5185496 -1733332 5081673 9003234 10471820
38102A0471820J562605k5502m528259p515118n477425L65070O202210P926665
$$ 10471820 12034425 12008923 7480664 -34454 -5511879 -5146809 1055401 8982066
38094H982066L458427l779049o856970m227629k154504m239981m815527O34088
$$ 8982066 12440493 8661444 1804474 -2423155 -4577659 -8817640 -13633167 -12999079
38086a2999079N161443M84115p497765n814467M916738J0537990N052397j612146
$$ -12999079 -7837636 -7353521 -14851286 -20665753 -15749015 -5211025 -158628 -1770774
38078a770774j443814j58253l876405o469500p36584P376532P803883K757885
$$ -1770774 -3214588 -3372841 -7249246 -13718746 -14455330 -7078798 725085 3482970
38070C482970J545123L909539J933376m020832n154758k20889J634361l466154
$$ 3482970 5028093 8937632 10871008 6850176 1695418 1474529 3108890 -357264
38062c57264p740969n045081M71004L887100O934552R609638N226220p011346
$$ -357264 -8098233 -13143314 -12672310 -8785210 -1850658 7758980 12985200 5973854
38054E973854j3919974m835063J0223662J2537779J625788m856444R14281N004866
$$ 5973854 -7946120 -12781183 -2557521 9980258 11606046 6749602 7663883 12668749
38046A2668749m928008j7832074j4264874L808663J4231184N899825o503900n627589
$$ 12668749 7740741 -10091333 -24356207 -20547544 -6316360 -416535 -6920435 -12548024
38038a2548024L397262L348372o912824j0706134R9905J2423128J1489434Q30852
$$ -12548024 -9150762 -5802390 -12715214 -23421348 -23321443 -10898315 591119 1421971
38030A421971n956689m362332Q3991L262178M365945J233671n817268r381875
$$ 1421971 -4534718 -8897050 -8813059 -5550881 -1184936 48735 -5768533 -15150408
38022a5150408m366916K084410R66782l041192K69877P235262N723607j857845
$$ -15150408 -19517324 -17432914 -16466132 -19507324 -19237447 -12002185 -6278578 -8136423
38014h136423k96126J1490224J5624898L981663q027402o629158j56197q86347
$$ -8136423 -8432549 3057675 18682573 22664236 14636834 8007676 7851479 6965132
38006F965132l447595J677747P352524K202215o720027m604370M916185N566099
$$ 6965132 3517537 5195284 12547808 14750023 8029996 3425626 8341811 13907910
37998A3907910l808869q848239n491579m186241o680378r95794J4194604K0910689
$$ 13907910 10099041 1250802 -4240777 -8427018 -15107396 -16103190 -1908586 19002103
37990A9002103Q238598r374006j2833303m402149M69637k617981n356964l399746
$$ 19002103 27240701 17866695 5033392 631243 1100880 -1517101 -6874065 -10273811
37982a0273811q29472M598J496939L377353J617642l633896o320299l291258N69289
$$ -10273811 -11103283 -11098685 -9601746 -6224393 -4606751 -8240647 -14560946 -17852204 -17282915
37973a7282915m41429l945162k408144N511326J1340501P650226p52466k569578
$$ -17282915 -17724344 -21669506 -24077650 -18566324 -7225823 424403 -328063 -2897641
37965b897641L838633Q252863M856863J012978L398360N156638k018134j0550624
$$ -2897641 940992 9193855 14050718 15063696 18462056 23618694 21600560 11049936
37957A1049936o610962O440475J0653941K61084j0216535q643669j117854J433857
$$ 11049936 4438974 10879449 21533390 21794474 11577939 2934270 1816416 3250273
37949C250273q23494k553488l745371m985501j921440N995527R963285M825055
$$ 3250273 2426779 -126709 -3872080 -8857581 -10779021 -4783494 5179791 10004846
37941A0004846q10200J839995O253762J508130q150362r635078l053812j245939
$$ 10004846 9194646 11034641 17288403 18796533 10646171 1011093 -2042719 -3288658
37933c288658p424872r337225J71345J0719331R949334J279093k672184K112621
$$ -3288658 -10713530 -20050755 -19879410 -9160079 789255 2068348 -603836 1508785
37925A508785Q375563R203916M739413j580580p290295j0569446r759152n178310
$$ 1508785 9884348 19088264 23827677 22247097 14956802 4387356 -5371796 -10550106
37917a0550106P1251K623911K277623K172740M656270P443793O023944K77041
$$ -10550106 -10478855 -7854944 -5577321 -3404581 1251689 8695482 14719426 14996467
37909A4996467m346363l924301j077491k78978j709422l495508o142587r230806
$$ 14996467 10650104 6725803 5648312 5369334 3659912 164404 -5978183 -15208989
37901a5208989p344046K878217J3488193J2319775M0929r215436o896523m02117
$$ -15208989 -22553035 -19674818 -6186625 6133150 6174079 -3041357 -9937880 -10339997
37893a0339997J59564l653682m743664l002116k151865K5182P117662J3320013
$$ -10339997 -10180433 -13834115 -18577779 -21579895 -23731760 -23706578 -16588916 -3268903
37885c268903R549599o40485m087915J546254L749805l830949r795452l176589
$$ -3268903 6280696 5640211 1552296 3098550 6848355 3017406 -6778046 -9954635
37877i954635Q195954R649379J952915k159970R35101K713723q26163l701681
$$ -9954635 -1758681 7890698 9843613 7683643 8618744 11332467 10506304 6804623
37869F804623k604457j942353l220882j739943K041291L23345p166794q900540
$$ 6804623 4200166 2257813 -963069 -2703012 -661721 -338376 -7505170 -16405710
37861a6405710k47316O201245K99981p243409j242670J1841267J2562337m82064
$$ -16405710 -16653026 -10451781 -10151800 -17395209 -18637879 -6796612 5765725 5283661
37853E283661p994833j73314R137906N288476o115921j1373485r325424o781108
$$ 5283661 -2711172 -2884486 6253420 11541896 5425975 -5947510 -15272934 -22054042
37845b2054042k245386J0025535K2952002J9937018j162527k0233467j8779407
$$ -22054042 -24299428 -14273893 8678109 28615127 27452600 7219133 -11560274
37838a1560274k990522O696732L639374J21436M752267Q771182K156443p673412
$$ -11560274 -14550796 -7854064 -4214690 -4093254 659013 9430195 11586638 3913226
37830C913226o145874M964751R344190J100174p460371o936540m448666p688012
$$ 3913226 -2232648 2732103 12076293 13176467 5716096 -1220444 -5669110 -13357122
37822a3357122r229634J40497J2555821J3042639K536836m551469k585439Q48887
$$ -13357122 -22586756 -22446259 -9890438 3152201 5689037 1137568 -1447871 -598984
37814e98984J382294K860967M765675N54460p519310p162841L857419J0375788
$$ -598984 783310 3644277 8409952 8964412 1445102 -5717739 -1860320 8515468
37806H515468J696059j1201201j1667992j343560M951332K501185Q24167N626176
$$ 8515468 10211527 -989674 -12657666 -14001226 -9049894 -6548709 -5724542 -98366
37798i8366R668694N324176l120758n987655k049684R67806j486307m742876l340291
$$ -98366 9570328 14894504 11773746 5786091 3736407 4704213 3217906 -1524970 -4865261
37789d865261J30408M75162L88086O129768J3361451R622787m840838j2126800
$$ -4865261 -4734853 -4259691 -3871605 2258163 15619614 25242401 20401563 8274763
37781H274763k045465J0095604N429284r126666j2261504k211111L139090j667337
$$ 8274763 6229298 16324902 21754186 12627520 366016 -1845095 1293995 -373342
37773c73342k109097P284456J0773009q61556j1797651n815358P538648R267658
$$ -373342 -2482439 4802017 15575026 14713470 2915819 -2899539 4639109 13906767
37765A3906767O63054k497892K761584M607981j627858o964989m800049M60906
$$ 13906767 14569821 12071929 14833513 19441494 17813636 10848647 6048598 6509504
37757F509504K855692K348699N51455k970329p647192j0217739p608402L53224
$$ 6509504 9365196 11713895 12265350 9295021 1647829 -8569910 -16178312 -15825088
37749a5825088R535666J2254489M621355n488275n514459M121638R267026L251708
$$ -15825088 -6289422 5965067 10586422 5098147 -416312 3705326 12972352 16224060
37741A6224060l255258j068542K123790l020894r097414m416522N330024N626650
$$ 16224060 12968802 11900260 14024050 11003156 1905742 -2510780 2819244 8445894
37733H445894k430398m748677J268746L326361l737973r488322n277621L693282
$$ 8445894 6015496 1266819 2535565 5861926 2123953 -7364369 -12641990 -8948708
37725h948708Q209585O077029k5051o191065o801200K82573P074674L778527o032614
$$ -8948708 -739123 5337906 5312855 -878210 -7679410 -7396837 -322163 3456364 -2576250
37716b576250r422819l461972J928882J900241L503178J0383761J4148674Q091666
$$ -2576250 -11999069 -15461041 -13532159 -11631918 -8128740 2255021 16403695 24495361
37708B4495361j466465n495543n154007o474190r056588p682702o97974Q571534
$$ 24495361 23028896 17533353 12379346 5905156 -3151432 -10834134 -11532108 -2960574
37700b960574J4781250J2288148J71263j1780317j0323108L355917J1433807J882284
$$ -2960574 11820676 24108824 24280087 12499770 2176662 5532579 16966386 18848670
37692A8848670j4300760j7028706l360912R868791Q252336l921378j1375889o273108
$$ 18848670 4547910 -12480796 -15841708 -5972917 2279419 -1641959 -13017848 -19290956
37684a9290956M441381Q483314K316641n840575o760080p59329M885513N969754
$$ -19290956 -14849575 -6366261 -4049620 -9890195 -16650275 -17409604 -12524091 -6554337
37676f554337M267683K340206Q67980N59914J589052J313613k655145p395215
$$ -6554337 -2286654 53552 921532 1481446 3070498 4384111 1728966 -5666249
37668e666249p426586k251498L295808N584929M800804K329088l0456o4021J313815
$$ -5666249 -13092835 -15344333 -12048525 -6463596 -1662792 666296 635840 571819 1885634
37659A885634m00669n367254n821222K615648J1258868R174684p52612o908651
$$ 1885634 1484965 -3882289 -9703511 -7087863 4171005 13345689 12593077 5684426
37651E684426o073381l857626j735731K901484O098404J370668o408444o152043
$$ 5684426 -388955 -4246581 -5982312 -3080828 3017576 4388244 -2020200 -8172243
37643h172243M44909J020615n353327n602365M567653J3002969J1496812O566713
$$ -8172243 -7727334 -6706719 -12060046 -17662411 -13094758 -91789 11405023 17971736
37635A7971736L463419k856831j2561129j4623098o146770q20839n997089q431829
$$ 17971736 21435155 18578324 6017195 -8605903 -14752673 -15573512 -21570601 -30002430
37627c0002430K503854J3863129R393765l036027m662261L729949O068113n89213
$$ -30002430 -27498576 -13635447 -4241682 -7277709 -11939970 -8210021 -2141908 -2731121
37619b731121l392313K461436O780181K947699k432739j865178K611580M360235
$$ -2731121 -6123434 -3661998 3118183 6065882 3633143 1767965 4379545 8739780
37611H739780J55211p067000q816087J361262J5880306J7029673O88370j4332433
$$ 8739780 8894991 1827991 -6988096 -5626834 10253472 27283145 27971515 13639082
37603A3639082j1801799j448425j635054r577470q676453J884918P240837L451464
$$ 13639082 1837283 388858 -1246196 -10823666 -19500119 -17615201 -10374364 -6922900
37595f922900J486326M233686J605410p728012j0503037j468244O338984K286311
$$ -6922900 -5436574 -1202888 402522 -7325490 -17828527 -19296771 -12957787 -10671476
37587a0671476o178210p345578j947604K522059L695263L034141J293882P79107
$$ -10671476 -16849686 -24195264 -26142868 -23620809 -19925546 -16891405 -15597523 -14818416
37579a4818416M162561P905268N714265O6645m80427L423479K198732n145544
$$ -14818416 -10655855 -2750587 2963678 3030323 2549896 5973375 8172107 3026563
37571C026563q075412k558890K681235K355182J959954L839797J825465l903394
$$ 3026563 -5048849 -7607739 -4926504 -2571322 -611368 3228429 5053894 1150500
37563A150500l271090M650543O379278k819120q617111k145426L840872j832734
$$ 1150500 -2120590 2529953 8909231 6090111 -2527000 -4672426 -831554 -2664288
37555b664288p675474j80317J0729279Q260172k713049o391954l747707n135849
$$ -2664288 -10339762 -10520079 209200 8469372 5756323 -635631 -4383338 -9519187
37547i519187n372178O360498J8520619R342289j4590462k2577269n965729R851675
$$ -9519187 -14891365 -8530867 9989752 19332041 4741579 -17835690 -23801419 -13949744
37539a3949744P020300o28867K645327Q236874M230472j061368K477188M419440
$$ -13949744 -6929444 -7558311 -4912984 3323890 7554362 6492994 8970182 13389622
37531A3389622o838940j8009926r711092R488925J4364898K405393m792572J836463
$$ 13389622 6550682 -11459244 -21170336 -11681411 2683487 5088880 296308 2132771
37523B132771P348845K093032k348587L765000J0037230M177599o942985r221788
$$ 2132771 9481616 11574648 9226061 12991061 23028291 27205890 20262905 11041117
37515A1041117l381150m25803k459247k433558Q75926R47555m129886q079530
$$ 11041117 7659967 7234164 4774917 2341359 3217285 4164840 34954 -8044576
37507h044576o092352k82101M918735O615102L431409k315921l899018J848436
$$ -8044576 -14136928 -14419029 -9500294 -2885192 546217 -1769704 -5668722 -3820286
37499c820286P775129N259865k089336l038443L522118O438873O862p299858o579948
$$ -3820286 3954843 9214708 7125372 4086929 7609047 14047920 14054782 6754924 174976
37490A74976j061936J471780J70700k221453o185603j0466384p660647N022845
$$ 174976 -886960 584820 755520 -1465933 -7651536 -18117920 -25778567 -20755722
37482b0755722J6312211J3495148P18583o775216l902078R89781K362625L258473
$$ -20755722 -4443511 9051637 9770220 2995004 -907074 82707 2445332 5703805
37474E703805M075818o8544p096302o931802J282585M238757m672570j1973092
$$ 5703805 9779623 9711079 2614777 -4317025 -3034440 1204317 -3468253 -15441345
37466a5441345l537938J2305917J5678747L641991p215377n242308L029884N837885
$$ -15441345 -18979283 -6673366 9005381 12647372 5431995 189687 3219571 9057456
37458I057456Q99005o324283j0286408p691604Q48725Q463168P494833k12428
$$ 9057456 9956461 3632178 -6654230 -14345834 -13497109 -5033941 2460892 2248464
37450B248464m614300j255697L030050J315913l553447n031640k743162m58358
$$ 2248464 -2365836 -3621533 -591483 724430 -2829017 -7860657 -10603819 -11062177
37442a1062177J133849L370456M726262L348519K176948N123815R356175P781011
$$ -11062177 -9928328 -6557872 -1831610 1516909 3693857 8817672 18173847 25954858
37434B5954858o40825q781697j0453164o630292j514507K434676L514755J9026
$$ 25954858 25314033 16532336 6079172 -551120 -2065627 369049 3883804 3902830
37426C902830n821045p107059l18864Q131816Q457297o3734q071598q131215k972693
$$ 3902830 -1918215 -9025274 -9344138 -1212322 7244975 7181241 -890357 -9021572 -11994265
37417a1994265N07157J261396L569637Q183470R359732K560216q218140j4021339
$$ -11994265 -11487108 -10225712 -6656075 1527395 10887127 13447343 5229203 -8792136
37409h792136j0836654l049047K915128N191790N299057L625196k4283k782142
$$ -8792136 -19628790 -22677837 -19762709 -14570919 -9271862 -5646666 -5670949 -8453091
37401h453091p90666L971673M012098l216836r425615n267030O595024J4372614
$$ -8453091 -9243757 -5272084 -1259986 -4476822 -13902437 -19169467 -12574443 1798171
37393A798171J2041587M528292k308747q922283j5947349j8026995j0158390L482988
$$ 1798171 13839758 18368050 16059303 7137020 -8810329 -26837324 -36995714 -33512726
37385c3512726J2929375J2875853N803148k698008p505040n768489o0994K630366
$$ -33512726 -20583351 -7707498 -1904350 -4602358 -12107398 -17875887 -17936881 -15306515
37377a5306515k91902k311119K521183Q715682O048802m680273j1438205o946343
$$ -15306515 -15598417 -17909536 -15388353 -6672671 -623869 -5304142 -16742347 -23688690
37369b3688690L194471R720386R520362M457214k135961n144688q23819O628176
$$ -23688690 -20494219 -10773833 -1253471 3203743 1067782 -4076906 -4900725 1727451
37361A727451P959063J207349n335869n451550l038765l742847n770923m628822
$$ 1727451 9686514 10893863 5557994 106444 -2932321 -6675168 -12446091 -17074913
37353a7074913j065644J503753K628384K847767J145349r71321J221733P067089
$$ -17074913 -18140557 -16636804 -14008420 -11160653 -10015304 -10986625 -9764892 -2697803
37345b697803P973233K9285p725148n820808J327662L431643R71053J991599N913916
$$ -2697803 5275430 5304715 -2420433 -8241241 -6913579 -3481936 -2510883 -519284 5394632
37336E394632M002115m082487p255848N1615Q489033O610129m119998j2292862
$$ 5394632 9396747 5314260 -1941588 -1889973 6599060 13209189 9089191 -3203671
37328c203671j0071948p8805Q339988P889400M62530m820768k844465J221611
$$ -3203671 -13275619 -13354424 -5014436 2874964 3337494 -1483274 -4327739 -3106128
37320c106128R20331q94737K054850O826400M694030l924310q607319m095462
$$ -3106128 -2185797 -3080534 -1025684 5800716 10494746 6570436 -2036883 -6132345
37312f132345L304887O310945M768349J286606k539909l734235m53049J885875
$$ -6132345 -2827458 3483487 8251836 9538442 6998533 3264298 2811249 4697124
37304D697124l244053j0311654o954449N121296Q931327k045023j1755853n269765
$$ 4697124 1453071 -8858583 -15813032 -10691736 -1760409 -3805432 -15561285 -20831050
37296b0831050Q646818J1925328L848494j878326J84579L143635K779921J728548
$$ -20831050 -12184232 -258904 3589590 1711264 1895843 5039478 7819399 9547947
37288I547947j6645n014549q768817l374208P662995J0706994J414914q252159
$$ 9547947 9531302 4516753 -4252064 -7626272 36723 10743717 12158631 3906472
37280C906472p126338O52703M145684J094766j972079p09720K098734J252733
$$ 3906472 -3219866 -2567163 1578521 2673287 701208 -8512 2090222 3342955
37272C342955m362233r601083p641705J368074Q331282N958192j046779k693849
$$ 3342955 -1019278 -10620361 -18262066 -16893992 -8562710 -2604518 -3651297 -6345146
37264f345146J789851M642421L635173M728132Q863717P686372k018386r895531
$$ -6345146 -4555295 87126 3722299 8450431 17314148 25000520 22982134 13086603
37256A3086603o391996K287698L489466k967859o042597j204568M034237L015369
$$ 13086603 6694607 8982305 12471771 9503912 3461315 2256747 6290984 9306353
37248I306353j340664l775752m803540o737279p087736j853288O859601J1506918
$$ 9306353 7965689 4189937 -613603 -7350882 -14438618 -16291906 -9432305 2074613
37240B074613P355735k745843j1674196j4000937r029123l08709P034646R794432
$$ 2074613 9430348 6684505 -4989691 -18990628 -28019751 -28328460 -21293814 -11499382
37232a1499382Q566479O178917M471943L096540J034315j743961m146182m658324
$$ -11499382 -2932903 3246014 7717957 10814497 11848812 10104851 5958669 1300345
37224A300345k374721J597691M087378K832748n79217k664897k573410j566848
$$ 1300345 -1074376 523315 4610693 7443441 6864224 4199327 1625917 59069
37216E9069J705707R695025J7490072J3299719n551555k2746381j9828637j103404
$$ 59069 1764776 11459801 28949873 42249592 36698037 13951656 -5876981 -6980385
37208f980385J0335618L029455r121254q947388O82222N732929L388187J942309
$$ -6980385 3355233 6384688 -2736566 -11683954 -11001732 -5268803 -1880616 61693
37200F1693L644956K477351j755613j306133M652105N560170m227903j4588405
$$ 61693 3706649 6184000 4428387 3122254 7774359 13334529 9106626 -5481779
37192e481779j2869016j165698Q005171R053926P563256Q420859Q172650J928457
$$ -5481779 -18350795 -19516493 -11511322 -2457396 5105860 13526719 21699369 23627826
37184B3627826p557348j2343902r132234k455509K388033N508888Q690959R137838
$$ 23627826 16070478 3726576 -5405658 -7861167 -5473134 35754 8726713 17864551
37176A7864551L058930n577419p685869k346327O85347m087354q909259n436680
$$ 17864551 20923481 15346062 7660193 5313866 5999213 1911859 -6997400 -12434080
37168a2434080J927149M837065N499007R835278J2254567L067618j1592457j4822523
$$ -12434080 -10506931 -5669866 -170859 9664419 21918986 24986604 13394147 -1428376
37160a428376m895225J793544k422378n439116J129390O256935k23572q361444
$$ -1428376 -6323601 -4530057 -6952435 -12391551 -11262161 -5005226 -5228798 -13590242
37152a3590242n283420K114667M92194m839120K65307J0941468R170554m374551
$$ -13590242 -18873662 -16758995 -16266801 -21105921 -20840614 -9899146 -728592 -5103143
37144e103143q681824L855541J5088711J0650254J009311R06631N745651M275011
$$ -5103143 -13784967 -9929426 5159285 15809539 16818850 17725481 23471132 27746143
37136B7746143P61424N749705J3327080P382351j1879579k5228675j9939040m169766
$$ 27746143 28507567 34257272 47584352 54966703 43087124 17858449 -2080591 -6250357
37128f250357P049329Q400707L111984m210049q191729m313572M353392Q039926
$$ -6250357 798972 9199679 12311663 8101614 -90115 -4403687 -50295 7989631
37120G989631K686369m144755m399257p37957o41276m169385m942831p70540L884772
$$ 7989631 10676000 6531245 2131988 1394031 752755 -3416630 -8359461 -9130001 -5245229
37111e245229N293825L991561Q64555m217485q582281p146267N18405P455489
$$ -5245229 48596 4040157 4904712 687227 -7895054 -15041321 -14522916 -7067427
37103g067427P028381R77285l307881k016622J749214L415789K520594J530839
$$ -7067427 -39046 938239 -2369642 -4386264 -2637050 778739 3299333 4830172
37095D830172J172011j88512k323610j626268L249106O503868J412681q390780
$$ 4830172 6002183 5813671 3490061 1863793 5112899 11616767 13029448 4638668
37087D638668j0718592j358275Q057052N480139l777312m576484N382681J2200880
$$ 4638668 -6079924 -7438199 618853 6098992 2321680 -2254804 3127877 15328757
37079A5328757O433780m311653q028117l863100J267402L562517K646734k300131
$$ 15328757 21762537 17450884 9422767 5559667 6827069 10389586 13036320 10736189
37071A0736189r086073j0735058m631935J842757K139077Q03196M245409Q023643
$$ 10736189 1650116 -9084942 -13716877 -11874120 -9735043 -8931847 -4686438 3337205
37063C337205M672012j524573j230601K396203j543289j0818265j1025013P06121
$$ 3337205 8009217 6484644 5254043 7650246 6106957 -4711308 -15736321 -15030200
37055a5030200J0267005R589764P715336J1007796R758021l074492j4964168j1744806
$$ -15030200 -4763195 4826569 12541905 23549701 33307722 30233230 15269062 3524256
37047C524256r25234Q06565n028325l613549N527778P317434j784896o572724
$$ 3524256 2599022 3405587 -1622738 -5236287 291491 7608925 5824029 -748695
37039g48695J087250Q138791K360580p163358n508656L567575N018277j840202
$$ -748695 338555 8477346 10837926 3674568 -1834088 1733487 6751764 4911562
37031D911562k640192P435335J4848848Q652685k944428n829735p43268K96016
$$ 4911562 2271370 9706705 24555553 33208238 30263810 24434075 23690807 23986823
37023B3986823o169263j0472212n439512L338618O429134K860651r68350l45839
$$ 23986823 17817560 7345348 1905836 5244454 11673588 14534239 13565889 13220050
37015A3220050L549396N526795N67804r943367j5426255o396272J0229991J5429054
$$ 13220050 16769446 22296241 22864045 12920678 -2505577 -8901849 1328142 16757196
37007A6757196L174076r085252m612410P900989Q065424n087617j3845062j0755375
$$ 16757196 19931272 10846020 6233610 14134599 22200023 17112406 3267344 -7488031
36999g488031o625496p443024l966919P961843J5401417Q615483j601544q71800
$$ -7488031 -14113527 -21556551 -25523470 -17561627 -2160210 6455273 4853729 3981929
36991C981929O352834O406490n97354l317377R08587M051293K515710O67776M25307
$$ 3981929 10334763 16741253 16143899 12826522 13735109 17786402 20302112 20969888 21395195
36982B1395195r60408l321696l696498k973087l639420l193806J186774M514649
$$ 21395195 20434787 17113091 13416593 10443506 6804086 3610280 4797054 9311703
36974I311703O06777o106231o336950j133756L80779l048503l539493J233214
$$ 9311703 9918480 3812249 -2524701 -3658457 -3277678 -6326181 -9865674 -8632460
36966h632460M400101K527197N10044J457594K004318L38605n60724j47325j670334
$$ -8632460 -4232359 -1705162 -1195118 262476 2266794 2605399 2044675 1897350 227016
36957B27016m047345j567173N493331Q744981L605782m179407p020534m046219
$$ 227016 -3820329 -5387502 105829 8850810 12456592 8277185 1256651 -2789568
36949b789568Q22864L345383O97130n260642p066478n82695P295120P768192L522260
$$ -2789568 -1966704 1378679 2075809 -3184833 -10251311 -10834006 -3538886 4229306 7751566
36940G751566K805444M201842O05259m839577l011641K168514k451994j4715402
$$ 7751566 10557010 14758852 15364111 10524534 7512893 9681407 7229413 -7485989
36932g485989j6452910k656208Q868077N865869P1351M782232J1779483O769723
$$ -7485989 -23938899 -26595107 -17727030 -11861161 -11789810 -7007578 4771905 11541628
36924A1541628n846315j0994475o246216j031326M55582J170368J763762J730294
$$ 11541628 5695313 -5299162 -11545378 -12576704 -12121122 -10950754 -9186992 -7456698
36916g456698M329561R368044Q115609l283742j3245607j0034428K03603M039663
$$ -7456698 -3127137 6240907 14356516 11072774 -2172833 -12207261 -12003658 -7963995
36908g963995J598081J927287M520971K062179l029412j543814N530746Q450047
$$ -7963995 -6365914 -4438627 82344 2144523 -884889 -2428703 3102043 11552090
36900A1552090N188318J846550r91393p070339j1697153o282430N034081R083785
$$ 11552090 16740408 18586958 17595565 10525226 -1171927 -7454357 -2420276 6663509
36892F663509L758261j242686k937318o816287r904266k029129J2371420J4156794
$$ 6663509 10421770 9179084 6241766 -574521 -10478787 -12507916 -136496 14020298
36884A4020298j330405j3976905q110283N044993O866110j184562m455666R99960
$$ 14020298 12689893 -1287012 -9397295 -4352302 2513808 1329246 -3126420 -2126460
36876b126460O569062O738733L502741p47527m130134k785083L554178P407779
$$ -2126460 4442602 11181335 14684076 13936549 9806415 7021332 10575510 17983289
36868A7983289L027284m277818o053308l147481j870515k256372M28954N324601
$$ 17983289 21010573 16732755 10679447 7531966 5661451 3405079 3834033 9158634
36860I158634O372321K097785k565807l730713j878560J180009L370305J992749
$$ 9158634 15530955 17628740 15062933 11332220 9453660 10633669 14003974 15996723
36852A5996723k585699m817509p83618M801914L891722l778948r908551p537426
$$ 15996723 13411024 8593515 7809897 12611811 16503533 12724585 2816034 -4721392
36844d721392J834966J0267489J0277277J727147o607735n843700J392945L816947
$$ -4721392 -2886426 7381063 17658340 19385487 12777752 6934052 8326997 12143944
36836A2143944k047343o454039k249581L209331M31745o120747n727687P43220
$$ 12143944 10096601 3642562 1392981 4602312 5034057 -1086690 -6814377 -6071157
36828f071157L783626K385242L693745O398723L14576j3852869j9211660n243415
$$ -6071157 -2287531 97711 3791456 10190179 10504755 -3348114 -22559774 -27803189
36820b7803189J5363676K2188697J2108133p14110m978092k656063j021696k843703
$$ -27803189 -12439513 9749184 21857317 21143207 16165115 13509052 12487356 9643653
36812I643653n821598o679592m261146p17307N87163m02095n2686K938388M282488
$$ 9643653 3822055 -2857537 -7118683 -7835990 -7248827 -7650922 -7703608 -4765220 -482732
36803d82732L33549n088925m892391J332797O394502N007727P5308k124806J72993
$$ -482732 -149183 -5238108 -10130499 -8797702 -2403200 2604527 2679835 555029 728022
36794G28022L767180O146292Q044820R573952P065696k265957j3077770j4821770
$$ 728022 4495202 10641494 18686314 28260266 35325962 33060005 19982235 5160465
36786E160465n069262M861017L500523m927332o565900J479147P206768K735656
$$ 5160465 91203 4952220 8452743 3525411 -3040489 -1561342 5645426 8381082
36778H381082m060379l463238O73804m96934m500749k421314M314114N802847
$$ 8381082 4320703 857465 1531269 1034335 -3466414 -5887728 -1573614 4229233
36770D229233J051890n98001K988324J970462p738099j5022705r953279Q00277
$$ 4229233 5281123 4683122 7671446 9641908 1903809 -13118896 -23072175 -22271898
36762b2271898M558947Q03625j408277J356446M407225M370950K341270k31119
$$ -22271898 -17712951 -16909326 -18317603 -16961157 -12553932 -8182982 -5841712 -6072831
36754f072831j764481N44632N716725O874738R02885m730247k737102J994228
$$ -6072831 -7837312 -7292680 -1575955 5298783 6201668 1471421 -1265681 728547
36746G28547R25738l210071k076029K223882R12241m274603l223799L640637M984870
$$ 728547 1654285 -1555786 -3631815 -1407933 -495692 -4770295 -7994094 -4353457 631413
36737F31413j038368k979696K960819N276632k350974r193436n759964R73978
$$ 631413 -406955 -3386651 -425832 4850800 2499826 -6693610 -12453574 -11479596
36729a1479596J984836K017043P700076J2205450P000468j109971q87391L414922
$$ -11479596 -9494760 -7477717 222359 12427809 19428277 18318306 17430915 20845837
36721B0845837L0647q375110q610561K69452N709221K800819K23123L332628O225053
$$ 20845837 20876484 12501374 3890813 4160265 9869486 12670305 12893428 16226056 22451109
36712B2451109L992086J30776k064222m568423p553699o945876k307827J235304
$$ 22451109 26443195 26573971 24509749 19941326 12387627 5441751 3133924 4369228
36704D369228J220268K88743m20985k179668l012812r5914K691036m84838n841521
$$ 4369228 5589496 5878239 5457254 3277586 264774 168860 2859896 2375058 -3466463
36695c466463m415506K380201M383407L96991J22342O089248Q583408L150563
$$ -3466463 -7881969 -5501768 -1118361 -721370 -599028 5490220 14073628 17224191
36687A7224191j556190J69696J276461l792056q136465m972946O19209K147219
$$ 17224191 15668001 15837697 17114158 13322102 5185637 212691 831900 2979119
36679B979119K549182M299861K94468j2672923k1426673j2362872O766976J5826833
$$ 2979119 5528301 9828162 10122630 -2550293 -23976966 -36339838 -29572862 -13746029
36671a3746029R039610r49366l210889L94094L672850M033692J189914k945647
$$ -13746029 -4706419 -5655785 -8866674 -8472580 -4799730 -766038 423876 -2521771
36663b521771k927121L715438R635044N828891m125484p057593J820753J2207676
$$ -2521771 -5448892 -1733454 7901590 13730481 9604997 2547404 4368157 16575833
36655A6575833J2096802J527617r349610j1513370m587165M155108P361729M701676
$$ 16575833 28672635 30200252 20850642 9337272 4750107 8905215 16266944 20968620
36647B0968620Q71932k558733p505383j0983668n684265O591353J2048264L360499
$$ 20968620 21840552 19281819 11776436 792768 -4891497 1699856 13748120 17108619
36639A7108619q084950q473263j631671l22832m634543m168433K443935O308122
$$ 17108619 9023669 550406 -1081265 -1404097 -6038640 -10207073 -7763138 -1455016
36631a455016N129217N420890P368202L362081n855973r177542l611415L11678
$$ -1455016 3674201 9095091 16463293 19825374 13969401 4791859 1180444 1492122
36623A492122k478321k454837O019662J1647208L881642q048217q394072Q37145
$$ 1492122 -986199 -3441036 2578626 14225834 18107476 10059259 1665187 2502332
36615B502332M406324j703818o178799k491582J677510q80716m738949j397948
$$ 2502332 6908656 5204838 -973961 -3465543 -1788033 -2668749 -7407698 -8805646
36607h805646O664108R555749M236868j850737j360712L796451N965423J963761
$$ -8805646 -2141538 7414211 11651079 9800342 8439630 12236081 18201504 20165265
36599B0165265l318888m047248j544566k031937o690805q609706k553729N851460
$$ 20165265 16846377 12799129 11254563 9222626 2531821 -6077885 -8631614 -2780154
36591b780154O272376j853685p487886k905217N644954P510835L176723J731428
$$ -2780154 3492222 1638537 -5849349 -8754566 -3109612 4401223 7577946 9309374
36583I309374M562890K819291n656430q865039P40393J0209664L193957j2678859
$$ 9309374 13872264 16691555 11035125 2170086 2910479 13120143 16314100 3635241
36575C635241j4080568K110445J1799025K98139j3680766o122125J4913823K0783133
$$ 3635241 -10445327 -8334882 3464143 3762282 -9918484 -16040609 -1126786 19656347
36567A9656347L961721j3612053j3725281l432592J697048o15215k970465k082514
$$ 19656347 23618068 10006015 -3719266 -7151858 -5454810 -6070025 -9040490 -11123004
36559a1123004L92694L488434N727871L688363k202061n307508j545507L968469
$$ -11123004 -10730310 -7241876 -1514005 2174358 -27703 -5335211 -6880718 -2912249
36551b912249M041705p69347m189275k831623J419061M920204M747994K74140
$$ -2912249 1129456 360109 -3829166 -6660789 -5241728 -321524 4426470 4700610
36543D700610m943108n568172j078625L110100L097664J322314J410174K130537
$$ 4700610 -242498 -5810670 -6889295 -3779195 -681531 640783 2050957 4181494
36535D181494L6995m672669q391933q389712m330725K582120R466132J2131874
$$ 4181494 4218489 -454180 -8846113 -17235825 -21566550 -18984430 -9518298 2613576
36527B613576Q059109p98732q664982r717888l021259N049811N866712j429072
$$ 2613576 10672685 9873953 1208971 -8508917 -11530176 -6480365 -613653 -2042725
36519b042725p797438n492863K200679O970883O910109N420498K948334j390381
$$ -2042725 -9840163 -15333026 -13132347 -6161464 748645 6169143 9117477 7727096
36511G727096l020564K787098J0145564Q208353k271718r343106p680222l921638
$$ 7727096 4706532 7493630 17639194 25847547 23575829 14232723 6552501 2630863
36503B630863k377740J076279O614309N850926l261082r411320m547554L398307
$$ 2630863 253123 1329402 7943711 13794637 10533555 1122235 -3425319 -27012
36495b7012L760911q54149j878065Q48165K424015K602819K043160k879389j0964476
$$ -27012 3733899 2879750 1001685 1849850 4273865 6876684 8919844 6040455 -4924021
36486d924021j1024779J588154J2260031O180442p267411o992909P371456J5018807
$$ -4924021 -15948800 -14360646 -2100615 4079827 -3187584 -10180493 -2809037 12209770
36478A2209770N648987p706471j1205351p783609n189490j720287N980247J1829636
$$ 12209770 17858757 10152286 -1053065 -8836674 -14026164 -15746451 -9766204 2063432
36470B063432Q021342k269458q749048o961446j074885L252295L796001J756214
$$ 2063432 10084774 7815316 -933732 -7895178 -8970063 -5717768 -1921767 -165553
36462a65553L04989J630746M135585M623664K807330K78605l432431q586812j0742233
$$ -165553 139436 1770182 5905767 10529431 13336761 13615366 10182935 1596123 -9146110
36453i146110n567249K588572M853352O67433k044240j39048J102455l11684J346315
$$ -9146110 -14713359 -12124787 -7271435 -6604002 -8648242 -8787290 -7684835 -7996519 -6650204
36444f650204P408593Q835288N2998r892636r557757k188103P7155m565039n677423
$$ -6650204 758389 9593677 9646675 -245961 -9803718 -11991821 -11914666 -16479705 -22157128
36435b2157128J959285R732651Q193533R29989j219293L923141P292236K430350
$$ -22157128 -20197843 -10465192 -2271659 -1341670 -2560963 1362178 8654414 11084764
36427A1084764m863816n209575M84428L130867P7551j540734J625027K118251
$$ 11084764 6220948 1011373 1495801 4626668 4704219 3163485 4788512 6906763
36419F906763n141633j1371450o012040N471036Q291987M18265m963876L12935
$$ 6906763 1765130 -9606320 -15618360 -10147324 -1855337 -1437072 -6400948 -6088013
36411f088013Q889503J0630670N346066j327341n778112n918340q71109M655277
$$ -6088013 2801490 13432160 18778226 17450885 11672773 5754433 4883324 9538601
36403I538601L093492m946998r604424n526669P27606J299958k241692l729156
$$ 9538601 12632093 7685095 -1919329 -7445998 -6718392 -5418434 -7660126 -11389282
36395a1389282j649531J303783K902815K092669k56545J57304N726169R994934
$$ -11389282 -13038813 -11735030 -8832215 -6739546 -6996091 -6838787 -1112618 8882316
36387H882316M741022n745182q637646k327851J133503l105791m523630L248156
$$ 8882316 13623338 7878156 -759490 -3087341 -1953838 -5059629 -9583259 -6335103
36379f335103R991121O123826j375641k131778Q16631N4001j848560m68812r21361
$$ -6335103 3656018 9779844 8404203 6272425 7089056 7143057 5294497 4825685 3904324
36370C904324o694857q226219J305250R691938L532927p745963o607452K464333
$$ 3904324 -2790533 -11016752 -9711502 -19564 3513363 -4232600 -10840052 -8375719
36362h375719J537203p576787n435447R923057J6822550M268089j1436986j2883040
$$ -8375719 -6838516 -14415303 -19850750 -9927693 6894857 11162946 -274040 -13157080
36354a3157080m070588K783049N376467O217672M091235o1877q67172J375031
$$ -13157080 -17227668 -14444619 -9068152 -2850480 1240755 1178878 311706 1686737
36346A686737M07368k482687N65494O557642L449584o155705m552051R914605
$$ 1686737 2094105 -388582 176912 6734554 10184138 4028433 -523618 9390987
36338I390987J4622316j551715j7291406j1387755M511359P073859k311479o165002
$$ 9390987 24013303 22461588 5170182 -6217573 -1706214 5367645 3056166 -3108836
36330c108836k048853N640N42438N648318P220990n245865j8933006j1581518
$$ -3108836 -5157689 -5152049 -4609611 1038707 8259697 3013832 -15919174 -27500692
36322b7500692J0983024J9441212N010400q798885m324646O726112P799363J830637
$$ -27500692 -16517668 2923544 7933944 -864941 -5189587 1536525 9335888 11166525
36314A1166525j947238n285140j0260552q388327L745627J1967852M166509q676893
$$ 11166525 9219287 3934147 -6326405 -14714732 -10969105 998747 5165256 -3511637
36306c511637q055307L804185Q743481J031669o276159l049934M626202O152721
$$ -3511637 -11566944 -7762759 980722 2012391 -4263768 -7313702 -2687500 3465221
36298C465221Q13548m163799l780344M05432L489490K946887J451152K731117
$$ 3465221 4278769 114970 -3665374 -3259942 229548 3176435 4627587 7358704
36290G358704M855379K058298n457127r629430n931434n27419r32985n063801
$$ 7358704 12214083 14272381 8815254 -814176 -6745610 -7273029 -8206014 -13269815
36282a3269815n837802j987834K680582O905616J1168077J2109315N991819l376751
$$ -13269815 -19107617 -21095451 -18414869 -11509253 -341176 11768139 17759958 14383207
36274A4383207p801898n469663j536025J558872O222574J1119666R305740r11002
$$ 14383207 6581309 1111646 -424379 1134493 7357067 18476733 27782473 26871471
36266B6871471j0317770r873902k697691J310607l37617j041829L089009O935420
$$ 26871471 16553701 6679799 3982108 5292715 4955098 3913269 7002278 13937698
36258A3937698M258249l125858p761571n663204l5458K669052j341999r189926
$$ 13937698 18195947 15070089 7308518 1645314 1609856 4278908 2936909 -6253017
36250f253017j1949092l075837J1244729J5508080M087123q485891n502878P743637
$$ -6253017 -18202109 -21277946 -10033217 5474863 9561986 1076095 -4426783 3316854
36242C316854J0768695j429876j0241562j676129J2378455J2368381r66234j0877457
$$ 3316854 14085549 12655673 2414111 737982 13116437 25484818 24518584 13641127
36234A3641127r230484k150511M037821P609812M965941n616615j4537780r834326
$$ 13641127 4410643 2260132 6297953 13907765 18873706 13257091 -1280689 -11115015
36226a1115015L893713R994847M382270j9521L436408M420558m431130j2641643
$$ -11115015 -7221302 2773545 7155815 7136294 10572702 14993260 10562130 -2079513
36218b079513q318442K445430N452504j64816k957118K512672R022039P333805
$$ -2079513 -10397955 -7952525 -2500021 -2664837 -5621955 -3109283 5912756 13246561
36210A3246561l098650j3357424j2710943m91537R626212M650854q339221r477295
$$ 13246561 10147911 -3209513 -15920456 -16411993 -6785781 -2134927 -10474148 -19951443
36202a9951443M695978J4346770O091612o062376k601090J1592379J6155901N886690
$$ -19951443 -15255465 -908695 5182917 -879459 -3480549 8111830 24267731 30154421
36194C0154421n326157p334844l883857q54921J009619Q18925k885835o336249
$$ 30154421 24828264 17493420 13609563 12754642 13764261 14583186 11697351 5361102
36186E361102m434533J0139P39404k28439L303170P805758L626672p424999j2146385
$$ 5361102 926569 936708 1676112 1447673 4750843 12556601 16183273 8758274 -3388111
36177c388111o010035L69490r49820l829615p14514M680386N403691L080933K946696
$$ -3388111 -9398146 -9028656 -9978476 -13808091 -14522605 -9842219 -4438528 -1357595 1589101
36168A589101L479907j69575o109684p090180j039136N493826N160915j591654
$$ 1589101 5069008 4899433 -1210251 -8300431 -9339567 -3845741 1315174 -276480
36160b76480o651590l173715N543134Q841934K581822m105147j272541O825964
$$ -276480 -6928070 -10101785 -4558651 4283283 6865105 2759958 1487417 8313381
36152H313381P616799j108218q554513p510409l197268k302776k458469J719414
$$ 8313381 15930180 14821962 6267449 -1242960 -4440228 -6743004 -9201473 -7482059
36144g482059Q570677J1417138P230600q36695p206630p895992l282165J813011
$$ -7482059 1088618 12505756 19736356 18899661 11693031 3797039 514874 2327885
36136B327885K920389N55925k186093m221415m775455j016931O126492P853352
$$ 2327885 5248274 5804199 3618106 -603309 -5378764 -6395695 -269203 7584149
36128G584149j602457j2795295j1002885K558167J1624746P954354P57993J19829
$$ 7584149 5981692 -6813603 -17816488 -15258321 -3633575 4320779 5078772 5198601
36120E198601L803509N750412N851063M659752r03127r301203j1774779n667763
$$ 5198601 9002110 14752522 20603585 25263337 24360210 15059007 3284228 -2383535
36112b383535p15222l642742o314394M26915J0012824R873357J672730j798473
$$ -2383535 -3098757 -6741499 -13055893 -12628978 -2616154 7257203 8929933 7131460
36104G131460K976102O132167J057947o081725o345328J83847O011404N455726
$$ 7131460 10107562 16239729 17297676 11215951 4870623 5054470 11065874 16521600
36096A6521600J50567l076604j57321M158492J751610o618166j0912199o495302
$$ 16521600 16672167 13595563 13438242 17596734 19348344 12730178 1817979 -4677323
36088d677323j249250k406870m528781O67232R257776J0807026M850257J47332
$$ -4677323 -5926573 -8333443 -12862224 -12194992 -2937216 7869810 12720067 12867399
36080A2867399l66432k005182n649329m537081L155786Q708877N191190k004138
$$ 12867399 12500967 10495785 4846456 309375 3465161 12174038 17365228 15361090
36072A5361090l158420J995006M928359R13655m768583m400926J886362O551094
$$ 15361090 12202670 14197676 19126035 20039690 15271107 10870181 12756543 19307637
36064A9307637M806918M74871p69256k01253k368195m878428n27786R343926J3167395
$$ 19307637 24114555 24589426 23820170 23618917 21250722 16372294 15844508 25188434 38355829
36055C8355829N213431n200309o939627k035640M00854j042243p55871K436236
$$ 38355829 43569260 38368951 31429324 29393684 29794538 28752295 27996424 30432660
36047C0432660L982402J995778j040088l716565o028920n834942j547784L154568
$$ 30432660 34415062 36410840 35370752 31654187 25625267 19790325 18242541 21397109
36039B1397109L454259N85079p35383J77580O48640J40023n23872k128627l692107
$$ 21397109 24851368 25436447 24701064 24878644 25527284 25667307 25143435 23014808 19322701
36030A9322701o94828O780038R790647K850542n161887k656957P109015J1819760
$$ 19322701 18627873 25407911 35198558 38049100 32887213 30230256 37339271 49159031
36022D9159031R158582O712643N768758L78199p539081p576729J957888J0087919
$$ 49159031 58317613 65030256 70799014 71177213 63638132 56061403 58019291 68107210
36014F8107210J0111678P566762P116601M589785j953531n294825p19233N199375
$$ 68107210 78218888 85785650 92902251 97492036 95538505 90243680 89524447 94723822
36006I4723822M892427Q22600k14174L389533R400890J5411843J7200285J1513356
$$ 94723822 99616249 100438849 100224675 103614208 113015098 128426941 145627226 157140582
35998A57140582L703199L028458P443413N187473m289972n994195O005561J5401363
$$ 157140582 160843781 163872239 171315652 176503125 172213153 166218958 172224519 187625882
35990A87625882P915383n131003m243003P549043J0589234m52700j1140483j1717302
$$ 187625882 195541265 190410262 186167259 193716302 204305536 203852836 192712353 180995051
35982A80995051q606966q590703p467544q32560N569221L910995m125424r919089
$$ 180995051 172388085 163797382 156329838 155497278 161066499 164977494 160852070 150932981
35974A50932981q570580l620140k844136r609880j7243602j5350625m376178K333459
$$ 150932981 142362401 138742261 135898125 126288245 109044643 93694018 89317840 91651299
35966I1651299l361084j1694240r596565q09914J365568l887531n731193k176841
$$ 91651299 88290215 76595975 66999410 66189496 67555064 63667533 57936340 55759499
35958E5759499k381981p276683n951217L633813P891157N0048o900700j443432
$$ 55759499 53377518 46100835 40149618 43783431 51674588 51724636 44823936 43380504
35950D3380504O665058K845769p382309p856235O46149J652851r353730j6911617
$$ 43380504 50045562 52891331 45509022 37652787 38298936 39951787 30598057 13686440
35942A3686440r223055N111146J1039982O856089J903541J678619L310146K455426
$$ 13686440 4463385 9574531 20614513 27470602 29374143 31052762 34362908 36818334
35934C6818334j282429m474420k856127L365146O583695m75619j2440899j4205996
$$ 36818334 35535905 31061485 28205358 31570504 38154199 37678580 25237681 11031685
35926A1031685r16946J2467702R703998m343811j0574501k233165P734406P070037
$$ 11031685 10114739 22582441 32286439 27942628 17368127 15134962 22869368 29939405
35918B9939405n90391n953437q038158r303504o221016L621954J1302096O893685
$$ 29939405 29349014 23395577 15357419 6053915 -167101 3454853 14756949 21650634
35910B1650634l208872l847556M610545N795414n508813j3057299m788120P277778
$$ 21650634 18441762 14594206 19204751 25000165 19491352 6434053 1645933 8923711
35902H923711O618490j405636o76991P285317P253521j265010k426892P065339
$$ 8923711 15542201 14136565 13459574 20744891 27998412 26733402 24306510 31371849
35894C1371849J0164986j717091j2923830r172719j049602m906745j3962397r009937
$$ 31371849 41536835 39819744 26895914 17723195 16673593 11766848 -2195549 -11205486
35886a1205486R427019K0646343J4007468J001828m947983m675740m803129o189743
$$ -11205486 -1778467 18867876 32875344 33877172 28929189 24253449 19450320 13260577
35878A3260577o500361m862725j54708O981954R169903N2147j1609679r151920
$$ 13260577 6760216 1897491 1742783 8724737 17894640 17946787 6337108 -2814812
35870b814812O600141J4209657K002146j3110543r700121P307181J5635395P616954
$$ -2814812 3785329 17994986 19997132 6886589 -2813532 4493649 20129044 27745998
35862B7745998l973116q191541o935171l860977J568327O005849K518639n963896
$$ 27745998 23772882 15581341 8646170 4785193 6353520 12359369 14878008 8914112
35854H914112o084749O226044J6267807R463192q331645j8807859j4177828k964591
$$ 8914112 2829363 9055407 25323214 34786406 26454761 7646902 -6530926 -9495517
35846i495517M099776N017456L628978K956040L300596L169373Q48841l170152
$$ -9495517 -5395741 -378285 3250693 6206733 9507329 12676702 13525543 10355391
35838A0355391n768706m753657j507095J524042L833926N080258K884880l824133
$$ 10355391 4586685 -166972 -1674067 -150025 3683901 8764159 11649039 7824906
35830G824906j0569859j0563575k744943O146894Q529073L588143k606686l668005
$$ 7824906 -2744953 -13308528 -16053471 -9906577 -1377504 2210639 -396047 -4064052
35822d064052R56054O183343P257579M587267J947343J135275M14907k165694
$$ -4064052 -3107998 3075345 10332924 14920191 16867534 18002809 18417716 16252022
35814A6252022n950370q226178o478996j097858L145162J047645n280429o664287
$$ 16252022 10301652 2075474 -4403522 -5501380 -2356218 -1308573 -6589002 -13253289
35806a3253289O65623P537834M229520l770162l222671N603944Q821929J746263
$$ -13253289 -12587666 -5049832 -820312 -4590474 -7813145 -2209201 6612728 8358991
35798H358991l405976J218719N375961r20649q871865n750464K277446O14554
$$ 8358991 4953015 6171734 11547695 10627046 1755181 -3995283 -1717837 -1103283
35790a103283p092562l889004J0112996J4558643J252057j0907994m339608J0729208
$$ -1103283 -8195845 -12084849 -1971853 12586790 13838847 2930853 -1408755 9320453
35782I320453J3142189K027443o378353o093810o554374j1261544r791751K935153
$$ 9320453 22462642 24490085 18111732 12017922 5463548 -5797996 -15589747 -12654594
35774a2654594J3967449R419191m536744r665423q65609Q428157O523954j785111
$$ -12654594 1312855 10732046 6195302 -3470121 -4335730 4092427 10616381 8831270
35766H831270n405669l166170j861063l316291l064372k81156P14587j96341K252451
$$ 8831270 3425601 259431 -1601632 -4917923 -7982295 -8263451 -7548864 -7745205 -5492754
35757e492754P576229P153847j301230o547067j07085Q377572M286529q661201
$$ -5492754 2083475 9237322 7936092 1389025 1281940 9659512 13946041 5284840
35749E284840j2694901k577282P095943M507717l268687l929060J352491K722056
$$ 5284840 -7410061 -9987343 -2891400 1616317 -1652370 -5581430 -4228939 -1506883
35741a506883j863232n218702k782740K746549P346275R444825Q345869M317920
$$ -1506883 -3370115 -8588817 -11371557 -8625008 -1278733 8166092 16511961 20829881
35733B0829881J1886k163021l059586l863675k640409J597202M050936k07125
$$ 20829881 20841767 18678746 15619160 11755485 9115076 10712278 14763214 14556089
35725A4556089o978813o764580J242200O427768J263464p954211j0169897m560626
$$ 14556089 7577276 812696 2054896 8482664 9746128 1791917 -8377980 -12938606
35717a2938606M95313R06067J112935M107387N290326O36181m926055l675048
$$ -12938606 -12443293 -11537226 -10424291 -6316904 -1026578 -390397 -5316452 -8991500
35709h991500L484009Q376047O980322K945244m4269k433739m035097j978752
$$ -8991500 -5507491 2868556 9848878 12794122 12749853 10316114 6281017 4302265
35701D302265L582691P358543N727820Q30184m427895r431450j1377547n519078
$$ 4302265 7884956 15243499 20971319 21801503 17373608 7942158 -3435389 -8954467
35693h954467N564636J1051910O381154L38913J94136n28806q395107j3779879
$$ -8954467 -3389831 7662079 14043233 14382146 14576282 14047476 5652369 -8127510
35685h127510m191143J2118325J4567266R54980r347184n401464J129653j597704
$$ -8127510 -12318653 -200328 14366938 15321918 5974734 573270 1702923 105219
35677A05219o879183m145642J912809N47101o144734o921676J369267J1274187
$$ 105219 -6773964 -10919606 -9006797 -8459696 -14604430 -21526106 -20156839 -8882652
35669h882652J5663593J2516847K821176q379340j2697013p373066R1345K036198
$$ -8882652 6780941 19297788 22118964 13739624 1042611 -6330455 -6239110 -4202912
35661d202912L12344Q6042O51275j42431Q51761N293246O094159k385045j1735031
$$ -4202912 -3890568 -3804526 -3153251 -3295682 -2443921 2849325 8943484 6558439 -5176592
35652e176592q956967L902950J1140503M202579q797001j5052836j0440947l33772
$$ -5176592 -14133559 -10230609 909894 5112473 -3684528 -18737364 -29178311 -29512083
35644b9512083O394859M455793j612346r53279Q383574J3375237L945106r391596
$$ -29512083 -23117224 -18661431 -20273777 -21227056 -12843482 531755 4476861 -4914735
35636d914735q897765L411773Q418498l58095p224034M793J0783708Q651742m312423
$$ -4914735 -13812500 -10400727 -1982229 -2340324 -9564358 -9559565 1224143 9875885 5563462
35627E563462j2333056q614283r04103L194030N470648R791709J2999485Q046883
$$ 5563462 -6769594 -15383877 -16287980 -13093950 -7623302 2168407 15167892 23214775
35619B3214775n120213j5473671j1347211M149220J3174179L931249j2632153
$$ 23214775 18094562 2620891 -8726320 -4577100 8597079 12528328 -103825
35612a03825j5661138k123678R788406O901956k107669l069751K057905J879857
$$ -103825 -15764963 -17888641 -8100235 -1198279 -3305948 -6375699 -4317794 -2437937
35604b437937l385561k452371O581294J0870319K438038q428815p809651J439455
$$ -2437937 -5823498 -8275869 -1694575 9175744 11613782 3184967 -4624684 -3185229
35596c185229M789446j467421n088038J993894R614422M091739r877564j4075156
$$ -3185229 1604217 136796 -4951242 -2957348 6657074 10748813 871249 -13203907
35588a3203907k460793J0123164Q863143j592902o068802k23262O374681N511530
$$ -13203907 -15664700 -5541536 3321607 1728705 -4340097 -4563359 1811322 7322852
35580G322852k20905l591222k011286J024644O64997l783753p234225m631407
$$ 7322852 7101947 3510725 1499439 2524083 3189080 -594673 -7828898 -12460305
35572a2460305J267804K627274j539723l074538K136403O786236M194202l43559
$$ -12460305 -11192501 -8565227 -10104950 -13179488 -11043085 -4256849 -62647 -406206
35564d06206J135503N736399N611231J157998k660474o979992j3406437j3940986
$$ -406206 729297 6465696 12076927 13234925 10574451 3594459 -9811978 -23752964
35556b3752964k033112J0903869Q040303n808339r340419K256345J0814405O183508
$$ -23752964 -25786076 -14882207 -6841904 -12650243 -21990662 -19734317 -8919912 -2736404
35548b736404J318839O605372J0382449M57021j2081156r342533M595449J0556490
$$ -2736404 -1417565 5187807 15570256 16027277 3946121 -5396412 -800963 9755527
35540I755527L129689n144550n125518q06018J587295J307893n65458k831643
$$ 9755527 12885216 7740666 2615148 1809130 3396425 4704318 4138860 1307217
35532A307217k530601R87934K733809k45238k295420J664369N944194L099801
$$ 1307217 -1223384 -235450 2498359 2253121 -42299 1622070 7566264 10666065
35524A0666065k186103k81094O169313N504101l936382j1217512r729869m482521
$$ 10666065 8479962 8198868 14368181 19872282 15935900 4718388 -5011481 -9494002
35516i494002q48871K413739N821390N109969j033916o763601o435046p96983
$$ -9494002 -10342873 -7929134 -2107744 3002225 1968309 -4795292 -11230338 -12027321
35508a2027321N747616Q719729M599983n091660j1240564o199294M898767R837644
$$ -12027321 -6279705 2440024 7040007 1948347 -9292217 -15491511 -10592744 -755100
35500g55100N760164Q60187k1510p48140l344237l311640Q17610L347219J442984
$$ -755100 5005064 5865251 5843741 5095601 1751364 -1560276 -742666 2604553 4047537
35491D047537J58649K556558L647626k04076m147018l422140j504149k877722
$$ 4047537 4206186 6762744 10410370 10206294 6059276 2637136 1132987 -1744735
35483a744735m628581k706817m92130k862081o321988l611111M508238R850389
$$ -1744735 -6373316 -9080133 -9572263 -12434344 -18756332 -22367443 -17859205 -8008816
35475h008816P969858K351823j847931k976447k129824j277645j940031l335178
$$ -8008816 -38958 2312865 464934 -2511513 -4641337 -5918982 -7859013 -11194191
35467a1194191k985965n43499J560840K400995L530825M321697J706109l183237
$$ -11194191 -14180156 -14723655 -13162815 -10761820 -7230995 -2909298 -1203189 -4386426
35459d386426m546488j426251k37844k859550p56401J0881530K0963815J5819639
$$ -4386426 -8932914 -10359165 -10597009 -13456559 -14212960 -3331430 17632385 33452024
35451C3452024k36218j0169698p722999k696505k802124l793502j131067Q97092
$$ 33452024 33215806 23046108 15323109 12626604 9824480 6030978 4899911 5797003
35443E797003j815200m627389k111852K484546L092814M61689j287406k788355
$$ 5797003 3981803 -645586 -2757438 -272892 2819922 3281611 1994205 -794150
35435g94150o305828q349366l964907L584971N823695J321545k802914k110658
$$ -794150 -7099978 -15449344 -19414251 -15829280 -10005585 -8684040 -11486954 -13597612
35427a3597612k7463k35892j088962m16810M24109O20957K183688M635544L624987
$$ -13597612 -13625075 -13860967 -14949929 -15366739 -14942630 -14321673 -12137985 -7502441 -3877454
35418c877454p34759r57332O024156J1019317N526024l458487l502390K413321
$$ -3877454 -4612213 -5569545 454611 11473928 16999952 13541465 10039075 12452396
35410A2452396K28230j0323608j2725023q89021Q321244J240650r295579l860373
$$ 12452396 12680626 2357018 -10368005 -11257026 -2935782 -1695132 -10990711 -14851084
35402a4851084J1080043J1886728m768376j5430484m674973J3043489J5531832
$$ -14851084 -3771041 8115687 3347311 -12083173 -16758146 -3714657 11817175
35395A1817175K312361r664632j0190705l788828J438835K667378J432315L99805
$$ 11817175 14129536 4464904 -5725801 -9514629 -8075794 -5408416 -3976101 -3576296
35387c576296P05820K27146k952748n249447j733998M084660L546519k301681
$$ -3576296 -2870476 -2643330 -5596078 -10845525 -12579523 -8494863 -4948344 -7250025
35379g250025k526245M748865O708303k555423q945526j91125J1706104P972682
$$ -7250025 -9776270 -5027405 1680898 -874525 -9820051 -10011176 1694928 9667610
35371I667610n595711o440378Q449997J6723626M781540j2719551j5819508n297468
$$ 9667610 4071899 -2368479 6081518 22805144 27586684 14867133 -952375 -6249843
35363f249843M707882P399907N339857J022538l666539m819304k100068j457227
$$ -6249843 -1541961 5857946 11197803 12220341 8553802 3734498 1634430 177203
35355A77203n267780o545452n37152N251155J987228n693640o302087J371826
$$ 177203 -5090577 -11636029 -12173181 -6922026 -4934798 -10628438 -16930525 -15558699
35347a5558699Q196757Q906831O190967K414136k638604o205468m179387J095959
$$ -15558699 -7361942 1544889 7735856 10149992 7511388 1305920 -2873467 -1777508
35339a777508K842276Q9877j926937j623957k553452m202276r10376P134808J0882766
$$ -1777508 1064768 1154645 -772292 -2396249 -4949701 -9151977 -10062353 -2927545 7955221
35330G955221N030062l933627p532603o483962o071860o145759l045817K117965
$$ 7955221 12985283 9051656 1519053 -4964909 -11036769 -17182528 -20228345 -18110380
35322a8110380M532669L618438L611996O401748Q757774P083991J352242n649491
$$ -18110380 -13577711 -9959273 -6347277 54471 8812245 15896236 17248478 11598987
35314A1598987j0065675q817435l022133J409778M02434k051387Q85744P740763
$$ 11598987 1533312 -7284123 -10306256 -8896478 -8494044 -10545431 -9659687 -1918924
35306a918924R041590Q50169q201199q087427r30548L125081Q58484j164333J302028
$$ -1918924 7122666 7972835 -228364 -8315791 -9246339 -6121258 -5262774 -6427107 -5125079
35297e125079L802892K303453R40482M259734P506439L325032m940816o534577
$$ -5125079 -1322187 981266 1921748 6181482 13687921 17012953 12072137 5537560
35289E537560K10376M657816n8856o882601n891059J864083P916754Q208638M837841
$$ 5537560 5747936 10405752 10346896 3464295 -2426764 -562681 7354073 15562711 20400552
35280B0400552M00750l076691l264354j276909k137214o049492n120721L919880
$$ 20400552 20801302 17724611 14460257 13183348 11046134 4996642 -124079 3795801
35272C795801J0615924M870319n840675o676489J173556L158349l593280n629046
$$ 3795801 14411725 19282044 13441369 6764880 7938436 11096785 7503505 1874459
35264A874459L070543J0223147N652499k889010m356196j694835k905863n809081
$$ 1874459 4945002 15168149 20820648 17931638 13575442 11880607 8974744 3165663
35256C165663m171532k67879Q05134J549615N008914N322636j989216q324898
$$ 3165663 -1005869 -1273748 -468614 1081001 6089915 11412551 9423335 1098437
35248A098437m734968J327730j904051q623524m543129O792515Q108352k119887
$$ 1098437 -3636531 -2308801 -4212852 -12836376 -17379505 -10586990 -2478638 -4598525
35240d598525o526251J759018Q434038L423944l520587k298060R34839j580272
$$ -4598525 -11124776 -9365758 -931720 2492224 -1028363 -3326423 -2391584 -3971856
35232c971856m236467q47384K027455j559247l495656L428836R295003K646513
$$ -3971856 -8208323 -9055707 -7028252 -8587499 -12083155 -8654319 640684 3287197
35224C287197p976829o579865L888238P034899K850m712094k248731o81177k705799
$$ 3287197 -4689632 -11269497 -7381259 -346360 -343510 -5055604 -7304335 -7985512 -10691311
35215a0691311q34367N591296N762063m196450j2609956r128934J432847Q829246
$$ -10691311 -11525678 -5934382 -172319 -4368769 -16978725 -26107659 -24674812 -15845566
35207a5845566J0782664J0055590O999375J869805j973810k579226j936963j111066
$$ -15845566 -5062902 4992688 11992063 13861868 11888058 9308832 7371869 6260803
35199F260803J225640L745701L005109K17066l34117m4704l665084p971535m578322
$$ 6260803 7486443 11232144 14237253 14454319 14120202 14075498 10410414 2438879 -2139443
35190b139443M356727O669538k31022m852290j791797m42462n533783n906710
$$ -2139443 2217284 8886822 8655800 3803510 2011713 1569251 -3964532 -9871242
35182i871242M982337J3238085N601114o796735n094543O644987Q996586l36353
$$ -9871242 -4888905 8349180 13950294 7153559 2059016 8704003 17700589 17364236
35174A7364236m588460K155416N794736k333137j0853618q001585l3520Q49942
$$ 17364236 12775776 14931192 20725928 18392791 7539173 -462412 -495932 354010
35166C54010m396326n787802k79278O202380Q424531N989200O63995m768523o974216
$$ 354010 -4042316 -9830118 -10109396 -3907016 4517515 10506715 11170710 6402187 -572029
35157e72029n144142k003037j18505L83833R0856j88931J530818N387228O481769
$$ -572029 -5716171 -7719208 -7837713 -7453880 -7363024 -7551955 -6021137 -633909 5847860
35148E847860N68563p626656q808055k113212L850187L907444K066041K339471
$$ 5847860 6416423 -1210233 -10018288 -12131500 -8281313 -4373869 -2307828 31643
35140C1643K286915o46750l756046m232807l472269k570770L87936N016425O578497
$$ 31643 2318558 1671808 -2084238 -6317045 -9789314 -12360084 -11972148 -6955723 -377226
35131c77226K807567k621982n885126o288546k482214O326736J3315019Q555160
$$ -377226 2430341 -191641 -6076767 -12365313 -14847527 -8520791 4794228 13349388
35123A3349388n030296j1222997k765015O981778M101880m487748k786768Q200446
$$ 13349388 8319092 -2903905 -5668920 1312858 5414738 926990 -1859778 6340668
35115F340668J1415147p77133j5616989j6982080m183705R435979J1371595J709422
$$ 6340668 17755815 16978682 1361693 -15620387 -19804092 -10368113 1003482 2712904
35107B712904p323540m579685N905789R042978k88472q668202l453240Q075633
$$ 2712904 -4610636 -9190321 -3284532 5758446 5469974 -3198228 -6651468 1424165
35099A424165J0007164J745092l129163J062298N630344L697066m94291j575255
$$ 1424165 11431329 13176421 10047258 11109556 16739900 20436966 19942675 18367420
35091A8367420j218529k069267k434209j287059j431641m061986o061335n267254
$$ 18367420 17148891 15079624 12645415 11358356 9926715 5864729 -196606 -5463860
35083e463860l242907j638796r11823k243089m828949l238989M683005J0072046
$$ -5463860 -8706767 -10345563 -11257386 -13500475 -18329424 -21568413 -16885408 -6813362
35075f813362L962083o068717l952692R613761J5660498M927869q431427q866720
$$ -6813362 -2851279 -8919996 -12872688 -3258927 12401571 17329440 8898013 31293
35067C1293n38982M042160L532473L053398O29507o931544j2047224n433866P230164
$$ 31293 -507689 3534471 7066944 10120342 10749849 3818305 -8228919 -13662785 -6432621
35058f432621J1871561O291154L69377j534938m009982p086247m376682K987052
$$ -6432621 5438940 11730094 12099471 10564533 6554551 -531696 -4908378 -1921326
35050a921326M705559j856818o013983j139012M128630N08739o099166m164229
$$ -1921326 2784233 927415 -5086568 -6225580 -2096950 -1588211 -7687377 -11851606
35042a1851606M866720R113441M123144k807400n353567m924466l385621J235508
$$ -11851606 -6984886 2128555 6251699 3444299 -1909268 -6833734 -10219355 -8983847
35034h983847P697027Q366283k98909r541166q472028L57634M236022j031370
$$ -8983847 -1286820 7079463 6780554 -2760612 -11232640 -10875006 -6638984 -7670354
35026g670354n191154J12799P858815O234008l094939p452167j895119N215569
$$ -7670354 -12861508 -12748709 -4889894 1344114 -1750825 -9202992 -11098111 -5882542
35018e882542O568033N117008M591625R23964q677564j5648572r937814L611516
$$ -5882542 685491 5802499 10394124 11318088 2640524 -13008048 -22945862 -19334346
35010a9334346J0071515N364358J280696O524035J2913952P575375p554572j7197233
$$ -19334346 -9262831 -3898473 -2617777 3906258 16820210 24395585 16841013 -356220
35002c56220j1878826J741535J0330939Q045254p01930q318203j0495593p472851
$$ -356220 -12235046 -10493511 -162572 7882682 7180752 -1137451 -11633044 -19105895
34994a9105895k114072K745093O007426P686652P284991M516957J561166J590855
$$ -19105895 -21219967 -18474874 -12467448 -4780796 2504195 7021152 8582318 10173173
34986A0173173L695826K709413l005041p258868m545310K59109j744069q570947
$$ 10173173 13868999 16578412 13573371 6314503 1769193 2028302 284233 -8286714
34978h286714q462630J961174J0926101Q671263J991908K497455P625067N287824
$$ -8286714 -16749344 -14788170 -3862069 4809194 6801102 9298557 16923624 22211448
34970B2211448o016020j4183259j0826839j026755N937742O662489K497617l460356
$$ 22211448 16195428 2012169 -8814670 -9841425 -3903683 2758806 5256423 1796067
34962A796067o074352k240353K995195J641090m870368o854159j316488L743331
$$ 1796067 -4278285 -6518638 -3523443 -1882353 -6752721 -13606880 -14923368 -11180037
34954a1180037K725131K97980J549618L588681K543023P60628J136607J387099
$$ -11180037 -8454906 -8156926 -6607308 -3018627 -475604 285024 1421631 2808730
34946B808730o04708k458270k844665m126739n676187l259054J158108j72944
$$ 2808730 2204022 -254248 -3098913 -7225652 -12901839 -16160893 -15002785 -15175729
34938a5175729n709227l174720R222698J4934438M118198q089806m325339O919179
$$ -15175729 -20884956 -24059676 -14836978 97460 4215658 -3874148 -8199487 -1280308
34930a280308N976179n044077p471649P99225K830091n942985q934293K408391
$$ -1280308 4695871 -348206 -7819855 -7020630 -4190539 -10133524 -19067817 -16659426
34922a6659426J3150544R477358J12400k71413N674583O124123P15089k158489
$$ -16659426 -3508882 5968476 6080876 5809463 11484046 17608169 18323258 16164769
34914A6164769j666538l649089p366523o462513j663585n80597m306031m766481
$$ 16164769 14498231 10849142 3482619 -2979894 -4643479 -5224076 -9530107 -14296588
34906a4296588J968636Q454072O421070j470060n829727l187835J120749J841212
$$ -14296588 -12327952 -3873880 2547190 1077130 -4752597 -7940432 -6819683 -4978471
34898d978471N6001j157614k387592m727923m398424K496456J0641144R292329
$$ -4978471 -4922470 -6080084 -8467676 -13195599 -17594023 -15097567 -4456423 4835906
34890D835906k302672j1320178p649998L374383R824604P674820L82050q265157
$$ 4835906 2533234 -8786944 -16436942 -13062559 -3237955 4436865 4818915 -3446242
34882c446242j3074133p177961P291120J5606423Q731299k197608k662699K130216
$$ -3446242 -16520375 -23698336 -16407216 -800793 7930506 5732898 3070199 5200415
34874E200415j902198j0524005o900079P359716J1379702p01507r033822j117907
$$ 5200415 3298217 -7225788 -14125867 -6766151 4613551 3912044 -5121778 -6239685
34866f239685P403460j11712j2912048j0931473K808653R146151L752390n1345
$$ -6239685 1163775 1052063 -11859985 -22791458 -19982805 -10836654 -7084264 -7135609
34858g135609L644568N131056k147037j0441134j0225393k988719L448003N101698
$$ -7135609 -3491041 1640015 -507022 -10948156 -21173549 -24162268 -20714265 -15612567
34850a5612567L329867J107751Q18166K887328N052902M461069O10044m223839
$$ -15612567 -12282700 -11174949 -10356783 -7469455 -2416553 2044516 2654560 -1569279
34842a569279o248494k615603M204307O253030J24332m984364J258755J1848233
$$ -1569279 -7817773 -10433376 -6229069 23961 148293 -4836071 -3577316 8270917
34834H270917R095693p500913j6282567m591952J1076731R604541l690324q297485
$$ 8270917 17366610 9865697 -6416870 -11008822 67909 9672450 5982126 -2315359
34826b315359j170449K537954k890251o501363k101534K274151J047913P52245
$$ -2315359 -3485808 -947854 -3838105 -10339468 -12441002 -10166851 -9118938 -8366693
34818h366693N880401Q762210K442385o521275p237096M75186P938439R230583
$$ -8366693 -2486292 6275918 8718303 2197028 -5040068 -4564882 3373557 12604140
34810A2604140M597098k967368q717677p857290j494453K816693J066090j016343
$$ 12604140 17201238 14233870 5516193 -2341097 -3835550 -1018857 47233 -969110
34802i69110K857208Q456780O426880l381062j0798713r043858k487096J727828
$$ -969110 1888098 10344878 16771758 13390696 2591983 -6451875 -8938971 -7211143
34794g211143L645506P218737J1094589R372652J155597o647799p898328m072618
$$ -7211143 -3565637 3653100 14747689 24120341 25275938 18628139 10729811 6657193
34786F657193k02214J711343K053803O67339j122498M58367N346386O427975p55000
$$ 6657193 6454979 8166322 10220125 10887464 9764966 10223333 15569719 21997694 21242694
34777B1242694q919734q078829o67489K469118n48818j150661L412791N301463
$$ 21242694 12322960 4244131 3576642 6045760 5496942 4346281 7759072 13060535
34769A3060535P70462l116966j876052j748266p287011j1594884p436808J037899
$$ 13060535 13830997 10714031 8837979 7089713 -197298 -11792182 -19228990 -18191091
34761a8191091O098228P422875P077557K617675n314103p370166J468129J0706149
$$ -18191091 -12092863 -4669988 2407569 5025244 -288859 -7659025 -6190896 4515253
34753D515253P773266l545423r591063o177713Q3009M653786P299119N699949
$$ 4515253 12288519 8743096 -847967 -7025680 -6942671 -2288885 5010234 10710183
34745A0710183j161405o454201l470980L069269M129010O20256l38905J285794
$$ 10710183 9548778 3094577 -376403 2692866 6821876 7442132 7103227 8389021
34737H389021P68748m79766J069593J108692m754734q541778q83626J0187286
$$ 8389021 9157769 8678003 9747596 10856288 6101554 -2440224 -3323850 6863436
34729F863436R222295j108893m222889J913605K467399n887123p514306L949758
$$ 6863436 16085731 14976838 10753949 12667554 15134953 9247830 1733524 5683282
34721E683282J1813777K759334j1169588j1590498q83447N083332J466294l239603
$$ 5683282 17497059 20256393 9086805 -2503693 -3387140 1696192 3162486 -77117
34713g7117l427256j899831j971035l455868m696842l023523L226726R336891
$$ -77117 -3504373 -5404204 -7375239 -10831107 -15527949 -18551472 -15324746 -5987855
34705e987855O862522l876966j0777909m936012P495737J3879546R928560J032361
$$ -5987855 874667 -3002299 -13780208 -18716220 -11220483 2659063 12587623 13619984
34697A3619984n870258p107695l489966Q1456K57246O66949N430069R008150K987201
$$ 13619984 7749726 642031 -2847935 -2766479 -2509233 -1842284 3587785 12595935 15583136
34688A5583136p704907r019860l8028M441461j876455o533833k53336P267002
$$ 15583136 7878229 -1141631 -1179659 3261802 1385347 -5148486 -5401822 1865180
34680A865180M808751j938855k988755j952553n815082q048913N23497J2062969
$$ 1865180 6673931 4735076 1746321 -206232 -6021314 -14070227 -13546730 -1483761
34672a483761J1066016j275972r029910n115163K633960O996354P796289L907365
$$ -1483761 9582255 8306283 -723627 -5838790 -3204830 3791524 11587813 15495178
34664A5495178o058381j4555416j0938769J637223Q196684L085422l425020k613920
$$ 15495178 9436797 -5118619 -16057388 -14420165 -6223481 -3138059 -6563079 -9176999
34656i176999J170968J279227l06256O76948K450858K119706K031289M664701
$$ -9176999 -8006031 -6726804 -7033060 -6356112 -3905254 -1785548 245741 4910442
34648D910442O605636L896066q44629k691442k468592m060916n559185o43357
$$ 4910442 11516078 15412144 14567515 11876073 9407481 5346565 -212620 -855977
34640h55977R540393J2912044J225664j4948730j5450625K860614J8508926J2456748
$$ -855977 8684416 21596460 22822124 7873394 -7577231 -4716617 13792309 26249057
34632B6249057n395950j0154905K042287R803589K29270j2400258j0726616r9936
$$ 26249057 20853107 10698202 12740489 22544078 22773348 10373090 -353526 -453462
34624d53462L958481J100091J730642N619661L202373n393578r529566n614261
$$ -453462 3505019 4605110 6335752 11955413 15157786 9764208 234642 -5379619
34616e379619r12967L81656J624989L711185L167462J174944K431230M131687
$$ -5379619 -6292586 -5910930 -4285941 -574756 2592706 3767650 6198880 10330567
34608A0330567j333938j0968754j1698606k50008R812382O813015l349755o769722
$$ 10330567 8996629 -1972125 -13670731 -13920739 -4108357 2704658 -645097 -7414819
34600g414819P81900J1435243J4783763O127337r382283j8712055j3174195K14578
$$ -7414819 -6632919 4802324 19586087 25713424 16331141 -2380914 -15555109 -15340531
34592a5340531O666501K964454o09343J602800K883757j212109k957134M429742
$$ -15340531 -8674030 -5709576 -6318919 -4716119 -1832362 -3044471 -6001605 -1571863
34584a571863J3303640J1489523K3657q588093p058797l49273L033857Q28191
$$ -1571863 11731777 23221300 23244957 14656864 7598067 7248794 10282651 11110842
34576A1110842k405785j546546K820152M755685R42862m056453m468554k081753
$$ 11110842 8705057 7158511 9978663 14734348 15677210 11620757 7152203 5070450
34568E070450j775992j506334L722685R878109P865962k97726k527328L756576
$$ 5070450 3294458 1788124 5510809 15388918 23254880 22957154 20429826 24186402
34560B4186402P132433J674946l808969k853281k494976p746610r849734k763464
$$ 24186402 31318835 32993781 29184812 26331531 23836555 16089945 6240211 3476747
34552C476747K513926m119035j1723825m864092Q983751R728200l018395j0109091
$$ 3476747 5990673 1871638 -9852187 -14716279 -5732528 3995672 977277 -9131814
34544i131814l857688L328078L305977L343306P258009O102513l126144p878543
$$ -9131814 -12989502 -9661424 -6355447 -3012141 4245868 10348381 7222237 -656306
34536f56306p91160O012479P50520p954392o233084J407372Q69053p366098j0677881
$$ -656306 -1447466 4565013 5315533 -2638859 -8871943 -7464571 -6595518 -13961616 -24639497
34527b4639497n684596L50156N887664J4541390J9770260J0311943o818161r620572
$$ -24639497 -30324093 -29973937 -24086273 -9544883 10225377 20537320 13719159 4098587
34519D098587N648354J4804062J263073j7205228j4737596L847972J2497873M156772
$$ 4098587 9746941 24551003 25814076 8608848 -6128748 -2280776 10217097 14373869
34511A4373869k667302L181773R708526M978502m128632o777144n436305n719417
$$ 14373869 11706567 14888340 24596866 29575368 25446736 18669592 13233287 7513870
34503G513870k733294P296102J2650298J379621j5482278j5391118K477326J4645571
$$ 7513870 4780576 12076678 24726976 26106597 10624319 -4766799 -2289473 12356098
34495A2356098O960797p282520j0003504l008351J195926O34427J757270L972128
$$ 12356098 19316895 12034375 2030871 -977480 218446 852873 2610143 6582271
34487F582271J200586m484407m644206M81573J366398m472860p244373m83392
$$ 6582271 7782857 3298450 -1345756 -864183 502215 -3970645 -11215018 -11698410
34479a1698410Q107400Q281668K283735k23802K126842J361934n339012q933087
$$ -11698410 -3591010 4690658 6974393 6750591 8877433 10239367 4900355 -4032732
34471d032732p72606J3257198J7376473N012760j1810128j5891926n247570N435916
$$ -4032732 -4805338 8451860 25828333 30841093 19030965 3139039 -2108531 3327385
34463C327385M252523l583580n420122K86215L698964L39630k110480K761722
$$ 3327385 7579908 3996328 -1423794 -1137579 2561385 2901015 790535 3552257
34455C552257Q463542M666496o824499j3375553p731569L958379J1052483R749560
$$ 3552257 12015799 16682295 9857796 -3517757 -11249326 -7290947 3761536 13511096
34447A3511096L617033k808454p663189j0616593j0606995n612202M397503J4109347
$$ 13511096 17128129 14319675 6656486 -3960107 -14567102 -20179304 -15781801 -1672454
34439a672454J5479730O722047l499761n194439P15797M097172p11485q253030
$$ -1672454 13807276 20529323 17029562 11835123 12550920 16648092 15936607 7683577
34431G683577j0035542m330717L849305Q286665N490114k500579p628319k939814
$$ 7683577 -2351965 -6682682 -2833377 5453288 10943402 8442823 814504 -2125310
34423b125310P867857J3131991P576692j810755o682692o899789n295428j271110
$$ -2125310 5742547 18874538 26451230 24640475 17957783 11057994 5762566 4491456
34415D491456L728904K462446p015973j3086988m680623J0844278J6178860P813825
$$ 4491456 8220360 10682806 3666833 -9420155 -14100778 -3256500 12922360 20736185
34407B0736185j414958k471523M99490J737384J402897r89595p668041j3625855
$$ 20736185 19321227 16849704 17349194 19086578 20489475 19499880 11831839 -1794016
34399a794016r701054J014587L948812l890670p318589J500575P744226j461111
$$ -1794016 -11495070 -10480483 -6531671 -10422341 -17740930 -16240355 -8496129 -9957240
34391i957240j2454797n147609J2922486J6454955K053762o981029J926938J2229574
$$ -9957240 -22412037 -27559646 -14637160 1817795 3871557 -3109472 -1182534 11047040
34383A1047040O417055p238336j0024345r29300O223414N390201K693437K039543
$$ 11047040 17464095 10225759 201414 -727886 5495528 10885729 13579166 15618709
34375A5618709L64625k767889k379187K578043N665492K353659l081756l949297
$$ 15618709 15983334 13215445 10836258 13414301 19079793 21433452 18351696 14402399
34367A4402399l03950K357992J298046o67381m90626K39443k251826p673636j0447173
$$ 14402399 14098449 16456441 17754487 17087106 16596480 16835923 14584097 6910461 -3536712
34358c536712o074704K541064P309492L738450m013507p577059l044137N367205
$$ -3536712 -9611416 -7070352 239140 3977590 -35917 -7612976 -10657113 -5289908
34350e289908R886181O976309M45236l142396j346860K828458N490500N285152
$$ -5289908 4596273 11572582 12017818 8875422 7528562 10357020 15847520 21132672
34342B1132672K457029k173227o166811o630481m176787k622716k917593j292186
$$ 21132672 23589701 21416474 15249663 8619182 4442395 1819679 -1097914 -2390100
34334b390100L665545O529394K442119m413589n689727m12672M200199K743414
$$ -2390100 1275445 7804839 10246958 5833369 143642 -269030 3931169 6674583
34326F674583k800453p161371o876424j903388L585620L507433k238375m687903
$$ 6674583 3874130 -3287241 -10163665 -12067053 -8481433 -4974000 -7212375 -11900278
34318a1900278K752198J2390892J1042250k28187o607628j748438L386063J1694
$$ -11900278 -9148080 3242812 14285062 14056875 7449247 5700809 9086872 9098566
34310I098566l075755M618294J3662531N738568j6248395k6707665j1126120J2740793
$$ 9098566 6022811 10641105 24303636 30042204 13793809 -12913856 -24039976 -11299183
34302a1299183J7550980J431730j2280376p299358O685163J0555814R91463q612033
$$ -11299183 6251797 7683527 -4596849 -11896207 -5211044 5344770 6336233 -2275800
34294b275800p401542J393489P702601O451015L19984m554814l436206L005115
$$ -2275800 -9677342 -8283853 -581252 5869763 6189747 1634933 -1801273 1203842
34286A203842P833528M374327m964058j0340545o659629O61458M566257N119658
$$ 1203842 9037370 13411697 8447639 -1892906 -8552535 -7891077 -3324820 1794838
34278A794838M991787K465751l747511p511930k413206O544976Q431523K966127
$$ 1794838 6786625 9252376 5504865 -2007065 -4420271 2124705 10556228 13522355
34270A3522355P46086N263696O440844k402539j1686001q865116K486111P688077
$$ 13522355 14268441 19532137 25972981 23570442 11884441 3019325 5505436 13193513
34262A3193513J779316n385621m891317M218J271149k575800o920214p990809
$$ 13193513 14972829 9587208 4695891 4700109 5971258 3395458 -3524756 -11515565
34254a1515565m921512J878313R867300J3692695R817343J553641m042272m420280
$$ -11515565 -16437077 -14558764 -4691464 9001231 18818574 20372215 16329943 11909663
34246A1909663l395770m309732n141620k587723J901366L420184j69843n875520
$$ 11909663 8513893 4204161 -937459 -3525182 -1623816 1796368 1626525 -4248995
34238d248995q803689o097523Q41827O103902L735749m197138o916821K144425
$$ -4248995 -13052684 -19150207 -18308380 -12204478 -8468729 -12665867 -19582688 -17438263
34230a7438263J3784523J2380417k554119j3208196o178373R592594J4833572
$$ -17438263 -3653740 8726677 6172558 -7035638 -13214011 -3621417 11212155
34223A1212155M528445q377074j1614316o692752j936198j51101J934734N542184
$$ 11212155 15740600 7363526 -4250790 -10943542 -12879740 -13030841 -11096107 -5553923
34215e553923O682621K278850l378322k104655O899722J2951509O061613q457242
$$ -5553923 1128698 3407548 29226 -2075429 4824293 17775802 23837415 15380173
34207A5380173j4745986o825111L822697N027689J53624J53146N590220O665215
$$ 15380173 634187 -6190924 -2368227 2659462 2813086 2966232 8556452 15221667
34199A5221667j008120j0376328j3399119r565979k292430N887003J1250863Q225858
$$ 15221667 14213547 3837219 -9561900 -19127879 -21420309 -15533306 -4282443 3943415
34191C943415l658288j5012993j4470877j802431J0742690J2244782N502424J805766
$$ 3943415 285127 -14727866 -29198743 -31001174 -20258484 -8013702 -2511278 -705512
34183g05512M882215O709058J288575n429692n787907l202269m433339m981444
$$ -705512 4176703 10885761 12174336 6744644 956737 -2245532 -6678871 -11660315
34175a1660315L537454J4302320J1139689m650630j1938863p84927J2198719R832533
$$ -11660315 -8122861 6179459 17319148 12668518 729655 -55272 12143447 21975980
34167B1975980j064304m746522j343502k08549o21661K858908N028063j612571
$$ 21975980 20911676 16165154 14821652 14613103 13991442 16850350 21878413 20265842
34159B0265842j0055636q138158R99933M842008K162743P23838O26305j933242
$$ 20265842 10210206 2072048 3071981 7913989 10076732 10800570 11426875 9493633
34151I493633j148376Q029988J3046228M63334j6394138j3157090N523301J1184765
$$ 9493633 8345257 16375245 29421473 29884807 13490669 333579 5856880 17041645
34143A7041645k743232j2250344n053271J231602n587622j0240187J63093J2009946
$$ 17041645 14298413 2048069 -3005202 -1773600 -7361222 -17601409 -17438316 -5428370
34135e428370J0282855L606707L972345L805780n073030j0554725j925061O658361
$$ -5428370 4854485 8461192 12433537 16239317 11166287 611562 -1313499 5344862
34127E344862j98688r441296j455615J3360303J0874516m698702p800589M992636
$$ 5344862 5146174 -4295122 -5750737 7609566 18484082 13785380 5984791 10977427
34119A0977427J1440220K943695m577459k981975m709383j4791084j7431958l125226
$$ 10977427 22417647 25361342 20783883 17801908 13092525 -1698559 -19130517 -22255743
34111b2255743J3343280J5900132R616653O158275L307955n214778j2362010p183671
$$ -22255743 -8912463 6987669 16604322 22762597 26070552 20855774 8493764 1310093
34103A310093N874556J2085121O767144j587725n631347n939384m731806j904216
$$ 1310093 7184649 19269770 26036914 24449189 18817842 12878458 8146652 6242436
34095F242436J916016M308512L849241P14327m540668r811573j0709123m604069
$$ 6242436 8158452 12466964 16316205 17030532 12489864 2678291 -8030832 -12634901
34087a2634901N073389J1198346R683488K762434l719100n318112k114524K016014
$$ -12634901 -7561512 3636834 13320322 16082756 12363656 7045544 4931020 6947034
34079F947034L100467L54457l511906m466055n34576N189991O148399R7081o012438
$$ 6947034 10047501 10401958 6890052 2423997 1889421 7079412 13227811 13324892 7312454
34070G312454l912548L899401O664202N38421o743431q514149p347933o390291
$$ 7312454 3399906 7299307 13963509 14501930 7758499 -755650 -8103583 -14493874
34062a4493874k308788O042195J0766633N915300j650313k176917K045023J980140
$$ -14493874 -16802662 -10760467 6166 5921466 4271153 2094236 4139259 6119399
34054F119399k897394n724573m937111m457721l715380R56795O267927M986532
$$ 6119399 3222005 -2502568 -7439679 -11897400 -15612780 -14655985 -8388058 -3401526
34046c401526q93777j405135N458041R883162N404942j685148k585596J841345
$$ -3401526 -4295303 -5700438 -242397 9640765 15045707 13360559 10774963 12616308
34038A2616308M063854N0410p445661j2355714r819306m52399Q509201R402652
$$ 12616308 16680162 16730572 9284911 -3070803 -12890109 -13342508 -4833307 4569345
34030D569345K467531m530683n180062m64831L927248M121693J739490J579846
$$ 4569345 7036876 2506193 -2673869 -3138700 788548 4910241 6649731 8229577
34022H229577M790489N964406R15164m839310k934242L397496K453203o728804
$$ 8229577 13020066 18984472 19899636 15060326 12126084 15523580 17976783 11247979
34014A1247979j1127351m452902K828818K020039J52117M141983N628780k917722
$$ 11247979 120628 -4332274 -1503456 516583 668700 4810683 10439463 7521741
34006G521741j0024012k352543J0128148P896894n904433j0456106j472231L954450
$$ 7521741 -2502271 -4854814 5273334 13170228 7265795 -3190311 -4662542 -708092
33998g08092k016081o529425q65637N220744K913756p64638J830327M729552R80612
$$ -708092 -2724173 -9253598 -10119235 -4898491 -1984735 -2749373 -919046 3810506 4791118
33989D791118l461723m17413N944501O371230P66108m413301o640355o953813
$$ 4791118 1329395 911982 6856483 13227713 13993821 9580520 2940165 -4013648
33981d013648m687992J35896L647997L026368N14261j139877k402782l398861
$$ -4013648 -8701640 -8565744 -4917747 -1891379 -1377118 -2516995 -4919777 -8318638
33973h318638k305305L26272J592135K192446N684474J0641891J1171923O459581
$$ -8318638 -10623943 -10297671 -8705536 -6513090 -828616 9813275 20985198 27444779
33965B7444779J754802r31558m099488o216021k529513M145419M959900k66901
$$ 27444779 29199581 28268023 24168535 17952514 15423001 19568420 24528320 24261419
33957B4261419j952438K475699L784557k258786o810081l738045n94194m667600
$$ 24261419 22308981 24784680 28569237 26310451 19500370 15762325 15168131 10500531
33949A0500531r477274n948951J985870M324914J037291K32378M300619P439307
$$ 10500531 1023257 -4925694 -2939824 1385090 2422381 2654759 6955378 14394685
33941A4394685N208265k98742l848618k005773L377071N491189L94962n840225
$$ 14394685 19602950 19304208 15455590 13449817 16826888 22318077 22713039 16872814
33933A6872814m429180K257994L474623k588636n480787O24003Q061095Q270439
$$ 16872814 12443634 14701628 18176251 15587615 10106828 10730831 18791926 27062365
33925B7062365K864402k707951o619955p242401k362180L767081K900650l806077
$$ 27062365 29926767 27218816 20598861 13356460 10994280 14761361 17662011 13855934
33917A3855934o063183j405698J241191j256365q47850M368718M364987l270847
$$ 13855934 7792751 6387053 7628244 6371879 5524029 9892747 14257734 10986887
33909A0986887n643381L093595R436675L449599l702293n29549L908963j541238
$$ 10986887 5343506 8437101 17873776 21323375 17621082 17091533 21000496 19459258
33901A9459258p140733K09172J0179323M752850r120317r147459N563981J3946842
$$ 19459258 12318525 12527697 22707020 27459870 18339553 9192094 14756075 28702917
33893B8702917P628949O37700K487971N186018K072387r32373O36232J656170
$$ 28702917 36331866 36969566 39457537 44643555 46715942 45783569 46419801 48075971
33885D8075971p27882j933095r84105k536314m914182j055336O155353N764031
$$ 48075971 47348089 45414994 44430889 41894575 36980393 35925057 42080410 47844441
33877D7844441j142216j004264Q138171J1346507K669160l372188L116283R464237
$$ 47844441 46702225 45697961 53836132 65182639 67851799 64479611 67595894 77060131
33869G7060131J911847j0799394j1914283k499361M328763N444643O622729O755218
$$ 77060131 78971978 68172584 56258301 53758940 58087703 63532346 70155075 76910293
33861G6910293J044942m606013o8433J0145688J1331638J800620m682972j448988
$$ 76910293 77955235 73349222 73280789 83426477 94758115 96558735 91875763 90426775
33853I0426775K167711j138669m767821j647955L113833K058265j898600j795651
$$ 90426775 92594486 91455817 86687996 85040041 88153874 90212139 88313539 86517888
33845H6517888J992623N345511Q319490J0897929Q084542r81227o161661k21149
$$ 86517888 88510511 93856022 102175512 113073441 121157983 120176756 114015095 113793946
33837A13793946O971590K193215q526931q195419K908054P319143K04523k946236
$$ 113793946 120765536 122958751 114431820 106236401 109144455 116463598 116668121 113721885
33829A13721885M705447P251301n957645j8803516j3485944k88143L2363r126420
$$ 113721885 118427332 125678633 119720988 100917472 87431528 87143385 87175748 78049328
33821G8049328q260486L645090R070037L207311r68082Q76383j385426q652256
$$ 78049328 69788842 73433932 82503969 85711280 84743198 85619581 84234155 75581899
33813G5581899q263530R80394L787796m312643q854061m362882m825070j4363110
$$ 75581899 67318369 68298763 72086559 67773916 58919855 54556973 49731903 35368793
33805C5368793j4247038L772714J6968723O657907r358390n926864P459479M767514
$$ 35368793 21121755 24894469 41863192 48521099 39162709 33235845 40695324 45462838
33797D5462838j0586337j2174641L303862J0601552j676138j3816593p689014
$$ 45462838 34876501 22701860 26005722 36607274 34931136 21114543 13425529
33790A3425529P877300J4444451Q357511j603322p275291m800585L725211Q277558
$$ 13425529 21302829 35747280 44104791 42501469 35226178 30425593 34150804 42428362
33782D2428362Q94299j1050289j2899954l896965K806003J195123j265984M57790
$$ 42428362 43322661 32272372 19372418 15475453 18281456 19476579 18210595 18668385
33774A8668385J912583P03172O55377J317151k725798r042123q191840p15725
$$ 18668385 20580968 21284140 21939517 23256668 20530870 11488747 3296907 2581182
33766B581182J590664m418237p427416j328316M726560L172324N4523J416957
$$ 2581182 4171846 -246391 -7673807 -9002123 -4275563 -1103239 -1048716 368241
33758C68241J707396l740806p132162r63512P806855Q446850L188500J457783
$$ 368241 2075637 -1665169 -8797331 -9760843 -1953988 6492862 9681362 11139145
33750A1139145L888880L733519l10422l315190l235878k016931k25237J990441
$$ 11139145 15028025 18761544 18451122 15135932 11900054 9883123 9657886 11648327
33742A1648327J626091k477959m982681j283565L760145K098427m644431o672006
$$ 11648327 13274418 10796459 5813778 4530213 8290358 10388785 5744354 -927652
33734i27652j07461P703446Q368070K300293l828056n484488l309908M552K662961
$$ -927652 -1035113 6668333 15036403 17336696 13508640 8024152 4714244 4718796 7381757
33725G381757L528595J534927k690103n839105n297420k958167k270939k098155
$$ 7381757 10910352 12445279 9755176 3916071 -1381349 -4339516 -6610455 -8708610
33717h708610J285016N984936N609701M31500j411383K265391K900070l280507
$$ -8708610 -7423594 -1438658 4171043 4602543 3191160 5456551 8356621 5076114
33709E076114o209044J378077R130868M697102n047498n005046K821927L906511
$$ 5076114 -1132930 245147 9376015 14073117 9025619 4020573 6842500 10749011
33701A0749011k983621m952098R01092L419049m38546k00765O460778P109572
$$ 10749011 7765390 2813292 3714384 7133433 6694887 6494122 12954900 20064472
33693B0064472k748342r663072m988847L94351l618023p925261j157753Q703716
$$ 20064472 17316130 7653058 2664211 3058562 -559461 -8484722 -9642475 -938759
33685i38759O968964k827390m266750O229722J4735321J0273913j921614r006289
$$ -938759 6030205 3202815 -1063935 5165787 19901108 30175021 28253407 19247118
33677A9247118n273708K728595L367779n953475j2635941l840832J3056965J6930654
$$ 19247118 13973410 16702005 20069784 14116309 1480368 -2360464 10696501 27627155
33669B7627155K418636j1459286q831068J784270M260115j000897l691760l034998
$$ 27627155 30045791 18586505 9755437 11539707 15799822 14798925 11107165 8072167
33661H072167m497737n278414J87247N817628J853933o238128m081027P275967
$$ 8072167 3574430 -1703984 -1516737 4300891 6154824 -83304 -4164331 3111636
33653C111636J0786465q7301j0625752p250044K733644L662560m963282q977808
$$ 3111636 13898101 13810800 3185048 -4064996 -1331352 2331208 -2632074 -11609882
33645a1609882p76276J0113733J0214407m28871r396259q550100k899297o23606
$$ -11609882 -12386158 -2272425 7941982 7513111 -1883148 -10433248 -13332545 -13956151
33637a3956151j027630J001321L708706J672558k117383O09268P727588P367526
$$ -13956151 -14983781 -13982460 -10273754 -8601196 -10718579 -10109311 -2381723 4985803
33629D985803k260732p342583L44049R492295O475921m169837q440585m108278
$$ 4985803 2725071 -4617512 -4273463 5218832 11694753 7524916 -915669 -5023947
33621e023947m05698j385062k143246L19421L197674M547388N500475N716039
$$ -5023947 -5429645 -6814707 -8957953 -8638532 -5440858 -893470 4607005 10323044
33613A0323044L028232k154371o284475o049530n86635O919589R247209K170672
$$ 10323044 13351276 11196905 4912430 -1137100 -1723735 5195854 14443063 16613735
33605A6613735p664754r207520k332043K700304K269354L102211N672487j28014
$$ 16613735 8948981 -258539 -2590582 109722 2379076 5481287 11153774 11025760
33597A1025760j4734697k0645623p127996J0703818J2565646J299747n460404
$$ 11025760 -3708937 -24354560 -31482556 -20778738 -8213092 -6913345 -12373749
33590a2373749j965981M248277R214983J3030249J0219503k386390j3379098j0020574
$$ -12373749 -14339730 -10091453 -876470 12153779 22373282 19986892 6607794 -3412780
33582c412780R94591L633755j906148l079610M62571j646770o945078k186535
$$ -3412780 -2418189 1215566 -690582 -3770192 -3307621 -4954391 -11899469 -14086004
33574a4086004R985645J1127334j488212p819963K062589J1333779M816716o984396
$$ -14086004 -4100359 7026975 5538763 -2281200 -218611 11115168 15931884 8947488
33566H947488p799982j973751k948254q544676o692502K433081P682303N597807
$$ 8947488 1147506 -826245 -3774499 -12319175 -19011677 -16578596 -8896293 -3298486
33558c298486K448905P22528k465483n188706j922626N041952O822369J733692
$$ -3298486 -849581 -127053 -2592536 -7781242 -9703868 -4661916 2160453 3894145
33550C894145k194352m40507J580040j171941m714401l233869P67830L63571m443583
$$ 3894145 1699793 1259286 2839326 1667385 -3047016 -6280885 -5513055 -5149484 -9593067
$$ [...]
##END NTUPLES=NMR SPECTRUM
##END=
