##TITLE=31Pdec_LR-738-B-CR10
 , 48 sc
 19.11.2021
##JCAMPDX= 6.0         $$ Bruker NMR JCAMP-DX V2.0
##DATA TYPE= NMR SPECTRUM
##DATA CLASS= NTUPLES
##ORIGIN= UXNMR, Bruker Analytische Messtechnik GmbH
##OWNER= root
$$ XWIN-NMR		Version 3.5
$$ Fri Nov 19 11:06:06 2021 Russian Standard Time (UT+4h)  she@DPX200
##.OBSERVE FREQUENCY= 81.013821
##.OBSERVE NUCLEUS= ^31P
##.ACQUISITION MODE= SIMULTANEOUS
##.ACQUISITION SCHEME= undefined
##.AVERAGES= 48
##.DIGITISER RES= 16
##SPECTROMETER/DATA SYSTEM= spect
##.PULSE SEQUENCE= zgpg30
##.SOLVENT NAME= CDCl3
##.SHIFT REFERENCE= (INTERNAL, CDCl3, 0, 248.564)
##AUDIT TRAIL= $$ (NUMBER, WHEN, WHO, WHERE, WHAT)
$$ ##TITLE= Audit trail, XWIN-NMR		Version 3.5
$$ ##JCAMPDX= 5.01
$$ ##ORIGIN= Bruker BioSpin GmbH
$$ ##OWNER= she
$$ F:/spectra/data/she/nmr/P31/1/pdata/1/auditp.txt
$$ ##AUDIT TRAIL=  $$ (NUMBER, WHEN, WHO, WHERE, WHAT)
(   1,<2021-11-19 11:05:04.90 +0400>,<she>,<DPX200>,
      <continue with go, POWCHK disabled, PULCHK disabled
       configuration hash MD5:
       00 E9 B6 7A A2 85 ED C7 34 08 36 98 17 FE 4E 26
       data hash MD5: 32K
       7A B7 7B 8D A9 77 8E 32 2C BB 54 FB 52 67 8A F5>)
(   2,<2021-11-19 11:05:07.81 +0400>,<she>,<DPX200>,
      <Start of raw data processing
       efp BC_mod = 2 LB = 1 FT_mod = 6 PKNL = 1 PHC0 = -9245.161 PHC1 = 208.0695 SI = 64K 
       data hash MD5: 64K
       3D F2 C1 2E 9E 36 C4 0C 9E 7E 6F 12 65 26 E0 D4>)
(   3,<2021-11-19 11:05:36.17 +0400>,<she>,<DPX200>,
      <pk PHC0 = 1.845129 PHC1 = 0 
       data hash MD5: 64K
       B6 07 5E 59 01 77 30 40 DD 77 90 86 61 CE 44 33>)
$$ ##END=
$$ 
$$ hash MD5
$$ FA B7 B5 A0 CC 01 4A 3B B3 15 36 11 F0 ED 5C 5E
##$RELAX= 
##$RELAX= 
##$RELAX= 
##$RELAX= 
##$RELAX= 
##$RELAX= 
##$RELAX= 
##$RELAX= 
$$ Bruker specific parameters
$$ --------------------------
##$DU= <F:/spectra>
##$EXPNO= 1
##$NAME= <P31>
##$PROCNO= 1
##$TYPE= <nmr>
##$USER= <she>
##$AMP= (0..31)
100 100 100 100 100 100 100 100 100 100 100 100 100 100 100 100 100 100 
100 100 100 100 100 100 100 100 100 100 100 100 100 100 
##$AQSEQ= 0
##$AQ_mod= 1
##$AUNM= <au_zg>
##$AUTOPOS= <>
##$BF1= 81.014009
##$BF2= 200.13
##$BF3= 200.13
##$BF4= 200.13
##$BF5= 200.13
##$BF6= 200.13
##$BF7= 200.13
##$BF8= 200.13
##$BYTORDA= 1
##$CFDGTYP= 0
##$CFRGTYP= 5
##$CHEMSTR= <none>
##$CNST= (0..31)
1 1 145 1 1 1 1 1 1 1 1 1 1 1 1 1 1 1 1 1 1 1 1 1 1 1 1 1 1 1 1 1 
##$CPDPRG= <waltz16>
##$CPDPRG1= <>
##$CPDPRG2= <waltz16>
##$CPDPRG3= <>
##$CPDPRG4= <mlev>
##$CPDPRG5= <mlev>
##$CPDPRG6= <mlev>
##$CPDPRG7= <mlev>
##$CPDPRG8= <mlev>
##$CPDPRGB= <>
##$CPDPRGT= <>
##$D= (0..31)
0 1 0 0 0 0 0 0 0 0 0 0.03 2e-05 3e-06 0 0 0 0 0 0 0 0 0 0 0 0 0 0 0 0 
0 0 
##$DATE= 1637305435
##$DBL= (0..7)
120 120 120 11 120 120 24 19 
##$DBP= (0..7)
150 150 150 150 150 150 150 150 
##$DBP07= 0
##$DBPNAM0= <>
##$DBPNAM1= <>
##$DBPNAM2= <>
##$DBPNAM3= <>
##$DBPNAM4= <>
##$DBPNAM5= <>
##$DBPNAM6= <>
##$DBPNAM7= <>
##$DBPOAL= (0..7)
0.5 0.5 0.5 0.5 0.5 0.5 0.5 0.5 
##$DBPOFFS= (0..7)
$$ [...]
##$SUBNAM2= <"">
##$SUBNAM3= <"">
##$SUBNAM4= <"">
##$SUBNAM5= <"">
##$SUBNAM6= <"">
##$SUBNAM7= <"">
##$SUBNAM8= <"">
##$SUBNAM9= <"">
##$SW= 501.771253377433
##$SWIBOX= (0..15)
0 1 3 0 0 0 0 0 0 0 0 0 0 0 0 0 
##$SW_h= 40650.406504065
##$TD= 32768
##$TD0= 1
##$TE= 0
##$TE2= 300
##$TE3= 300
##$TEG= 300
##$TL= (0..7)
0 120 53 12 22 120 120 120 
##$TP= (0..7)
150 150 150 150 150 150 150 150 
##$TP07= 0
##$TPNAME0= <>
##$TPNAME1= <>
##$TPNAME2= <>
##$TPNAME3= <>
##$TPNAME4= <>
##$TPNAME5= <>
##$TPNAME6= <>
##$TPNAME7= <>
##$TPOAL= (0..7)
0.5 0.5 0.5 0.5 0.5 0.5 0.5 0.5 
##$TPOFFS= (0..7)
0 0 0 0 0 0 0 0 
##$TUNHIN= 0
##$TUNHOUT= 0
##$TUNXOUT= 0
##$USERA1= <user>
##$USERA2= <user>
##$USERA3= <user>
##$USERA4= <user>
##$USERA5= <user>
##$V9= 5
##$VALIST= <valist>
##$VCLIST= <CCCCCCCCCCCCCCC>
##$VD= 0
##$VDLIST= <DDDDDDDDDDDDDDD>
##$VPLIST= <PPPPPPPPPPPPPPP>
##$VTLIST= <TTTTTTTTTTTTTTT>
##$WBST= 1024
##$WBSW= 4
##$XGAIN= (0..3)
0 0 0 0 
##$XL= 0
##$YL= 0
##$YMAX_a= 1849
##$YMIN_a= -2766
##$ZGOPTNS= <>
##$ZL1= 120
##$ZL2= 120
##$ZL3= 120
##$ZL4= 120
##$ABSF1= 0
##$ABSF2= 0
##$ABSG= 0
##$ABSL= 0
##$ALPHA= 0
##$AQORDER= 0
##$ASSFAC= 0
##$ASSFACI= 0
##$ASSFACX= 0
##$ASSWID= 0
##$AUNMP= <proc_1d>
##$AZFE= 0.1
##$AZFW= 0.5
##$BCFW= 0
##$BC_mod= 2
##$BYTORDP= 0
##$COROFFS= 0
##$CY= -3
##$DATMOD= 1
##$DC= 0
##$DFILT= <>
##$DTYPP= 0
##$F1P= 0
##$F2P= 0
##$FCOR= 1
##$FTSIZE= 65536
##$FT_mod= 6
##$GAMMA= 0
##$GB= 0
##$INTBC= 1
##$INTSCL= 5.30512e-09
##$ISEN= 30
##$LB= 1
##$LEV0= 0
##$LPBIN= 0
##$MAXI= 10000
##$MC2= 0
##$MEAN= 0
##$ME_mod= 0
##$MI= 50
##$NCOEF= 0
##$NC_proc= -8
##$NLEV= 6
##$NOISF1= 182.463
##$NOISF2= 159.3651
##$NSP= 0
##$NTH_PI= 0
##$NZP= 0
##$OFFSET= 248.5645
##$PC= 4
##$PHC0= -9243.316
##$PHC1= 208.0695
##$PH_mod= 1
##$PKNL= yes
##$PPARMOD= 0
##$PSCAL= 0
##$PSIGN= 0
##$REVERSE= no
##$SF= 81.014009
##$SI= 65536
##$SIGF1= 159.3651
##$SIGF2= -187.1042
##$SINO= 113.3802
##$SIOLD= 16384
##$SREGLST= <1H.CDCl3>
##$SSB= 0
##$STSI= 65536
##$STSR= 0
##$SW_p= 40650.406504065
##$SYMM= 0
##$S_DEV= 0
##$TDeff= 32768
##$TDoff= 0
##$TI= <>
##$TILT= no
##$TM1= 0
##$TM2= 0
##$TOPLEV= 0
##$USERP1= <user>
##$USERP2= <user>
##$USERP3= <user>
##$USERP4= <user>
##$USERP5= <user>
##$WDW= 1
##$XDIM= 65536
##$YMAX_p= 82197962
##$YMIN_p= -456492795
$$ End of Bruker specific parameters
$$ ---------------------------------
##NTUPLES= NMR SPECTRUM
##VAR_NAME=  FREQUENCY,     SPECTRUM/REAL,   SPECTRUM/IMAG
##SYMBOL=    X,             R,               I
##VAR_TYPE=  INDEPENDENT,   DEPENDENT,       DEPENDENT
##VAR_FORM=  AFFN,          ASDF,            ASDF
##VAR_DIM=   65536,         65536,           65536
##UNITS=     HZ,            ARBITRARY UNITS, ARBITRARY UNITS
##FACTOR=    0.620285442955139, 1,           1
##FIRST=     20137.2065510759, 0,            0
##LAST=      -20513.1999529892, 0,           0
##MIN=       -20513.1999529892, -456492795,  0
##MAX=       20137.2065510759, 82197962,     0
$$ Real data points
##PAGE= N=1
##DATA TABLE= (X++(R..R)), XYDATA
$$ [...]
12991a0190702M990980M806098K277814j067830m300436n814424l328802K596053
$$ -10190702 -5199722 -393624 1884190 816360 -3484076 -9298500 -12627302 -10031249
12983a0031249O805962M621938j685728m787410j317847M049228N091233J905963
$$ -10031249 -3225287 1396651 -289077 -5076487 -6394334 -2345106 2746127 4652090
12975D652090l60643R14979K873667K016951q52192k296731j368848o41878k023076
$$ 4652090 4291447 5206426 8080093 10097044 9244852 6948121 5579273 4937395 2914319
12966B914319l823731l487214j651928j048824j945340j644870J017433L730286
$$ 2914319 -909412 -4396626 -6048554 -7097378 -9042718 -10687588 -9670155 -5939869
12958e939869M538875M524214M544514K520744k566304o549403m553233J600381
$$ -5939869 -1400994 3123220 7667734 10188478 7622174 1072771 -3480462 -1880081
12950a880081N194603L529693L29897j027869j593313k679542k537887r339K308810
$$ -1880081 3314522 6844215 7174112 6146243 4552930 1873388 -664499 -673838 1634972
12941A634972J814885N3105k8216J222867J256600n18402k422111l085911k121045
$$ 1634972 3449857 3502962 3474746 4697613 5954213 5435811 3013700 -72211 -2193256
12932b193256L77766K943260K966240p7716l242352l820985k395116l42700K689261
$$ -2193256 -1815490 1127770 4094010 4016294 773942 -3047043 -5442159 -5784859 -3095598
12923c095598O032044O177556J922762j794256o00144J436544k416690r366726
$$ -3095598 2936446 9114002 11036764 9242508 8642364 10078908 7662218 -1704508
12915a704508r305715l65915O735988M009189k236750j813496L650890M418246
$$ -1704508 -11010223 -11376138 -4640150 -630961 -2867711 -4681207 -1030317 3387929
12907C387929j227618m631542j046115L070189Q39084m108914l536616K626120
$$ 3387929 2160311 -2471231 -3517346 -447157 391927 -3716987 -7253603 -4627483
12899d627483O177942K549232l009615k902963K847258P029932M395861k223129
$$ -4627483 1550459 4099691 1090076 -1812887 1034371 8064303 12460164 10237035
12891A0237035n629944k787540J992503K694232j124784m400097l189874J199674
$$ 10237035 4607091 1819551 3812054 6506286 5381502 981405 -2208469 -1008795
12883a008795N037858O430423N370021K087553k111718m097099k092341J145228
$$ -1008795 4029063 10459486 15829507 17917060 15805342 11708243 9615902 10761130
12875A0761130J283398j856119m604203n219251n482902n768969k974877L826755
$$ 10761130 12044528 10188409 5584206 364955 -5117947 -10886916 -13861793 -10035038
12867a0035038R169942O959556r56865o288931m544202K4278J129461j038175
$$ -10035038 -865096 6094460 5137595 -1151336 -5695538 -5671260 -4541799 -5579974
12859e579974j073203L011620O151037L041578l624033n476756M36874O736620
$$ -5579974 -6653177 -3641557 2509480 5551058 1927025 -3549731 -3112857 3623763
12851C623763M987537k782755o804346l065920J867160J275230k259037k059212
$$ 3623763 8611300 5828545 -975801 -4041721 -2174561 -899331 -3158368 -5217580
12843e217580K135920M572967K554630n77680j566966j448796k269922l175231
$$ -5217580 -3081660 1491307 4045937 3468257 1901291 452495 -1817427 -4992658
12835d992658j833262J950345N437306N309123R91471l808259m205351N83L499802
$$ -4992658 -6825920 -4875575 561731 5870854 6862325 3054066 -1151285 -1150702 2349100
12826B349100K368809p91776j582181p17406j531143k834176m69417M569928O195463
$$ 2349100 4717909 3926133 2343952 1626546 95403 -2738773 -3208190 1361738 7557201
12817G557201K491348j274664j080931J70378j375084l886500l365086k34378
$$ 7557201 10048549 8773885 7692954 7863332 6488248 2601748 -763338 -997716
12809i97716J772108J012449j185935l171750l723094j964830J128595K875963
$$ -997716 774392 1786841 600906 -2570844 -6293938 -8258768 -7130173 -4254210
12801d254210K222918Q89539J60579m76175n30985J534896M024542K619077k320720
$$ -4254210 -2031292 -1141753 -981174 -1457349 -1988334 -453438 3571104 6190181 3869461
12792C869461m609683j796853L41141k130609l307735K937468J0699482R081674
$$ 3869461 -740222 -2537075 -2195934 -4326543 -7634278 -4696810 6002672 15084346
12784A5084346j253973q660981p078025k278334m50309O0541K429716M656583
$$ 15084346 13830373 5169392 -1908633 -4186967 -4637276 -4576735 -2147019 2509564
12776B509564L619862L17001k719149m866137n550141l334711P60872L344396
$$ 2509564 6129426 6446427 3727278 -1138859 -6689000 -10023711 -9262839 -5918443
12768e918443L786383M428544M500228L97565n748807n677708K311714Q004627
$$ -5918443 -2132060 2296484 6796712 7194277 1445470 -4232238 -1920524 6084103
12760F084103L300630n076090n388626J620310N011647Q37435l487996k262425
$$ 6084103 9384733 4308643 -1079983 540327 5551974 6389409 2901413 638988
12752F38988Q68700J016517l48435k8812Q35917J8571r04146M55160K480269K027543
$$ 638988 1507688 2524205 2175770 2146958 2982875 3001446 2097300 2552460 5032729 7060272
12742G060272m49651k186782k789621l564305l348488K31848M970667M493313
$$ 7060272 6610621 4423839 1634218 -1930087 -5278575 -5046727 -76060 4417253
12734D417253k865740r384637o738092K294461O666655K284219k107097J772575
$$ 4417253 1551513 -7833124 -14571216 -12276755 -5610100 -3325881 -5432978 -3660403
12726c660403Q461318O514319l539790r049921l939353K781612J700720l255909
$$ -3660403 4800915 11315234 7775444 -1274477 -5213830 -2432218 -731498 -3987407
12718c987407l457602l07651r66731m106837j955734M704239N871390j157698
$$ -3987407 -7445009 -7752660 -8719391 -12826228 -14781962 -10077723 -4206333 -5364031
12710e364031n863636k46945Q598256Q722909j25068p693591p232814j411721
$$ -5364031 -11227667 -11474612 -2876356 5846553 5721485 -1972106 -9204920 -10616641
12702a0616641L767568N010260K412210j329105k645537j024744p1368k056518
$$ -10616641 -6849073 -1838813 573397 -755708 -3401245 -4425989 -4497357 -6553875
12694f553875l628171n90849M960303O718017K658937k645798m291628k163167
$$ -6553875 -10182046 -10772895 -5812592 905425 3564362 918564 -3373064 -5536231
12686e536231O82741J977431J734762J374616J782375J772304m95035l994580
$$ -5536231 -4853490 -2876059 -1141297 233319 2015694 3787998 3292963 -701617
12678g01617m982619k132764J139612J729145J271856K351276L259865J005211
$$ -701617 -5684236 -7817000 -6677388 -4948243 -3676387 -1325111 1934754 2939965
12670B939965k605726l079504m26711R63411n65222k020640j385599k68727N5146
$$ 2939965 334239 -2745265 -3171976 -2208565 -2773787 -4794427 -6180026 -6448753 -6393607
12661f393607O71839J700687J195196r92468k230873j661713j617641k513300
$$ -6393607 -5721768 -4021081 -2825885 -3818353 -6049226 -7710939 -9328580 -11841880
12653a1841880q06420M866065R603011Q357112L035847r26221k583174m873709
$$ -11841880 -12648300 -7782235 1820776 10177888 13213735 12287514 9704340 4830631
12645D830631p376378n730863O24319N385893L151988k971064n198443r84206
$$ 4830631 -2545747 -8276610 -7652291 -2266398 885590 -2085474 -7283917 -8268123
12637h268123M596860O233339M419054K609855J495454p16739l884092n565052
$$ -8268123 -3671263 2562076 6981130 9590985 11086439 10369700 6485608 920556
12629I20556m965955l735560k360498N02491M029719M765692K280084R92875L216761
$$ 920556 -4045399 -7780959 -10141457 -9638966 -5609247 -843555 1436529 2429404 5646165
12620E646165M743855J689294k554579k942491j467511k865149m628217n92414
$$ 5646165 10390020 12079314 9524735 6582244 5114733 2249584 -2378633 -2971047
12612b971047O462565O349416k462840q786149n283480N80188p55361n490068
$$ -2971047 3491518 9840934 7378094 -1408055 -6691535 -6111347 -6866708 -12356776
12604a2356776l382527N025449Q966759L842693k958129m049177j472597p10273
$$ -12356776 -15739303 -10713854 -1747095 2095598 -862531 -4911708 -6384305 -7094578
12596g094578j612842l15961L146484M275193Q23720l459043l221002J818300
$$ -7094578 -8707420 -9023381 -5876897 -1601704 -777984 -4237027 -7458029 -5639729
12588e639729O445178O367380L163694J215586J305909M22344k514932m653960
$$ -5639729 805449 7172829 10336523 11552109 12858018 13280362 10765430 6111470
12580F111470l896427j870011n02567Q79618K743429K913450j06024l880431m987762
$$ 6111470 2215043 345032 -157535 722083 3465512 6378962 6272938 2392507 -2595255
12571b595255l183244l01741K547280M205121K664883j816191n162061m242024
$$ -2595255 -5778499 -6080240 -3532960 672161 3337044 1520853 -3641208 -7883232
12563g883232j096710N79229P40901J368781J980862Q59977r30900q47097Q54433
$$ -7883232 -8979942 -8400713 -7659812 -6291031 -4310169 -3450192 -4381092 -5228189 -4373756
12554d373756J677594Q10031n86343j797710k280450m11249M212107Q281090P597560
$$ -4373756 -2696162 -1886131 -2472474 -4270184 -6550634 -6961883 -2749776 5531314 13128874
12545A3128874J820623n324204r229016p031125j41936M888168K598609k850490
$$ 13128874 14949497 9625293 396277 -6634848 -6776784 -1888616 709993 -2140497
12537b140497j717985O161255Q798721K13257q226733m114748O487082Q534299
$$ -2140497 -3858482 2302773 11101494 11314751 3088018 -1026730 5460352 13994651
12529A3994651J244697l091649q32472j062475o794907q517405j619224M344617
$$ 13994651 15239348 12147699 11315227 10252752 3457845 -5059560 -6678784 -2334167
12521b334167J548877l221734r06670M599179L990827j924876m716381j617652
$$ -2334167 -785290 -4007024 -4913694 -314515 3676312 1751436 -2964945 -4582597
12513d582597K939373N614146N825966K207094m826626r376597o309072M85847
$$ -4582597 -1643224 3970922 9796888 12003982 7177356 -2199241 -8508313 -8022466
12505h022466K710304r29030m143007k702748J296182M218736M723324L073250
$$ -8022466 -5312162 -6241192 -10384199 -13086947 -11790765 -7572029 -2848705 224545
12497B24545P46477J17966J329686J180612j721070l534490r40657K782736K356976
$$ 224545 971022 1088988 2418674 3599286 1878216 -1656274 -2596931 185805 2542781
12488B542781j564880m296660m354562l230331n56497M169185P171536M671415
$$ 2542781 977901 -3318759 -7673321 -10903652 -11460149 -7290964 -119428 4551987
12480D551987K41687P00700N272736O259136Q11960n317027o955983n432646l501387
$$ 4551987 4793674 5494374 10767110 17026246 17838206 12521179 5565196 132550 -3368837
12471c368837j049072J549611J804667j76651o27279J375637J546968k332191
$$ -3368837 -4417909 -2868298 -1063631 -1240282 -1867561 -491924 1055044 -1277147
12463a277147n956050n144186k185049r79955K0966M463197J0148699J0281830
$$ -1277147 -7233197 -12377383 -14562432 -15542387 -15521421 -11058224 -909525 9372305
12455I372305K610450o718804r396693l389492M956262O894000N14547o304388
$$ 9372305 11982755 5263951 -4132742 -7522234 -2565972 4328028 4842575 -1461813
12447a461813m887863K666660N673356l39366p184175n995139L31941K804202
$$ -1461813 -6349676 -3683016 1990340 1650974 -5533201 -11528340 -11196399 -8392197
12439h392197J5325j614728P79980L071358K371695J294737K099543K753647J432398
$$ -8392197 -8376872 -9991600 -9211620 -6140262 -3768567 -2473830 -374287 2379360 3811758
12430C811758j70560p19085j779732l686048l425139R115K510575J078172r09683
$$ 3811758 3641198 2922113 1142381 -2543667 -5968806 -5959691 -3449116 -2370944 -3280627
12421c280627O87424L551385K898762k31253j118269J35331n92830k838080j602313
$$ -3280627 -2593203 958182 3856944 3625691 2507422 2642753 2049923 -788157 -2390470
12412b390470K928119L753829j749496o444520m110760Q84703J008035k381428
$$ -2390470 537649 4291478 2541982 -3902538 -8013298 -7128595 -6120560 -8501988
12404h501988k258507J736901K914525p99715l156052L03364N344342N943173
$$ -8501988 -10760495 -9023594 -6109069 -6908784 -10064836 -9761472 -4417130 1526043
12396A526043K862587Q54510R24732L20312j642546k521322j279762L0194j94048
$$ 1526043 4388630 5243140 6167872 6488184 4845638 2324316 1044554 1074748 880700
12387H80700r13741q98646q11271j195733n69549J961871L662402J235988l259401
$$ 880700 -33041 -931687 -1742958 -2938691 -3508240 -1546369 2116033 3352021 92620
12378I2620l794977P47022L493426q98933p438470p327956r63002L051629J532120
$$ 92620 -3702357 -2955335 538091 -360842 -7799312 -15127268 -16090270 -13038641 -11506521
12369a1506521O64031L973886N424358J59978n580942l385902L893323O701069
$$ -11506521 -10842490 -6868604 -1444246 -1284268 -6865210 -10251112 -6357789 343280
12361C43280L382023O86343J327709R33485k135054l376471q70498Q14608j279215
$$ 343280 3725303 4411646 5739355 6672840 4537786 1161315 290817 1105425 -173790
12352a73790l492450k289425J32360Q41868J251193L007525L699808J236614j447681
$$ -173790 -3666240 -5955665 -5823305 -4981437 -3730244 -722719 2977089 4213703 2766022
12343B766022p03752J784981J650388j472221l688937k175202J814016M462027
$$ 2766022 2062270 3847251 5497639 4025418 336481 -1838721 -24705 4437322
12335D437322K845513j765593m203155j522543K088411P73525l524881l344257
$$ 4437322 7282835 5517242 1314087 -208456 1879955 2653480 -871401 -4215658
12327d215658K185283N170138J335657l303992k580407L52704k00556k413323
$$ -4215658 -2030375 3139763 4475420 1171428 -1408979 -1056275 -1256831 -3670154
12319c670154j147909K135991J775025j989035k903489J529024O274358N660631
$$ -3670154 -4818063 -2682072 -907047 -2896082 -5799571 -4270547 2003811 7664442
12311G664442J05843m826956m157496J300704M825368J194529n552070o295227
$$ 7664442 7770285 2943329 -1214167 86537 4911905 6106434 554364 -5740863
12303e740863K00325M972870K353581j816970p45108K153225N29152k795941q64114
$$ -5740863 -5540538 -567668 1785913 -31057 -776165 1377060 1906212 -889729 -1753843
12294a753843M427159N025029N04540j416973J834267L863857N06905l923338
$$ -1753843 2673316 7698345 8202885 6785912 8620179 12484036 12990941 9067603
12286I067603m541497k912772k724512l833972l867950k035093P56100K811708
$$ 9067603 4526106 1613334 -1111178 -4945150 -8813100 -10848193 -10092093 -7280385
12278g280385K242864m51001j337326J681558M456991K502728r82345J83037M159460
$$ -7280385 -5037521 -5488522 -6825848 -5144290 -687299 1815429 833084 1016121 5175581
12269E175581L271740k920148o099613k711742L21830k452562n731257k301755
$$ 5175581 8447321 5527173 -572440 -3284182 -2962352 -5414914 -11146171 -13447926
12261a3447926M966518P129791J955501l593980k716589L600412Q256887N539022
$$ -13447926 -8481408 -1351617 603884 -2990096 -5706685 -2106273 6150614 11689636
12253A1689636k476555p152878l180887L736259L516007m386125r925675o670844
$$ 11689636 9213081 2060203 -1120684 2615575 6131582 1745457 -8180218 -14851062
12245a4851062q6239J910050J93823O36398L709227M539368J347252k025136j887416
$$ -14851062 -14937301 -13027251 -12833428 -12197030 -8487803 -3948435 -2601183 -4626319 -6513735
12236f513735R78532L068508J973345j337619l006199l54581M023298M876222
$$ -6513735 -5535203 -2466695 -493350 -1830969 -4837168 -5191749 -1168451 3707771
12228C707771J751018j02743J882427L076708p19712n496928m523700J037383
$$ 3707771 5458789 5356046 7238473 10315181 9595469 4098541 -425159 612224
12220F12224L498435R2714l302811j436199K653023K586944j990999n097438k626105
$$ 612224 4110659 4203373 900562 -535637 2117386 4704330 2713331 -2384107 -5010212
12211e010212K555272M646836J946775j874986k720472m38780J903490J556809
$$ -5010212 -2454940 2191896 4138671 2263685 -456787 -895567 1007923 2564732
12203B564732j690998n444585o210951k577223K344092L677453J036263p73088
$$ 2564732 873734 -4570851 -10781802 -13359025 -11014933 -7337480 -6301217 -7074305
12195g074305Q84708K108642q25343l979554j052768N616985O731091l98850p034901
$$ -7074305 -6189597 -4080955 -4906298 -8885852 -9938620 -4321635 2409456 2010606 -5024295
12186e024295m976691K288327N064655M67422n167001n426816q31461L596730
$$ -5024295 -10000986 -7712659 -2648004 -2180582 -7347583 -12774399 -13605860 -10009130
12178a0009130M556307K898417J218790N03974l17445j862216k702562j321713
$$ -10009130 -5452823 -2554406 -1335616 -831642 -1149087 -3011303 -5713865 -7035578
12170g035578J309592K617661J430387j035191k519956j281539K255063M573771
$$ -7035578 -5725986 -3108325 -1677938 -2713129 -5233085 -6514624 -4259561 314210
12162C14210K260233k422980k651640L400574Q031781L807161n284318q658330
$$ 314210 2574443 151463 -2500177 900397 8932178 12739339 7455021 -1203309
12154a203309l439861K724551K987740r41115l455752k159795J264526L484433
$$ -1203309 -4643170 -1918619 1069121 128006 -3327746 -5487541 -4223015 -738582
12146g38582K112470j135827j020453L751713O348748J008544o470246n776655
$$ -738582 1373888 238061 -782392 2969321 9318069 10326613 3856367 -1920288
12138a920288J958295N313383J42547m857250k879381J431680K006759J030594
$$ -1920288 38007 5351390 5493937 636687 -2242694 -811014 1195745 2226339
12130B226339K039025J903821k592367p030378o055545k163666k43148J283786
$$ 2226339 4265364 6169185 3576818 -3453560 -9509105 -11672771 -11915919 -10632133
12122a0632133N765407R485328O462083r73765n054967m160758l471554n215280
$$ -10632133 -4866726 4618602 11080685 10106920 5051953 891195 -2580359 -7795639
12114g795639n955997l429031O05078M416752P483236P924318M285643n32482
$$ -7795639 -13751636 -17180667 -16575589 -12158837 -4675601 3248717 7534360 7001878
12106G001878k413660k278181l607246m846773j158392O115617R032753M111296
$$ 7001878 4588218 2310037 -1297209 -6143982 -7302374 -1186757 7845996 11957292
12098A1957292k426705l491768k16982J384875p16769k906873j514169K732662
$$ 11957292 9530587 6038819 5821837 7206712 6489943 3583070 2068901 4801563
12090D801563N456093K899477l785812q593119o698063m32483L010230L22019
$$ 4801563 10257656 13157133 9371321 778202 -5919861 -6352344 -3342114 -3020095
12082c020095l886030l232274K051391N310950K047140m024245n607785j595944
$$ -3020095 -6906125 -10138399 -8087008 -2776058 -728918 -4753163 -10360948 -11956892
12074a1956892J525929n61675l289469n78145M830269N487650J737263J058581
$$ -11956892 -10430963 -10992638 -14282107 -14860252 -10029983 -4542333 -2805070 -1746489
12066a746489M444558L792749l520601q005434k813025M290117L101489k551981
$$ -1746489 2698069 6490818 2970217 -5035217 -7848242 -3558125 -456636 -3008617
12058c008617k001347M036912N409255J40504l297795j486265p77184m038671
$$ -3008617 -5009964 -973052 4436203 4576707 1278912 -207353 -984537 -5023208
12050e023208m984697l20980L521375J838608j27276K286869L664013j202146
$$ -5023208 -10007905 -10328885 -6807510 -4968902 -5096178 -2809309 854704 -347442
12042c47442n341039M16004J0349404R839790k431202j1050849n541180N635149
$$ -347442 -5688481 -5272477 5076927 14916717 12485515 1434666 -4106514 1528635
12034A528635Q561035K630461k320271k067893j609988m213658n795443k324953
$$ 1528635 10089670 12720131 10399860 8331967 6721979 2508321 -3287122 -5612075
12026e612075L452019N979704L687620q78924m464882m247592Q73282O989572
$$ -5612075 -2160056 3819648 7507268 6628344 2163462 -2084130 -1210848 5778724
12018E778724O646516k158210j1107017j0635163k057575M737150M516814J414495
$$ 5778724 12425240 10267030 -839987 -11475150 -13532725 -8795575 -4278761 -2864266
12010b864266K83911J07803j571859l167107j645838K710570O963948Q501570
$$ -2864266 -2580355 -2472552 -4044411 -7211518 -8857356 -6146786 817162 9318732
12002I318732N937334R3063m910690n299883l279653m378399q097598p331241
$$ 9318732 15256066 15349129 10438439 5138556 1858903 -2519496 -10617094 -17948335
11994a7948335K22072O695992M890531j202307k839068P70155L054297Q36813
$$ -17948335 -17726263 -11030271 -6139740 -7342047 -10181115 -9410960 -6356663 -5519850
11986e519850k314498k751768j080981M67015R93040R71961J754344M258602O517595
$$ -5519850 -7834348 -10586116 -11667097 -11200082 -10207042 -9235081 -7480737 -3222135 3295460
11977C295460M774831r50963n430209m875576j647946L55367Q74992O21355j671428
$$ 3295460 8070291 7119328 1689119 -3186457 -4834403 -4479036 -3604044 -2982689 -4654117
11968d654117n142843m756841J220185O400136M966367N11986n54545M47410j296336
$$ -4654117 -9796960 -14553801 -13333616 -6933480 -1967113 -1455127 -2009672 -1562262 -2858598
11959b858598l692010j290771L636156L937361N8360q22219K208380K444366j720950
$$ -2858598 -6550608 -7841379 -4205223 -267862 -209502 -1031721 1176659 3621025 1900075
11950A900075l431106O19287M695453M197605K279053K022444N22332l993098
$$ 1900075 -1531031 -911744 3783709 7981314 10260367 12282811 12805143 8812045
11942H812045o709997l956337k33359j255170m755160m422355L69673M405996
$$ 8812045 2102048 -1854289 -2087648 -3342818 -8097978 -12520333 -12150660 -7744664
11934g744664M193534J325255n28930O34665L255538L347112k41779k580238Q19446
$$ -7744664 -3551130 -2225875 -2754805 -2120140 1135398 4482510 4240731 1660493 2479939
11925B479939N351107K397350o522553r693953k285199N857298M998643o34668
$$ 2479939 7831046 10228396 3705843 -5988110 -8273309 -2416011 2582632 1947964
11917A947964j629402J303024P80003l071754k814039L074671P065721M147776
$$ 1947964 318562 1621586 2401589 -670165 -3484204 -409533 6656188 10803964
11909A0803964j164117k099688J412966L996667K016903k585830m564542j308028
$$ 10803964 9639847 7540159 8953125 12949792 14966695 12380865 7816323 6508295
11901F508295L093522J961315m479683p697353k354429N070770M811711k297074
$$ 6508295 9601817 11563132 7083449 -613904 -2968333 2102437 6914148 4617074
11893D617074o668761m154291l46143j15722q51303R41880L010103J869833o70393
$$ 4617074 -2051687 -6205978 -6552121 -6667843 -7519146 -6577266 -3567163 -1697330 -2367723
11884b367723m20756K481383M146234K688853j81293k413394l497318l562180
$$ -2367723 -2788479 -307096 3839138 6527991 6346698 3933304 435986 -3126194
11876c126194k844215j793013m09206J636961L278079K368840n86648j394687
$$ -3126194 -5970409 -7763422 -8172628 -6535667 -3257588 -888748 -1475396 -2870083
11868b870083K247004O058151L999679k994411p390316m665385J317977L823257
$$ -2870083 -623079 5435072 9434751 6440340 -949976 -5615361 -4297384 -474127
11860d74127Q61340m223096o896141m609104J402227O033119N008836R15535N22256
$$ -474127 387213 -3835883 -10732024 -15341128 -13938901 -7905782 -2896946 -1981411 -1459155
11851a459155M369715M706327k247793q197168l998406N718342Q387500J633652
$$ -1459155 2910560 7616887 5369094 -2828074 -6826480 -1108138 7279362 8913014
11843H913014m610323m035091j430948j898623k737459o88147J377551N41236
$$ 8913014 4302691 267600 -1163348 -3061971 -5799430 -6487577 -5110026 -4568790
11835d568790o91370m03503j523776m360718k706888N365562J0532002N163158
$$ -4568790 -5260160 -5663663 -7187439 -11548157 -14255045 -8889483 1642519 6805677
11827F805677l455908l528897K938193M288134j678773n769352l775523j811663
$$ 6805677 3349769 -179128 2759065 7047199 5368426 -400926 -4176449 -5988112
11819e988112l541000m024416p3562L489883K690284R69946J863245K468590l56647
$$ -5988112 -9529112 -13553528 -13627090 -10137207 -7446923 -6476977 -4613732 -2145142 -2501789
11810b501789l339953j911294K394750M494478K603512r22744k845934j069184
$$ -2501789 -5841742 -7753036 -5358286 -863808 1739704 816960 -2028974 -3098158
11802c098158L471081N958627K799981k132695j936904K210553J839120m847555
$$ -3098158 372923 6331550 9131531 6998836 5061932 7272485 9111605 4264050
11794D264050q298827j764327P393601P465716j678907r664985r407243l169875
$$ 4264050 -4034777 -5799104 1594497 9060213 7381306 -2283679 -11690922 -14860797
11786a4860797L186888N948652M390070Q71583k28397K560576M755092J469053
$$ -14860797 -11673909 -5725257 -1335187 -463604 -692001 1868575 6623667 8092720
11778H092720m901587o848474j968761L060508R46255o157878q543573j385922
$$ 8092720 3191133 -3657341 -5626102 -2565594 -1619339 -7777217 -16320790 -17706712
11770a7706712P955424Q500064L7026o509946m085938J747923K904241P24040
$$ -17706712 -9751288 -1251224 -1214198 -7724144 -11810082 -10062159 -7157918 -6433878
11762f433878Q49687J949785p77161m491397k239802L837579M622474j90686p67899
$$ -6433878 -5584191 -3634406 -4411567 -8902964 -11142766 -7305187 -2682713 -2873399 -3641298
11753c641298N740281R179250K751038n817137o536800j266371K085795J608991
$$ -3641298 2098983 11278233 14029271 8212134 1675334 408963 2494758 4103749
11745D103749p4471k540955n253749m445229N95170L765706J343667j089711K114400
$$ 4103749 4029278 1488323 -3765426 -8210655 -7615485 -3849779 -2506112 -3595823 -1481423
11736a481423O700990N507619j73692m098628m717121l672209k17100M835301
$$ -1481423 5219567 10727186 10553494 6454866 1737745 -1934464 -2151564 2683737
11728B683737N442574o17726n006945p76999N126170K480181m952853n886037
$$ 2683737 8126311 7508585 2501640 1724641 6850811 9330992 4378139 -1507898
11720a507898o68346P68761k454906j534652M054214M405128k136808m165747
$$ -1507898 -2176244 -1407483 -3862389 -5397041 -1342827 3062301 925493 -3240254
11712c240254L201366Q682911K967205o246907p311233k311545n86172k590855
$$ -3240254 -38888 8644023 11611228 5364321 -1946912 -4258457 -4844629 -7435484
11704g435484k057177J105271J787146N47482K430319O082800M533343k403405
$$ -7435484 -9492661 -8387390 -6600244 -6052762 -3622443 2460357 6993700 4590295
11696D590295n997461j435684N132543O005481J885986j957012m065524n772395
$$ 4590295 -1407166 -2842850 2289693 8295174 10181160 8224148 4158624 -1613771
11688a613771n557920r69625N110681O389936J991815k035943j622207J11312
$$ -1613771 -7171691 -8141316 -3030635 3359301 5351116 3315173 1692966 1804278
11680A804278o74803j937337k55461K179569J221053j220039J41120M401012N150020
$$ 1804278 1129475 -807862 -1063323 1116246 2337299 1117260 1258380 5659392 10809412
11671A0809412J029987k175614j591055j331850l453459k960652L007704Q097586
$$ 10809412 11839399 9663785 8072730 6740880 3287421 326769 3334473 11432059
11663A1432059N409043k079355o378622n423575k635273M25597L913906N197671
$$ 11432059 16841102 14761747 8383125 2959550 324277 749874 4663780 9861451
11655I861451J609138l900753n717522k766305J685041M792326M498027p73581
$$ 9861451 11470589 7569836 1852314 -913991 771050 5563376 10061403 9287822
11647I287822p676161q117820k14904O208337K690527m843612n512335n92427
$$ 9287822 1611661 -6506159 -6721063 -512726 2177801 -2665811 -8178146 -8770573
11639h770573M96232k542544j298339M838746O844917K324101q0013L713523N878329
$$ -8770573 -8274341 -10816885 -12115224 -7276478 -431561 1892540 1812527 5526050 11404379
11630A1404379N70521n842354n267538K68591M002686M226642K469858j327964
$$ 11404379 11974900 6132546 865008 1133599 5136285 9362927 11832785 10504821
11622A0504821n746350o063424j303427K363073M97183k752610j725429K193763
$$ 10504821 4758471 -1304953 -2608380 -245307 251876 -2500734 -4226163 -2032400
11614b032400M195904L241233Q79391k251551m493749k912020J142734J989502
$$ -2032400 2163504 5404737 6284128 4032577 -461172 -3373192 -2230458 -240956
11606b40956j235029k379754O88537J392189l366923n566756J066500R080921
$$ -240956 -1475985 -3855739 -3167202 -1775013 -5141936 -10708692 -9642192 -561271
11598e61271Q387077K009802o98227k18157l092452o758758l078837M861837M936434
$$ -561271 7825806 9835608 9137381 8919224 5826772 -931986 -4010823 851014 5787448
11589E787448l924063q686917k799025M216765L468865k689J280318L704116P83826
$$ 5787448 1863385 -6823532 -9622557 -5405792 -1936927 -1939616 -659298 3044818 3828644
11580C828644l655139j927222L512565L954048r47744l484013j346113L8201j150004
$$ 3828644 173505 -1753717 1758848 5712896 4765152 1281139 -64974 -26773 -1176777
11571a176777j68267L608455L484842k324979m797777K071571R210240M377674
$$ -1176777 -1345044 2263411 5748253 3423274 -1374503 697068 9907308 14284982
11563A4284982q336286j2663420l338572O611524N107578l005586n908136k324081
$$ 14284982 5948696 -6714724 -10053296 -3441772 1665806 -1339780 -7247916 -9571997
11555i571997L20755k7999J165826L773110J650670n500814q707433k672358N518250
$$ -9571997 -9251242 -9279241 -8113415 -4340305 -2689635 -8190449 -16897882 -19570240 -14051990
11546a4051990O475137J516423j037710J369873L684728K510741M33434N10523
$$ -14051990 -7576853 -6060430 -7098140 -5728267 -2043539 467202 900636 1411159
11538A411159J608405R96031j404425k931321j181818L125358N796099L026396
$$ 1411159 3019564 4015595 2611170 -320151 -1501969 1623389 7419488 10445884
11530A0445884l386177o939646m324087K36274J151573r42143j570103J47208
$$ 10445884 7059707 120061 -4204026 -3967752 -2816179 -3758322 -5328425 -5181217
11522e181217J386263J415568J971366K245752o56002n274780n483184Q77262
$$ -5181217 -3794954 -2379386 -408020 1837732 1181730 -4093050 -9576234 -8698972
11514h698972P612377P739528K147088k728117l455961k209924k073096l185885
$$ -8698972 -1086595 6652933 8800021 6071904 2615943 406019 -1667077 -4852962
11506d852962l686828k302995M66250K804106L231491K143483J075546L85816
$$ -4852962 -8539790 -10842785 -10376535 -7572429 -4340938 -2197455 -1121909 -736093
11498g36093r28580k737723l001056n86593K721875M305530L479406J165232j553263
$$ -736093 -1664673 -4402396 -7403452 -7990045 -5268170 -962640 2516766 3681998 2128735
11489B128735l315541k771505n70944P55461N51313J371949M342167N981976L237553
$$ 2128735 -1186806 -3958311 -4529255 -3773794 -3222481 -1850532 2491635 8473611 11711164
11480A1711164q33991j290584N07253r52887n383583o047487q07285L389337J006724
$$ 11711164 10877173 9586589 10093842 9140955 3757372 -2290115 -3097400 291937 1298661
11471A298661l468209l019983R45743K057482j84094o87526J865534L480429K237819
$$ 1298661 -2169548 -5189531 -4243788 -2186306 -2370400 -3057926 -1192392 2288037 4525856
11462D525856K64207j628667m336538n390414j167607M920494M872606j113362
$$ 4525856 4790063 3161396 -1175142 -6565556 -7733163 -2812669 2059937 946575
11454I46575l346989J967670N524632l88927q606041p577285J151961O307817
$$ 946575 -2400414 -432744 5091888 4702961 -3903080 -11480365 -10328404 -4020587
11446d020587L932521M64583L02965N53462j064905j899062m3371K408062L593897
$$ -4020587 -88066 376517 679482 1232944 168039 -1731023 -1774394 633668 4227565
11437D227565L814578K405008j610147n212595l917761N74237J667782j947393
$$ 4227565 8042143 10447151 8837004 3624409 -293352 280885 1948667 1274
11429A274m048925q20782L474695L668354P91684j265980j412015n79220P12774
$$ 1274 -4047651 -4868433 -1393738 2274616 3066300 1800320 388305 -190915 521859
11420E21859J676431J660515K164746M261685M452035o28342n924229l269765
$$ 521859 2198290 3858805 6023551 10285236 14737271 14108929 8184700 4914935
11412D914935M125401L626209o625314j1750628k099277J0309686Q796275l374440
$$ 4914935 9040336 12666545 6041231 -5709397 -7808674 2501012 11297287 7922847
11404G922847r307637l880631K336997K651130K291420M782716M318151k579639
$$ 7922847 -1384790 -5265421 -2928424 -277294 2014126 6796842 11114993 8535354
11396H535354q673976o572770j03779K015070j402663m488763l547690P4095L927663
$$ 8535354 -138622 -6711392 -6815171 -4800101 -6202764 -10691527 -14239217 -14165122 -10237459
11387a0237459O254332N421581J661896j753554k178759j029659q53429r61695
$$ -10237459 -3983127 1438454 3100350 1346796 -831963 -1861622 -2715051 -3676746
11379c676746N55659K088404J23402m493465o081152j448129N235236P262837
$$ -3676746 -3121087 -1032683 -909281 -5402746 -11483898 -12932027 -7696791 -433954
11371d33954L584793m65773m79351J649049J107226k882330o152446n295938j505460
$$ -433954 3150839 2685066 2205715 3854764 4961990 2079660 -4072786 -9368724 -10874184
11362a0874184J979277L666241L699559K384280P71454O52278J837820J515765
$$ -10874184 -8894907 -5228666 -1529107 855173 1626627 2278905 4116725 5632490
11354E632490j258522k841493k09249L263487J887025l467345n835469k065741
$$ 5632490 4373968 1532475 1323226 4586713 6473738 3006393 -2829076 -4894817
11346d894817K778412K842144r28719l500997k939252j387423m94987O74854L050855
$$ -4894817 -2116405 725739 -202980 -3703977 -6643229 -8030652 -8525639 -7850785 -4799930
11337d799930N092441L967270j079590o854258q411095l992966K651004O002727
$$ -4799930 292511 4259781 3180191 -3674067 -12085162 -16078128 -13427124 -7424397
11329g424397M381921N99907k068431k498322r80486J358013K305298N21937j693270
$$ -7424397 -3042476 -2442569 -4511000 -7009322 -7989808 -6631795 -4326497 -3804560 -5497830
11320e497830l42626M604980Q176449O448451J221718l017660m421699l834891
$$ -5497830 -5840456 -1235476 6940973 13389424 14611142 11593482 7171783 3336892
11312C336892j693473J867041M644305L558266r97264m441978l174652R90389
$$ 3336892 1643419 3510460 8154765 11713031 10715767 6273789 3099137 4089526
11304D089526L336288K376377J029711J302326Q00413k956684p003622o049666
$$ 4089526 7425814 9802191 10831902 12134228 12934641 9977957 2974335 -3075331
11296c075331o70410K687112J067106j058868L4266J046912j458683l303224P06858
$$ -3075331 -3745741 -1058629 8477 -1050391 -1016125 30787 -1427896 -4731120 -4024262
11287d024262O180949M434575l011407n367590Q29684O211053L264124k863542
$$ -4024262 2156687 6591262 3579855 -1787735 -958051 5253002 8517126 5653584
11279E653584l958533j122826k81902j461496n98724K035388K895203J817636
$$ 5653584 1695051 572225 290323 -1171173 -1769897 265491 3160694 4978330
11271D978330Q88479m89404k854987k415683K952547O706309J625514p388443
$$ 4978330 5866809 5377405 2522418 106735 3059282 9765591 11391105 4002662
11263D002662q633810j159381L810132L51859m290378k950063P76531Q97458p71995
$$ 4002662 -4631148 -5790529 -1980397 -1628538 -5918916 -8868979 -8092448 -7194990 -7966985
11254g966985R0350J802515J013643N6967K448283N421894M221562J04776k821903
$$ -7966985 -7876635 -6074120 -5060477 -5003510 -2555227 2866667 7088229 7193005 4371102
11245D371102m801765p082928n663362K458239R975313O972564l079386o367109
$$ 4371102 -430663 -7513591 -13176953 -10718714 -743401 6229163 3149777 -3217332
11237c217332R97864P255782L344079m041070m488794J70991J133548k284056
$$ -3217332 -2219468 5036314 8380393 4339323 -149471 21520 1155068 -1128988
11229a128988l074787O83171L326565J853599L8026M92280Q7873l204694m934552
$$ -1128988 -4203775 -3520604 -194039 1659560 1697586 2189866 2277739 -926955 -5861507
11220e861507p18175N665623O548712J213736l294630k567143l87042j327213
$$ -5861507 -6579682 -914059 5634653 6848389 3553759 986616 599574 -727639
11212g27639k871864k08642M138961K790851m149691p023897n13716P197818N640304
$$ -727639 -3599503 -3808145 330816 3121667 -1028024 -8051921 -8565637 -1367819 4272485
11203D272485k423066n312414j41796L702545J60729m169042j357473M801465
$$ 4272485 1849419 -3462995 -3604791 97754 258483 -3910559 -5268032 -466567
11195d66567M669959k454832p524309m782382J316439L421589K78193l886497
$$ -466567 4203392 1748560 -5775749 -10558131 -9241692 -5820103 -5541910 -9428407
11187i428407n413890l809195r7892M513113Q154110Q335218M076910j900636
$$ -9428407 -14842297 -18651492 -18749384 -14236271 -6082161 2253057 6329967 4429331
11179D429331m606875j854302K781302L846717M49421l298328l938404j952518
$$ 4429331 -177544 -2031846 749456 4596173 5045594 1747266 -2191138 -4143656
11171d143656P92910L452970M845305L076110j295995m370994l492250n38941
$$ -4143656 -3350746 102224 4947529 8023639 6727644 2356650 -1135600 -1674541
11163a674541J356123J838525J739603K96459k697125m266064j824177J953039
$$ -1674541 -318418 1520107 3259710 3556169 859044 -3407020 -5231197 -3278158
11155c278158K018953j676121l819527j350343K274264K194710j038868k291881
$$ -3278158 -1259205 -2935326 -6754853 -8105196 -5830932 -3636222 -4675090 -6966971
11147f966971J235990O027256O079063M5128o799917q256378l608193K759597
$$ -6966971 -5730981 296275 6375338 6420466 -379451 -8635829 -12244022 -9484425
11139i484425O501734N895542J152893m946782o708573r44687O798375P078083
$$ -9484425 -2982691 2912851 4065744 -881038 -7589611 -8534298 -1735923 5342160
11131E342160o14473n882332j658749N608092N511446j430734n731497l189757
$$ 5342160 4727687 -1154645 -2813394 2794698 8306144 6875410 1143913 -2045844
11123b045844O99456O48055j240985n64829K149120K788908r4728l265516k767182
$$ -2045844 -1346388 -698333 -1939318 -2504147 -355027 2433881 2339153 -926363 -3693545
11114c693545J302340M587017L566913J96745o80227J500746J985476j721304
$$ -3693545 -2391205 2195812 5762725 5959470 5279243 6779989 8765465 7044161
11106G044161n186381l167667K581571N601236L195350r74464k060593P35792
$$ 7044161 1857780 -1309887 1271684 6872920 10068270 9093806 7033213 7769005
11098G769005L608305J775233m867011r695071o334539K089123N829585J878488
$$ 7769005 11377310 13152543 8285532 -1409539 -7744078 -5654955 174630 2053118
11090B053118k152293l55031K855141J609441j382497j033981K50401k211634
$$ 2053118 -99175 -454206 2400935 4010376 2627879 1593898 1844299 -367335
11082c67335n202020k408790L856815N648995K144464j66866J102807J899501
$$ -367335 -5569355 -7978145 -4121330 1527665 3672129 3505263 4608070 6507571
11074F507571K62070j521498k758459l994538k118024M924310J0035625M497438
$$ 6507571 6769641 5248143 2489684 -1504854 -3622878 1301432 11337057 15834495
11066A5834495o837178r871686j945486M333444Q54457n038074m382750M08308
$$ 15834495 8997317 -874369 -2819855 1513589 2368046 -2670028 -7052778 -6644470
11058f644470L136355M096076N199790L704249j308134l872351l61613L232144
$$ -6644470 -3508115 587961 5787751 9492000 8183866 4311515 3949902 7182046
11050G182046R42032l094714k470113P7834j515359m634461k072434M960949P887189
$$ 7182046 8124078 5029364 2559251 2637085 1121726 -3512735 -5585169 -624220 7262969
11041G262969L715701j710962l335933k323690j360964p93301m90391q73520j339917
$$ 7262969 10978670 9267708 5931775 3608085 2247121 1453820 963429 89909 -1250008
11032a250008j041600r38593k006108k469115j88410L268986M285044K083418
$$ -1250008 -2291608 -3230201 -5236309 -7705424 -7893834 -4624848 -339804 1743614
11024A743614q60946k367418k148855j011709l20387q34312r78580J355884M507199
$$ 1743614 882668 -1484750 -3633605 -4645314 -4965701 -5800013 -6778593 -5422709 -915510
11015i15510M204635L17780k105335o15726R17934o12816k098468o5893K817229
$$ -915510 3289125 3606905 1501570 885844 1803778 1190962 -907506 -973399 1843830
11006A843830K111637j327909l536804l406206k055341L27815K742826K222124
$$ 1843830 3955467 2627558 -909246 -4315452 -6370793 -6042978 -3300152 -1078028
10998a078028j172547k272039J601092N468665M400931J410379J283345J674635
$$ -1078028 -2250575 -4522614 -2921522 2547143 6948074 8358453 9641798 11316433
10990A1316433j603845m856821j796251M161479L527776l902009q014110m127821
$$ 11316433 9712588 4855767 3059516 7220995 10748771 6846762 -1167348 -5295169
10982e295169N45293l30340k488405J44561M529599L937539m13174j269307K690665
$$ -5295169 -4749876 -5080216 -7568621 -7424060 -2894461 1043078 629904 -639403 2051262
10973B051262M361158r23165p773209p583969K6271O890944O816960K211951j227326
$$ 2051262 6412420 5489255 -2283954 -9867923 -9841652 -2950708 3866252 6078203 4850877
10964D850877k474681m055606n501474l334458K465272P013917O786217L194651
$$ 4850877 2376196 -1679410 -7180884 -10515342 -8050070 -1036153 5750064 8944715
10956H944715j144962n182361p012775l892052K509575N548414J834525l875965
$$ 8944715 7799753 2617392 -4395383 -8287435 -5777860 -229446 1605079 -2270886
10948b270886n427568k994901l45576J645495M099700N813586M706584J719903
$$ -2270886 -7698454 -10693355 -11038931 -9393436 -5293736 519850 5226434 6946337
10940F946337o89905k150619l134326k457505L38768K307570O33736k764301l591009
$$ 6946337 6256432 4105813 971487 -1486018 -1147250 1160320 1794056 -970245 -4561254
10931d561254q40597K615964L769381J807107j582210k917886k51905L560596
$$ -4561254 -5401851 -2785887 983494 2790601 1208391 -1709495 -1961400 1599196
10923A599196M191717K441459K472938L376766j17971o768006p614170p8584N713142
$$ 1599196 5790913 8232372 10705310 14082076 13964105 7196099 -418071 -496655 5216487
10914E216487J535364o082236o293644n19839J639462j593628l268704o08348
$$ 5216487 6751851 669615 -5624029 -6143868 -4504406 -6098034 -9366738 -9975086
10906i975086J755545J370791J524497L878231N014163K299010k156040m779846
$$ -9975086 -8219541 -6848750 -5324253 -1446022 3568141 5867151 3711111 -1068735
10898a068735m062711q64967J637319j32658m877052n770081O38074Q045299Q192705
$$ -1068735 -5131446 -5996413 -4359094 -4491752 -9368804 -15138885 -14500811 -6455512 1737193
10889A737193K090343k342144j309680K098073L923139K375760k809096q430853
$$ 1737193 3827536 1485392 175712 2273785 6196924 8572684 5763588 -2667265
10881b667265q010694R9029P788901O830109L08279k664468m78820R69955m91266
$$ -2667265 -10677959 -10578930 -2790029 4040080 4348359 1683891 1205071 2175026 1683760
10872A683760j036876Q76906K238208J723616J162220P46876q45363k110489p28544
$$ 1683760 646884 1523790 3761998 5485614 6647834 7394710 6549347 4438858 3710314
10863C710314J155606j0664k474007k283189r63102k309175l696559K06018O253274
$$ 3710314 4865920 4855256 2381249 98060 -865042 -3174217 -6870776 -6664758 -411484
10854d11484N638095j541077m978143L0481N275805K682407l511952l904147J956478
$$ -411484 5226611 3685534 -1292609 -1262128 4013677 6696084 3184132 -720015 1236463
10845A236463N289395M18649p597839r131840k042611N249635M649928n97289
$$ 1236463 6525858 6944507 -653332 -9785172 -11827783 -6578148 -1928220 -2525509
10837b525509j495278J943315J180426m462396m491927M069283Q189132p13550
$$ -2525509 -4020787 -2077472 -897046 -5359442 -9851369 -5782086 2407046 1693496
10829A693496j0457226o533105L831538L745721m903828n405916M826682J0278653
$$ 1693496 -8763730 -15296835 -11465297 -7719576 -12623404 -18029320 -13202638 -2923985
10821b923985L225076n852494p304136m400549j802996K080024O045214M305106
$$ -2923985 301091 -5551403 -12855539 -17256088 -19059084 -16979060 -10933846 -6628740
10813f628740j026179j57791O571051O440402l815424r944853k714119O719355
$$ -6628740 -7654919 -7812710 -1241659 5198743 1383319 -8561534 -11275653 -4556298
10805d556298N086225k608139l709120J629486L868479N16509k925748l216479
$$ -4556298 529927 -2078212 -5787332 -4157846 -289367 227142 -2698606 -5915085
10797e915085q64229L691166P592236N195766k628519n902767J97767O361533
$$ -5915085 -6779314 -3088148 4504088 9699854 7071335 1168568 1366335 7727868
10789G727868L048229m707082o536013l304232k709343m197602j133968N310071
$$ 7727868 10776097 6069015 -466998 -3771230 -6480573 -10678175 -11812143 -6502072
10781f502072P091309L097095N39619K053217J793063l421926p806190n161496
$$ -6502072 589237 3686332 4225951 6279168 8072231 4650305 -3155885 -8317381
10773h317381K129389O413274L901791k098560n614840m252068j008593K82683
$$ -8317381 -6187992 225282 4127073 2028513 -3586327 -7838395 -8846988 -8564305
10765h564305R0082J274055L275541K857364M85153J65194K030947J605069j718851
$$ -8564305 -8474223 -7200168 -3924627 -1067263 -582110 -416916 1614031 3219100 1500249
10756A500249k589724R46811L420722J411044m31836J670166K927488j496689
$$ 1500249 -1089475 -142664 3278058 4689102 4257266 5927432 8854920 7358231
10748G358231o350487l536080M233544O313849k91482o599596m365315L236983
$$ 7358231 1007744 -2528336 1705208 8019057 7727575 1127979 -3237336 -353
10740c53O786047K834965k873593l891516j287062o25673k514861j786288K605382
$$ -353 6785694 9620659 6747066 2855550 1568488 942815 -1572046 -3358334 -752952
10731g52952M031069o98396m084587J25566M703297M5606p975271n867712M506144
$$ -752952 3278117 2579721 -1504866 -1379300 3323997 3369603 -4605668 -10473380 -5967236
10722e967236P551193p62261o821085k694519K036309q13374l975831q1505L722977
$$ -5967236 1583957 821696 -5999389 -8693908 -6657599 -7470973 -11446804 -11528309 -7805332
10713g805332o78355o509359l881898K504365K276316j789401N58006P647334
$$ -7805332 -8483687 -14993046 -18874944 -16370579 -14094263 -15883664 -15325658 -7678324
10705g678324P918759m62186o442395l411851K343503K952450p00865l074398
$$ -7678324 240435 -221751 -6664146 -10075997 -7732494 -4780044 -5480909 -8555307
10697h555307j741508J743952M530825M361762J321830j988743l310368k550140
$$ -8555307 -10296815 -8552863 -4022038 339724 1661554 -327189 -3637557 -6187697
10689f187697l97722J889023J347379l189098o362448j745087P182071R718076
$$ -6187697 -6585419 -4696396 -3349017 -6538115 -12900563 -14645650 -7463579 2254497
10681B254497L495483k033123q45578J277210j332649m475982l171305p77850
$$ 2254497 5749980 3716857 2871279 4148489 2815840 -1660142 -4831447 -5609297
10673e609297j127935m68146M305920P702140M683037j64773j222603j615121
$$ -5609297 -6737232 -7205378 -2899458 4802682 9485719 9320946 8098343 6483222
10665F483222n264288p412718l276578J605018N13408k360465m49273J868943
$$ 6483222 1218934 -6193784 -9470362 -7865344 -7351936 -9712401 -10161674 -8292731
10657h292731k563855q369376m748926N975172J1052605O529582N71229j447303
$$ -8292731 -10856586 -19225962 -23974888 -17999716 -6947111 -417529 153700 -1293603
10649a293603k519256m384630l943406q02466J195029J320124K657833M897455
$$ -1293603 -3812859 -8197489 -12140895 -12943361 -11748332 -10428208 -7770375 -2872920
10641b872920M159675M06328k079232j741022r12949m54164O93749J549250N25813
$$ -2872920 1286755 1693083 -386149 -2127171 -3040120 -3494284 -2800535 -1251285 -725472
10632g25472n45048O28519J837310M6693k401819j331339J827020K296602j86694
$$ -725472 -1270520 -642001 1195309 1242002 -1159817 -2491156 -664136 1632466 1445772
10623A445772j486025L93234L420446M591120J892638l868932p345464l723603
$$ 1445772 -40253 352981 3773427 8364547 10257185 6388253 -957211 -4680814
10615d680814K789407K697737m290995p697054k756191K427053J672317O09792
$$ -4680814 -1891407 806330 -3484665 -11181719 -13937910 -11510857 -9838540 -9228748
10607i228748L967672N369575O5673l965095K70078M932149P30604n986026m393006
$$ -9228748 -5261076 108499 174172 -3790923 -3520845 1411304 2141908 -3844118 -8237124
10598h237124J681476J926942j093465J781153O899659L210083o596451q755462
$$ -8237124 -6555648 -4628706 -5722171 -3941018 2958641 6168724 -427727 -9183189
10590i183189q87978N447165M527082K430819K363552k36072n505388o288226
$$ -9183189 -10071167 -4624002 -96920 2333899 4697451 4461379 -1044009 -7332235
10582g332235r03356L193299J677362j055774r76028K70869R25327J560758J041187
$$ -7332235 -8235591 -5042292 -3364930 -4420704 -5396732 -5125863 -4200536 -2639778 -1598591
10573a598591k209396m989393k884056J896324L624519K215910J796632K574662
$$ -1598591 -3807987 -8797380 -11681436 -9785112 -6160593 -3944683 -2148051 426611
10565D26611J876817N46856O78020J97489k839461m569091j512573K167297J242681
$$ 426611 2303428 2850284 3528304 3725793 886332 -3682759 -5195332 -3028035 -1785354
10556a785354j939996k886336k820749l466136j296695M637617P142754K061675
$$ -1785354 -3725350 -6611686 -9432435 -12898571 -14195266 -9557649 -2414895 -353220
10548c53220l337119k033581J944538L126513L969557N239343L0374j1464091
$$ -353220 -3690339 -5723920 -3779382 -652869 3316688 8556031 8586405 -2877686
10540b877686j5298785m764182O514464O210164K072919L812919M046190m208466
$$ -2877686 -18176471 -22940653 -16426189 -10216025 -8143106 -4330187 -283997 -4492463
10532d492463r144342p14380P852568K358383n787292n53631Q391939M186371
$$ -4492463 -13636805 -14351185 -6498617 -4140234 -9927526 -10481157 -2089218 2097153
10524B097153m887038j725308O156599J433784q718861o235063K877854J094093
$$ 2097153 -2789885 -4515193 1641406 3075190 -5643671 -11878734 -9000880 -7906787
10516g906787n726644q36483Q643386N265102l690492j514785K717021o548804
$$ -7906787 -13633431 -14469914 -5826528 -561426 -4251918 -5766703 -3049682 -9598486
10508i598486j4334967q87504J4658491M924918j1761901k791344J4790413M482782
$$ -9598486 -23933453 -24820957 -10162466 -5237548 -16999449 -19790793 -5000380 -517598
10500e17598j6782437q045023J3171599M85846k6599714j3522181J7061278k774465
$$ -517598 -17300035 -25345058 -12173459 -11687613 -38287327 -51809508 -34748230 -37522695
10492c7522695m7016793k5840267L0376462j7496904j64027027j94965571N341278
$$ -37522695 -84539488 -110379755 -80003293 -97500197 -261527224 -456492795 -451151517
10485d51151517K37006520K40372605N5970354o1602950j8133782M1717418J1439229
$$ -451151517 -214144997 26227608 82197962 20595012 2461230 44178648 55617877
10478E5617877l3916406j3303603K1814293M933440k4994327j0476538J7648872
$$ 55617877 21701471 8397868 30212161 35145601 10151274 -325264 17323608
10471A7323608P322905j7836454j0218580J3631564J1763256m716515j255132
$$ 17323608 24646513 6810059 -3408521 10223043 21986299 17269784 16014652
10464A6014652J1587829L485814j3921512j0061569O075033N030477p717512o140738
$$ 16014652 27602481 31088295 17166783 7105214 13180247 18210724 10493212 4352474
10456D352474N461380L684157p514508o299062L929598K760146o562914m222092
$$ 4352474 9813854 13498011 5983503 -315559 3614039 6374185 -188729 -4410821
10448d410821P018266P193395k813616l996974M505802N322414l418039n651768
$$ -4410821 2607445 9800840 6987224 2990250 7496052 12818466 9400427 3748659
10440C748659J602480L766636l057091n602125J303871N990803J351900m114443
$$ 3748659 5351139 9117775 6060684 458559 1762430 7753233 9105133 4990690
10432D990690j980098M313175P605469N666332l90031p360412r874204o449906
$$ 4990690 3010592 7323767 14929236 20595568 20205537 12845125 2970921 -3478985
10424c478985k849625k902042j870037L604801O954462K552369l050932j522682
$$ -3478985 -6328610 -9230652 -11100689 -7495888 -541426 2010943 -1039989 -2562671
10416b562671L297541L139940k28615l8800K333410R37931l230725m788289l187439
$$ -2562671 734870 3874810 3646195 3607395 5940805 6878736 3648011 -1140278 -4327717
10407d327717n91959L551489P849630O360040j135616m885695K6207M293152l35460
$$ -4327717 -4919676 -1368187 6481443 12841483 11705867 6820172 6846379 11139531 10804071
10398A0804071o736675m927091J100200J976473n64746O09195L653229K579812
$$ 10804071 4067396 -859695 240505 2216978 1652232 2261427 5914656 8494468
10390H494468n45839j113809k323424p121665p922352J389574J1064624Q577441
$$ 8494468 7948629 6834820 4511396 -2610269 -10532621 -9143047 1921577 10499018
10382A0499018r90518l958241q05847k083505o861668m747227L163996N022655
$$ 10499018 9508500 5550259 4744412 2660907 -4200761 -8947988 -5783992 -761337
10374g61337k49575j321814M009717M629310k591987n791022O79402M983758k273244
$$ -761337 -1010912 -2332726 1676991 6306301 3714314 -2076708 -1397306 3586452 1313208
10365A313208j0811407n805835R059600J6448608Q793912l981439r065018m934428
$$ 1313208 -9498199 -15304034 -6244434 10204174 18998086 15016647 5951629 1017201
10357A017201L52735L14816l009876k815418K868196P799744N714987q18209l926923
$$ 1017201 1369936 1684752 -1325124 -4140542 -1272346 6527398 12242385 11424176 7497253
10348G497253j254280J822644O48358k952096m514758k766009J04326J761850
$$ 7497253 6242973 8065617 8713975 5761879 1247121 -1518888 -1414562 347288
10340C47288J762477R14885n51105l051629m937588k127277N713276J0768501
$$ 347288 2109765 3024650 2473545 -578084 -5515672 -7642949 -1929673 8838828
10332H838828N473098n235106q513440j826498L334551k05999m147157N04545
$$ 8838828 14311926 9076820 563380 -1263118 2071433 1865434 -2281723 -1777178
10324a777178P330824M385079o135532j0509390l407971N961846P779597K631567
$$ -1777178 5553646 9938725 3803193 -6706197 -10114168 -4152322 3627275 6258842
10316F258842k746557l926406j257674J778907J881268j64513m17137J583851
$$ 6258842 3512285 -414121 -1671795 107112 1988380 1823867 1406730 2990581
10308B990581J145296l514617o712057l559959K238000M351206K664772L31527
$$ 2990581 4135877 621260 -6090797 -9650756 -7412756 -3061550 -396778 -65251
10300f5251k630493n982494n011257K211226Q071401M854086k922231m837784
$$ -65251 -2695744 -8678238 -13689495 -11478269 -3406868 1447218 -1475013 -6312797
10292f312797M1426L771334K983966J630444J606432N29386j353264j017534N99059
$$ -6312797 -6271371 -2500037 483929 2114373 3720805 4250191 2896927 1879393 2478452
10283B478452o7488j685170j86560K446898O63974l924888m035113Q41707L525961
$$ 2478452 2410964 725794 539234 2986132 3650106 -274782 -4309895 -3468188 57773
10274E7773J633644M91343J638194n08026o631767p988876j05148Q056187O241526
$$ 57773 1691417 2182760 3820954 3312928 -3318839 -11307715 -11412863 -3356676 2884850
10265B884850k500442p203997m183798Q42967K920215K923507L242260L974308
$$ 2884850 384408 -6819589 -11003387 -10160420 -7240205 -4316698 -1074438 2899870
10257B899870M042660K986152J302665L46463J034715J890431K49731l618171
$$ 2899870 6942530 9928682 11231347 11577810 12612525 14502956 14752687 11134516
10249A1134516n927803m294028j012346J92813j139272k392448j469464J128557
$$ 11134516 5206713 912685 -99661 93152 -1046120 -3438568 -4908032 -3779475
10241c779475L147030K892950R84997o00111j361792k347384k729290K70614N586360
$$ -3779475 -632445 2260505 3245502 2645391 1283599 -1063785 -3793075 -3522461 2063899
10232B063899O495092n82027q606502p684397J233136P479571N434385P26742
$$ 2063899 8558991 7976964 -629538 -8313935 -7080799 398772 5833157 6559899
10224F559899k1056J538350L25348l425740n117472k635292J596862L868035K238308
$$ 6559899 6538843 8077193 8402541 4976801 -140671 -2775963 -1179101 2688934 4927242
10215D927242k036797m875882l283301M24970J224663j262924k095896J000705
$$ 4927242 2890445 -1985437 -5268738 -4843768 -3619105 -4882029 -6977925 -5977220
10207e977220L813977K585737M5154K20401J112352j842526p222980q661014m128154
$$ -5977220 -2163243 422494 467648 688049 1800401 -42125 -7265105 -15926119 -20054273
10198b0054273J419556L619023L809797M473127M187525Q76682k930706k643283
$$ -20054273 -18634717 -15015694 -11205897 -6732770 -2545245 -1668563 -4599269 -7242552
10190g242552J664010N254464N434206M221347L439708J327055l425966p528220
$$ -7242552 -5578542 -324078 5110128 9331475 12771183 14098238 10672272 3144052
10182C144052o687913j694953K648390L761524L037783J931154M1270k411657
$$ 3144052 -3543861 -5238814 -2590424 1171100 4208883 6140037 6181307 3769650
10174C769650l419071j665468J735717M418497M280167P20427l525408l494742
$$ 3769650 350579 -1314889 420828 4839325 9119492 9839919 6314511 2819769
10166B819769J710008N618420K132510m931975o238990m56551L876104J263540
$$ 2819769 4529777 10148197 12280707 7348732 1109742 653191 4529295 5792835
10158E792835l492955l921547q07818J556293J945974O44262k960097o630832
$$ 5792835 2299880 -1621667 -2429485 -873192 1072782 1717044 -1243053 -7873885
10150g873885m952981K132770O399266K826323k101909p23968L288615J834062
$$ -7873885 -12826866 -10694096 -4294830 -1468507 -3570416 -4294384 -1005769 828293
10142H28293l208996l364557J417556K765868j349378l228511J176897N757606
$$ 828293 -2380703 -5745260 -4327704 -1561836 -2911214 -6139725 -4962828 794778
10134G94778M750554J023311n71948p48624j836743k453548j118056j17490j022066
$$ 794778 5545332 6568643 5996695 5248071 3411328 957780 -160276 -277766 -1299832
10125a299832q80853K392876N046705K975329j305621k395207P873J992427K066966
$$ -1299832 -2180685 212191 5258896 8234225 6928604 4533397 4541270 6533697 8600663
10116H600663J615261L14105l405143p844541r040683o323380k403391J795733
$$ 8600663 10215924 10530029 7124886 -719655 -9760338 -16083718 -18487109 -16691376
10108a6691376P137122J0852710P614765j524388p421398m353515J996861L529238
$$ -16691376 -9554254 1298456 8913221 7388833 -32565 -4386080 -2389219 1140019
10100A140019J735242K994583N583196J984112o130968p199033K024153Q967100
$$ 1140019 2875261 5869844 11453040 13437152 7306184 107151 2131304 11098404
10092A1098404L611648n538654m847201K640478K857510n548992r083394k085049
$$ 11098404 14710052 9171398 4324197 6964675 9822185 4273193 -4810201 -6895250
10084f895250M133403M18282n634458l219647M158029N743668J065380j142569
$$ -6895250 -2761847 -2343565 -7978023 -11197670 -7039641 -1295973 -230593 -1373162
10076a373162K098821M800057K712169j551718m344580n084613m091376j679580
$$ -1373162 725659 5525716 8237885 6686167 2341587 -2743026 -6834402 -8513982
10068h513982M79342J221322K119508M029316L762060q95302n441125m072474
$$ -8513982 -8034640 -6813318 -4693810 -664494 3097566 2202264 -3238861 -7311335
10060g311335J032332K627589l27856j504231K223891N957001M569823j50289
$$ -7311335 -6279003 -3651414 -3979270 -5483501 -3259610 2697391 7267214 7116925
10052G116925k870821j604078R72970J016795k407313n389073k694559M604428
$$ 7116925 4246104 2642026 3614996 4631791 2224478 -3164595 -5859154 -1254726
10044a254726Q071053K714283m469061l276483M646505P811999J756201n101308
$$ -1254726 6816327 9530610 5061549 1785066 6431571 14243570 15999771 10898463
10036A0898463m801219n83979L69011j849684k133030L57470J426935j332388
$$ 10898463 6097244 5513265 5882276 4032592 1899562 2257032 3683967 2351579
10028B351579n632395p632364n024460J670979Q308786R375862L871537k623658
$$ 2351579 -3280816 -10913180 -15937640 -14266661 -5957875 3417987 7289524 4665866
10020D665866m452602k627642j882527k944109k379951M66604J860141M96211
$$ 4665866 213264 -2414378 -4296905 -7241014 -9620965 -9154361 -7294220 -6798009
10012f798009P19560N269571Q991886N487937k204087m722267m02822J803771
$$ -6798009 -6078449 -808878 8183008 13670945 11466858 6744591 6341769 8145540
10004H145540l338167q136535l852723M679233O056171K16221k168246K364296
$$ 8145540 4807373 -3329162 -7181885 -2502652 3553519 3769740 1601494 3965790
9996C965790N021760M80772m133862j772965L188620L591355Q59540o24611k700959
$$ 3965790 8987550 9468322 5334460 3561495 6750115 10341470 11201010 10576399 7875440
9987G875440p338209q249826J2262R536676Q064598k104603o799786r56741N499854
$$ 7875440 537231 -7712595 -7700333 1836343 9900941 7796338 996552 39811 5539665
9978E539665M148892j275519m009477l802374k999099j563283k61747j422309
$$ 5539665 9688557 8413038 4403561 601187 -2397912 -3961195 -4222942 -5645251
9970e645251l013452L28181O880212P137168j569649q621135n083746K996339
$$ -5645251 -8658703 -8330522 -1450310 5686858 4117209 -4503926 -9587672 -6591333
9962f591333M812317J292530Q22091L354735J199715n490430o576023J795698
$$ -6591333 -1779016 -486486 335605 3690340 4890055 -600375 -7176398 -5380700
9954e380700R386344O239067k814689n535518L89744N562549L142811k757263
$$ -5380700 4005644 10244711 7430022 1894504 2284248 7846797 10989608 8232345
9946H232345m689845j981754M82523N2501j472960k043198j768902j067941L70034
$$ 8232345 3542500 1560746 2043269 2095770 622810 -1420388 -3189290 -4257231 -3887197
9937c887197J929314J808411m57865k856014l143686j051674K038973M250691
$$ -3887197 -1957883 -149472 -607337 -3463351 -6607037 -7658711 -5619738 -1369047
9929a369047M008698J250217k137892m282185m906352l740720J68868M799443
$$ -1369047 2639651 3889868 1751976 -2530209 -7436561 -11177281 -11008413 -6208970
9921f208970M319888k739544p652990j686491R616511J2159339L562150l660786
$$ -6208970 -1889082 -4628626 -12281616 -13968107 -4351596 7807743 11369893 7709107
9913G709107k003180M87867l992441q795545m606984M188582P034571M054758
$$ 7709107 5705927 6193794 2201353 -6594192 -11201176 -7012594 21977 4076735
9905D076735K705798K955044p23692n963428m943784J160986L497586R79717J076710
$$ 4076735 6782533 9737577 9013885 3050457 -1893327 -732341 2765245 3744962 4821672
9896D821672M455089K816220n047935q673847k510124N011752N167957R63173
$$ 4821672 9276761 12092981 7045046 -1628801 -4138925 872827 6040784 7003957
9888G003957j166938j654403k463625p68584L856128M383826k538336q067984
$$ 7003957 5837019 4182616 1718991 950407 4806535 9190361 6652025 -1415959
9880a415959l839341L476509J931191n974538o418316L937973J2131633P669984
$$ -1415959 -5255300 -1778791 152400 -5822138 -12240454 -8302481 3829152 11499136
9872A1499136l440898q630692n096051J59990J901900J494537J673702K274801
$$ 11499136 8058238 -572454 -5668505 -5508515 -3606615 -2112078 -438376 1836425
9864A836425K193213J847228J690046M30989k846911n796005m818749k44784L187191
$$ 1836425 4029638 5876866 7566912 7997901 5150990 -645015 -5463764 -5708548 -2521357
9855b521357K277509n10120p25599K126083M444140L039476j811649o330328n409186
$$ -2521357 -243848 -753968 -1479567 646516 5090656 8130132 6318483 -11845 -5421031
9846e421031K251568R998287Q724454r05342p291131l431494K639260K29575o957782
$$ -5421031 -3169463 6828824 15553278 14647936 7356805 3925311 6564571 6794146 -163636
9837a63636o713689J889599P089458L275484j338874K62588K660482j246934p065234
$$ -163636 -6877325 -4987726 2101732 5377216 4038342 4300930 6961412 5714478 -1350756
9828a350756n420712L322934R447874P108347L32121m005723m055109k735850
$$ -1350756 -6771468 -3448534 5999340 13107687 13439808 9434085 5378976 2643126
9820B643126k664022l194914k273962j36886P77546J37832P90269L366230L818160
$$ 2643126 -20896 -3215810 -5489772 -5626658 -4849112 -4711280 -3921011 -554781 3263379
9811C263379L35411j733423J972502N946736K436996n130539o483875q87228K108331
$$ 3263379 3598790 1865367 3837869 9784605 12221601 7091062 607187 -280041 1828290
9802A828290j108142l166137K24592K906602O8429l143025j331417J872645J405372
$$ 1828290 720148 -2445989 -2221397 685205 753634 -2389391 -3720808 -1848163 -442791
9793d42791j00737J751154M492899L403824m54768l210900m335856m369300j843787
$$ -442791 -543528 1207626 5700525 9104349 8649581 5438681 1102825 -3266475 -5110262
9784e110262K284637L048340k92183r56887M347092Q134183L269800n096195p196431
$$ -5110262 -2825625 222715 -69468 -1026355 3320737 11454920 14724720 9628525 2432094
9775B432094k910295L93475j2323q77721m75411M16956K060315L525172Q65801
$$ 2432094 -478201 -84726 -97049 -974770 -1450181 -1033225 1027090 4552262 5418063
9766E418063n754161q314639k306357L816308L84713p341150o477840L264071
$$ 5418063 -336098 -8650737 -10957094 -7140786 -6756073 -14097223 -20575063 -17310992
9758a7310992R332544N499512j034698k883386j559550o84675J51563J331104
$$ -17310992 -7978448 -2478936 -3513634 -6397020 -7956570 -8641245 -8489682 -7158578
9750g158578R10500n51596M21622L559993M109252M87167l463886n014710n033636
$$ -7158578 -6248078 -6799674 -6378052 -2818059 1291193 1778360 -1685526 -6700236 -11733872
9741a1733872l363486J179907N432939M252294m29145r60387L834816O350729
$$ -11733872 -15097358 -13917451 -8484512 -4232218 -4661363 -5621750 -1786934 4563795
9733D563795K699401j386881j039156J72991j561477k750792Q1522K594955k08980
$$ 4563795 7263196 5876315 4837159 5010150 3448673 697881 779403 3374358 3165378
9724C165378m572777l738559J035821L255858J965318J611548K894592J888103
$$ 3165378 -1407399 -5145958 -4110137 -854279 1111039 2722587 5617179 7505282
9716G505282j799305l406517q46702J963699J479180p70352j924472j969443j768138
$$ 7505282 5705977 2299460 1452758 3416457 4895637 4125285 2200813 231370 -1536768
9707a536768m34991K491827M615944L184019j101418m639839m586995j023515
$$ -1536768 -1971759 520068 5136012 8320031 7218613 2578774 -2008221 -3031736
9699c031736L333945M771237J509859l826410o211243l978659q53998n59504j578641
$$ -3031736 302209 5073446 6583305 2756895 -3454348 -7433007 -8287005 -8846509 -10425150
9690a0425150l03035K330132J870995k003571l948499j041051K199464O21947
$$ -10425150 -10728185 -8398053 -6527058 -8530629 -12479128 -13520179 -11320715 -10698768
9682a0698768l204716k508274L472941Q127750O436730P03166l644744m100721
$$ -10698768 -13903484 -16411758 -12938817 -4811067 1625663 2328829 -1315915 -5416636
9674e416636j541115K017575M255786L489440M59421k107326k209689L31014M420986
$$ -5416636 -6957751 -4940176 -684390 2805050 3264471 1157145 -1052544 -721530 3699456
9665C699456O946917L409376o153840j3130148q538139M166814J1340604O374794
$$ 3699456 10646373 14055749 7901909 -5228239 -13766378 -9599564 1741040 8115834
9657H115834k321192m322426j095377o90825m162974n475060k243215J578657
$$ 8115834 5794642 1472216 376839 -313986 -4476960 -9952020 -12195235 -10616578
9649a0616578L315344M619597N863623L871354k098948o820226n159731P79041
$$ -10616578 -7301234 -2681637 3181986 7053340 4954392 -1865834 -7025565 -6246524
9641f246524L923118R69804l687850l512967K023372O569090M565617j959643
$$ -6246524 -2323406 -1353602 -5041452 -8554419 -6531047 38043 4603660 2644017
9633B644017o124705m536514j24471K924441L634253K950445J234980j260834
$$ 2644017 -3480688 -8017202 -8141673 -5217232 -1582979 1367466 2602446 1341612
9625A341612l419149m019105k408694J277640M944914N015854R50209k510512
$$ 1341612 -2077537 -6096642 -8505336 -7227696 -2282782 2733072 3683281 1172769
9617A172769j536998N53958j350287m856589l471826K028526M499191K700322
$$ 1172769 -364229 189729 -1160558 -6017147 -9488973 -7460447 -2961256 -260934
9609b60934K730601N672626M670590k049527o112862k385744K730481K718618
$$ -260934 2469667 8142293 12812883 10763356 4650494 2264750 4995231 7713849
9601G713849O86759N24335j409980o987927q690724j710079N454142L957307n09559
$$ 7713849 8400608 8924943 7514963 527036 -8163688 -9873767 -4419625 -462318 -971877
9592i71877J399624N260355J371213o063672n148398K528274M566323l45742j280576
$$ -971877 427747 5688102 7059315 995643 -4152755 -1624481 2941842 2596100 1315524
9583A315524L798995M075864l694889q255031l165412K624950R34213k821985
$$ 1315524 5114519 9190383 5495494 -2759537 -5924949 -3299999 -2365786 -5187771
9575e187771j398709J801233J086191r74985l39541J61856k086863k388582K564466
$$ -5187771 -6586480 -4785247 -3699056 -4674041 -5013582 -4851726 -6938589 -9327171 -6762705
9566f762705O613912L769629j026289j23581L799454K579331m016911q868143
$$ -6762705 -148793 3620836 2594547 2470966 6270420 8849751 4832840 -4035303
9558d035303q175088l586199K921435Q635826Q291898Q25544n367035k508021
$$ -4035303 -12210391 -15796590 -12875155 -4239329 4052569 4878113 -488922 -2996943
9550b996943M115758L250527m615297p309812M18253Q782816P383493n78443m537751
$$ -2996943 1118815 4369342 -245955 -7555767 -7137514 1645302 9028795 8450352 3912601
9541C912601j743931P38122k379103p079890n911350J811655Q749634Q301970
$$ 3912601 2168670 2906792 527689 -6552201 -12463551 -10651896 -1902262 6399708
9533F399708K101950k811568k642437q890R51244l46746j339823K59187L790915
$$ 6399708 8501658 5690090 3047653 3038763 3990007 3643261 2303438 2562625 6353540
9524F353540N220383P71496p011376r750442l851311K812912J440726l651726
$$ 6353540 11573923 12345419 5334043 -4416399 -8267710 -5454798 -4014072 -7665798
9516g665798j381485O878200P388749l458077j0620271k720189R266283Q195176
$$ -7665798 -9047283 -2169083 5219666 1761589 -8858682 -11578871 -2312588 5882588
9508E882588l089281p177969N63770O707956K684936k856019m09484M590064J770970
$$ 5882588 2793307 -4384662 -3820892 2887064 5572000 2715981 2306497 6896561 8667531
9499H667531o780060r826830l838661L257847M452239J469579j090822k456239
$$ 8667531 1887471 -7939359 -11778020 -8520173 -4067934 -2598355 -3689177 -6145416
9491f145416l372757k369566J183707L581316J403493k046277m62780N370080
$$ -6145416 -9518173 -11887739 -10704032 -7122716 -5719223 -7765500 -8228280 -2858200
9483b858200P221678J224111n668605n205700P58994M035016K041641o92941j295228
$$ -2858200 4363478 5587589 -81016 -5286716 -4527722 -492706 1548935 855994 -439234
9474d39234j520914j924966k83537K611798K238611k021092m479907j517618K995977
$$ -439234 -1960148 -3885114 -4168651 -1556853 681758 -1339334 -5819241 -7336859 -4340882
9465d340882M096207K469984Q89171j239180m903922o985107m130011J273817
$$ -4340882 -244675 2225309 3114480 1875300 -3028622 -10013729 -14143740 -12869923
9457a2869923L860104K472438N67455P49028K402417L778854L690710K011609
$$ -12869923 -9009819 -6537381 -5969926 -5220898 -2818481 960373 4651083 6662692
9449F662692J08309o95815j643496m551013o919143l855048L611512P832590M909104
$$ 6662692 6771001 6075186 4431690 -119323 -7038466 -10893514 -7282002 550588 5459692
9440E459692j58115k067274k229491k532616K98295P003199R549145J989856p876370
$$ 5459692 5301577 3234303 1004812 -1527804 -1229509 5773690 15322835 17312691 9436321
9431I436321q306141j122477K073369j419814l271477j88571J381609j115840
$$ 9436321 1130180 7703 2081072 661258 -2610219 -2798790 -1417181 -2533021
9423b533021j136550L793722N735736j33882o182097m512045O11198J427636l04943
$$ -2533021 -3669571 124151 5859887 5726005 -456092 -4968137 -4356939 -2929303 -3234246
9414c234246R20505K412300j334564o163615l702923L283533L930700k670742
$$ -3234246 -2313741 98559 -1236005 -7399620 -11102543 -7819010 -3888310 -6559052
9406f559052n571710j97682M530678K174282l60340M141813R510286N978424l333088
$$ -6559052 -12130762 -12328444 -7797766 -5623484 -5983824 -1842011 7668275 13646699 10313611
9397A0313611p064790k747695J768816J931044N82957j096779n587453j0213487
$$ 10313611 3248821 501126 2269942 4200986 4783943 3687164 -1900289 -12113776
9389a2113776p224105L135395R230902L663558n633854o789761J12881O146704
$$ -12113776 -19337881 -16202486 -6971584 -3308026 -8941880 -15731641 -15618760 -9472056
9381i472056P072185N222493J842796l185293n965106k064209M920360O573253
$$ -9472056 -2399871 2822622 4665418 1480125 -4484981 -6549190 -1628830 4944423
9373D944423J875562j724195m24414R74729j393655l929662k681327l89057j299326
$$ 4944423 6819985 5095790 4671376 5646105 4252450 322788 -2358539 -2747596 -4046922
9364d046922l809832l544072m21616K124566K685464K499973K160364J162855
$$ -4046922 -7856754 -11400826 -11822442 -9697876 -7012412 -4512439 -2352075 -1189220
9356a189220k39990j182842j312994m16298J647519L735107L999811K281806q3865
$$ -1189220 -1429210 -2612052 -3925046 -4341344 -2693825 1041282 5041093 7322899 7239034
9347G239034k597537m861250m424062J49306M615988L320886j614261k336454
$$ 7239034 4641497 -219753 -4643815 -4494509 121479 3442365 1828104 -508350
9339e08350K177187L743184j612018o454892l773864J852051K452771m20106J23123
$$ -508350 1668837 5412021 3800003 -2654889 -6428753 -4576702 -2123931 -2544037 -2420914
9330b420914L821030M459316R65260j787276j973591k145475k178526Q18814N197824
$$ -2420914 1400116 5859432 6824692 5037416 3063825 918350 -1260176 -441362 4756462
9321D756462N196423J7326m254573l372320K60829K745733L141969J697997j025044
$$ 4756462 9952885 9970211 5715638 2343318 2604147 5349880 8491849 10189846 9164802
9312I164802k360087j60428K248067m02006o186956p085044q86138M836243L590298
$$ 9164802 6804715 6644287 8892354 8490348 2303392 -4781652 -5667790 -831547 2758751
9303B758751j428379l401429j317014R45661J099210J10362o7226J878699M674787
$$ 2758751 1330372 -2071057 -3388071 -2442410 -1343200 -1232838 -1300064 578635 5253422
9294E253422L703796l321822r840514o577885M123866Q616011P33177q588829
$$ 5253422 8957218 5635396 -4205118 -10783003 -6659137 1956874 2690051 -5898778
9286e898778p341434K10116K035534k130520k164982M224917P806675L659630
$$ -5898778 -13240212 -13030096 -10994562 -13125082 -15290064 -11065147 -3258472 401158
9278D01158j142798J58756L798632L424621N26939l0347O94026j494026n143095
$$ 401158 -741640 -582884 3215748 6640369 7167308 7136961 7830987 6336961 1193866
9269A193866m748535p5582K849291P25078k534901k072202J293235L195996J876888
$$ 1193866 -3554669 -3630251 -780960 -55882 -2590783 -4662985 -3369750 -173754 1703134
9260A703134m28826j146949k62658M84257J46655k49481R11927L467381N087741
$$ 1703134 1274308 127359 -135299 348958 495613 246132 1158059 4625440 9713181
9251I713181L732083J05323k893153k988501n20084J982882K001488n87344l148983
$$ 9713181 13445264 13550587 10657434 7668933 7148849 9131731 11133219 10545875 7396892
9242G396892l131344j253697m02706j186617r46843J632063L605783J960250j419358
$$ 7396892 4265548 3011851 2609145 1422528 475685 2107748 5713531 7673781 6254423
9233F254423k362534o59987K61370n51157k34345K231309L262292j18261n295489
$$ 6254423 3891889 3231902 3493272 2942115 2707770 4939079 8201371 8083110 2787621
9224B787621o973003l431995K073294M948322L127098j196112l028047J69655
$$ 2787621 -4185382 -7617377 -5544083 -595761 2531337 1335225 -1692822 -1523167
9216a523167M294705K802023m041912q261199m709302J944572M418732K815043
$$ -1523167 2771538 5573561 1531649 -6729550 -11438852 -9494280 -5075548 -2260505
9208b260505K164688L128447J781125k333899m540879k293771J338724K952922
$$ -2260505 -95817 3032630 4813755 2479856 -2061023 -4354794 -3016070 -63148
9200f3148K900056K246472l8998m136831o806718m857604M05809M468343M531149
$$ -63148 2836908 5083380 5044382 907551 -5899167 -10756771 -10350962 -5882619 -1351470
9191a351470J942471L79523J998621M728801M036069j274836o275840n349056
$$ -1351470 591001 970524 2969145 7697946 11734015 10459179 4183339 -1165717
9183a165717O11319N374304M943353O94031m175426p289638o614257j988887K372013
$$ -1165717 -554398 4819906 9763259 10457290 6281864 -1007774 -7622031 -9610918 -7238905
9174g238905J493088l252894n114169j289985L356720L766755J254990q926R62092
$$ -7238905 -5745817 -8998711 -14112880 -15402865 -12046145 -8279390 -7024400 -7033326 -6071234
9165f071234K505026L635603L952035K856816J169592Q78036J559780L05451l053436
$$ -6071234 -3566208 69395 4021430 6878246 8047838 8925874 10485654 10791105 7737669
9156G737669m564521k321601J61659k43144j264380J42256J880914P6222m191038
$$ 7737669 3173148 851547 1013206 770062 -494318 -352062 1528852 1605074 -2585964
9147b585964o056761l386667J343197M367908L383691r86118m395139k413812
$$ -2585964 -8642725 -12029392 -10686195 -6318287 -2934596 -3920714 -8315853 -10729665
9139a0729665K835325L758691j907999o319046k373349N396241P444657L225934
$$ -10729665 -7894340 -4135649 -6043648 -12362694 -14736043 -9339802 -1895145 1330789
9131A330789O35614K934747M586107J214789l444898l504544R12210M526082L347175
$$ 1330789 1966403 4901150 9487257 10702046 7257148 3752604 4664814 9190896 12538071
9122A2538071j680223n985395n671622j568380J631517J302176j01747K99173
$$ 12538071 10857848 4872453 -799169 -2367549 -736032 566144 464397 763570
9114G63570J299085Q32504K43418J002006N33162l218300o136955l443396J641183
$$ 763570 2062655 2895159 3138577 4140583 4673745 1455445 -4681510 -8124906 -6483723
9105f483723K382601o4478J298622O139594N775680k322142q795615n959767J164886
$$ -6483723 -4101122 -4165600 -2866978 3272616 9048296 6726154 -2069461 -8029228 -6864342
9096f864342L540573J137164J36004J982937K840300J304095j94298m69774m71372
$$ -6864342 -3323769 -2186605 -2050601 -67664 2772636 4076731 3882433 3412659 2941287
9087B941287J6185J696332K615681K94967l532126m557280j918678J275477K886818
$$ 2941287 2957472 4653804 7269485 7564452 4032326 -524954 -2443632 -1168155 1718663
9078A718663L190776J941184j371026m092297k096523L699461O868915L780747
$$ 1718663 4909439 6850623 5479597 1387300 -709223 2990238 9859153 13639900
9070A3639900j255418k047764J044359K279526j132798n282195m581747J375407
$$ 13639900 12384482 10336718 11381077 13660603 12527805 7245610 2663863 4039270
9062D039270O945219O301593Q9966m673349k722293K497527L126155k021599n470606
$$ 4039270 10984489 17286082 17376048 12702699 9980406 12477933 15604088 13582489 8111883
9053H111883k265729K182459M21530n002820n220616Q91313M812459J757860k393644
$$ 8111883 5846154 8028613 8450143 3447323 -1773293 -881980 3930479 5688339 3294695
9044C294695j295518K044497J361996k491745l935214j646157J303038L242345
$$ 3294695 1999177 4043674 5405670 2913925 -1021289 -2667446 -1364408 1877937
9036A877937L511377m32502q141795j1463761l761987P754886R108701p56390
$$ 1877937 5389314 4956812 -3184983 -14648744 -18410731 -10655845 -1547144 -2303534
9028b303534q009535l843111M486427O872257M222395K547254K172551Q91723
$$ -2303534 -10313069 -14156180 -9669753 -2797496 1424899 3972153 6144704 7036427
9020G036427O60373K655086J788096m929194r983406n152296M553171P282588
$$ 7036427 7696800 10351886 12139982 7210788 -2772618 -7924914 -3371743 3910845
9012C910845J777559k650899j973655j354806k665633l99027O315431Q687367
$$ 3910845 5688404 3037505 1063850 -290956 -2956589 -3355616 2959815 11647182
9004A1647182J498145p144487o677960J187990O132077L823666n48724j805477
$$ 11647182 13145327 6000840 -677120 510870 6642947 10466613 9917889 8112412
8996H112412j116158j917055m066924m305620r05071L738925N518598L474317
$$ 8112412 6996254 5079199 1012275 -3293345 -4198416 -459491 5059107 8533424
8988H533424J031810J150300J848506n08102m468577m365254J349966O869049
$$ 8533424 9565234 10715534 12564040 12055938 7587361 3222107 4572073 11441122
8980A1441122O270555P65661l897944m814208l710484k815107k125742r82447
$$ 11441122 17711677 18477338 14579394 9765186 6054702 3239595 1113853 131406
8972A31406j48798j001163l054719l562909p48881L024341L490583M48805j362913
$$ 131406 -17392 -1018555 -4073274 -7636183 -8385064 -5360723 -1870140 -1421335 -2784248
8963b784248Q50485L450689K153416p55196k24354K401437P78007n475794q300043
$$ -2784248 -1933763 1516926 3670342 2915146 2690792 5092229 5870236 394442 -7905601
8954g905601k726374M988696N681981j02836l567160j16115N350586O246337K671154
$$ -7905601 -10631975 -5643279 38702 -64134 -3631294 -3747409 1603177 7849514 10520668
8945A0520668m74889p90998l27741j056612j893386j513292j534416m087569p221869
$$ 10520668 10045779 9254781 8927040 7870428 5977042 4463750 2929334 -1158235 -8380104
8936h380104o106871M56459P446709R028803M679954j341292m711195l792187
$$ -8380104 -14486975 -14030516 -6583807 2444996 7124950 5783658 1072463 -2719724
8928b719724K98789M336131N006037K042056j533428l165116l205765k853196
$$ -2719724 -2420935 1915196 6921233 8963289 7429861 4264745 1058980 -1794216
8920a794216j923932o3504J833504K699516K066867m89933l996909m495872O73815
$$ -1794216 -3718148 -3781652 -1948148 751368 2818235 2328302 -1668607 -6164479 -5490664
8911e490664O681647N363662k619487o771353j569995M991073L460999l146642
$$ -5490664 1190983 6554645 3935158 -2836195 -4406190 584883 4045882 899240
8903H99240n230834j272730K207464K121698J315050J261288N86086J11359J790712
$$ 899240 -4331594 -5604324 -3396860 -1275162 39888 1301176 1887262 1998621 3789333
8894C789333L186672K88991m613402n140768q01977K298849R34078j796255k757999
$$ 3789333 6976005 7264996 2651594 -2489174 -3291151 -992302 -58224 -1854479 -4612478
8885d612478k119982k82145K325354K689049j123062m483087j492726M977324
$$ -4612478 -6732460 -7014605 -4689251 -2000202 -3123264 -7606351 -9099077 -4121753
8877d121753O411421J522680k425087j494754M94140M45361O8686j11527k081789
$$ -4121753 2289668 3812348 1387261 -107493 386647 832008 900694 789167 -1292622
8868a292622l854363p05847M881511M154978l774004q538519l788811L573776
$$ -1292622 -5146985 -5852832 -971321 3183657 -590347 -9128866 -12917677 -9343901
8860i343901N017508K307180J086113O02780k147459m277894j466312L498254
$$ -9343901 -4326393 -2019213 -933100 -330320 -2477779 -6755673 -8221985 -4723731
8852d723731M298605P65862j417678P07411L965432L557768j687821p585738p591315
$$ -4723731 -425126 340736 -1076942 -369531 3595901 7153669 5465848 -2119890 -9711205
8843i711205j09696P768646Q118835K632262q53680q39864k588055o333640n643820
$$ -9711205 -9820901 -2052255 6066580 8698842 7845162 7005298 4417243 -1916397 -7560217
8834g560217L58172L906112J439069r02304R12991K119780l39617j464950J149354
$$ -7560217 -7202045 -3295933 -1856864 -2759168 -1846177 273603 -66014 -1530964 -381610
8825c81610J204056m060657o333194o6723O452416M271181j475122j362229K416686
$$ -381610 822446 -3238211 -9571405 -9638128 -3185712 1085469 -389653 -1751882 664804
8816F64804K309116k1859J401547L606500l0401n921418n233691P84629L449339
$$ 664804 2973920 2952061 4353608 7960108 7929707 2008289 -3225402 -2440773 1008566
8807A008566J614615J131393J979202p70916m792788k711552L896043N520922
$$ 1008566 2623181 3754574 5733776 4962860 170072 -2541480 1354563 6875485
8799F875485K21168l915902k628735l23886O274P04045J993708R61482r71827
$$ 6875485 7096653 3180751 552016 228130 234404 938449 2932157 3893639 2921812
8790B921812N11474L432136K090003j507677l71523L473942Q74810p388286r597088
$$ 2921812 3433286 6865422 8955425 7447748 7076225 10550167 11424977 4036691 -5560397
8781e560397k373178L291184N07231k755481J287842O805015N044978j401281
$$ -5560397 -7933575 -4642391 -4135160 -6890641 -5602799 1202216 6247194 4845913
8773D845913m344665k348245R93479M380295O772962M341388l152098q500226
$$ 4845913 501248 -1846997 -853518 3526777 10299739 14641127 11489029 2988803
8765B988803o314832q32279J485524J193686J484249Q60169k595932n136448l039538
$$ 2988803 -3326029 -4158308 -2672784 -1479098 5151 865320 -1730612 -6867060 -9906598
8756i906598K85265J44590r68239J636320N317034L760170k305193n850269l829088
$$ -9906598 -9621333 -9476743 -10444982 -8808662 -3491628 268542 -2036651 -7886920 -11716008
8747a1716008l955J941124K400331K979003L871520M094549K064858k476153n694579
$$ -11716008 -11719963 -9778839 -7378508 -4399505 -527985 3566564 5631422 3155269 -2539310
8738b539310k625268M794435P724316K179472m658853m979950j735168k608595
$$ -2539310 -5164578 -370143 7354173 9533645 4874792 -105158 -1840326 -4448921
8730d448921o852145o402471J437831R774879J0788658L712705n499902r016870
$$ -4448921 -11301066 -17703537 -16265706 -6490827 4297831 8010536 2510634 -6506236
8722f506236l455983N289062O636442j506786q533823n195178L348064N885923
$$ -6506236 -9962219 -4673157 1963285 456499 -8077324 -13272502 -9924438 -4038515
8714d038515J836079j57770K460530L376561M7581j812782R15382K992162J76131
$$ -4038515 -2202436 -2360206 100324 3476885 3524466 1711684 2627066 5619228 5795359
8705E795359l580302l344917j101234r10888j447228O39280L636548L186728j83756
$$ 5795359 2215057 -1129860 -2231094 -3141982 -4589210 -3949930 -313382 2873346 2689590
8696B689590j496954J146078L829889K237947k879918o440847m280772K166838
$$ 2689590 1192636 2338714 6168603 8406550 5526632 -914215 -5194987 -3028149
8688c028149O354106L247581m295790q136453m556259J634377M184040L118042
$$ -3028149 3325957 6573538 2277748 -5858705 -10414964 -8780587 -4596547 -1478505
8680a478505K439902L125820K743808O81406p43835m84304k73353j215310k093271
$$ -1478505 961397 4087217 6831025 7512431 6768596 6284292 6010939 4795629 2702358
8671B702358k082593k196783k738807k146444m4612J348313J032741J556763M408905
$$ 2702358 619765 -1577018 -4315825 -6462269 -6506881 -5158568 -4125827 -2569064 1839841
8662A839841N812149J724758m561793n547601m16194L274560Q10880k711257p44979
$$ 1839841 7651990 9376748 4814955 -732646 -1148840 2125720 2936600 225343 -519636
8653e19636M228397M439529j612228p489082p931442m180179P215K811734L908330
$$ -519636 3708761 8148290 6536062 -953020 -8884462 -13064641 -13057426 -10245692 -6337362
8644f337362L510291K905841L000974K258956p02546l178577j513591K178700
$$ -6337362 -2827071 78770 3079744 5338700 4636154 1457577 -56014 2122686
8636B122686J965596k529356m757231j263566K956382K455706p78921j813623
$$ 2122686 4088282 1558926 -3198305 -4461871 -1505489 950217 171296 -1642327
8628a642327n67486o0710l10730P21589K322839K036651N4908j383077j517222
$$ -1642327 -2209813 -2270523 -2581253 -1859664 463175 2499826 2554734 1171657 -345565
8619c45565o34663J761417M799351M871615O76930k969493j333097K553905K082904
$$ -345565 -980228 781189 5580540 10452155 11129085 8159592 6826495 9380400 11463304
8610A1463304k818374o067566m992520k841628j752811j17748J965975J427562
$$ 11463304 8644930 2577364 -2415156 -5256784 -7009595 -7127343 -5161368 -3733806
8602c733806j447768j772756J991633M802860L204213Q44022J388923J636417
$$ -3733806 -5181574 -6954330 -4962697 -159837 3044376 3888398 5277321 6913738
8594F913738k194677n899552k721069M943590P375268J231166n945554o790013
$$ 6913738 4719061 -1180491 -3901560 1042030 8417298 9648464 3702910 -3087103
8586c087103l217557j010713o21865J401231M779993N239940J772613r08471Q11592
$$ -3087103 -6304660 -7315373 -7937238 -6536007 -1756014 3483926 5256539 4348068 5159660
8577E159660L635482J721525m565953q170581m501994K176144M264411Q34806
$$ 5159660 8795142 10516667 5950714 -2219867 -6721861 -4545717 -281306 553500
8569E53500j900994r1559K487046J163315j683028m01323M015395M082467k829195
$$ 553500 -1347494 -1439053 1047993 2211308 528280 126957 4142352 8224819 5395624
8560E395624r049088o456857K067767O454725L132234j091342K02500L995110
$$ 5395624 -3653464 -10110321 -8042554 -1587829 1544405 453063 655563 4650673
8552D650673L223032k336308n791181l170201J173502J120491k599472l852350
$$ 4650673 7873705 5537397 -253784 -3423985 -2250483 -1129992 -3729464 -7581814
8544g581814j39139L622315J899112l377958m782344O86850O984236O477776k0395
$$ -7581814 -7720953 -4098638 -2199526 -5577484 -10359828 -9672978 -2688742 3789034 3768639
8535C768639m268587j646186K698511J165877n437113q478846k931889N702256
$$ 3768639 -499948 -2146134 552377 1718254 -3718859 -12197705 -15129594 -9427338
8527i427338Q136800K593601l941664n088828j970660N38415J072454J890934
$$ -9427338 -1290538 1303063 -2638601 -7727429 -9698089 -9159674 -8087220 -6196286
8519f196286L433222L227214P55382p53213N72422J809266j02021l062528l004722
$$ -6196286 -2763064 464150 1219532 466319 1038741 2848007 2745986 -316542 -3321264
8510c321264m43377N40796j075444k162083q68475J146600K237687K394248J006107
$$ -3321264 -3764641 -3223845 -4299289 -6461372 -7329847 -6183247 -3945560 -1551312 -545205
8501e45205k507627n240887k988946K831578N649329K899364p40495j438242j309178
$$ -545205 -3052832 -8293719 -11282665 -8451087 -2801758 97606 -642889 -2081131 -3390309
8492c390309k191437j137302K912008M553555N75340k830976M88102N238354K415849
$$ -3390309 -5581746 -6719048 -3807040 746515 1321855 -1509121 -1021019 4217335 6633184
8483F633184n240726o659694r057M638679J426051l417615l202916o64716j107391
$$ 6633184 1392458 -5267236 -5276293 -637614 788437 -2629178 -5832094 -6496810 -7604201
8474g604201l128819j949286K865558P538050Q454244M082643l343220p090376
$$ -7604201 -10733020 -12682306 -9816748 -2278698 6175546 10258189 6914969 -175407
8466a75407k667975L902480K239714o364249q777302J22569Q192603M107183n135041
$$ -175407 -2843382 1059098 3298812 -3065437 -11842739 -11720170 -3527567 579616 -4555425
8457d555425n452779K829022P319290L461199r47521n65895K92991k450384n571134
$$ -4555425 -10008204 -7179182 140108 3601307 2653786 2087891 2380882 -69502 -5640636
8448e640636n150901k666509o30093J692690M434817M321557j7189l800904j554088
$$ -5640636 -10791537 -13458046 -14088139 -12395449 -7960632 -3639075 -3656264 -7457168 -9011256
8439i011256N183651R072852N292544l264661q960869p084789p22291K794114
$$ -9011256 -3827605 5245247 10537791 7273130 -1687739 -8772528 -9494819 -6700705
8431f700705O49968k502804j685888J775372L800136M002920L866377J882580
$$ -6700705 -6050737 -8553541 -10239429 -8464057 -4663921 -661001 3205376 5087956
8423E087956l094810o124393j647258O080076O517407j995223q848409n776188
$$ 5087956 1993146 -4131247 -5778505 301571 6818978 4823755 -4024654 -9800842
8415i800842K591712O773456M556487K92126k593832l181500j145283J937859
$$ -9800842 -7209130 -435674 4120813 4412939 1819107 -1362393 -2507676 -569817
8407e69817K550364L69278j55872K929200M669033Q28167m468674m768086j368687
$$ -569817 1980547 2349825 2193953 5123153 9792186 10620353 6151679 1383593 14906
8398A4906m39196k566839k828299k76346N99237j322547j108607L479194O933636
$$ 14906 -424290 -2991129 -5819428 -6095774 -5496537 -6819084 -7927691 -4448497 2485139
8389B485139L779624k986386n683730j815065L594788M474706r9109n655624o672617
$$ 2485139 6264763 3278377 -2405353 -4220418 -625630 3849076 3749967 -1905657 -8578274
8380h578274j692535M981937P319568L582979k588872o770171p529905n671926
$$ -8578274 -10270809 -5288872 2030696 5613675 3024803 -3745368 -11275273 -16947199
8372a6947199k278221J419399M068986N223250N183336L646865L37349k907164
$$ -16947199 -19225420 -17806021 -13737035 -8513785 -3330449 316416 653765 -2253399
8364b253399l247278q52882P69620l31106j906071j377564K28870N23989k64110
$$ -2253399 -5500677 -6353559 -5583939 -5915045 -7821116 -9198680 -8969810 -8445821 -8709931
8355h709931l65926Q1271j54213m8871K682369P018725Q433325M763074k39970
$$ -8709931 -9075857 -8994586 -9148799 -9197670 -6515301 503424 8936749 13699823 13459853
8346A3459853j630359j16313r15824n402501p588429k157391O266805P427332
$$ 13459853 11829494 11713181 10797357 5394856 -2193573 -4350964 1915841 9343173
8338I343173l70063o752369l775204K239616O79781o011108n680946L513404Q757148
$$ 9343173 8973110 2220741 -1554463 685153 1364934 -4646174 -10327120 -6813716 1943432
8329A943432K241977o422526n391260J447874K742101q88874P54572Q250978J0039453
$$ 1943432 4185409 -2237117 -7628377 -6180503 -3438402 -4327276 -3572704 4678274 14717727
8320A4717727J114769q312483q001369j643075J069033j073118j914391R64761
$$ 14717727 15832496 7520013 -481356 -2124431 -1055398 -2128516 -4042907 -3078146
8312c078146L717989L126762M46373j357214r21155O41081P19103j742982l962895
$$ -3078146 639843 3766605 4212978 2855764 1934609 2575690 3294793 1551811 -2411084
8303b411084k750141M1949j22369k526189j649967L065187N021793J242799k027864
$$ -2411084 -5161225 -5119276 -5241645 -7767834 -9417801 -6352614 -1330821 -88022 -2115886
8294b115886M06542L778037J545131l413875m021498r56775k42548j658951O65619
$$ -2115886 -1709344 2068693 3613824 199949 -3821549 -4778324 -5020872 -6679823 -6014204
8285f014204O659862Q770906L678433k415560l160821n69441o16581m458572p408760
$$ -6014204 645658 9416564 13094997 10679437 7518616 6949175 6332594 1874022 -5534738
8276e534738m849945K461244Q308392O979459L74304l451511q84268K357108P90297
$$ -5534738 -10384683 -7923439 384953 7364412 7738716 4287205 3402937 5760045 6550342
8267F550342j761265N31320L992933R03141o124461o382568J978727Q216445M872357
$$ 6550342 4789077 5320397 9313330 10216471 4092010 -2290558 -311831 7904614 12776971
8258A2776971k483951n422319l850911k081685j088695j22658k52194j514575
$$ 12776971 10293020 4870701 1019790 -1061895 -2150590 -2273248 -2525442 -4040017
8250d040017j507085l26073j290914l733682k031516M345059P602233L577504
$$ -4040017 -5547102 -5873175 -7164089 -10897771 -12929287 -8584228 -981995 2595509
8242B595509j126337n21939M70944m141251q669050l963726O397720J0146692
$$ 2595509 1469172 947233 1418177 -2723074 -11392124 -15355850 -8958130 1188562
8234A188562M448348j538875j924706p81314k036459k968890j194826L35361n69412
$$ 1188562 5636910 4098035 2173329 1392015 -644444 -3613334 -4808160 -4472799 -5042211
8225e042211j058915R64352K608779J381609m10357l47837o7995j028387j003738
$$ -5042211 -6101126 -5136774 -2527995 -1146386 -1556743 -1904580 -1972575 -3000962 -4004700
8216d004700J030884J386400j940499l901919K75955N986809N063257j124688
$$ -4004700 -2973816 -1587416 -3527915 -7429834 -7153879 -1167070 3896187 2771499
8208B771499k886993K844073P303825K998641n305214q251395n086098k195840
$$ 2771499 -115494 2728579 10032404 13031045 7725831 -525564 -5611662 -7807502
8200g807502j917515q33372J819100K277086L6001j46015L119056M281305J31665
$$ -7807502 -9725017 -10558389 -8739289 -6462203 -6426202 -6572217 -3453161 828144 959809
8191I59809l932875k587592M14752q48334l514044q37585N088302N607720k53260
$$ 959809 -2973066 -5560658 -5145906 -5994240 -9508284 -10345869 -5257567 350153 96893
8182I6893l908093q37248L371720L267543J104020N21636N68534J82246J238503
$$ 96893 -3811200 -4648448 -1276728 1990815 3094835 3616471 4185005 4367251 5605754
8173E605754K739563m25258p653671r441101j054059P711543N206081n010299
$$ 5605754 8345317 7920059 266388 -9174713 -10228772 -2517229 2688852 -2321447
8165b321447r503792m049512K663364L414513J047528J223253L992545N379522
$$ -2321447 -11825239 -15874751 -13211387 -9796874 -8749346 -7526093 -3533548 1845974
8157A845974K999269j758401m752286k495231L264191O075398K544772l126722
$$ 1845974 4845243 3086842 -1665444 -4160675 -896484 5178914 7723686 4596964
8149D596964n503031n015877m375013k344442K676582O662140M920870K63835
$$ 4596964 -906067 -5921944 -10296957 -12641399 -9964817 -3302677 1618193 1882028
8141A882028j386482r07086l006354n693536k835762L484433M209176j617923
$$ 1882028 495546 -411540 -3417894 -9111430 -11947192 -8462759 -4253583 -5871506
8133e871506l931098K668970J0296978R863188L097587l136220o645203p641718
$$ -5871506 -9802604 -7133634 3163344 13026532 16124119 12987899 6342696 -1299022
8125a299022l941286L889172Q225420L460141m458446n421640P68191N499821
$$ -1299022 -5240308 -1351136 6874284 10334425 5875979 454339 1222530 6722351
8117F722351M543194K014571J468318Q35320k041403m990285n304124l795030
$$ 6722351 11265545 13280116 14748434 15583754 13542351 8552066 3247942 -547088
8109e47088k711205k477981k159019r73323J417886L987173L766684q23283o042058
$$ -547088 -3258293 -5736274 -7895293 -8868616 -7450730 -3463557 303127 -520156 -6562214
8100f562214n967524l56172M577898M652214K670203K437112K490429K45541j456774
$$ -6562214 -12529738 -12885910 -8308012 -3655798 -985595 1451517 3941946 4187487 2730713
8091B730713J640095O474550N345904k077328o840322l585919J534404O53384
$$ 2730713 4370808 10845358 16191262 14113934 7273612 3687693 5222097 5875481
8083E875481m023042m957105j578898K16521j228569j563380Q68015K685268K742767
$$ 5875481 1852439 -3104666 -4683564 -4467043 -5695612 -7258992 -6390977 -3705709 -962942
8074i62942L762123N037755J938580m394714n735075J20881L773017j437865p797426
$$ -962942 2799181 7836936 9775516 5380802 -354273 -233392 3539625 2101760 -5695666
8065e695666n128547K449875L110240l432558n953120k89064M643777K008136
$$ -5695666 -10824213 -8374338 -5264098 -8696656 -14649776 -14938840 -10295063 -8286927
8057h286927k744518j900238K808486M874271L380816J947033J021343k021166
$$ -8286927 -11031445 -12931683 -10123197 -5248926 -1868110 78923 1100266 -920900
8049i20900o243220o412683j97544P348771Q805691K945949l813760n310313l049487
$$ -920900 -7164120 -13576803 -13774347 -6425576 2380115 5326064 1512304 -3798009 -6847496
8040f847496k844033n085144l653497L666508R468320O279470k268195n995105
$$ -6847496 -9691529 -14776673 -18430170 -14763662 -5295342 984128 -1284067 -7279172
8032g279172j672864M207332N169193J476700k755785m219670j963159J883994
$$ -7279172 -8952036 -4744704 424489 1901189 -854596 -5074266 -7037425 -5153431
8024e153431L306354J287388l86695O68854J106025j650222l272520K41969L852726
$$ -5153431 -1847077 -559689 -946384 -277530 828495 -821727 -4094247 -3852278 448
8015D48J003904l936675j786863N154086N568222k072345o546991k271067K620317
$$ 448 1004352 -2932323 -4719186 434900 6003122 3930777 -2616214 -4887281 -2266964
8006b266964J289093j423734l58949M7998m087135o344966o52504O549135N753248
$$ -2266964 -977871 -2401605 -2760554 -2712556 -6799691 -13144657 -13797161 -7248026 -1494778
7997a494778k70645j766146J939825L015926p17374l089275o87769K597457K942707
$$ -1494778 -1765423 -3531569 -1591744 1424182 706808 -2382467 -3070236 -472779 2469928
7988B469928J178532p74555k133224j677743Q88213K461886L63394k512113j708424
$$ 2469928 3648460 2873905 740681 -937062 -48849 2413037 2776431 264318 -1444106
7979a444106J067305M86119k971639l105724J793357N464037K647217l618243
$$ -1444106 -376801 109318 -2862321 -5968045 -4174688 1289349 3936566 318323
7971C18323o471101l489703J938443N056296L614637j054401n344365o309219
$$ 318323 -6152778 -9642481 -7704038 -2647742 966895 -87506 -5431871 -11741090
7963a1741090l670465R65288N464772P245516M560187n19913k882388m58705K827025
$$ -11741090 -15411555 -14446267 -8981495 -1735979 2824208 2304295 -578093 -1036798 1790227
7954A790227K696176M15516j95820Q45485L95595k172328m044351l204203n22113
$$ 1790227 4486403 4901919 4706099 5551584 5947179 3774851 -269500 -3473703 -3995816
7945c995816K018014K959767J992957N46073M19753P41909j226906m929062n688152
$$ -3995816 -1977802 981965 2974922 3520995 3940748 4682657 3455751 -1473311 -7161463
7936g161463j398145L550427M034992O98352k208151k245526N14889M412100N410926
$$ -7161463 -8559608 -5009181 -974189 -275837 -2483988 -4729514 -4214625 197475 5608401
7927E608401K25294p062073p556692l07503M793630J936524j286223K815408Q033768
$$ 5608401 5833695 -1228378 -8785070 -9092573 -4298943 -2362419 -3648642 -833234 7200534
7918G200534M478710m173226o709282k950927k076039n030661l809468J929923
$$ 7200534 11679244 7506018 796736 -2154191 -4230230 -9260891 -13070359 -11140436
$$ [...]
##END NTUPLES=NMR SPECTRUM
##END=
