##TITLE=31Pdec_LR-738-B-B2-CR3
 D2O, 24 sc
 30.10.2021
##JCAMPDX= 6.0         $$ Bruker NMR JCAMP-DX V2.0
##DATA TYPE= NMR SPECTRUM
##DATA CLASS= NTUPLES
##ORIGIN= UXNMR, Bruker Analytische Messtechnik GmbH
##OWNER= root
$$ XWIN-NMR		Version 3.5
$$ Sat Oct 30 13:29:28 2021 Russian Standard Time (UT+4h)  she@DPX200
##.OBSERVE FREQUENCY= 81.013821
##.OBSERVE NUCLEUS= ^31P
##.ACQUISITION MODE= SIMULTANEOUS
##.ACQUISITION SCHEME= undefined
##.AVERAGES= 24
##.DIGITISER RES= 16
##SPECTROMETER/DATA SYSTEM= spect
##.PULSE SEQUENCE= zgpg30
##.SOLVENT NAME= D2O
##.SHIFT REFERENCE= (INTERNAL, D2O, 0, 248.564)
##AUDIT TRAIL= $$ (NUMBER, WHEN, WHO, WHERE, WHAT)
$$ ##TITLE= Audit trail, XWIN-NMR		Version 3.5
$$ ##JCAMPDX= 5.01
$$ ##ORIGIN= Bruker BioSpin GmbH
$$ ##OWNER= she
$$ F:/spectra/data/she/nmr/P31/1/pdata/1/auditp.txt
$$ ##AUDIT TRAIL=  $$ (NUMBER, WHEN, WHO, WHERE, WHAT)
(   1,<2021-10-30 13:28:02.81 +0400>,<she>,<DPX200>,
      <created by zg, POWCHK disabled, PULCHK disabled
       configuration hash MD5:
       00 E9 B6 7A A2 85 ED C7 34 08 36 98 17 FE 4E 26
       data hash MD5: 32K
       CC 3F 8F 83 24 C0 70 AC 5F BA 33 47 EE 3E 22 5D>)
(   2,<2021-10-30 13:28:14.20 +0400>,<she>,<DPX200>,
      <Start of raw data processing
       efp BC_mod = 2 LB = 1 FT_mod = 6 PKNL = 1 PHC0 = -8881.253 PHC1 = 155.8694 SI = 64K 
       data hash MD5: 64K
       DB 82 59 93 48 41 76 4D 74 A6 2F 75 7C 62 07 32>)
(   3,<2021-10-30 13:28:35.39 +0400>,<she>,<DPX200>,
      <pk PHC0 = 3.189341 PHC1 = -8 
       data hash MD5: 64K
       71 45 58 2D 36 7C 72 20 60 A8 C3 DF 8E 33 6F DB>)
(   4,<2021-10-30 13:28:39.10 +0400>,<she>,<DPX200>,
      <abs ABSG = 5 
       data hash MD5: 64K
       61 3D A0 BA 6D F1 61 C6 EA A8 43 29 23 BA 50 E3>)
$$ ##END=
$$ 
$$ hash MD5
$$ B3 7D 21 2B CF FC 59 D6 B5 E2 6B C2 DA FE 9C DF
##$RELAX= 
##$RELAX= 
##$RELAX= 
##$RELAX= 
##$RELAX= 
##$RELAX= 
##$RELAX= 
##$RELAX= 
$$ Bruker specific parameters
$$ --------------------------
##$DU= <F:/spectra>
##$EXPNO= 1
##$NAME= <P31>
##$PROCNO= 1
##$TYPE= <nmr>
##$USER= <she>
##$AMP= (0..31)
100 100 100 100 100 100 100 100 100 100 100 100 100 100 100 100 100 100 
100 100 100 100 100 100 100 100 100 100 100 100 100 100 
##$AQSEQ= 0
##$AQ_mod= 1
##$AUNM= <au_zg>
##$AUTOPOS= <>
##$BF1= 81.014009
##$BF2= 200.13
##$BF3= 200.13
##$BF4= 200.13
##$BF5= 200.13
##$BF6= 200.13
##$BF7= 200.13
##$BF8= 200.13
##$BYTORDA= 1
##$CFDGTYP= 0
##$CFRGTYP= 5
##$CHEMSTR= <none>
##$CNST= (0..31)
1 1 145 1 1 1 1 1 1 1 1 1 1 1 1 1 1 1 1 1 1 1 1 1 1 1 1 1 1 1 1 1 
##$CPDPRG= <waltz16>
##$CPDPRG1= <>
##$CPDPRG2= <waltz16>
##$CPDPRG3= <>
##$CPDPRG4= <mlev>
##$CPDPRG5= <mlev>
##$CPDPRG6= <mlev>
##$CPDPRG7= <mlev>
##$CPDPRG8= <mlev>
##$CPDPRGB= <>
##$CPDPRGT= <>
##$D= (0..31)
0 1 0 0 0 0 0 0 0 0 0 0.03 2e-05 3e-06 0 0 0 0 0 0 0 0 0 0 0 0 0 0 0 0 
0 0 
##$DATE= 1635586082
##$DBL= (0..7)
120 120 120 11 120 120 24 19 
##$DBP= (0..7)
150 150 150 150 150 150 150 150 
##$DBP07= 0
##$DBPNAM0= <>
##$DBPNAM1= <>
##$DBPNAM2= <>
$$ [...]
##$SUBNAM3= <"">
##$SUBNAM4= <"">
##$SUBNAM5= <"">
##$SUBNAM6= <"">
##$SUBNAM7= <"">
##$SUBNAM8= <"">
##$SUBNAM9= <"">
##$SW= 501.771253377433
##$SWIBOX= (0..15)
0 1 3 0 0 0 0 0 0 0 0 0 0 0 0 0 
##$SW_h= 40650.406504065
##$TD= 32768
##$TD0= 1
##$TE= 0
##$TE2= 300
##$TE3= 300
##$TEG= 300
##$TL= (0..7)
0 120 53 12 22 120 120 120 
##$TP= (0..7)
150 150 150 150 150 150 150 150 
##$TP07= 0
##$TPNAME0= <>
##$TPNAME1= <>
##$TPNAME2= <>
##$TPNAME3= <>
##$TPNAME4= <>
##$TPNAME5= <>
##$TPNAME6= <>
##$TPNAME7= <>
##$TPOAL= (0..7)
0.5 0.5 0.5 0.5 0.5 0.5 0.5 0.5 
##$TPOFFS= (0..7)
0 0 0 0 0 0 0 0 
##$TUNHIN= 0
##$TUNHOUT= 0
##$TUNXOUT= 0
##$USERA1= <user>
##$USERA2= <user>
##$USERA3= <user>
##$USERA4= <user>
##$USERA5= <user>
##$V9= 5
##$VALIST= <valist>
##$VCLIST= <CCCCCCCCCCCCCCC>
##$VD= 0
##$VDLIST= <DDDDDDDDDDDDDDD>
##$VPLIST= <PPPPPPPPPPPPPPP>
##$VTLIST= <TTTTTTTTTTTTTTT>
##$WBST= 1024
##$WBSW= 4
##$XGAIN= (0..3)
0 0 0 0 
##$XL= 0
##$YL= 0
##$YMAX_a= 6772
##$YMIN_a= -6031
##$ZGOPTNS= <>
##$ZL1= 120
##$ZL2= 120
##$ZL3= 120
##$ZL4= 120
##$ABSF1= 248.5645
##$ABSF2= -253.2056
##$ABSG= 5
##$ABSL= 3
##$ALPHA= 0
##$AQORDER= 0
##$ASSFAC= 0
##$ASSFACI= 0
##$ASSFACX= 0
##$ASSWID= 0
##$AUNMP= <proc_1d>
##$AZFE= 0.1
##$AZFW= 0.5
##$BCFW= 0
##$BC_mod= 2
##$BYTORDP= 0
##$COROFFS= 0
##$CY= -3
##$DATMOD= 1
##$DC= 0
##$DFILT= <>
##$DTYPP= 0
##$F1P= 0
##$F2P= 0
##$FCOR= 1
##$FTSIZE= 65536
##$FT_mod= 6
##$GAMMA= 0
##$GB= 0
##$INTBC= 1
##$INTSCL= 5.30512e-09
##$ISEN= 30
##$LB= 1
##$LEV0= 0
##$LPBIN= 0
##$MAXI= 10000
##$MC2= 0
##$MEAN= 0
##$ME_mod= 0
##$MI= 50
##$NCOEF= 0
##$NC_proc= -7
##$NLEV= 6
##$NOISF1= 182.463
##$NOISF2= 159.3651
##$NSP= 0
##$NTH_PI= 0
##$NZP= 0
##$OFFSET= 248.5645
##$PC= 4
##$PHC0= -8878.063
##$PHC1= 147.8694
##$PH_mod= 1
##$PKNL= yes
##$PPARMOD= 0
##$PSCAL= 0
##$PSIGN= 0
##$REVERSE= no
##$SF= 81.014009
##$SI= 65536
##$SIGF1= 159.3651
##$SIGF2= -187.1042
##$SINO= 113.3802
##$SIOLD= 16384
##$SREGLST= <1H.CDCl3>
##$SSB= 0
##$STSI= 65536
##$STSR= 0
##$SW_p= 40650.406504065
##$SYMM= 0
##$S_DEV= 0
##$TDeff= 32768
##$TDoff= 0
##$TI= <>
##$TILT= no
##$TM1= 0
##$TM2= 0
##$TOPLEV= 0
##$USERP1= <user>
##$USERP2= <user>
##$USERP3= <user>
##$USERP4= <user>
##$USERP5= <user>
##$WDW= 1
##$XDIM= 65536
##$YMAX_p= 364032008
##$YMIN_p= -281907342
$$ End of Bruker specific parameters
$$ ---------------------------------
##NTUPLES= NMR SPECTRUM
##VAR_NAME=  FREQUENCY,     SPECTRUM/REAL,   SPECTRUM/IMAG
##SYMBOL=    X,             R,               I
##VAR_TYPE=  INDEPENDENT,   DEPENDENT,       DEPENDENT
##VAR_FORM=  AFFN,          ASDF,            ASDF
##VAR_DIM=   65536,         65536,           65536
##UNITS=     HZ,            ARBITRARY UNITS, ARBITRARY UNITS
##FACTOR=    0.620285442955139, 1,           1
##FIRST=     20137.2065510759, 0,            0
##LAST=      -20513.1999529892, 0,           0
##MIN=       -20513.1999529892, -281907342,  0
##MAX=       20137.2065510759, 364032008,    0
$$ Real data points
##PAGE= N=1
##DATA TABLE= (X++(R..R)), XYDATA
$$ [...]
36458C926410K020400J401832n26326j626174m99472O27900n53183k019345n41934
36449B210108K366904K437700j88494j036372J235938K815241J369535m70988
36441A0739572k65150M31857K9357K12054K108777L161337J478569j83630J191230
36432A8903973L528345L063090O68119J13941J647615J991775p3129k434765l607408
36423B3801556m121181m126626l106041j865379j654843j629005k95731J135046
36415H137796L63724j596822j558436M91423J326347K72q69387r1235J28907j447343
36405D885246k770320k273513j316975j035525k74954J316511J613655k42274
36397i8149j699074r02131K35374j91314m64731J290181L014789J990667k16464
$$ y = [3926410, 5946810, 7348642, 6822316, 5196142, 4696670, 5324570, 4771387, 2752042, 2210108, 4577012, 7014712, 6826218, 5789846, 7025784, 9841025, 11210560, 10739572, 10474422, 10906279, 10935636, 11147690, 13256467, 16417804, 17896373, 17712743, 18903973, 22432318, 25495408, 26163527, 26277468, 27925083, 29916858, 29843729, 27408964, 23801556, 19680375, 15553749, 12447708, 10582329, 8927486, 7298481, 7002750, 8137796, 8501520, 6904698, 5346262, 5837685, 7164032, 7164304, 6294917, 6203682, 6332589, 4885246, 2114926, -158587, -1475562, -2511087, -2786041, -1469530, 144125, -98149, -1797223, -2699354, -2463980, -2655294, -3120025, -1829844, 1184945, 3175612, 2959148]
36388B959148l24832J020123O90496j114727j327481J88855K44479j754755k255993
36379a674687N07419L177445K257421p57203k009316p84588N03290M64867N9187
36370A743835J97148L66098o8210p37524r29994n24792L6164K33121j60074q41877
36360f86105j127244n76307N46914J519826J710772R16928m63794j501076j398458
36351a058544l36362O36763P42186K23275j91627k19539j12930q9115j00291j35917
36341f42101l51264p09198p53838q3841R69413J470736Q61762l64410j118037
36332g20778p27294N17707J582361J458686J59776r90973o63361P31011J385018
36323B732153M98649o95461r28400p16931j088707j594657j124712O9431Q11195
$$ y = [2959148, 2634316, 3654439, 4344935, 3230208, 1902727, 2091582, 2336061, 581306, -1674687, -1167268, 2010177, 4267598, 3510395, 1501079, 716491, 1219781, 1684648, 1743835, 1940983, 2307081, 2238871, 1501347, 571353, 46561, 82725, 315846, 155772, -686105, -1813349, -2389656, -1842742, -322916, 1387856, 2304784, 1840990, 339914, -1058544, -1394906, -758143, -15957, 207318, 15691, -203848, -316778, -405893, -506184, -642101, -993365, -1702563, -2456401, -2540242, -1570829, -100093, 761669, 397259, -720778, -1448072, -930365, 651996, 2110682, 2270458, 1279485, 616124, 1347135, 2732153, 3230802, 2535341, 1606941, 890010, -198697, -1793354, -2918066, -2848635, -2037440]
36314b037440Q71970P54369K41295r41134j605379m80137J268621J349454k593
36305e80974m03281N80997P62618o58903j573763n84586Q09299J084937R58142
36296C94486J184056Q58717k87759o17993M52021R68615l3129n40220M78837M78370
36286C336001k075538l840301j485406K365181K910105O93828p804J219428R08995
36277D024489j230932j512276P29910J385754j289090l280277j355468J718498
36269h09392J904993j1852q24082l56366n35968j137867m63592R27628Q59091
36260d47407n71202r79908L91161J560534J076208N7649M5077N17090j35807j931117
36250d17722k882781j506266J001665J964924O35858p16630J06526K126709K598699
$$ y = [-2037440, -1165470, -411101, -169806, -1110940, -2716319, -3196456, -1927835, -578381, -580974, -984255, -403258, 359360, -299543, -1873306, -2457892, -1648593, -563656, 394486, 1578542, 2437259, 2149500, 1531507, 1983528, 2952143, 2919014, 2378794, 2857631, 3336001, 1260463, -2579838, -4065244, -1700063, 1210042, 1903870, 1896066, 3115494, 4024489, 2793557, 1281281, 2011191, 3396945, 2107855, -1172422, -2527890, -809392, 1095601, 1083749, 259667, -96699, -632667, -1770534, -2234126, -1306498, -447407, -1018609, -1998517, -1607356, -46822, 1029386, 1087035, 1132112, 1649202, 1513395, -417722, -3300503, -4806769, -3805104, -1840180, -1204322, -1920952, -1814426, 312283, 2910982]
36241B910982Q34783j178719j763192j298201q21179n35764j43652N07981J300552
36232a86409J585786O08511q44521n13601J947268L349996J317212j539647j381158
36223D343437N16731o0626k657652k561451Q16526K377394l4795j896581o4332
36214G78651J695085k08582k305540k29522K954471J703312k046271j792457K293467
36205B842614L335844p21144l576818q74204K907678J806397k540988l964261
36197g84882q54381K457579K189142p73911l169849l120314j045633J572967L389505
36188a39777L541454J723803j215761k976356j686013J299949K307646K22626
36180C077571j693927p26359J039472L51968j577434j155175J332776K217220
$$ y = [2910982, 3745765, 2567046, 803854, -494347, -1315526, -1851290, -1994942, -1486961, -186409, 1399377, 2007888, 1163367, 649766, 2597034, 5947030, 7264242, 5724595, 4343437, 4860168, 4799542, 2141890, -419561, 396965, 2774359, 2739564, 842983, 778651, 2473736, 2265154, -40386, -269908, 2684563, 4387875, 2341604, 549147, 2842614, 6178458, 5457314, 1880496, 1006292, 3913970, 5720367, 3179379, -784882, -1639263, 818316, 3007458, 2233547, -936302, -4056616, -5102249, -3529282, -139777, 3401677, 5125480, 3909719, 933363, -752650, 547299, 2854945, 3077571, 1383644, 657285, 1696757, 2048725, 471291, -683884, 648892, 2866112]
36172B866112O86974l16342L17124L03527j057803j230833N49674J286165m67073
36163B937525j691853j63997J468009L08534j723590j449952M27l67862j707601
36154b390360q42726J850217K834556J277781J02980Q60443J515482L11371j470086
36145D049658j962684j395345r02737n41323J57862R22688J127054P11739J02057
36136B268969l06528m17617n60960j057192j321635k97118J569674K122443M73267
36127B473303j247414q07126Q59714J408038P75441N08967M98860m77126j549658
36118B442999o02717J615085J828701n96248k356461j404688n3788q56458k343013
36109b326588j591847J015339K496361J584297j63882r58112m93403M80893Q33398
$$ y = [2866112, 3553086, 3236744, 3553868, 3857395, 2799592, 1568759, 2118433, 3404598, 2937525, 1245672, 1081675, 2549684, 2858218, 1134628, -315324, -314897, -682759, -2390360, -3233086, -1382869, 1451687, 2729468, 2832448, 3692891, 5208373, 5519744, 4049658, 2086974, 691629, -211108, -752431, -594569, 328119, 1455173, 2166912, 2268969, 1962441, 1544824, 983864, -73328, -1394963, -1692081, -122407, 2000036, 2473303, 1225889, 418763, 1278477, 2686515, 3461956, 3970923, 4469783, 3992657, 2442999, 1840282, 3455367, 5284068, 4687820, 2331359, 926671, 872883, 16425, -2326588, -3918435, -2903096, -406735, 1177562, 1013680, 55568, -437835, 43058, 876456]
36100H76456j34911j460197j150766Q14049J685858j67177k277040j412465J425001
36091a801192K352550L68106j427541o10404J485709K307429J295748m96625k022947
36082A450833k383631j038601J031202J798922P63843l18325p0294O83641O48731
36073B566321k2305o90426j485105k231218j734867J78095J400697L31849j326599
36064c013558q58478J316683K350196J326771J72821J36558J26757p14140j275881
36055d32271n85151L28150J67299m97661l53142M99074J000559R63359R86015
36046B076231J038258N15590m40921q53860k83150N02985M54084n82228j718635
36037G08354j891254q99084M01737J097982J221390J319945J307221N64680q25547
$$ y = [876456, 741545, -718652, -1869418, -1055369, 630489, 463312, -1813728, -3226193, -1801192, 551358, 919464, -508077, -1118481, 367228, 2674657, 3970405, 3473780, 1450833, -932798, -1971399, -940197, 858725, 1622568, 1304243, 1233949, 1917590, 2566321, 2544016, 1853590, 368485, -1862733, -3597600, -3419505, -2018808, -1686959, -3013558, -3872036, -2555353, -205157, 1121614, 1294435, 1430993, 1557750, 843610, -432271, -1017422, -689272, -521973, -1019634, -1372776, -873702, 126857, 1090216, 2076231, 3114489, 3630079, 3189158, 2335298, 2052148, 2555133, 3009217, 2426989, 708354, -1182900, -2081984, -1680247, -582265, 639125, 1959070, 3266291, 3830971, 3005424]
36028C005424j842257j702777n69977R04047J904199J498554m28016k277007k137343
36019a645153k51892J298581J459067J064397P15541k9672p91012j63552J480469
36010C136774J490213j064090l238305k226539N49307J835768J186331M28329
36002B097788Q7412n51448r87728l25530L11652n72036j544271j24740K518341
35993I09440K652139j34012k109031j154720N52445P96842N03968R40616J134927
35984D092614K10392n85306l35331l51320j500986k139422r50778N01916M12710
35975f45511l10947j38513K64971n6998J70285K037591L451757J943532j008078
35966E708089j999247r46226n92504j421563j017875J276636K762184J458011
$$ y = [3005424, 1163167, -539610, -1109587, -205540, 1698659, 3197213, 2769197, 492190, -1645153, -1897045, -598464, 860603, 1925000, 2640541, 2610869, 1819857, 1656305, 3136774, 4626987, 3562897, 324592, -1901947, -1352640, 483128, 1669459, 2097788, 2185200, 1633752, 646024, 320494, 632146, 60110, -1484161, -1608901, 909440, 3561579, 3427567, 1318536, 163816, 716261, 1513103, 2017071, 2957687, 4092614, 4303006, 3717700, 3382369, 3031049, 1530063, -609359, -1560137, -1058221, -645511, -956458, -1094971, -830000, -886998, -716713, 1320878, 4772635, 6716167, 5708089, 3708842, 2762616, 2170112, 748549, -269326, 1007310, 3769494, 5227505]
35958E227505j093725k300816j630954k16544R04177J285483J132414J305531
35950D613071K119315K248581L16473k644470m033795k849344l78700J836090
35942A227221K811411J576758j595325l742986j973852K135290L911931J852697
35934F203145o68940q62106k33521j032136k126915j170249J217317K301977J206915
35925D835487l29790n99338L99779J458237J178778q04551k854550k699883m68977
35916A15192J199238Q72098J31775N07697R97355M74351J23656R50189J120099
35907F491650r90821k948639j380833K129878K642458o76068l073155j238943
35899I55527K195620L121468J577792L27241K43420N8671o25404q12317j82130
$$ y = [5227505, 4133780, 1832964, 202010, -14534, 889643, 2175126, 3307540, 4613071, 6732386, 8980967, 9297440, 6652970, 2619175, -230169, -608869, 1227221, 4038632, 5615390, 4020065, 277079, -1696773, 438517, 4350448, 6203145, 5534205, 4672099, 4438578, 3406442, 1279527, 109278, 1326595, 3628572, 4835487, 4505697, 3906359, 4306138, 5764375, 6943153, 6138602, 3284052, 584169, 115192, 1314430, 2186528, 2318303, 2826000, 3823355, 4297706, 4421362, 5371551, 6491650, 5500829, 2552190, 1171357, 3301235, 5943693, 5267625, 2194470, 955527, 3151147, 6272615, 7850407, 8177648, 8421068, 8479739, 7854335, 7042018, 6859888]
35890F859888L33380J909r20715j619788j187530O14681K346676J869079n85677
35881G711903j838987J4970K303917J235972k277633l498467o98425K266127J587317
35872F806694j207642j994912p6098J565812J229551N69119J232730K067507J149293
35863A1342054j003342k010835q30396J089045J801133R47422l34639q15280j42954
35854A0042208J109863J959903J731566O03090m41148l18207J228708L221494
35846A9137477M142687L401290K060902J712418K651388L699555L868363L463612
35838D4137692L227505L140698K676542J660311J87280j795596l997462n289574
35830D3947396m735546l038037k008305k444481l276039k996429j346030N95456
$$ y = [6859888, 7193268, 7195177, 6274462, 4654674, 3467144, 4081825, 6428501, 8297580, 7711903, 5872916, 5887886, 8191803, 9427775, 7150142, 3651675, 2953250, 5219377, 6806694, 5599052, 3604140, 3528042, 5093854, 6323405, 6892524, 8125254, 10192761, 11342054, 10338712, 8327877, 7497481, 8586526, 10387659, 11335081, 11000442, 10185162, 10042208, 11152071, 13111974, 14843540, 15446630, 15005482, 14687275, 15915983, 19137477, 23280164, 26681454, 28742356, 30454774, 33106162, 36805717, 40674080, 44137692, 47365197, 50505895, 53182437, 54842748, 55030028, 53234432, 49236970, 43947396, 39211850, 36173813, 34165508, 31721027, 28444988, 25448559, 24102529, 24697985]
35822B4697985J520237R91489k40520j080513j402771j983877k765932k272471
35814A7463627O9454K031806J009050j973797k972189k89986L223031M019620
35806B2580616K101473O6028m88383P7158R36032J468573J071001j77489j070127
35797B6564882o89690K90731Q29311J201068K077723K788311K253962J078923
35789C6395221Q39710J631830K194594K199696K376036K503932J629232N35920
35781E0306171J508783M794735P604759P849035O798646O609124P195949P413426
35773A00080628P612650Q788813J0404023J1386929J2421880J4790449J7468940
35766A82954312J8040976J6534615J5666948J6558751J6612428J2951482O134393
$$ y = [24697985, 26218222, 27209711, 26969191, 25888678, 24485907, 22502030, 19736098, 17463627, 17533081, 19564887, 20573937, 18600140, 15627951, 15337965, 18560996, 22580616, 24682089, 24748117, 24259734, 24336892, 25272924, 26741497, 27812498, 27635009, 26564882, 25875192, 26165923, 26995234, 28196302, 30274025, 33062336, 35316298, 36395221, 37234931, 38866761, 41061355, 43261051, 45637087, 48141019, 49770251, 50306171, 51814954, 56609689, 64214448, 72063483, 78862129, 85471253, 92667202, 100080628, 107693278, 116482091, 126886114, 138273043, 150694923, 165485372, 182954312, 200995288, 217529903, 233196851, 249755602, 266368030, 279319512, 285453905]
35759B85453905j062191p153081j2530886j7401116k0867258k1960752k0519435
35752A83959186j7259068j3781257j1967957j2208609j2531265j0725334p240998
35745I8244698m737572m677085n733354o007473n407236m844372m223690k798005
35737E9815911j102552q36222k423578m022007l795951k276163j376136j618647
35729D2364655j713753q92936j71242n58482j218284p17205N34957O84975p32177
35720C7580508j943799j458180l8916P44738P10648N40513J23101q48316j307174
35711C4103123O363J900183J665068p69857k121232n53067J252938J71062k215436
35702C3439145j894169J074844K285062l00256l190419k692865j81140O31789
$$ y = [285453905, 284391714, 277238633, 264707747, 247306631, 226439373, 204478621, 183959186, 166700118, 152918861, 140950904, 128742295, 116211030, 105485696, 98244698, 93507126, 88830041, 83096687, 77089214, 71681978, 66837606, 62613916, 59815911, 58713359, 57877137, 55453559, 51431552, 47635601, 45359438, 43983302, 42364655, 40650902, 39757966, 39586724, 39028242, 37809958, 37092753, 37627710, 38312685, 37580508, 35636709, 34178529, 34139613, 34884351, 35594999, 36135512, 36258613, 35410297, 34103123, 34109486, 36009669, 37674737, 36904880, 34783648, 34230581, 35483519, 35654581, 33439145, 31544976, 32619820, 34904882, 34604626, 31414207, 28721342, 28540202, 29171991]
35694B9171991p17339j834184j913462k186452k536088j384573P20939R70039
35686B0290871j157478k451732q49868J154695M17328j916454k407179o73342
35678A2406841N83309J54786m21042k01379k75047j202004j793267j479292j448454
35669F324451k170329k088997m01180R62138K05048j148198l78570K139503L316150
35660F760016J677802r75791k340401k032178r06497K49976P20907K0285j167433
35651B006686j295714N8850J389568J154515k12622r51211k40953R11547J079638
35642C900304K41864k50377L26037P26453n34554k330950j691454J743259M105675
35633F236257K161668j811709k892761m61553J185743n22517k770400j946185
$$ y = [29171991, 28454652, 26620468, 24707006, 22520554, 19984466, 18599893, 19320832, 20290871, 19133393, 16681661, 15831793, 16986488, 17403816, 15487362, 13080183, 12406841, 12990150, 13144936, 12723894, 12522515, 12247468, 11045464, 9252197, 7772905, 6324451, 4154122, 2065125, 1663945, 2626083, 2831131, 1682933, 1304363, 3443866, 6760016, 8437818, 7462027, 5121626, 3089448, 2182951, 2432927, 3153834, 3174119, 2006686, 710972, 769822, 2159390, 3313905, 3101283, 2150072, 1909119, 2820666, 3900304, 4142168, 3891791, 4217828, 4944281, 4409727, 2078777, 387323, 2130582, 6236257, 8397925, 6586216, 3693455, 3231902, 4417645, 3895128, 1124728, -821457]
35625h21457J034411K472471J112542r72826j778408j294563l61588M53585P10706
35616E54873J85137o51869r79002m38195P40631J939855K150701O41047j776010
35607B367168l022394j996331K31557J897197K194481J154498n99581j459609
35599G66986q8575K075201J761942j376124l395987j431068J972400K557059L10877
35590C152711j480722j493688j053238o31328N08797J597436J010141m28287l75945
35581H05877P54622K35799j922769k399774k2570K146315J738006M33469M26884
35572B195859Q68074J73607r41925j181739j043078j216217q30500N17889J170279
35563b87751O9045j063016m32496R63975J381659J111989R34248L3107j935887
$$ y = [-821457, 212954, 2685425, 3797967, 2825141, 1046733, -247830, -609418, -155833, 554873, 740010, 88141, -890861, -1329056, -588425, 1351430, 3502131, 4143178, 2367168, -655226, -2651557, -2420000, -522803, 1671678, 2826176, 2226595, 766986, 678411, 2753612, 4515554, 3139430, -256557, -1687625, 284775, 2841834, 3152711, 1671989, 178301, -874937, -1506265, -997468, 599968, 1610109, 1181822, 805877, 1560499, 1796298, -126471, -2526245, -2548815, -402500, 1335506, 1768975, 2195859, 3063933, 3237540, 2295615, 1113876, 70798, -1145419, -1975919, -1458030, -287751, -218706, -1281722, -1714218, -750243, 631416, 1743405, 2677653, 2710760, 774873]
35554G74873k880833j258943R32044J086681k4979k66689m0252o68971q98535
35545c245604Q99256K667556J335139j570315j763947R28197K494897J437908
35537C183087L72850M17027o05474k886469k898602N03525K967035J002342k374160
35528c18839k207379J068735K931556J546631o74492j400120q34841k2756O08250
35519F96745P81901K82316n03970j036841j310754j308053n60075Q49896J790940
35510c17895J536667P41906J50142m75989j259141j415317o06436K34559M32225
35501i79279N25848P81550M24887n71858p98344K21608R23228L80891n7376N21990
35491A373145O35082p42407j796690r51419O7406o83479j532444j40264J776683
$$ y = [774873, -2105960, -3364903, -2432859, -1346178, -1371157, -1637846, -1678098, -2347069, -3245604, -2346348, 321208, 1656347, 86032, -1677915, -749718, 1745179, 3183087, 3555937, 3972964, 3367490, 481021, -2417581, -1914056, 1052979, 2055321, -318839, -2526218, -1457483, 1474073, 3020704, 2346212, 946092, 111251, 88495, 696745, 1478646, 1760962, 1256992, 220151, -1090603, -2398656, -2958731, -2108835, -317895, 1218772, 1960678, 2110820, 1634831, 375690, -1039627, -1646063, -1411504, -979279, -453431, 328119, 753006, 181148, -617196, -395588, 527640, 908531, 851155, 1373145, 2008227, 1265820, -530870, -1482289, -1414883, -2098362, -3630806, -3771070, -1994387]
35482a994387J058435j040276n47921K310287L109966M36973k011286j604538
35474b82747k23703J03006M03112J416342J331563m82736j374930N3334J007380
35465A950621o54813k266168r03988J270449Q21747o81901M15782K696476J510819
35456D159024k722500m336948j257129J869755J226805p92480n63679R42693R52528
35447e21931N9168N22409J626602P87032j812956l235634k058686J71404J536784
35438b925808J507540M08445q00208n85051J352186K819629J710758p34522j506896
35429A246073k09170O82723j64626j326700j380578p82241l23008P1342K90047
35420a896138j51030o35904N9516J235062P24179j291194j776776M30001K354236
$$ y = [-1994387, -935952, -1976228, -2524149, -213862, 2896104, 3333077, 1321791, -282747, -506450, -403444, -332, 1416010, 2747573, 2264837, 889907, 943241, 1950621, 1295808, -970360, -1874348, -603899, 217848, -464053, -48271, 2648205, 4159024, 1436524, -2900424, -4157553, -2287798, -1060993, -1853473, -2417152, -1474459, -521931, -462763, 59646, 1686248, 2473280, 660324, -2575310, -4633996, -4462592, -2925808, -1418268, -1009823, -1810031, -2395082, -1042896, 1776733, 3487491, 2752969, 1246073, 1036903, 1719626, 1555000, 228300, -1152278, -1934519, -2257527, -2186185, -1896138, -2047168, -2683072, -2623556, -1388494, -664315, -1955509, -3732285, -3302284, -948048]
35411i48048J467876k80015R8941J561909J018683j195136j846784k25364R32766
35402E84828J99296n54487J29061Q78706L25136l86624J52327R55197L87493q64817
35392A806116q15127N29307R75547o63475k723616k681693k99696J971504J853454
35383d7679j7928j020137j40342P67841O4456r78372l03468J371216J575402R0914
35373A361903p75419L8262J012194R70253P06807Q27319M79159n85802j010784
35364C023892k57473J35630q42638j928485j935513j622177j511457l00401K304645
35355b933977L584932J575477j162723r64867J177905J109709j871451l851981
35347c336976k158306J088118K329898Q42784j471472k523986j384975J100234
$$ y = [-948048, 519828, 239813, 338754, 1900663, 2919346, 1724210, -122574, -347938, 584828, 784124, 229637, 358698, 1237404, 1562540, 1175916, 1328243, 2283440, 2670933, 1806116, 990989, 1520296, 2495843, 1832368, -891248, -3572941, -3872637, -1901133, -47679, -65607, -1085744, -1226086, -458245, -393789, -1372161, -1675629, -304413, 1270989, 1361903, 586484, 624746, 1636940, 2607193, 3314000, 4141319, 4620478, 4034676, 3023892, 2766419, 2902049, 2059411, 130926, -1804587, -3426764, -4938221, -5238622, -2933977, 650955, 2226432, 1063709, 98842, 1276747, 2386456, 515005, -3336976, -5495282, -4407164, -2077266, -1234482, -2705954, -5229940, -6614915, -5514681]
35339e514681K505353J299173p16844m71240J810564K714483Q26300j157174p80686
35330E15248O11778P10364J02132N72660J380068M39853j618596j859180L27894
35321A182221J919043N98553j857274k141455L8260J809494J041941j266721k740926
35312a416864k449556j219719R132R63277J365204P61405m87944r96598K5973
35303c445690J479932J597486K15341r93028n23528J326707K832933K486131M42056
35294E418340j436891j448589j76743J35108j193375k007847m55679J897115K037371
35285B768810j16634j608849p35298P89776O21592j051271k147304j379600N39364
35276b319414J743957R66015r36164j440428N95535K835140K126285r66307k539349
$$ y = [-5514681, -3009328, -1710155, -2426999, -2898239, -1087675, 1626808, 2453108, 1295934, 515248, 1127026, 1837390, 1939522, 2512182, 3892250, 4332103, 2713507, 854327, 1182221, 3101264, 3699817, 1842543, -298912, -260652, 1548842, 2590783, 1324062, -1416864, -3866420, -5086139, -5077007, -4113730, -2748526, -1987121, -2475065, -3471663, -3445690, -1965758, -368272, -152931, -1145959, -1669487, -342780, 2490153, 4976284, 5418340, 3981449, 2532860, 2356117, 2491225, 1297850, -709997, -1165676, 731439, 2768810, 2652176, 1043327, 308029, 1097805, 1719397, 668126, -1479178, -2858778, -2319414, -575457, 390558, -545606, -1986034, -1390499, 1444641, 3570926, 2604619, 65270]
35267F5270o63302K046370K251874J86867j476527j477061p98864n04999m68599
35258h38971j45328M03168L81181q73793k492145k157715R59606L874303K788885
35249A899191j429091l695290j576708J453088J464535l89609p01571M76828N89144
35240a909483l94986j42823J403959J729008L99416Q0630J795341K742539P11066
35231F414667k235233k826085j208189L6651O9012L18288J392501J911437O98149
35222D571198j576113l373037l697885k237758O20842L253476L416996O43861
35214A621580k425430k435870P44413L583996K952000l09609k721808k260482
35206a251210M8531J967157J987755j26469k941796l647085q29053K881274L299466
$$ y = [65270, -598032, 1448338, 3700212, 3887079, 2410552, 933491, 134627, -370372, -838971, -984299, -581131, -199950, -1073743, -3565888, -5723603, -4763997, -889694, 1899191, 470100, -3225190, -4801898, -3348810, -1884275, -2273884, -2975455, -2498627, -1909483, -2304469, -2447292, -1043333, 685675, 1085091, 1165721, 2961062, 5703601, 6414667, 4179434, 1353349, 145160, 181811, 250823, 569111, 1961612, 3873049, 4571198, 2995085, -377952, -4075837, -6313595, -5692753, -2439277, 977719, 1621580, -803850, -3239720, -2495307, 1088689, 4040689, 3731080, 1009272, -1251210, -1202679, 764478, 2752233, 2625764, -316032, -3963117, -4792170, -1910896, 1388570]
35197A388570L16363j760762n79742Q39954o50684k880626j865489J439579K457545
35188a295292K56805j162278O64724L130117K944556O55999j155101j636429j593643
35179H09458j452843j087466n36924K16753J136996J392498K98381q36837l3507
35170i3491J841530J688566q58768k318784p98821Q56910j22559j668812m23795
35161a898024K405161K900870P08079q46881l60821J15068o19564j005030p1871
35152A326987O77638J05664o19627l78311k0568m32377p51553q0239P50093O18747
35142A196454j37325o84044r49696q07977L34167J871349J744119n45551k438441
35133d16945j766532j8200J42342r10761q58533L36608N82566k96552j01470J651347
$$ y = [1388570, 1704933, -55829, -635571, 204383, -446301, -3326927, -5192416, -3752837, -1295292, -1038487, -2200765, -1536041, 1594076, 4538632, 5194631, 4039530, 2403101, 809458, -643385, -1730851, -2267775, -2051022, -914026, 478472, 776853, -59984, -93491, 1748039, 3436605, 2577837, 259053, -539768, 317142, 194583, -1474229, -1898024, 507137, 3408007, 4116086, 3269205, 2908384, 3023452, 2403888, 1398858, 1326987, 2004625, 2110289, 1490662, 1112351, 1091783, 659406, -92147, -172386, 577707, 1196454, 1059129, 375085, -574611, -1382588, -1048421, 822928, 2567047, 2021496, -416945, -2183477, -2201677, -2059335, -2970096, -3828629, -3492021, -2909455, -3206007, -3307477, -1656130]
35123a656130K436323P77249j183483r36132P62168J467095N94912n80903j189593
35114D91506j127039k42014J027704J245660L9645n78361Q81994K329305P48890
35105D817290k756782l879994j201225J956472K582773J613368J006393L48819
35097D487114j187978k019955l72485K135111K195805n52991l256238l804603
35089b376220k622427p66900J239674K523306K102022M99317o60216q84876r41905
35080a888225q67482N004R92205N46459p65658m58181J782804K958374J215546
35071C520846j156603j267165J07627L67354n88686q66296k84520l82957j075838
35062a626238m59987J602831K557633R12452j364526j720216n77176j80786r36402
$$ y = [-1656130, 780193, 1557442, 373959, -562173, 199995, 1667090, 2262002, 1681099, 491506, -635533, -877547, 150157, 1395817, 1435462, 857101, 1739095, 4068400, 4817290, 2060508, -1819486, -3020711, -1064239, 1518534, 3131902, 4138295, 4487114, 3299136, 1279181, 906696, 3041807, 5237612, 4684621, 1428383, -2376220, -4998647, -5765547, -4525873, -2002567, 99455, 598772, -61444, -946320, -1888225, -2755707, -2750703, -1758498, -1212039, -1977697, -2435878, -653074, 2305300, 3520846, 2364243, 1097078, 1204705, 1572059, 983373, 117077, -167443, -550400, -1626238, -2086225, -483394, 2074239, 2986691, 1622165, -98051, -675227, -856013, -1792415]
35053a792415j022299L70733J352876m6203k634121l094411l75120K572794K538987
35044b129179L07812p33678L68595J107901l4580r93355K94490K132676J636321
35035A957003m65887q59605J032921K135254O28958j338177j264466p4251j83923
35026A567827j456133j538921L41710K167663K000579M31297o12346n02295l08560
35017B090821q43320j365902p48173O71366J332319N36759o63528j023675o56436
35008f69769m10224n12880o45058o62382l84666N75792J788879J733403p5346
34999G37749j577848o42236J554519J841791l80041k309201j881366k99050N24307
34990b431376P18774J113399J102544q8864j310559q61479P00011J200347J04376
$$ y = [-1792415, -2814714, -2443981, -1091105, -1137308, -3771429, -6865840, -7240960, -4668166, -2129179, -1821367, -2555045, -2186450, -1078549, -1113129, -2106484, -1811994, 320682, 1957003, 1491116, 631511, 1664432, 3799686, 4428644, 3090467, 1826001, 1751750, 1567827, 111694, -1427227, -1085517, 1082146, 3082725, 3514022, 2901676, 2399381, 2090821, 1247501, -118401, -866574, -195208, 1137111, 1673870, 1010342, -13333, -669769, -1079993, -1592873, -2237931, -2900313, -3284979, -2709187, -920308, 813095, 737749, -840099, -1482335, 72184, 1913975, 1533934, -775267, -2656633, -2955683, -2431376, -1712602, -599203, 503341, 414477, -896082, -1757561, -1057550, 142797, 247173]
34981B47173q07794k55702P61588P17263j69353m67192K64433R08652M84977m50242
34971A233803o94508k47135k61958r97201j024251N65187K141888J377612j201998
34962H91439k375462l71970K748050L700498J745054j101671k664813k388556
34954A82569j109387K877M30303O08658J025683J186830K72968j306805k162537
34945h68841j748242p00199N53471J881856K210456M29546k057579k276004q8665
34936b664201J153125j61259j158830O07702K616646J372647j456650j436684
34928a127504J367707K440025O8776k267239j767194j48577J82245n9273N42986
34919g68048J064985L59846l39697K29897N78317r33641k500250j302931J586934
$$ y = [247173, -560621, -816323, -54735, 662528, 493175, 25983, 290416, 1199068, 1684045, 1233803, 539295, 292160, 30202, -966999, -1991250, -1426063, 715825, 2093437, 891439, -1484023, -1855993, 892057, 4592555, 6337609, 5235938, 2571125, 182569, -926818, -923941, -493638, 115020, 1140703, 2327533, 2600501, 1293696, -868841, -2617083, -3317282, -2763811, -881955, 1328501, 1758047, -299532, -2575536, -2664201, -1511076, -1672335, -2831165, -2223463, 393183, 1765830, 309180, -1127504, 240203, 2680228, 2749004, 481765, -1285429, -1434006, -1251761, -1311034, -768048, 296937, 656783, 317086, 546983, 1125300, 191659, -2308591, -3611522, -2024588]
34910b024588K358825K17896j554473p83491O61321M27585o05057k64698J100559
34901d66121J224088l72936j587205r03404M31466L55156r49607j310109K61785
34892c316887J992355J678522k76611j441785p27554L55156K52884l36602R0612
34883a729910J219531J410115L44576n84863n81781m21244o49889m65776O25942
34874h33299J417400O53399q40174j251407m70837j0252m23723o22552l3912M00149
34864b015208J57673L40771J664032K695593J821219o3225p58836j3420N03059
34855D331658J17055k14388k03079p49432j707090j587757l57329j9870j132788
34846a523020j356058O12126K238090J028690r73176r5643K918644L764059J144406
$$ y = [-2024588, 334237, 552133, -1002340, -1785831, -1124510, -696925, -1301982, -1566680, -466121, 757967, 385031, -1202174, -2105578, -1674112, -1318956, -2268563, -3578672, -3316887, -1324532, 353990, 77379, -1364406, -2091960, -1736804, -1483920, -1820522, -1729910, -510379, 899736, 1244312, 659449, 77668, -343576, -993465, -1459241, -833299, 584101, 1237500, 397326, -854081, -1324918, -1335170, -1758893, -2381445, -2415357, -2015208, -1857535, -1516764, 147268, 2842861, 4664080, 4600855, 3842019, 3828599, 4331658, 4448713, 4234325, 4031246, 3281814, 1574724, -13033, -370362, -390232, -1523020, -2879078, -2266952, -28862, 999828, 26652, -68991, 2849653, 6613712, 7758118]
34837G758118j478371j315252J92203N43010j98808p04302q39599r67784p17557
34828B271658j01680q7339n51022L39877K881323M032596J374426k667419l515688
34819C976732o73688J704747O36063j979563k492652m60454J155677J66606j889606
34810A43862j671880J397362L732966J889630k530287m417103j755751J833846
34802a377355K250311O3677j497869j488104j285363j129872M0018J706298J909518
34793h08741N75535o9597R20507J678716N56713j377612k056499j044591O10632
34784a014937J830178J882000N67225j047760j215036K79230J488296P43799j197414
34775B315581k272222j581124K4808J173831J177239N27345M68666J438538K037252
$$ y = [7758118, 6279747, 4964495, 5156698, 5699708, 5500900, 4796598, 3956999, 2989215, 2271658, 2169978, 2082639, 1531617, 1871494, 4752817, 8785413, 10159839, 7492420, 3976732, 3303044, 5007791, 5643854, 3664291, 1171639, 711185, 1866862, 2033468, 143862, -1528018, -130656, 3602310, 5491940, 2961653, -1455450, -3211201, -1377355, 872956, 936633, -561236, -2049340, -3334703, -4464575, -4424557, -2718259, -808741, -233206, -302803, 617704, 2296420, 2853133, 1475521, -580978, -1625569, -1014937, 815241, 2697241, 3264466, 2216706, 1001670, 1280900, 2769196, 3512995, 2315581, 43359, -1537765, -1512957, -339126, 838113, 1365458, 1834124, 3272662, 5309914]
34766E309914P02399j668195k455679j014812L27360j69052j107765m67084J044386
34757E01472J175892l18863j368742m75801J643931L103974K439014l18086l093678
34748C289113l132437k02139K454565J895770p62076k231258j706577j135711
34740a530750j371368j002408O48477K108218K163433J332839J22754j708971
34732G62224l124576j853480J760575L645807J259957k260619k264793Q00202
34724a274703K496967J133272n66605n43597j75399q33877j146696K87603J977118
34715A354083J636697l60227j669447j115392M34441J507020J168753l57526j385350
34706A213052l35842J666552J611542r52036k652656j234898Q17769L25692j281662
$$ y = [5309914, 6012313, 4344118, 1888439, 873627, 1200987, 1031935, -75830, -542914, 501472, 1677364, 1358501, -10241, -486042, 1157889, 4261863, 6700877, 6382791, 3289113, 156676, -45463, 2409102, 4304872, 3542796, 1311538, -395039, -1530750, -2902118, -3904526, -3256049, -1147831, 1015602, 2348441, 2471195, 762224, -2362352, -4215832, -2455257, 1190550, 2450507, 189888, -2074905, -1274703, 1222264, 2355536, 1788931, 1245334, 1069935, 236058, -910638, -623035, 1354083, 2990780, 2630553, 961106, -154286, 280155, 1787175, 2955928, 2598402, 1213052, 877210, 2543762, 4155304, 3203268, 550612, -684286, 133483, 459175, -822487]
34697h22487m58214K241996K892482O68818j013740l75753K24431q60276j449077
34688A048180K65657J921089N84223k306780k958210p11348J556515J724818M81631
34679A605775n44411n72552K45497J011071O91061l97459n77683O61226J465787
34670C588312L46960j394002j742947r98651o56707o95407l45405k40789j090386
34661c229022j354921O37488L059813K553736l99613j736797J01937J953989R98330
34652B584940j225107j727779m51028M64278J11791n23638m14076N00800J562837
34643H83018J820591Q75098l48929o27011k49474m13423q97953l36457J005804
34634A711264J126576l59354j273218m24647L89552m37003j484207p58748R37486
$$ y = [-822487, -1280701, 961295, 3853777, 4522595, 3508855, 3133102, 3357533, 2497257, 1048180, 1313837, 3234926, 3819149, 1512369, -1445841, -2157189, -600674, 1124144, 1605775, 1061364, 488812, 734309, 1745380, 2436441, 2038982, 1461299, 2122525, 3588312, 3935272, 2541270, 798323, -200328, -857035, -1552442, -1897847, -2138636, -3229022, -4583943, -3946455, -886642, 1667094, 1267481, -469316, -367379, 1586610, 2584940, 1359833, -367946, -818974, -354696, -242905, -766543, -1180619, -679819, 883018, 2703609, 3578707, 3229778, 2602767, 2353293, 1939870, 1041917, 705460, 1711264, 2837840, 2478486, 1205268, 780621, 1170173, 733170, -751037, -1509785, -572299]
34625e72299J463412P22380J87922J20511l44509j016498q19692J97770R29782
34616H68779R77135P12883J08088q14618j004729J82176J130578j93133k757167
34607g90008l271579q09039J732240J633511k16559j158195m37856N29442O61252
34598b126791L70578L95698O53969N61455n5811o86297o89976k6161O87475Q78190
34588c7671N44790m6591p80797j430570j392165l38619J011811J428366N52295
34579d89151o72448j017170j34096J263085K102366J839871Q30133j66201p78109
34570B778280j103451j129773o47415J27547M64156M1095m61725j38900R38822
34561H68636J583897O29981j606789l014349j596145J759104L432950J278894
$$ y = [-572299, 891113, 1613493, 1801415, 1921926, 1577417, 560919, -258773, -61003, 868779, 1845914, 2558797, 2666885, 1852267, 847538, 1029714, 2160292, 1967159, -790008, -4061587, -4870626, -3138386, -1504875, -1721434, -2879629, -3317485, -2788043, -2126791, -1756213, -1360515, -706546, -145091, -200902, -887199, -1577175, -1603336, -915861, -37671, 507119, 460528, -320269, -1750839, -3143004, -3481623, -2469812, -1041446, -489151, -1161599, -2178769, -2312865, -1049780, 1052586, 2892457, 3722590, 3556389, 2778280, 1674829, 545056, -102359, 25188, 489344, 530439, 68714, -70186, 868636, 2452533, 3082514, 1475725, -1538624, -3134769, -1375665, 2057285, 3336179]
34553C336179k197257k762070o3265K111073J268782q50102j622470j058810l69157
34544b207097N19702J834599K295679J007094m96746n17624j09826j063670k246623
34535i84512j173449J446980K263621N18721p46722L69031J701175P13170j493525
34526B614490k107505p87083M80797P01052O59236O52566k65818k110104k807212
34517b969581o94901K603189L555190J203745j389081j260246L74778K52801j619286
34508E6608j871794O20309K491567J108492j047579l24482K003754J601280j884459
34499B753696l911176j663681K141000L414099J689071p29462k197586k354247
34491h58286j109047R22682K057176J359112O6732j82472K82637N5982p89367
$$ y = [3336179, 1138922, -1623148, -1686413, 424660, 1693442, 843340, -779130, -1837940, -2207097, -1687395, 147204, 2442883, 3449977, 2953231, 2435607, 2325781, 1262111, -984512, -2157961, -710981, 1552640, 2071361, 1324639, 1693670, 3394845, 4108015, 2614490, 506985, -280098, 200699, 901751, 1560987, 2213553, 1947735, -162369, -2969581, -3664482, -1061293, 2493897, 3697642, 2308561, 1048315, 1423093, 1675894, 56608, -1815186, -1194877, 1296690, 2405182, 1357603, 1033121, 3036875, 4638155, 2753696, -1157480, -2821161, -680161, 2733938, 4423009, 3693547, 1495961, -858286, -1967333, -1044651, 1012525, 2371637, 2438369, 2255897, 2538534, 2594516, 1805149]
34482A805149p72575M92601J487365R30687m56370j120747q82079q90042j520055
34473i26066j577577k74000J092738Q59317k26711M6461J643339J957669l592
34464B591578j726962j156364m3300q01696k144562j195420J418763K347174Q71632
34455A60843k85113L49568J139520Q33964M68288O68960K48037j060280j337256
34446A186531L25800J832841J081566j076268k470139k351271j142366O44193
34438a969113J974911J722905O10747N75534J323302L45988k391050l224106m23567
34429a454449K376045J437396j381455j867713L8844J126004N85487M14702J006009
34420B280870O11865q89006j502658o68994R371j15866L4699O16841M15034n40389
$$ y = [1805149, 1032574, 1525175, 3012540, 3943227, 3486857, 2366110, 1484031, 593989, -926066, -2503643, -2777643, -1684905, -825588, -1052299, -1005838, 637501, 2595170, 2591578, 864616, -291748, -335048, -1136744, -3281306, -4476726, -3057963, -710789, 160843, -124270, 225298, 1364818, 2198782, 2667070, 3336030, 3584067, 2523787, 1186531, 1512331, 3345172, 4426738, 3350470, 880331, -1470940, -2613306, -1969113, 5798, 1728703, 2339450, 2914984, 4238286, 4584274, 2193224, -1030882, -1454449, 921596, 2358992, 977537, -890176, -851332, 274672, 860159, 1274861, 2280870, 2892735, 2003729, 501071, -167923, -158552, -274418, -239719, 377122, 792156, 251767]
34410B51767p32636J9258J97779n70564j022696r21087j294826j632218q0807
34401e786030K747247L557943J320200q05311k70976J148536O88404j029491j603450
34392c2928p93265j06610J12558N75232R97204M90742n88341j034701n12086M51534
34382d40661J348453J508144L85503q41933R3921K734925L134165n69596m234720
34373C118201k997724J328196K633883m65189k991810j562511J002605R96690
34365A062341n86660q50917j16143n82598j907689j786771K0573J458217J528643
34356a761004J100047O26892k50493q18579L14197K424075K714973J42155k741958
34347A750305k938785n80092J734756K069560O34234j005021j360314k73797Q04023
$$ y = [251767, -480869, -461611, -263832, -834396, -1857092, -2778179, -4073005, -5705223, -5786030, -3038783, 519160, 1839360, 1034049, 763073, 1911609, 2600013, 1570522, -32928, -826193, -932803, -820245, -245013, 752191, 1242933, 654592, -380109, -892195, -440661, 907792, 2415936, 2801439, 1959506, 2053427, 4788352, 7922517, 7352921, 3118201, 120477, 1448673, 4082556, 3617367, 625557, -936954, 65651, 1062341, 475681, -375236, -491379, -1073977, -2981666, -4768437, -4747864, -3289647, -1761004, -660957, -34065, -284558, -1103137, -788940, 1635135, 4350108, 4492263, 1750305, -1188480, -1768572, -33816, 2035744, 2669978, 1664957, 304643, 30846, 834869]
34338H34869M37398q19744j133536q8432Q61289Q80742P67493Q18780o7201j824464
34328F67194k060386L66848K558157J241182k053575k821123j16844K286041J706684
34319A774178J2906j57617M69320j63250j446168j056440J036313K262517J167242
34310C899001p48516j407363p13710Q1603L88957N58367O89595K85167p43873
34301B289228j482675j007202K71345R12016K26453q22320q64499J98345J239093
34292I59784J283503L73697o32600p33661L20594J457544J279492M4315m05628
34283C947040N60595J053277m14610k133447j594296L18926M61089j473842k233113
34274a508381j18486K285148K075983J56036p08207k3985N33804J16250o02083
$$ y = [834869, 1272267, 452523, -681013, -769445, 91844, 972586, 1740079, 2558859, 2491658, 667194, -1393192, -1026344, 1531813, 2772995, 719420, -2101703, -2218547, 67494, 1774178, 1787084, 1629467, 2098787, 1935537, 489369, -567071, 469242, 2731759, 3899001, 3150485, 1743122, 1029412, 1111015, 1499972, 2058339, 2747934, 3033101, 2289228, 806553, -200649, 70696, 982712, 1209165, 386845, -477654, -279309, 959784, 2243287, 2616984, 1984384, 1250723, 1571317, 3028861, 4308353, 4352668, 3947040, 4507635, 5560912, 5146302, 3012855, 1418559, 1737485, 2198574, 724732, -1508381, -1626867, 658281, 2734264, 2890300, 2182093, 2158108, 2691912, 2808162, 2206079]
34265B206079r76244q10621J61790J630811K210369J167197k4208M81086K107658
34256H153917K711603J798999R25914R57250R44424J47998o49240p02011p30271
34247A3558583j613002k577601k058010j29311J149543K34638j876215k897951
34239C790674k124637r21865k99583M86165J959416K528164N30138k529112l171515
34230B47845n71985K187740K139394j87255k197521k294901o11414J645640K592661
34221B950204J026137j635993k413316o92972Q34158K79849p33608k29622O34502
34212A9339j64009j578597r49079J545509K952780J845567j04180r83342p87008
34203A796980l50540l1322K1532l21797o46758k50606Q36246J700581J388831
$$ y = [2206079, 1229835, 419214, 581004, 2211815, 4422184, 5589381, 5565173, 6046259, 8153917, 10865520, 12664519, 13590433, 14547683, 15492107, 15640105, 14990865, 14288854, 13558583, 11945581, 9367980, 7309970, 7180659, 8330202, 8564840, 6688625, 3790674, 1666037, 744172, 444589, 930754, 2890170, 5418334, 5948472, 3419360, 247845, -324140, 1863600, 4002994, 3815739, 1618218, -676683, -1288097, 357543, 2950204, 3976341, 2340348, -72968, -765940, 68218, 348067, -385541, -615163, 19339, -144670, -1723267, -2672346, -1126837, 1825943, 3671510, 3567330, 2583988, 1796980, 1446440, 1415118, 1436650, 1114853, 468095, 217489, 1053735, 2754316, 4143147]
34194D143147l18003k397746k829393o27504K178367K461929L32254r28176r5016
34185A919859P9893j976163l192432p62379K608924K545811j93563j347047J554
34176c15543J025913O55258N35910Q63163J36207q86342J41891K213858J744793
34167F115108j001967j593795J072656K433618k18690l082800k010156J187293
34159B901267K429118J591357Q99865K40982j455085k461089m56302K879671L677722
34150A0247506J534603l45527j34440R76748J831355K608691K913898J719786
34142B1352620j57399k50652J935680L763340L142163J593043K099159M964921
34134C8442875P490155P595266O278254N738576O037602N148253K239281j004020
$$ y = [4143147, 3825144, 1427398, -1401995, -2029499, 148868, 2610797, 2943051, 2014875, 1919859, 1999752, 23589, -3168843, -3931222, -1322298, 1223513, 1029950, -317097, -315543, 710370, 1365628, 1901538, 2764701, 2900908, 2014566, 2156457, 4370315, 6115108, 5113141, 3519346, 4592002, 7025620, 6806930, 3724130, 1713974, 2901267, 5330385, 6921742, 7821607, 8062589, 6607504, 4146415, 3690113, 6569784, 10247506, 11782109, 11436582, 11302142, 12278890, 14110245, 16718936, 19632834, 21352620, 21195221, 20944569, 22880249, 26643589, 29785752, 31378795, 33477954, 38442875, 45933030, 53528296, 59806550, 65545126, 71582728, 76730981, 78970262, 77966242]
34126G7966242l182898n287901q232669j0182940r050304o271641m859868m671030
34118B6226991l368593j439771j683355l523441k937818O31043K435637j48921
34110A6191772l209166k548182O975N11484o04675m64181O92056N45159o77451
34101A0443791r65399l57897q3108N18492K327010L420544J835455l20099O9716
34092A6888505J520931L32732k601246k847837J1788J494753m74590k673030k382409
34083I269597j266463j457368j904981j016314K98873N20992j1000l39924m70847
34074C622565m00310L17241J059309M31572j142923j541148l54563M06607k49595
34065B148755r25200p35123o67584r93076k61568J801726L169280K637554J476421
$$ y = [77966242, 74783344, 69495443, 61262774, 51079834, 42029530, 35757889, 30898021, 26226991, 22858398, 21418627, 19735272, 16211831, 13274013, 13905056, 16340693, 16191772, 12982606, 10434424, 10441399, 10952883, 10348208, 9884027, 10576083, 11121242, 10443791, 9478392, 9120495, 9037387, 9555879, 11882889, 15303433, 17138888, 16818789, 16888505, 18409436, 18742168, 16140922, 13293085, 13304873, 14799626, 14325036, 11652006, 9269597, 8003134, 6545766, 4640785, 3624471, 3923344, 4444336, 4433336, 4093412, 3622565, 3222255, 3539496, 4598805, 5030377, 3887454, 2346306, 1991743, 2398350, 2148755, 1223555, 488432, -179152, -1172228, -1433796, 367930, 3537210, 6174764, 7651185]
34056G651185P81720n9164j104081j066956j17910l28528j844780j977349J38882
34047B073019J574479M99924o56819K69402J167477l50762k218002j249354J402239
34038B511603K380256J625321J443188J796118R43589n10867o47162l09493j640972
34029G591581l270362j825583J819824K823116k79708l199054k428581R524N07563
34020A748320q60008j517530l99513J521186L034998L276297J874698k28827j364738
34011G084883j218362r04197p68867j28513O30623K11211r09249p54520N50486
34002C793495N97500r27591j242963N53738J306749q95069k873248j241976J906322
33993I76957K249602q9241j448373o59887K77751O59982J680977K745435J562197
$$ y = [7651185, 8432905, 8373741, 7269660, 6202704, 6084794, 5756266, 3911486, 1934137, 2073019, 3647498, 4147422, 3490603, 3760005, 4927482, 4576720, 2358718, 1109364, 2511603, 4891859, 6517180, 7960368, 9756486, 10700075, 10189208, 9542046, 9232553, 7591581, 4321219, 2495636, 4315460, 7138576, 6858868, 3659814, 1231233, 1240757, 1748320, 888312, -629218, -1028731, 492455, 3527453, 6803750, 8678448, 8449621, 7084883, 5866521, 4962324, 4193457, 4064944, 4695567, 4906778, 3997529, 3243009, 3793495, 4390995, 3463404, 2220441, 2774179, 4080928, 3185859, 312611, -929365, 976957, 3226559, 3137318, 1688945, 1029058, 1306809, 1966791, 3647768, 6393203, 7955400]
33984G955400j509405l087409j651046N48542J288453Q81001J05890j056993j693581
33975A780852l23377J918593J995191R8950N8874K747108L549421l84798m524767
33966F916047l120708K070684M473969K318871M2996N63566J645134R69930O8615
33957A5949104J038494K748201K790305J121665l43996n11818J8602K3445j206539
33948B1627463l033483l612204j953778L05200P18093o00645j358077p44309l35146
33939A1013114r64697j216923l504J563515K091833J838092J514517R01922m5011
33930A6692858k50147R11143K239444K149033O37076j015254j695799j168396
33922A8499958k67602m51483j909128k421375l5103L415194M113703J751297R6772
$$ y = [7955400, 6445995, 3358586, 1707540, 2256082, 3544535, 4425536, 4531426, 3474433, 1780852, 1457475, 3376068, 5371259, 5470209, 5529083, 8276191, 11825612, 11440814, 6916047, 3795339, 5866023, 10339992, 12658863, 12701859, 13265425, 14910559, 15880489, 15949104, 16987598, 19735799, 22526104, 23647769, 23303773, 22791955, 22810557, 22834002, 21627463, 18593980, 14981776, 13027998, 13333198, 14051291, 13450646, 12092569, 11348260, 11013114, 10048417, 8831494, 8827990, 10391505, 12483338, 14321430, 15835947, 16737869, 16692858, 16442711, 17353854, 19593298, 21742331, 22379407, 21364153, 19668354, 18499958, 18232356, 17780873, 15871745, 13450370, 13415267, 16830461, 20944164, 22695461, 22792233]
33913B2792233J317053L070917K783304J606556J928134L570106M798384M918424
33905D6785111L743602O71796l561809o312013o240773n025631m207273l058747
33897B2794263j424068j269685k874052l118377p13239P84510r49318k172256
33889A1057778N43719L252674O60740m056898l483933J785520L880078M82336
33881A4122014k122088l82733J106134j024440k399013J009218M976482L548009
33873A8833583j309520l002603r9286L128569L832722K843938J176513q54608
33865B4549308j795644m77156J270549P83698j284129k140011j228891k48058
33857A9429666K52890J038688J775188J626296J494011K545074L369386J939623
$$ y = [22792233, 24109286, 27180203, 29963507, 31570063, 33498197, 37068303, 41866687, 46785111, 50528713, 51200509, 47638700, 41326687, 35085914, 30060283, 25853010, 22794263, 21370195, 20100510, 17226458, 14108081, 13394842, 14179352, 13230034, 11057778, 11601497, 14854171, 15514911, 11458013, 7974080, 9759600, 13639678, 14122014, 11999926, 11617193, 12723327, 11698887, 9299874, 10309092, 15285574, 18833583, 17524063, 14521460, 14422174, 17550743, 21383465, 24227403, 25403916, 24549308, 22753664, 22276508, 23547057, 24330755, 23046626, 20906615, 19677724, 19429666, 19682556, 20721244, 22496432, 24122728, 25616739, 28161813, 31531199, 33470822]
33849C3470822l84198m20766J778740L225356L090412L443669M655264M380762
33841E3240061K240860J413698L692695O509678P163975O915090Q188380J0343726
33833I9708163J1394903J2077211J4749985J9099006K2191149K2835809K3174260
33826B25230486K5338273K8512723K9953526K7370182J9806437P820381o149634
33819C57882374j8598013k7159511l1671814l2879866l1177718k7286691k3006554
33812A66102207j9950260j7954363j5797023j3111745j0556443q529454o997110
33805G3205809o289981o588994o758209n406300l231602k390232l113536l123587
33797C6303368j295739M20156K16010o80699l65974M92152K51016n61391n33078
$$ y = [33470822, 33086624, 32665858, 34444598, 37669954, 40760366, 44204035, 48859299, 53240061, 55480921, 56894619, 60587314, 67096992, 74260967, 81176057, 89364437, 99708163, 111103066, 123180277, 137930262, 157029268, 179220417, 202056226, 225230486, 250568759, 279081482, 309035008, 336405190, 356211627, 364032008, 357882374, 339284361, 312124850, 280453036, 247573170, 216395452, 189108761, 166102207, 146151947, 128197584, 112400561, 99288816, 88732373, 80202919, 73205809, 66915828, 60326834, 53568625, 48162325, 44930723, 42540491, 39426955, 36303368, 35007629, 35427785, 35643795, 34963096, 34597122, 35089274, 35340290, 34778899, 34245821]
33788C4245821l90395j569216k868519k062322j84350l82987k651694l688021
33780B0448317k372468j291952j892120k260463j267587q49371j998496k307127
33772F208733k42487J602251P50289p60792M9305J731664R08104j618371j917922
33763F710774N30827J917646K12176j808052j082202J252555J920630J57838j756152
33754H056040j826012n25561L86951J40146n93884j091684j398796j410309l32694
33745A404197J771669K988558J926416K07593K06817J040499k6837k450451k622784
33736D445677J16523J938080O22566j002902j96589J138088L06282j300139j070053
33727D997533l0060o35462j969363j431856N05599J415900J360813K106084L084908
$$ y = [34245821, 33855426, 32286210, 29417691, 27355369, 27171019, 26788032, 24136338, 20448317, 18075849, 16783897, 14891777, 12631314, 11363727, 10514356, 8515860, 6208733, 5966246, 7568497, 8318786, 7557994, 7607299, 9338963, 10247067, 8628696, 6710774, 7241601, 9159247, 9371423, 7563371, 6481169, 7733724, 9654354, 9812192, 8056040, 6230028, 5704467, 6091418, 6231564, 5637680, 4545996, 3147200, 1736891, 1404197, 3175866, 6164424, 8090840, 8298433, 8505250, 9545749, 9518912, 7068461, 4445677, 4562200, 6500280, 7122846, 6119944, 5923355, 7061443, 7367725, 6067586, 4997533, 4967473, 4332011, 2362648, 930792, 1436391, 2852291, 4213104, 6319188, 9404096]
33718I404096K222206j18420j802013k498611k901566j870413J372286L715409
33710G522974J854643j562095j046523K934418M286450Q28755k684043k539024
33702I595555j089032j346434j949698q16918N87909K39256o21915o5867Q88285
33693E421141L72703q76004j001150n7745P91014J271060J266098J30351j506658
33684E810810j510441M23653J638338N21976j006156j010159o41373j279086j478203
33675A469359J76175J691391N88853j735779k065014l06894J007532J022951R82668
33666B831242J127800M63944o72593p46827L08178J026391R36943R25351J176318
33657G376747Q58763j41264r63591j163178r01465k06130N35916J83236j380989
$$ y = [9404096, 11626302, 11507882, 9705869, 7207258, 4305692, 2435279, 3807565, 7522974, 9377617, 7815522, 6768999, 9703417, 13989867, 14818622, 12134579, 9595555, 8506523, 7160089, 5210391, 4393473, 4981382, 5220638, 4598723, 4532856, 5421141, 5793844, 4917840, 3916690, 3858945, 4649959, 5921019, 7187117, 7317468, 5810810, 4300369, 4724022, 6362360, 6884336, 5878180, 4868021, 4226648, 2947562, 1469359, 1645534, 3336925, 3925778, 2189999, 124985, -181909, 825623, 1848574, 2831242, 3959042, 4422986, 3750393, 3003566, 3311744, 4338135, 5275078, 6200429, 7376747, 8235510, 8094246, 7130655, 5967477, 5066012, 4859882, 5395798, 5579034, 4198045]
33648D198045k102052m49635J739609J580831m56436j256525J71502J591459J385041
33639F401839N73245L16910J30506l10833m6316J044214J174403m77880j670672
33630G135416j07333K723898L294523J117227o21000J23465J416838O81275j304769
33621A4459540j981112j199013r77549j530187q33092J195551J533009j053429
33613I613718l103908j439659J535995J438360r72669j052920J885139L192362
33605A1096418L06931l251876l385517r11459R74169J356460R73933j52948j562078
33596E444033j338338Q15126J839916k89475k717803j721623J364953K139029
33588E535818k15427k289312j976677q36576p37902j363977j578190q10071J148895
$$ y = [4198045, 2095993, 1646358, 3385967, 4966798, 4510362, 3253837, 3425339, 5016798, 6401839, 6975084, 7291994, 7422500, 7111667, 7065351, 8109565, 9283968, 8806088, 7135416, 7028083, 9751981, 13046504, 14163731, 13542731, 13666196, 15083034, 15764309, 14459540, 12478428, 11279415, 10301866, 8771679, 7938587, 9134138, 10667147, 9613718, 6509810, 5070151, 6606146, 8044506, 7071837, 6018917, 7904056, 11096418, 11403349, 8151473, 4765956, 3854497, 4828666, 6185126, 7159059, 7006111, 5444033, 4105695, 4920821, 6760737, 6471262, 3753459, 2031836, 3396789, 5535818, 5320391, 3031079, 1054402, 217826, -520076, -1884053, -3462243, -4272314, -3123419]
33579c123419L580362M269998J836602j620276k654540j022180M75004M61190
33571B202741L65906J109524J403340K31653j403189k177138j948355r21374P79036
33562c57856K149722J840492K07305r33202r31177p81017p95911j10889J038716
33553A326183J016392m03260j293442o82953q5885o80456j252333n22990N76064
33544b002680P64369O50243J111019J182910j05990j240549k52217J643170J340606
33535C090881j397448l299494k188371L28319J787567K164586K528691K256491
33527E271222J00241k705664l142885o74850J525837Q75543r82447q11458J220897
33518F76436J846595j87510k130445j352593Q62197J449870j9962j202046o15287
$$ y = [-3123419, 456943, 4726941, 6563543, 4943267, 2288727, 1266547, 1741551, 2202741, 2568647, 3678171, 5081511, 5313164, 3909975, 1732837, -215518, -1136892, -357856, 1791866, 3632358, 3839663, 2906461, 1975284, 1194267, 398356, 287467, 1326183, 2342575, 1939315, 645873, -37080, -122965, -803421, -2055754, -2578744, -2002680, -1238311, -588068, 522951, 1705861, 1599871, 359322, 107105, 1750275, 3090881, 1693433, -1606061, -3794432, -3466113, -1678546, 486040, 3014731, 5271222, 5371463, 2665799, -477086, -1151936, 373901, 1249444, 266997, -544461, 676436, 2523031, 2335521, 205076, -1147517, -285320, 1164550, 1144588, -57458, -672745]
33509f72745O17427Q15416j5510n92357j87062N98020P48670J67746l03132k99339
33499H77134n80413j450451j488672M08808K375485J527155j382934k333076K7246
33490b019718K103761R06495j346329j094100P98689R45054o55637q85190R11129
33481c35846J777427N3860k092797k127405m63827Q41596P53691l00882j156886
33472c051069n84307J407670K858836J911975n70860k062030j729719q96303m81203
33463c197010j23293K61634K02966q086K90668N46752j62059r95275l67887J181911
33453b369679J685423J082092J047446J556326P80613j232199k054185q56677
33445c60840K50832o2480l69271L80745O85842p33044k456082k574365j373160
$$ y = [-672745, -55318, 760098, 744588, 152231, -34831, 563189, 1311859, 1479605, 1176473, 877134, 296721, -1153730, -2642402, -2233594, 141891, 1669046, 286112, -2046964, -2019718, 84043, 990538, -355791, -1449891, -651202, 293852, -361785, -1246975, -335846, 1441581, 1495441, -597356, -2724761, -3188588, -2346992, -1593301, -1894183, -3051069, -3635376, -2227706, 631130, 2543105, 1972245, -89785, -1819504, -2715807, -3197010, -3320303, -3058669, -2855703, -2863789, -2573121, -2026369, -2188428, -3183703, -3551590, -2369679, -684256, 397836, 1445282, 3001608, 3782221, 2550022, 495837, -360840, -110008, -172488, -541759, -161014, 524828, -208216, -2664298, -5238663, -6611823]
33436f611823j11281J023878K120821K392689J385861j6348r29788j412004j336232
33427c494227j22538J618734K146740J160463L03780L29082K1235j142530j703734
33418h82995p72707M55955R14671J089475J190028M22420q12755p40692N70615
33409A434015P84022o05475j085733L00321Q81707q72735k272483j006923P85021
33400a658263N16694k07300R33403J927860k77052l643775l428875L94893L070689
33391b371726K112593n4594p09241j00604N11736Q03017O34005j69253r18945
33382b63012q74305o30205q48032n90279Q70372J945549J134441N1665Q74214
33373A670408K223332J307568j025503j517104J5938P73264J06033L903N27156
$$ y = [-6611823, -6723104, -5699226, -3578405, -1185716, 200145, 183797, -745991, -2157995, -3494227, -3616765, -1998031, 148709, 1309172, 1612952, 1942034, 1963269, 820739, -882995, -1655702, -1199747, -285076, 804399, 1994427, 2416847, 1604092, 863400, 1434015, 2218037, 1612562, 526829, 827150, 1708857, 836122, -1436361, -2443284, -1658263, -1141569, -1348869, -415466, 1512394, 1235342, -2408433, -5837308, -5442415, -2371726, -259133, -313727, -1022968, -1123572, -611836, 191181, 825186, 655933, -263012, -1137317, -1767522, -2615554, -3205833, -2335461, -389912, 744529, 796194, 1670408, 3893740, 5201308, 4175805, 2658701, 2674639, 3447903, 3553936, 3557839, 4084995]
33364D084995m39644k400788k129133N73944J803857j21889j881328q24090R75561
33355c58515J003073N44537J414329K031254M82384j380352q91900N60135k18044
33346C186901k519490k542944M67344K837710J827496q18966j883743q79636K99634
33337b5694M44640O2791j13163j66595k78794l1275P07933P99563q54749k984995
33327b440338k741443L63437L179169L086869J538920J180443J299013n04609
33319D961461l237637l243898j23588K175596J257230m88881k88771P56186K48684
33310B016382j269627j436469J65960J767838J934702N71837j588769l079909
33302i18055k415257m4454J571640J030796j89327j90729N73977N19917m07808
$$ y = [4084995, 3645351, 1244563, -884570, -310626, 1493231, 1371342, -509986, -1334076, -358515, 644558, 1189095, 2603424, 4634678, 5117062, 3736710, 2844810, 3404945, 3186901, 667411, -1875533, -1408189, 1429521, 3257017, 2438051, 554308, -325328, -25694, 418946, 481737, 368574, 201979, -76815, -108090, 599843, 1399406, 544657, -2440338, -5181781, -4818344, -1639175, 1447694, 2986614, 4167057, 5466070, 4961461, 1723824, -1520074, -1643662, 531934, 1789164, 1300283, 1011512, 1767698, 2016382, 746755, -689714, -523754, 1244084, 3178786, 3750623, 2161854, -918055, -3333312, -3377766, -1806126, -775330, -964657, -1155386, -581409, -61492, -469300]
33293d69300j014932q80227n04719o2541O60032J462938J788292J290576N4180
33284B324299j161064j078300M87529J525394K04966j875570j356925J752149
33276H22478L599287K002363o43669j391531o53510j91609l8011K69937j06069
33267C669666j371310j605807K62235K096029J695081J34414o83399j373224k753052
33258G0633k674474O67849M077126K818487j990211m319004j789178J391666J235519
33249e11587n77974l36577J840630K727322R56563j389354j823179l35623J103091
33240A653312J140960M89039N07432R34683L61347r94401j009841Q91318K174448
33231F148297Q31615j389143j692299m52482M0042l20189J97504J461437J424556
$$ y = [-469300, -1484232, -2364459, -2869178, -2931719, -2271687, -808749, 979543, 2270119, 2324299, 1163235, 84935, 572464, 2097858, 2302824, 427254, -929671, 822478, 4421765, 6424128, 5780459, 4388928, 3735418, 3543809, 3505798, 3775735, 3669666, 2298356, 692549, 954784, 3050813, 4745894, 4880308, 4196909, 2823685, 70633, -2603841, -1935992, 2141134, 4959621, 2969410, -1349594, -3138772, -1747106, -511587, -1089561, -1426138, 414492, 3141814, 4098377, 2709023, 885844, 550221, 1653312, 2794272, 3283311, 3790743, 4725426, 5086773, 4092372, 3082531, 3973849, 6148297, 6979912, 5590769, 3898470, 3445988, 3486030, 3165841, 3363345, 4824782, 6249338]
33222F249338k80722j593368j105581N11824K219773L439873L224416R60535j990451
33213A1635637l423663k972201j836809n51741P44548Q21907r78310k444530j137534
33204a42696J331907J294247j172534k463525j364297l46293n61795k01495J165324
33195b461157J339923R7125K81452K308100K491644l99954j922031R17476L932944
33186F585522K068395k310958l154961k22628J307183m48173j913460q99933K9630
33177A040617j349265k976512k010215Q24232K693001K416934R32747m72773r00020
33168A98746l0999J200327J141058m19962j594498q09592J004905J665179N87839
33159B943003o62589n60439N21289R72426J9708j420471j944360j083367P37322
$$ y = [6249338, 5968616, 4375248, 3269667, 3781491, 6001264, 9441137, 12665553, 13626088, 11635637, 8211974, 5239773, 3402964, 2851223, 3595771, 4417678, 3439368, 994838, -142696, 1189211, 2483458, 1310924, -1152601, -2516898, -2863191, -3424986, -3626481, -2461157, -1121234, -1024109, -742657, 1565443, 4057087, 3657133, 1735102, 2652578, 6585522, 8653917, 6342959, 3187998, 2965370, 4272553, 3824380, 1910920, 1010987, 1040617, -308648, -3285160, -5295375, -4471143, -1778142, 638792, 1571539, 1098766, 198746, 167747, 1368074, 2509132, 2089170, 494672, -314920, 689985, 2355164, 2943003, 2280414, 1719975, 2241264, 3213690, 3233398, 1812927, -131433, -1214800, -477478]
33150d77478K786100L792123K162994j925630n241090m421667k44490L125425
33142d43713L332502J906905P96193j68444j155530q54422P45024R09816j718996
33133C349335l964619k392369J133876J989969k81023j727248m02778J196950
33125a097907Q90727J32705Q03808J714278P31371j476730k309016j034246M00434
33116a244576L48575l85415p2121J158331J304991m85822k108294j058243J802775
33107g39799L045235J350875q71016j244716l59591L04365P80020J067680j67943
33098C165110k780687l536953o07449K535986J646047j641231k256625L11014
33090c164788J691223K28933o06898J310707L006591J519187j379086k460237
$$ y = [-477478, 2308622, 6100745, 8263739, 6338109, 1097019, -3324648, -3569138, -443713, 2888789, 4795694, 5591887, 5423443, 4267913, 3413491, 4158515, 5068331, 3349335, -615284, -3007653, -1873777, 116192, -164831, -1892079, -2294857, -1097907, -207180, -74475, 729333, 2443611, 3174982, 1698252, -610764, -1645010, -1244576, -896001, -1281416, -1353537, -195206, 1109785, 623963, -1484331, -2542574, -739799, 2305436, 3656311, 2785295, 1540579, 1180988, 1485353, 2265373, 3333053, 3165110, 384423, -3152530, -3759979, -1223993, 422054, -1219177, -3475802, -3164788, -1473565, -1244632, -1851530, -540823, 2465768, 3984955, 2605869, 145632]
33082A45632j801712j331764j172835l32692Q46284J490374J947600K625302K535224
33073D951413Q95427j192125k263231k238857j397936M61418K416053K209064
33065C841226n27240k955390k829169j412992o49600L3312J561893K429529J249818
33056G41387q0665P05121K004973Q38494j918964k933132j966621j585239j879913
33047f074559l35955K702155L378130N54360j757407l98091K273626K419959L59631
33038C121849r36534p80187r21385j923754k310663j067386J041853K556450K443700
33029A223943O20982j548454k020113m78153Q58132R9004j535412j367482R14509
33020c233044K828367K415286M65502q81104o64495K51067M93524k58142j001696
$$ y = [145632, -1656080, -2987844, -4160679, -4493371, -3647087, -2156713, -209113, 2416189, 4951413, 5846840, 4654715, 2391484, 152627, -1245309, -783891, 1632162, 3841226, 3313986, 358596, -2470573, -3883565, -4533165, -4499853, -2937960, -508431, 741387, 660722, 1365843, 3370816, 4209310, 2290346, -642786, -2609407, -4194646, -6074559, -6410514, -3708359, -330229, 224131, -1533276, -1931367, 342259, 2762218, 3121849, 2185315, 1405128, 483743, -1440011, -3750674, -4818060, -3776207, -1219757, 1223943, 1844925, 296471, -1723642, -2201795, -1343663, -1244659, -2780071, -4147553, -3233044, -404677, 2010609, 2476111, 1595007, 930512, 1181579, 1675103, 1416961, 415265]
33011D15265p54524L3450Q2086p05244r48658K3623R59579O32159j38284J50743
33001b49805J102398R80069m16398j271941m65399Q41478J029043J81358n11778
32992A219025o28112p12370j038628j169089o98193K49880J268454J881657J572674
32983A945298K49697j170496j303163R8376J471454J035265r83027k356648j408389
32974b421633Q94030J961195O13208j528195j988354l49104J423147J513077L24912
32965D42283n01950m85818n72055j082454q60494P39929K247474J912899M32190
32956B272004J3127R23027J050965o20733k210032j753238l5305R83091J083866
32947A706772J202775J098645o2512j443258j346012j59070m441j182032j521366
$$ y = [415265, -339259, -305809, -223723, -928967, -1877625, -1854002, -894423, -262264, -400548, -249805, 852593, 1832662, 1416264, 144323, -321076, 520402, 1549445, 1730803, 1219025, 590913, -121457, -1160085, -2329174, -3027367, -2777487, -1509033, 372624, 1945298, 2194995, 1024499, -278664, -180288, 1291166, 2326431, 1343404, -1013244, -2421633, -1527603, 433592, 1046800, -481395, -2469749, -2818853, -1395706, 117371, 442283, -59667, -545485, -1117540, -2199994, -3060488, -2320559, -73085, 1839814, 2272004, 2285131, 3208158, 4259123, 3638390, 1428358, -324880, -360185, 622906, 1706772, 2909547, 4008192, 3945680, 2502422, 1156410, 997340, 992899, -189133, -1710499]
32938a710499n2421J208107N38307o64646l08185Q72853O00766j118875j917420
32929b552013o14782J251388J721678O44347p63270j348457o91607O46272J308162
32920c98282M45906j078555j666532j059835l56176n2074M87721J349188J407209
32911i21430R1125j445494j820343j058941J26930J570009K984567L103142J098013
32902C727578j603419k510389j014433J146481K265300K157129J308198Q8167
32894E564612q41046p61212q9834p1467p68246p78077L37514R45185j64799j658164
32884A714466j623819m59684Q1800j66874O0421Q30743P60797n33279j694939
32875a030368j611606n12872R76083K182232J908073l14975k501816k152499q2049
$$ y = [-1710499, -1762920, -554813, -16506, -681152, -989337, -116484, 484282, -634593, -2552013, -3166795, -1915407, -193729, 450618, -312652, -1661109, -2352716, -1706444, -398282, 47624, -1030931, -2697463, -3757298, -4113474, -4165548, -3677827, -2328639, -921430, -830305, -2275799, -4096142, -5155083, -5028153, -3458144, -473577, 2629565, 3727578, 2124159, -386230, -1400663, -254182, 2011118, 4168247, 5476445, 5564612, 4723566, 3962354, 3872520, 3801053, 3032807, 2254730, 2592244, 3537429, 3372630, 1714466, 90647, -369037, -287237, -454111, -393690, 437053, 1197850, 664571, -1030368, -2641974, -3154846, -2178763, 3469, 1911542, 1596567, -905249, -3057748, -3139797]
32866c139797N19857p05056n43980K021165L266262O09969k567154j833021J354250
32857a017505K229992L88541l49618R65941R90400j500476k991102j065571J473050
32848h76348J133420r40918j329010L27912J496511Q46250n66359j379318j061034
32839b348894L26604J824411J861478K87062q99173k25871J081184J129717J97919
32830C234437k60969j74602l77658o41783l03971J319o19460j294269n81948R43871
32820g5033J529714J077122P90546N21210q49534k524115k167612L59732K266850
32811I28880J644180k28308j223890r29586R413J057206J296516k52681k664789
32802c63059l299056j205651J371267K108806J387619N73661m29729j900975k362064
$$ y = [-3139797, -2619940, -3324996, -3868976, -1847811, 1418451, 2028420, -538734, -2371755, -1017505, 1212487, 1601028, 1251410, 2217351, 3207751, 1707275, -1283827, -2349398, -876348, 257072, -683846, -2012856, -1684944, -188433, 657817, 91458, -1287860, -2348894, -2022290, -197879, 1663599, 1950661, 1051488, 825617, 1906801, 3036518, 3234437, 2973468, 2798866, 2421208, 1779425, 1475454, 1476773, 857313, -436956, -1018904, -75033, 1454681, 2531803, 3322349, 3843559, 2994025, 469910, -1697702, -1337970, 928880, 2573060, 2344752, 1120862, 191276, 200689, 1257895, 2554411, 2301730, -363059, -3662115, -4867766, -3496499, -1387693, -74, 573587, 143858, -1757117, -4119181]
32793d119181n06807K014720K380332O24394o33880k49746K36337l07138q06315
32784a367284j46816R18743J214334R40176P85995M71438m93183j444792j314156
32775d35545k94964L71518N7720p19551j241546j199594m65986Q77498K137226
32766i13224K314316J124038o06364j678329j457863k12785J069366J298876K73036
32757A211067q86835q37004K81620Q19915l34039k208689k844872j651779K7335
32748f423281O96047L71518J72490P20147J454467J440076M75363o56523q46717
32739b596413L92874K332597L299580J984683j060372l416183k960038k51321
32731b274593J847711J373926m96604j140980R5624J357754J047318k68578j143531
$$ y = [-4119181, -4625988, -2611268, -230936, 393458, -240422, -490168, -253831, -560969, -1367284, -1514100, -595357, 618977, 1559153, 2345148, 2816586, 2323403, 878611, -435545, -730509, -358991, -301271, -1020822, -2262368, -3461962, -3927948, -3050450, -913224, 1401092, 2525130, 1918766, 240437, -1217426, -1430211, -360845, 938031, 1211067, 324232, -512772, -231152, 588763, 254724, -1953965, -4798837, -6450616, -6423281, -5727234, -5355716, -5183226, -4463079, -3008612, -1568536, -1093173, -1749696, -2596413, -2203539, 129058, 3428638, 5413321, 4352949, 936766, -2023272, -2274593, -426882, 947044, 450440, -690540, -594916, 762838, 1810156, 1541578, 398047]
32722C98047j125266n45207L85832J188983Q56196o80892j676165p23283R17557
32713a004198R76904l40681p10637N79711J698960J500077J113713J279215O47673
32704E740737j465451k871642j511378R27212J201159o12542j450299k29165O57360
32695C85991n01075j911274j181950R91261K019348J134745m7161k29384O7027
32686G27528j27792p18040j003501q73946p86478p74156j77258J322687K756762
32677C45806K600628O73274j193467r72515J166083K845895K065231n72746k542074
32668D416115k192354m66829M35834j58108o81606L15029J909730J927408j2823
32659E492396j861333j821066n29343R0523o50851j639870j542203l28826P67898
$$ y = [398047, -727219, -1272426, -886594, 302389, 1158585, 477693, -1198472, -1921755, -1004198, -27294, -367975, -1078612, -498901, 1200059, 2700136, 3813849, 5093064, 5740737, 4275286, 1403644, -107734, 819478, 2020637, 1408095, -42204, -271369, 385991, -115084, -2026358, -3208308, -2217047, -197699, 937046, 889885, 660501, 727528, 599736, -118304, -1121805, -1995751, -2782229, -3556385, -3733643, -2410956, 345806, 2946434, 3619708, 2426241, 1453726, 2619809, 5465704, 7530935, 6958189, 4416115, 2223761, 1756932, 2192766, 2034658, 1353052, 1668081, 3577811, 5505219, 5492396, 3631063, 1809997, 1280654, 1371177, 720326, -919544, -2461747, -2790573, -2022675]
32650b022675P05662K6751K82661J660188K198610N99145j267148p90659J143818
32641B536353J235210r61586k229305r49304M46650n5367p45368J64444J033094
32632D74821J71505m71898R83066J844479r85166m525449l272650J742513L758662
32623b80117N24689k540208j134808J813289J758335o19675j852873j255053k69156
32614c855577R21133K445922K610789K58949k316219k050640M97860K270312K098978
32605B881507J273424O56621j44562j251919k233286k832081k561479p51169J567168
32596c395776J645784j074969k993017r55813K826754L658585R90549j297456
32588e95359p97744P15881Q44369j84906q29591o86131n14702r07555j521430
$$ y = [-2022675, -1317013, -1290262, -1007601, 652587, 2851197, 3450342, 2183194, 1392535, 2536353, 3771563, 2809977, 580672, -368632, 78018, 22651, -722717, -558273, 474821, 646326, 174428, 1157494, 3001973, 2016807, -2508642, -5781292, -4038779, -280117, 244572, -2295636, -3430444, -1617155, 141180, -478495, -2331368, -3586421, -3855577, -2934444, -488522, 2122267, 2381216, 64997, -1985643, -1487783, 782529, 2881507, 4154931, 4811552, 4666990, 3415071, 1181785, -1650296, -4211775, -4962944, -3395776, -1749992, -2824961, -5817978, -6773791, -3947037, -288452, 702097, -595359, -1393103, -677222, 167147, -17759, -847350, -1533481, -2048183, -2955738, -4477168]
32579d477168j243700M79223K165914J579805o87106j097424J605502L559532
32571A884578J111907l188742l880360n44630J993533J057447r06954j319853
32563c793074r43686q70177k0471K112351L380488K122994L1164m38187M23493
32554B004895Q16712M86727L38787L31540j24534o16277m54248j81511o61617
32545A940474j329187r99461M8121L92584k92839p56223q2986J008241J233203
32536A161927M73290j69107n719J57508p23783j862183j246148J133262K388900
32527A307947O05163j913825j605211J132310K571681J222049m11553j57140Q31814
32518C583235O94613j95885o69157j015718j838902k210881r69270J127466K235682
$$ y = [-4477168, -5720868, -5241645, -3075731, -1495926, -2183032, -3280456, -1674954, 1884578, 2996485, -192257, -4072617, -4617247, -2623714, -1566267, -2473221, -3793074, -4736760, -5606937, -5627408, -3515057, -134569, 1988425, 2019589, 1581402, 2004895, 2821607, 3308334, 3647121, 3978661, 3854127, 3237850, 2783602, 2602091, 1940474, 611287, -388174, -340053, 52531, -240308, -996531, -1079517, -71276, 1161927, 1635217, 1466110, 1460391, 1617899, 894116, -968067, -2214215, -1080953, 1307947, 1913110, -715, -1605926, -473616, 2098065, 3320114, 2908561, 2751421, 3583235, 4277848, 4081963, 3412806, 2397088, 558186, -1652695, -2621965, -1494499, 741183]
32509G41183J759619N59395n17673j178500j300707r43933l94225K29232Q70173
32500a75436J014275K73250n48872l27009M78939M58887k52637k54445K33958
32491I00910n29577k192800j900696J049313L230781J970294n80793j045907n7036
32482H44489m28990j845218j369943J297542K930643J613421o77204j312651l93063
32473F59026L35277J68397k52904l02568L672K93823K47153n6834j80886N5604
32463I69760L60069O54064J279595K035358J946263P59776l45406n24361o36196
32454F498922j583227k403007j722213k99019j42808j414702k125655j045236
32446d236945P39756J571152J235032O71008M88294L46778l70418j426944j535455
$$ y = [741183, 2500802, 3060197, 2542524, 1364024, 63317, -880616, -1274841, -1045609, -175436, 838839, 1112089, 563217, 236208, 715147, 1174034, 921397, 666952, 900910, 371333, -1821467, -3722163, -2672850, 557931, 2528225, 1947432, 901525, 844489, 415499, -1429719, -2799662, -1502120, 1428523, 3041944, 2364740, 1052089, 659026, 994303, 1162700, 909796, 607228, 610900, 904723, 1151876, 1095042, 914156, 969760, 1329829, 1983893, 3263488, 5298846, 7245109, 8004885, 7659479, 7135118, 6498922, 4915695, 2512688, 790475, 491456, 348648, -1066054, -3191709, -4236945, -3497189, -1926037, -691005, -19997, 468297, 815075, 444657, -982287, -2517742]
32437b517742Q3959K095241K247805M53219r25894n67382j16484j243573k549085
32428c039936j544305J348123L091699K032793k95392j383968l90040J416445
32420A235419J915762J43507k324520k760479o86304J368757J365118L16186P672
32411E81118N0140p54933j715954j352721o9599O28330O22826O56919M36749l73385
32401a290510n04952Q81371J794092J76855k058800j443148J287669J939229n55545
32392B26261k466027j061768J737422K941277K391553J325445j42220k063337
32384B888606l215499k494280n27286J152916J468410J43897j731408j718253
32376d032897J183781M046595L129824o30987k625701j279679J78397m56786j106881
$$ y = [-2517742, -2433783, -338542, 1909263, 2362482, 1436588, 869206, 752722, -490851, -3039936, -4584241, -3236118, -144419, 1888374, 1592982, 209014, -181026, 1235419, 3151181, 3294688, 970168, -1790311, -2476615, -1107858, 257260, 573446, 581118, 631258, -123675, -1839629, -3192350, -3261949, -2633619, -2010793, -1353874, -917125, -1290510, -1795462, -914091, 880001, 1056856, -1001944, -2445092, -1157423, 781806, 226261, -2239766, -3301534, -1564112, 1377165, 3768718, 5094163, 4951943, 2888606, -326893, -2821173, -3348459, -2195543, -727133, -583236, -2314644, -4032897, -2849116, 1197479, 4327303, 3696316, 1070615, -209064, -30667, -487453, -1594334]
32367a594334R4112J171657M0641j557972j134527K63634K52462n91689j28970
32358c184986J255145J383382J19182n88344R9710J172455J660972J236710k42777
32349B911449j922740j844684L92991K221018J473539l42660o06044J84360k52076
32340B215153j656781j702671j94713O65615J73721k6983O59524P14875l61466
32331D86274p99843K82680J014213k58854k083905j910400K44100J996173J851745
32322H22183O00071m26289r91208j349477j109022J44860J421855R98739r20214
32313h08502j653924M65708L216925L175275N66804j184404o06700J81372m38244
32304B914310j121250o22171k62957j276222k286836j734155m87962K67129J357207
$$ y = [-1594334, -1500222, -328565, -287924, -1845896, -2980423, -2716789, -2464327, -3056016, -3184986, -1929841, -546459, -427277, -1015621, -915911, 256544, 1917516, 3154226, 2911449, 988709, -855975, -462984, 1758034, 3231573, 2888913, 2282869, 2467229, 2215153, 558372, -1144299, -1339012, -673397, -499676, -526659, 132865, 847740, 486274, -313569, -30889, 983324, 724470, -1359435, -3269835, -3025735, -1029562, 822183, 1422254, 995965, 4757, -1344720, -2453742, -2308882, -887027, 111712, -808502, -2462426, -1996718, 1220207, 4395482, 4962286, 3777882, 3171182, 3352554, 2914310, 1793060, 1170889, 907932, -368290, -2655126, -4389281, -4877243, -4610114, -3252907]
32295c252907L221289L678543J295221j226418o80855J439336J360908p86274
32287E048843j582190l05993K77222q92235j621451p79325j44101q27415j344911
32278b171556n51414M87693P74627Q42923Q85003K8261j434601j559784L46263
32269b352585K431966K789921J370754r14517k838236k595234M00818L377130
32261A670017K922683Q989j220150K0963J20988k329856l612409r64835K604070
32252g79540K863661M33502j168319r49677m50527l36599k34462l93933p71318
32243a787212j32411J475096J525011r49535k607724n55960K501958K077917r72606
32234E74534j958588J3574J114863l83229j483034M1910J990462J710595K32024
$$ y = [-3252907, -31618, 3646925, 4942146, 3715728, 3034873, 4474209, 5835117, 5048843, 3466653, 3160660, 3437882, 2545647, 924196, 144871, 770, -826645, -2171556, -2722970, -2235277, -1460650, -617727, 267276, 295537, -1139064, -2698848, -2352585, 79381, 2869302, 4240056, 3325539, 487303, -2107931, -1707113, 1670017, 4592700, 4601689, 3381539, 3402502, 3523490, 1193634, -2418775, -3383610, -779540, 2084121, 2517623, 1349304, 399627, -50900, -387499, -621961, -1015894, -1787212, -1919623, -444527, 1080484, 130949, -2476775, -3032735, -530777, 1547140, 574534, -1384054, -1370480, -255617, -638846, -2121880, -2079970, -89508, 1621087, 1853111]
32225A853111n4630P08378P38022l38379j453880j906904j537887k29722J304763
32216i17128J348898o67369k711214k376175r1J891496J924977J193061J130110
32207H16565J459744J037155j01531p71239o86160j103063k561351l190681j088239
32198f188800K179015K938121O44020j011508M37065K429844J474035j286586
32190A615206k011844l27001L81799j314545k717540j508136P80725J431779L66558
32181c302999m79538j04715P83409J091845M88134k26042K39400J792171K253336
32172B535001J65484k330183j940063P03641J595042n49790k295817r41045J534444
32163a523286K118869J193253O11499K01737o56593m92978J558626K664857Q7830
$$ y = [1853111, 1798481, 2506859, 3244881, 2906502, 1452622, -454282, -1992169, -2221891, -917128, 431770, -235599, -2946813, -5322988, -5323079, -3431583, -1506606, -313545, 816565, 2276309, 3313464, 3211933, 2440694, 1754534, 651471, -1909880, -5100561, -6188800, -4009785, -1071664, -427644, -1439152, -1002087, 1427757, 2901792, 1615206, -396638, -723639, -341840, -1656385, -4373925, -5882061, -5101336, -3669557, -3302999, -3782537, -3887252, -3103843, -2011998, -1523864, -1749906, -1510506, 281665, 2535001, 2700485, 370302, -1569761, -866120, 728922, 179132, -2116685, -3057730, -1523286, 595583, 1788836, 2400335, 2602072, 1945479, 1452501, 3011127, 5675984, 5763814]
32154E763814l498200l169199N83571K389627K96524j705468o56330J001957M47461
32145A453757o53463K54267J679841P91018j389339j714940l43342j76215j501126
32136a599542j424094R41408K578772J244252j026544j104819O38199J252334
32128A499966k94072j794133j092774R46663J728438N50205m04434O91222K210114
32119D041195J056001k442219m128069j615805K117169K864653R15523l01603
32111B506845J31795N1484j129395j245972L53166J129902m13420k042909j435006
32102b093510K56373Q99485R92405J886462K406700O53661j965276k035722P38323
32093A738901K848269J785049j107618l158470l378979k120640J23830K289625
$$ y = [5763814, 2265614, -903585, -320014, 2069613, 2366137, 660669, 4339, 1006296, 1453757, 800294, 1054561, 2734402, 3525420, 2136081, 421141, 77799, -98416, -1599542, -3023636, -2082228, 496544, 1740796, 714252, -390567, 247632, 1499966, 1205894, -588239, -1681013, -734350, 994088, 1544293, 1139859, 1831081, 4041195, 5097196, 2654977, -1473092, -3088897, -971728, 1892925, 2808448, 2506845, 2638640, 2690124, 1560729, 314757, 667923, 1797825, 1384405, -658504, -2093510, -1837137, -937652, 54753, 1941215, 4347915, 5001576, 3036300, 1000578, 1738901, 4587170, 6372219, 5264601, 2106131, -1272848, -3393488, -3269658, -980033]
32085i80033K673512P81732j542740k002093m73068J045757R02676m06513r98244
32076i99014P3836J546332J352123p70822k747701k499956j67562K268496K864412
32067I20144J064871j765494k953109j078315J719639J848315p22493k020808
32059b987250K3175K141531P48582k246061k353100M79488K075957O77495r69793
32050b409976n95346N11702N73086J26646J97321K76409l15144r93643r98026
32041c626971l33712Q35243K001399J663441p43814k588232r26385K399577K540113
32032A220659q78641k642831n979K888214J622524j650532k001837P42137K653108
32023A946822J903628J48022j063974j530908r23388O36046J280009l29530k289284
$$ y = [-980033, 1693479, 2475211, 932471, -1069622, -1542690, -496933, 405743, -770, -999014, -925178, 621154, 1973277, 1202455, -1545246, -4045202, -4212764, -1944268, 920144, 1985015, 219521, -2733588, -3811903, -2092264, -243949, -966442, -2987250, -2964075, -822544, -73962, -2320023, -4673123, -4193635, -2117678, -1440183, -2409976, -3005322, -2493620, -1920534, -1793888, -1596567, -1320158, -1635302, -2628945, -3626971, -3960683, -3125440, -1124041, 539400, -204414, -2792646, -3719031, -1319454, 1220659, 342018, -2300813, -2306792, 581422, 2203946, 553414, -1448423, -706286, 1946822, 3850450, 3998472, 2934498, 1403590, 480202, 1116248, 2396257, 2066727, -222557]
32014b22557j905075J51762J162665P52666N79130N44011q44791k647943k014549
32005d444681J042844L046411K087926J99800l46772j2919J05135M72733J385034
31996C535511J369447n53778k595592k259289J92497K050110J529854m65373j851859
31987I51528j710330q98400o61065j029661j045507m45218p5709k14213K11754
31978d916821J742288L023763K745924J769090J594188J751851P66017j044466
31970G431834j975883j743309j639900k037529j890452q27650K29082P24316R89641
31961g39850R91432K54321q49502j314213j042334p06750k62551P94197J898494
31952i76756J857574P17359l43536p20296n63205R0118P51080N3816k049340k835450
$$ y = [-222557, -2127632, -1975870, -813205, -60539, 518591, 1062602, 217811, -2430132, -4444681, -3401837, -355426, 1732500, 1932300, 1585528, 1572609, 1677744, 2150477, 3535511, 4904958, 4351180, 1755588, -503701, -311204, 1738906, 3268760, 2803387, 951528, -758802, -1657202, -2318267, -3347928, -4393435, -4838653, -4914362, -5128575, -4916821, -3174533, -150770, 2595154, 4364244, 5958432, 7710283, 8476300, 7431834, 5455951, 3712642, 2072742, 35213, -1855239, -2682889, -2453807, -1729491, -739850, 251582, 505903, -343599, -1657812, -2700146, -3406896, -3669447, -2875250, -976756, 880818, 1598177, 1254641, 534345, -28860, 61258, 812338, 866154, -1183186, -4018636]
31942d018636k43958L200301L124796m71613l142031k179843M72312J898416J569948
31933B09692L63791q38519q96975N48966J465671k50933k773671k184749J371443
31924b985284L414488J887632r8930J57578R50738O9784j248569j178346p56067
31915B13024j362612j609205P4558K114073K134041O57134k95482m04574l49269
31906A171688P0595O66670q5392k212226k859851n12442J919089J367030n54420
31897a029259n91457O49023M40674p31220k43551J407928J187685j019162k050526
31888a979865p58525N02524K11038l17712l3593K38903K09545R03349J999414
31879I75078J433301j102607k981155k287958k86110R64691J192493R15035Q9081
$$ y = [-4018636, -4262594, -1062293, 2062503, 1590890, -1551141, -3730984, -3258672, -1360256, 209692, 573483, -265036, -1162011, -613045, 852626, 601693, -2171978, -4356727, -2985284, 429204, 2316836, 2217906, 2375484, 3326222, 3396006, 2147437, 969091, 213024, -1149588, -2758793, -2684235, -570162, 1563879, 2221013, 1925531, 1520957, 1171688, 1242283, 1908953, 1823561, -388665, -3248516, -3760958, -1841869, -474839, -1029259, -1620716, -971693, -531019, -1262239, -1505790, -97862, 1089823, 70661, -1979865, -2738390, -2235866, -2024828, -2342540, -2376133, -2137230, -1927685, -1024336, 975078, 2408379, 1305772, -1675383, -3963341, -4249451, -3284760, -2092267, -1177232, -1088151]
31870a088151q26658m60298J240031K041823L80827k013388k177391J62202K283384
31861d57619J860123m60256k013768j159711Q91273J527657M6333j329191m65162
31852a560321J589816J990004J00991j626591r70637J366619K922842K301058
31844F113781K05898j758255k704158k802234k231153n68413J902986L050368
31836A208820J066844k238553k891898k35774J863434P11126j371648j202302
31828c089951K80968M46083j90320M58719J513937O06354j250890q64326J535330
31819e54096K440221Q34514o50581o92583q63400j518191p10726J473929J992514
31810A751601L3502j175214J03494J061577m48343j803528k52705J931555J180371
$$ y = [-1088151, -1914809, -2375107, -1135076, 906747, 1287574, -725814, -2903205, -2741003, -457619, 1402504, 942248, -1071520, -2231231, -1339958, 187699, 234032, -1095159, -1560321, 29495, 2019499, 2120490, 493899, -476738, 889881, 3812723, 6113781, 6319679, 4561424, 1857266, -944968, -3176121, -3744534, -1841548, 1208820, 2275664, 37111, -2854787, -3090561, -1227127, -516001, -1887649, -3089951, -2808983, -2362900, -2553220, -2094501, -580564, 25790, -1225100, -2089426, -554096, 1886125, 2720639, 2070058, 1377475, 514075, -1004116, -1714842, -240913, 1751601, 1785103, 609889, 713383, 1774960, 1326617, -476911, -729616, 1201939, 2382310]
31801B382310j219431j349486O74122J071047j073726k216581r2248K603476K030751
31792B810234j451500l695125j913215J877997L131752L73837k600111j538034
31784c004165K130018K834562j095877m487271k454605K593947M396634J370239
31776B283482k101654k293225l75151N87633j4739m65664L36141J518436J556157
31767A031416L05619o41895r091J144027O79545j337036k418685j278578L80518
31758b144160P77035O05213J075904J464659O86368m52589q07159j023191j734331
31749a552251j441605Q90169K806176J499228j249467j350779R62746J349485
31741A913702j413002l149543q89592K511288L016103J254516M15761P79577J46906
$$ y = [2382310, 1162879, -186607, 487515, 1558562, 484836, -1731745, -1823993, 779483, 2810234, 1358734, -2336391, -4249606, -2371609, 760143, 1133980, -1466131, -3004165, -874147, 1960415, 864538, -3622733, -6077338, -3483391, 913243, 2283482, 181828, -2111397, -2486548, -1898915, -1913654, -2379318, -2043177, -524741, 1031416, 1337035, 695140, 686049, 1830076, 2509621, 1172585, -1246100, -2524678, -2144160, -1367125, -761912, 313992, 1778651, 2465019, 2012430, 1205271, 182080, -1552251, -2993856, -2103687, 702489, 2201717, 952250, -398529, 564217, 1913702, 500700, -2648843, -3538435, -1027147, 1988956, 3243472, 3659233, 4438810, 4585716]
31732D585716j528888j772217R5978J483853L52118j802135k213722o37187P80268
31723f56216P61379K88551M63033N69265m19716j364887j57903K440827K689564
31714D613897q82753m323210l074167J413217L389183Q87931j809333r08337J488394
31705G94822J297709j061311j697057N76461K764117K375744M52456q70343j304580
31696C328018j583449j497672m26192J060507J607858Q55833j91448n49796l06248
31687B297411j61865l68946m36208Q2766P07899L83574j057976k281999j896743
31678b732087j65358J477674K279927K458089J827857k45728l005141m035453
31670b140220k140442O32574J446869M40441J55717J456381K219819P51581j469536
$$ y = [4585716, 3056828, 1284611, 1380589, 2864442, 3216560, 1414425, -799297, -1436484, -656216, 105163, 393714, 856747, 1426012, 1006296, -358591, -516494, 1924333, 4613897, 3731144, -592066, -3666233, -2253016, 1136167, 2024098, 214765, -693572, 794822, 2092531, 1031220, -665837, -89376, 2674741, 5050485, 5502941, 4632598, 3328018, 1744569, 246897, -179295, 881212, 2489070, 3344903, 3153455, 2603659, 2297411, 2135546, 1766600, 1330392, 1413158, 2121057, 2504631, 1446655, -835344, -2732087, -2897445, -1419771, 860156, 3318245, 5146102, 4900374, 1895233, -2140220, -4280662, -3648088, -2201219, -1760778, -1605061, -148680, 2071139, 2822720, 1353184]
31661A353184j891325m63616O14821J64063o84630n51730K86455O55351K32072
31652b85355k21912k8409N83889Q26359K84736n81894r49893o57898m62020j013232
31642b505629j814377j648288p8063J814798K386651J114341p26255j249061l3879
31633b739762J251759Q35878p86233j413659j63605J297824J180206L2330l73033
31624h78295K52870O32830K02798j04821M11661R91150N18391q56228j791486
31615f21130j218784N01138J828633J566000J67356q60552q64223n15439k01362
31606b18363O98884K116597K349333L51218k136971k613644j215066q5748L8711
31597g15049K60638P59394K84178j102891j358246L25458J789638R44216j072827
$$ y = [1353184, -538141, -1001757, -386936, -222873, -907503, -1459233, -1172778, -517427, -285355, -507267, -535676, 48213, 874572, 1159308, 577414, -372479, -1030377, -1492397, -2505629, -4320006, -5968294, -6046357, -4231559, -1844908, -730567, -1456822, -2705883, -2739762, -1488003, -652125, -1438358, -2852017, -3015622, -1717798, -537592, -505262, -878295, -625425, 7405, 210203, 105382, 517043, 1508193, 2026584, 1170356, -621130, -1839914, -1338776, 489857, 2055857, 2223213, 1362661, 498438, -17001, -218363, 480521, 2597118, 4946451, 5297669, 3160698, 547054, -668012, -753760, -715049, -454411, 304983, 589161, -513730, -1871976, -1546518, 243120, 1187336, 114509]
31588A14509j487969L32893K292135K315878N07743j345790j723011p84016N9204
31579B81576N1406l3103M31902M16741j014923k336269j330526J084356J666954
31570g81886j50805j167625N70592K705913K389580M81587m77382k98952m23767
31561B847255q56751p23960o75041j756665k676410j226745J847735L349460K141021
31552B269899L89253j75188n01571j651716k425672j326748O64049J218628r0245
31543a629311j309513q31722O02758J026530k51079j817118j795648J06843K498269
31534c399991L912596L873785K515709K22606j951186k545489j238636N05591
31526A894985J132685P89587O27211Q87817P30314k71561j432358j837531j310525
$$ y = [114509, -1373460, -1040567, 1251568, 3567446, 4075189, 2729399, 1006388, 222372, 281576, 332982, 299879, 731781, 1148522, 133599, -2202670, -3533196, -2448840, -781886, -932691, -2100316, -1529724, 1176189, 3565769, 4047356, 3569974, 3271022, 2847255, 1990504, 1266544, 591503, -1165162, -3841572, -5068317, -3220582, 128878, 2269899, 2659152, 2483964, 1982393, 330677, -2094995, -3421743, -2757694, -1539066, -1629311, -2938824, -3770546, -3167788, -2141258, -2392337, -4209455, -6005103, -5898260, -3399991, 512605, 4386390, 6902099, 7124705, 5173519, 2628030, 1389394, 1894985, 3027670, 3817257, 4444468, 5332285, 6062599, 5791038, 4358680, 2521149, 1210624]
31517A210624m41212j4131l27002q27436o42219L23121J143490R82474J05465
31508A513174m92399k48224L54739K66638q98747k066665j733495j02728P99977
31499b607730q3304j143130n10476J070293J617827J011569M08254l42024j779787
31490b358508k216443L08390L682172L446761n42953l348905k027280O81459J437345
31481i37962Q59184O43622J99484q47162m85951J942290L176581Q58434k121143
31472C287377j966877J65723P96369k9360k2828M38434n57099k086061j818196
31463a792518m66084l64550r86954l40657O78091O6198p21805Q20763K777606
31454c29910J523964j275345q26815K221777K388371j165615l097241j154531
$$ y = [1210624, 769412, 755281, 428279, -399157, -1041376, -718255, 425235, 1407709, 1513174, 1020775, 772551, 1127290, 1393928, 495181, -1571484, -3304979, -3407707, -2607730, -2691034, -3834164, -4344640, -3274347, -1656520, -644951, -236697, -578721, -2358508, -4574951, -4266561, -584389, 2862372, 2319419, -1029486, -3056766, -2375307, -937962, -78778, 564844, 764328, -82834, -568785, 1373505, 4550086, 5408520, 3287377, 1320500, 1486223, 2282592, 2253232, 2230404, 2668838, 2111739, 25678, -1792518, -2258602, -2623152, -3610106, -3950763, -3272672, -3206474, -3928279, -3107516, -329910, 1194054, -81291, -908106, 1313671, 3702042, 2536427, -560814, -1715345]
31446a715345L65008j207996k419256p41577N77230r91509j966338Q37725L905488
31437c356570K663662o20098o91985J937380K327519n39073k649007j660512L65693
31428b222991J100151O74046j46893j174100j695971q20479O84527R66841l02675
31419b937544j525854j339873N6136J429191J516901K09568p69619L10599K315937
31410g34558K300800O1516j164554K11266J554396N58678q96830k99333J042759
31401B634140N85305q15945o84055N04067M96277l07544L39105K050914K111399
31392F913663J07540j334305p04416N70647Q17709J1680j251814k338676k094781
31383F97247m8239J982385J735357j88710j176347n67012k27228j049074j489712
$$ y = [-1715345, -1350337, -2558333, -4977589, -5719166, -5141936, -6133445, -8099783, -7262058, -3356570, -692908, -1313006, -2004991, -67611, 2259908, 1720835, -928172, -2588684, -2222991, -1122840, -448794, -595687, -1769787, -3465758, -4286237, -3601710, -2634869, -2937544, -4463398, -5803271, -5747135, -4317944, -2801043, -2591475, -3361094, -3050495, -734558, 1566242, 1627758, 463204, 674470, 2228866, 2787544, 1890714, 1591381, 2634140, 3219445, 2403500, 1719445, 2223512, 2719789, 2412245, 2751350, 4802264, 6913663, 7021203, 5686898, 4982482, 5553129, 6370838, 6382518, 5130704, 2792028, 697247, 649008, 2631393, 4366750, 4178040, 3001693, 2434681, 2207453, 1158379, -331333]
31374c31333l14324J317059J504493M2662j519974j562007j2402J300953N42424
31365I67551j441641j702176O34108K666262J840594k54929n95755O08941R57931
31356C680886K00173J02216O83262J09559j677406k483963j422081j08145K33245
31347f82254L14173P96471J036292N50666j15582n51605r22197r59756o2052J394200
31337G98356K192059J744870L45374j535663k998901k728007q02285O27458K12208
31328b144531m70876K66614J080411O2729j393409p25686J132146J186705l69518
31319a375415o00335Q46747J268581n6134p27795K52925J018090P30441Q24320
31310B181425J334120J84885k478880l399749j346844Q13235J016401R57678K003460
$$ y = [-331333, -645657, 671402, 2175895, 2218557, 698583, -863424, -875826, 425127, 967551, -474090, -2176266, -1542158, 1124104, 2964698, 2709769, 2114014, 2722955, 3680886, 3881059, 3983275, 4666537, 4776096, 3098690, 614727, -807354, -915499, -682254, -368081, 428390, 1464682, 2015348, 1899766, 1348161, 425964, -533792, -595844, 798356, 2990415, 4735285, 5080659, 3544996, 546095, -2181912, -2984197, -2356739, -2144531, -2615407, -2348793, -1268382, -1205653, -2599062, -3324748, -2192602, -1005897, -1375415, -1975750, -1129003, 139578, 83444, -644351, -391426, 626664, 1357105, 2181425, 3515545, 3700430, 1221550, -2178199, -3525043, -2711808, -1695407, -737729, 1265731]
31301A265731K212407J78890j818900j527355l09925m3431L29696J876061K452770
31292D615944J82727k518323k356402l81119K28743l65750K73514J777624J479996
31283B936954o28551j711695p72598K92916M54838P51169J337124P58191j037869
31274B380479j966396j071302J0906j98349j044670j377256j069879j04765J760523
31265b680709L466695K885794j02592k543698j997778J37202O33455j067453k255213
31256c524297q34418J822615K710776J015331j080768j386856k68955N48252O79130
31247c19190R93710J364153O52052p96131r76916M69932J101069n37132k113541
31238a61994r18219J598798J725750q79603k692616j578712M87776R03464J09016
$$ y = [1265731, 3478138, 3657028, 1838128, 310773, 848, -42583, 287113, 2163174, 4615944, 4798671, 2280348, -76054, -457173, -228430, -594180, -320666, 1456958, 2936954, 2308403, 596708, -175890, 117026, 571864, 1323033, 2660157, 3418348, 2380479, 414083, -657219, -646313, -844662, -1889332, -3266588, -4336467, -4441232, -2680709, 785986, 3671780, 3569188, 1025490, -972288, -835086, -201631, -1269084, -3524297, -4358715, -2536100, 174676, 1190007, 109239, -1277617, -1546572, -998320, -319190, 674520, 2038673, 2690725, 1894594, 917678, 1387610, 2488679, 1951547, -161994, -1080213, 518585, 2244335, 1364732, -1327884, -2906596, -2418820, -1515356, -1406340]
31229a406340J74012J348816J873432O64031j205332j835773p14940O67618N07310
31220G2834j063762j980721q56651J176183K001532J134662k85849j420444k177659
31211c399875k152345q22775J102559K061977J663358J018145Q13261M77412k90758
31202D70959o45075m7583O52950O02986L86330R15095J616652J060476q65620
31193D147170k597428k779893j589457m2065J136612J619859J278500N23572L34677
31184B031547J163433K044106J615842j5255j335878j498135j281083j481775
31176A242802j489138n05302P21130Q37005O2748j93549K41736L1971j204655
31167b55252j882092p51169J093825J578902K42164j385110j496075L10867K470704
$$ y = [-1406340, -1232328, 116488, 1989920, 2653951, 1448619, -387154, -1102094, -434476, 72834, -990928, -2971649, -3828300, -2652117, -650585, 484077, 198228, -1222216, -3399875, -5552220, -6374995, -5272436, -3210459, -1547101, -528956, 284305, 761717, 470959, -174116, -221699, 431251, 1034237, 1420567, 2335662, 3952314, 5012790, 4147170, 1549742, -1230151, -2819608, -2861673, -1725061, -105202, 1173298, 1696870, 2031547, 3194980, 5239086, 6854928, 6839673, 5503795, 4005660, 2724577, 1242802, -246336, -751638, -30508, 806497, 869245, 675696, 917432, 949403, -255252, -2137344, -2888513, -1794688, -215786, 26378, -1358732, -2854807, -2543940, -73236]
31158g3236K498048l74163l513692l312628K96388L408814K977386K81181j575527
31149F12571j738287j366682q92662J08144J107974J036540K45582K6513L14203
$$ y = [-73236, 2424812, 2050649, -1463043, -4775671, -4479283, -1070469, 1906917, 2188098, 612571, -1125716, -2492398, -3385060, -3276916, -2168942, -1132402, -886820, -860307, -546104]
$$ [...]
##END NTUPLES=NMR SPECTRUM
##END=
