##TITLE=31Pdec_LR-738-B-B2-CR2
 D2O, 24 sc
 30.10.2021
##JCAMPDX= 6.0         $$ Bruker NMR JCAMP-DX V2.0
##DATA TYPE= NMR SPECTRUM
##DATA CLASS= NTUPLES
##ORIGIN= UXNMR, Bruker Analytische Messtechnik GmbH
##OWNER= root
$$ XWIN-NMR		Version 3.5
$$ Sat Oct 30 13:14:51 2021 Russian Standard Time (UT+4h)  she@DPX200
##.OBSERVE FREQUENCY= 81.013821
##.OBSERVE NUCLEUS= ^31P
##.ACQUISITION MODE= SIMULTANEOUS
##.ACQUISITION SCHEME= undefined
##.AVERAGES= 24
##.DIGITISER RES= 16
##SPECTROMETER/DATA SYSTEM= spect
##.PULSE SEQUENCE= zgpg30
##.SOLVENT NAME= D2O
##.SHIFT REFERENCE= (INTERNAL, D2O, 0, 248.564)
##AUDIT TRAIL= $$ (NUMBER, WHEN, WHO, WHERE, WHAT)
$$ ##TITLE= Audit trail, XWIN-NMR		Version 3.5
$$ ##JCAMPDX= 5.01
$$ ##ORIGIN= Bruker BioSpin GmbH
$$ ##OWNER= she
$$ F:/spectra/data/she/nmr/P31/1/pdata/1/auditp.txt
$$ ##AUDIT TRAIL=  $$ (NUMBER, WHEN, WHO, WHERE, WHAT)
(   1,<2021-10-30 13:13:37.31 +0400>,<she>,<DPX200>,
      <created by zg, POWCHK disabled, PULCHK disabled
       configuration hash MD5:
       00 E9 B6 7A A2 85 ED C7 34 08 36 98 17 FE 4E 26
       data hash MD5: 32K
       19 27 A1 B1 A6 46 DB BC 54 11 6E 7D 66 94 05 35>)
(   2,<2021-10-30 13:13:41.34 +0400>,<she>,<DPX200>,
      <Start of raw data processing
       efp BC_mod = 2 LB = 1 FT_mod = 6 PKNL = 1 PHC0 = -8967.679 PHC1 = 400.4694 SI = 64K 
       data hash MD5: 64K
       90 E1 E1 5D B7 29 A1 14 45 D3 96 65 CB 30 A1 51>)
(   3,<2021-10-30 13:14:08.81 +0400>,<she>,<DPX200>,
      <pk PHC0 = 86.42567 PHC1 = -244.6 
       data hash MD5: 64K
       AC 86 B9 DF 5C EB 65 DF C2 F5 DB 28 CB 7C 85 51>)
$$ ##END=
$$ 
$$ hash MD5
$$ E8 6C A9 37 94 21 25 20 43 82 40 AA 90 1D 0D 9C
##$RELAX= 
##$RELAX= 
##$RELAX= 
##$RELAX= 
##$RELAX= 
##$RELAX= 
##$RELAX= 
##$RELAX= 
$$ Bruker specific parameters
$$ --------------------------
##$DU= <F:/spectra>
##$EXPNO= 1
##$NAME= <P31>
##$PROCNO= 1
##$TYPE= <nmr>
##$USER= <she>
##$AMP= (0..31)
100 100 100 100 100 100 100 100 100 100 100 100 100 100 100 100 100 100 
100 100 100 100 100 100 100 100 100 100 100 100 100 100 
##$AQSEQ= 0
##$AQ_mod= 1
##$AUNM= <au_zg>
##$AUTOPOS= <>
##$BF1= 81.014009
##$BF2= 200.13
##$BF3= 200.13
##$BF4= 200.13
##$BF5= 200.13
##$BF6= 200.13
##$BF7= 200.13
##$BF8= 200.13
##$BYTORDA= 1
##$CFDGTYP= 0
##$CFRGTYP= 5
##$CHEMSTR= <none>
##$CNST= (0..31)
1 1 145 1 1 1 1 1 1 1 1 1 1 1 1 1 1 1 1 1 1 1 1 1 1 1 1 1 1 1 1 1 
##$CPDPRG= <waltz16>
##$CPDPRG1= <>
##$CPDPRG2= <waltz16>
##$CPDPRG3= <>
##$CPDPRG4= <mlev>
##$CPDPRG5= <mlev>
##$CPDPRG6= <mlev>
##$CPDPRG7= <mlev>
##$CPDPRG8= <mlev>
##$CPDPRGB= <>
##$CPDPRGT= <>
##$D= (0..31)
0 1 0 0 0 0 0 0 0 0 0 0.03 2e-05 3e-06 0 0 0 0 0 0 0 0 0 0 0 0 0 0 0 0 
0 0 
##$DATE= 1635585216
##$DBL= (0..7)
120 120 120 11 120 120 24 19 
##$DBP= (0..7)
150 150 150 150 150 150 150 150 
##$DBP07= 0
##$DBPNAM0= <>
##$DBPNAM1= <>
##$DBPNAM2= <>
##$DBPNAM3= <>
##$DBPNAM4= <>
##$DBPNAM5= <>
##$DBPNAM6= <>
##$DBPNAM7= <>
##$DBPOAL= (0..7)
0.5 0.5 0.5 0.5 0.5 0.5 0.5 0.5 
##$DBPOFFS= (0..7)
$$ [...]
##$SUBNAM2= <"">
##$SUBNAM3= <"">
##$SUBNAM4= <"">
##$SUBNAM5= <"">
##$SUBNAM6= <"">
##$SUBNAM7= <"">
##$SUBNAM8= <"">
##$SUBNAM9= <"">
##$SW= 501.771253377433
##$SWIBOX= (0..15)
0 1 3 0 0 0 0 0 0 0 0 0 0 0 0 0 
##$SW_h= 40650.406504065
##$TD= 32768
##$TD0= 1
##$TE= 0
##$TE2= 300
##$TE3= 300
##$TEG= 300
##$TL= (0..7)
0 120 53 12 22 120 120 120 
##$TP= (0..7)
150 150 150 150 150 150 150 150 
##$TP07= 0
##$TPNAME0= <>
##$TPNAME1= <>
##$TPNAME2= <>
##$TPNAME3= <>
##$TPNAME4= <>
##$TPNAME5= <>
##$TPNAME6= <>
##$TPNAME7= <>
##$TPOAL= (0..7)
0.5 0.5 0.5 0.5 0.5 0.5 0.5 0.5 
##$TPOFFS= (0..7)
0 0 0 0 0 0 0 0 
##$TUNHIN= 0
##$TUNHOUT= 0
##$TUNXOUT= 0
##$USERA1= <user>
##$USERA2= <user>
##$USERA3= <user>
##$USERA4= <user>
##$USERA5= <user>
##$V9= 5
##$VALIST= <valist>
##$VCLIST= <CCCCCCCCCCCCCCC>
##$VD= 0
##$VDLIST= <DDDDDDDDDDDDDDD>
##$VPLIST= <PPPPPPPPPPPPPPP>
##$VTLIST= <TTTTTTTTTTTTTTT>
##$WBST= 1024
##$WBSW= 4
##$XGAIN= (0..3)
0 0 0 0 
##$XL= 0
##$YL= 0
##$YMAX_a= 5011
##$YMIN_a= -5050
##$ZGOPTNS= <>
##$ZL1= 120
##$ZL2= 120
##$ZL3= 120
##$ZL4= 120
##$ABSF1= 0
##$ABSF2= 0
##$ABSG= 0
##$ABSL= 0
##$ALPHA= 0
##$AQORDER= 0
##$ASSFAC= 0
##$ASSFACI= 0
##$ASSFACX= 0
##$ASSWID= 0
##$AUNMP= <proc_1d>
##$AZFE= 0.1
##$AZFW= 0.5
##$BCFW= 0
##$BC_mod= 2
##$BYTORDP= 0
##$COROFFS= 0
##$CY= -3
##$DATMOD= 1
##$DC= 0
##$DFILT= <>
##$DTYPP= 0
##$F1P= 0
##$F2P= 0
##$FCOR= 1
##$FTSIZE= 65536
##$FT_mod= 6
##$GAMMA= 0
##$GB= 0
##$INTBC= 1
##$INTSCL= 5.30512e-09
##$ISEN= 30
##$LB= 1
##$LEV0= 0
##$LPBIN= 0
##$MAXI= 10000
##$MC2= 0
##$MEAN= 0
##$ME_mod= 0
##$MI= 50
##$NCOEF= 0
##$NC_proc= -7
##$NLEV= 6
##$NOISF1= 182.463
##$NOISF2= 159.3651
##$NSP= 0
##$NTH_PI= 0
##$NZP= 0
##$OFFSET= 248.5645
##$PC= 4
##$PHC0= -8881.253
##$PHC1= 155.8694
##$PH_mod= 1
##$PKNL= yes
##$PPARMOD= 0
##$PSCAL= 0
##$PSIGN= 0
##$REVERSE= no
##$SF= 81.014009
##$SI= 65536
##$SIGF1= 159.3651
##$SIGF2= -187.1042
##$SINO= 113.3802
##$SIOLD= 16384
##$SREGLST= <1H.CDCl3>
##$SSB= 0
##$STSI= 65536
##$STSR= 0
##$SW_p= 40650.406504065
##$SYMM= 0
##$S_DEV= 0
##$TDeff= 32768
##$TDoff= 0
##$TI= <>
##$TILT= no
##$TM1= 0
##$TM2= 0
##$TOPLEV= 0
##$USERP1= <user>
##$USERP2= <user>
##$USERP3= <user>
##$USERP4= <user>
##$USERP5= <user>
##$WDW= 1
##$XDIM= 65536
##$YMAX_p= 339216271
##$YMIN_p= -109390162
$$ End of Bruker specific parameters
$$ ---------------------------------
##NTUPLES= NMR SPECTRUM
##VAR_NAME=  FREQUENCY,     SPECTRUM/REAL,   SPECTRUM/IMAG
##SYMBOL=    X,             R,               I
##VAR_TYPE=  INDEPENDENT,   DEPENDENT,       DEPENDENT
##VAR_FORM=  AFFN,          ASDF,            ASDF
##VAR_DIM=   65536,         65536,           65536
##UNITS=     HZ,            ARBITRARY UNITS, ARBITRARY UNITS
##FACTOR=    0.620285442955139, 1,           1
##FIRST=     20137.2065510759, 0,            0
##LAST=      -20513.1999529892, 0,           0
##MIN=       -20513.1999529892, -109390162,  0
##MAX=       20137.2065510759, 339216271,    0
$$ Real data points
##PAGE= N=1
##DATA TABLE= (X++(R..R)), XYDATA
$$ [...]
38419E91970n55615O68794R17683J05371l86121r8690J9221m46821o20826N229
38409B00195N70290K41143m74166o09512r8706N21182J047924J429261J177439
38400D005050j28869j910249k818859k008150J1732J720069J853211O55947k39961
38391A139921L27007J495511J440832j17902j506406j408730n14831k76519q74181
38382b95298j243748p18752R6394J36042p33982j343420n43218J121392J883218
38373a641372J288530J016459K063231K508743J91449l281365l970961j049764
38365b875050K017746K380796J162802P15008J016578N95543q07113k280809l110414
38356a184913k760124r61735J021505J044686o75706j104225J099915K978979
$$ plain form
38419 591970 36355 705149 1622832 1728203 1342082 1243392 1262613 815792 194966 200195
38409 200195 770485 1011628 537462 -72050 -170756 350426 1398350 2827611 4005050
38400 4005050 3876181 1965932 -852927 -2861077 -2849345 -1129276 723935 1379882 1139921
38391 1139921 1466928 2962439 4403271 4285369 2778963 1370233 855402 578883 -295298
38382 -295298 -1539046 -2257798 -2161404 -2025362 -2759344 -4102764 -4645982 -3524590 -1641372
38373 -1641372 -352842 663617 2726848 5235591 5427040 2145675 -1825286 -2875050
38365 -2875050 -857304 1523492 2686294 3401302 4417880 5013423 4206310 1925501 -1184913
38356 -1184913 -3945037 -4906772 -3885267 -2840581 -3516287 -4620512 -3520597 -541618
38348e41618J617957j142444j510116M42468J465736O60258L00853J190441J188418
38339C671953o44692j882273m40446K062352K574044O10496j671869k342266j346720
38330E90579K683L45252m18216q87766N3820J415719J294465k96332j468194j372289
38320g40279j099328j273458r20472L32870J020987K34857n16375L88277J892316
38311f80605J788890J37457r43173m97217K84781L47177J36993K13199J44093
38302I31595l30913l38714P41857J789804J217569o29301j779212j411282q38741
38293f47338j116049j147322M20928K413338K241558k75451k229657j446007P18911
38284a067089J566173P02314p5543K28425O65741J45218j024107j784219j678616
$$ plain form
38348 -541618 1076339 -66105 -1576221 -1133753 331983 992241 1293094 2483535 3671953
38339 3671953 3027261 1144988 704542 2766894 5340938 5951434 4279565 1937299 590579
38330 590579 593262 938514 520298 -367468 -313648 1102071 2396536 2100204 632010 -740279
38320 -740279 -1839607 -3113065 -4033537 -3700667 -2679680 -2444823 -2961198 -2572921 -680605
38311 -680605 1108285 1245742 302569 -194648 90133 437310 574303 787502 931595
38302 931595 600682 261968 1003825 2793629 4011198 3381897 1602685 191403 -647338
38293 -647338 -1763387 -2910709 -2489781 -76443 2165115 1889664 -339993 -1786000 -1067089
38284 -1067089 499084 1201398 1125855 1354280 2020021 2165239 1141132 -643087 -2321703
38275b321703j109334n98544p2563J014027K612574L359888J800029j417255l550646
38266b83527k675186J09271K018137J521874n52195k106862j471850J103269L173629
38257H36560K414823k85067j531662J0365J657469P39102j400909j715068k30501
38248D95112L71892p60743j587076o76351Q49240J413633R17185n642q84077j115929
38238i82756l92721L30620l0756n45988O34576K782740K751937l68641l231534
38229I47477k603250J88288J378911N8194j180183n19889O25746K04197j203738
38220b104247j245171O73862K358830J793182j44314j124984o83105k53684k15918
38211i45549O16950J977362J476915j305750k819217m79479K599665J627040k434288
$$ plain form
38275 -2321703 -3431037 -4029581 -4102144 -3088117 -475543 2884345 4684374 3267119 -283527
38266 -283527 -2958713 -2849442 -831305 690569 138374 -1968488 -3440338 -2337069 836560
38257 836560 3251383 2966316 1434654 1445019 3102488 3841590 2440681 725613 495112
38248 495112 867004 106261 -1480815 -2157166 -1307926 105707 1022892 1017250 133173 -982756
38238 -982756 -1375477 -1044857 -1075613 -1621601 -987025 1795715 4547652 4179011 947477
38229 947477 -1655773 -1467485 -88574 -30380 -1210563 -1730452 -1104706 -900509 -2104247
38220 -2104247 -3349418 -2675556 -316726 1476456 1332142 207158 -475947 -729631 -945549
38211 -945549 -328599 1648763 3125678 1819928 -999289 -1478768 1120897 2747937 313649
38202C13649l920391q28435K492704K116039k79397j117257k18429M37552N51508
38193d52457J000656J296691N37428k66292M39193J810283J572514m64149k107757
38184C366110j872688m82164O17432O11561o21891k239500k482473o38327J311182
38175b430758Q42928j402799k182226k85730J625140R56779r69444r22680J456340
38166c312450L118815J848406r23607k332872j678953m94673J71141Q46709J933580
38157h23904K478047J506753l35201j473053j246967k35933Q26491J542966J534743
38148C773942O06553p47251j696265j918458j598292q84297j2809L93216K6233
38139b057428l30927L41845J753418K468718J644447r7237j500068j812880j242744
$$ plain form
38202 313649 -3606742 -4435177 -1942473 173566 -105831 -1223088 -1441517 -1003965 -452457
38193 -452457 548199 1844890 2382318 2116026 2555219 4365502 5938016 5473867 3366110
38184 3366110 1493422 1011258 1628690 2240251 1618360 -621140 -3103613 -3741940 -2430758
38175 -2430758 -1587830 -2990629 -5172855 -5458585 -3833445 -2876666 -3846110 -4768790 -3312450
38166 -3312450 -193635 1654771 731164 -1601708 -3280661 -3775334 -3604193 -2757484 -823904
38157 -823904 1654143 3160896 2825695 1352642 105675 -130258 696233 2239199 3773942
38148 3773942 4380495 3633244 1936979 18521 -1579771 -2464068 -2476877 -2083661 -2057428
38139 -2057428 -2388355 -2046510 -293092 2175626 3820073 3722836 2222768 409888 -832856
38130h32856p27454r43077j243167l47142J487375K221357Q85062p35254o95258
38121i30414K31257K24750l14690K78204J536984J357096k68572r46690K80267
38112A448192J497133J047927k99553j148695j223478n41463R05285J797947K70234
38103C753529k757176l514044m02469L110266K825547n96087k810381j587205
38095a978020J006115K018676J092608l6667j83773J08767k25327j141095j644278
38086i82994j411079j170761j070116p7260J909914K917288J600125l82489r18058
38077D14570q13925j724128k276340k31434K479496J734224j744126k658734M18693
38068d401704K424679O9707k609964q60167K996016L269384m52362l398548k817676
$$ plain form
38130 -832856 -1560310 -2503387 -3746554 -4093696 -2606321 -384964 500098 -235156 -930414
38121 -930414 -699157 -474407 -789097 -510893 1026091 2383187 2114615 1167925 1448192
38112 1448192 2945325 3993252 3693699 2545004 1321526 780063 1685348 3483295 3753529
38103 3753529 996353 -2517691 -2920160 190106 3015653 2419566 -390815 -1978020
38095 -1978020 -971905 1046771 2139379 2102712 1918939 2027706 1802379 661284 -982994
38086 -982994 -2394073 -3564834 -4634950 -4712210 -2802296 114992 1715117 1332628 414570
38077 414570 -399355 -2123483 -4399823 -4631257 -2151761 -417537 -2161663 -4820397 -4401704
38068 -4401704 -1977025 -1907318 -4517282 -5377449 -2381433 887951 435589 -2962959 -5780635
38059e780635n14597J154003J843404J786296R57042k394j40686N06949J319451
38050A128833J998741J898846K5880k719633l258921m04656K675678K448112k95622
38041C497258k163563j755940K5281K301846L986467L138627l24590l061828k621814
38032C021744j328122k305043l840089k196152J636054L122496J361417q9098
38024f16793M90000R21484J405l58655Q69555J804806J075250j96387r69840j598560
38014A422265j750274m28457J204879P06476j150275q21621J881156K558932q28539
38005B794542m093458k900559Q62318K358478Q26378m30810M46267J879328J938319
37996C680803P86496j83377k23056J9823o30826k010011k288875o99356O18858
$$ plain form
38059 -5780635 -6295232 -5141229 -3297825 -1511529 -554487 -556881 -697567 -190618 1128833
38050 1128833 3127574 5026420 5052300 2332667 -926254 -1330910 1344768 3792880 3497258
38041 3497258 1333695 -422245 -396964 1904882 5891349 9029976 8705386 5643558 3021744
38032 3021744 1693622 -611421 -4451510 -6647662 -5011608 -1889112 -527695 -616793
38024 -616793 -126793 794691 796096 437441 1306996 3111802 4187052 3990665 3020825 1422265
38014 1422265 -328009 -756466 448413 1154889 4614 -817007 1064149 3623081 2794542
38005 2794542 -1298916 -4199475 -3337157 -978679 -152301 -583111 -136844 1742484 3680803
37996 3680803 4467299 4283922 4060866 4080689 3449863 1439852 -849023 -1548379 -929521
37987i29521k06496j108866Q13424L507544K233982k247008l579020M23853L883648
37978B791540J896064k169132k875696j229038j278302k173306l45050K776873
37970b606047K338148j388998k830814n4331K346356R19463j589855j362474P93460
37961c435092J869989J424664Q72813M52310k92353p51643l85741j82582r03085
37952a330720j265469K6217J680055J482917k69832j231546m59550O76806R51876
37943B60754O99745N19828L06547J34491O14399J520849J302275q62512l312462
37934A183914l562138j429643Q00344J395664R96769R00327Q88973M7189j058838
37925A62561p41477J144041K376597R99263k043504l783943k510183M50392K274172
$$ plain form
37987 -929521 -1136017 -2244883 -1431459 2076085 4310067 2063059 -1515961 -1092108 2791540
37978 2791540 4687604 2518472 -357224 -1586262 -2864564 -5037870 -5382920 -2606047
37970 -2606047 -267899 -1656897 -4487711 -4542042 -2195686 -1276223 -2866078 -4228552 -3435092
37961 -3435092 -1565103 -140439 732374 1184684 892331 140688 -245053 -427635 -1330720
37952 -1330720 -2596189 -2569972 -889917 593000 323168 -908378 -1367928 -691122 260754
37943 260754 960499 1480327 1786874 1921365 2535764 4056613 5358888 4496376 1183914
37934 1183914 -2378224 -3807867 -3007523 -1611859 -615090 285237 1174210 1221399 162561
37925 162561 -578916 565125 2941722 3940985 1897481 -1886462 -4396645 -3946253 -1672081
37916a672081J637420r0681p35896l4614L13018o27988j489004o93455R88334
37907b404947J518370O49224J10810P89714J494226R49079m55127j507883j650591
37898e07125j089105l16108K04398N96329J561068K825584K411434o71934l732820
37889A281721l174969J39403J649736j19520j342003P32194L044078J670084j537984
37880B342740j677007J426336K924968L97219k816548k928974p81701M24424p2945
37871g61488n52896j90253N521n62380q35736K32025J832395K130813P20790p46479
37861A272312q23592k70089p31317k012105k269138q39640R36348J989424K569982
37852a77815K427148M25330k628060l331159k12060L167366K584821q31785k320444
$$ plain form
37916 -1672081 -34661 -125342 -861238 -895852 -582834 -1210822 -2699826 -3393281 -2404947
37907 -2404947 -886577 -237353 -126543 663171 2157397 3106476 2651349 1143466 -507125
37898 -507125 -1596230 -1912338 -1707940 -1111611 449457 3275041 5686475 5014541 1281721
37889 1281721 -1893248 -1753845 -104109 -223629 -1565632 -833438 2210640 3880724 2342740
37880 2342740 665733 2092069 5017037 5414256 2597708 -331266 -1112967 -688543 -761488
37871 -761488 -1314384 -1504637 -1499116 -2061496 -2897232 -2665207 -832812 1298001 2018791 1272312
37861 1272312 448720 178631 -552686 -2564791 -4833929 -5673569 -4737221 -2747797 -177815
37852 -177815 2249333 2674663 46603 -3284556 -3496616 -329250 2255571 1423786 -896658
37843h96658m23944J432259M69484j771744k319020o42555J616127K775569J961500
37834B201018l68991j953081o69552K233195K906324p3245l552508m020216j892195
37825e189251J60628J192110J935540K198805J071163p42340j294764k28350P68644
37816a27815N78441o0067k45948k08062l08353k48295q235k37465q68321o58873
37806b392993P90123J806619Q93185q04873j064523P9881O73660J75414n0530
37797A05963K08378o26143k394661k105042J364130M206598K686651q47164j183382
37788A415328J639162K471938m66470k694869r71777J399754K34607k661580k746778
37779b380685l5695J705138J314050Q77131Q92071k74904k073505j642047J153559
$$ plain form
37843 -896658 -1320602 111657 581141 -1190603 -3509623 -4152178 -2536051 239518 2201018
37834 2201018 1832027 -121054 -790606 1442589 4348913 4275668 723160 -3297056 -5189251
37825 -5189251 -5028623 -3836513 -1900973 297832 1368995 626655 -668109 -896459 -127815
37816 -127815 450626 390559 144611 -63451 -371804 -620099 -628334 -865799 -1734120 -2392993
37806 -2392993 -1602870 203749 1096934 292061 -772462 -692581 -18921 156493 105963
37797 105963 314341 -311802 -2706463 -4811505 -3447375 759223 3445874 2598710 1415328
37788 1415328 3054490 5526428 5059958 2365089 1393312 2793066 3027673 366093 -2380685
37779 -2380685 -2416380 -711242 602808 1479939 2372010 2097106 23601 -1618446 -464887
37770d64887K760984J295549r03783j493866j263041j299016n71537J347564K273804
37761A681771P72454j087373j042993k90272r06870j850357r10206J017892J238469
37752a377485j68482o76348K41758N10854n96096j192895j09372J308599J596866
37743d62601J052128M08917k59179n82478R7438J018821M26909j399352j800203
37734a499600K91265K217355J272219j262123j962888j9756K089422K128819L17776
37725C572489j778158k809122k061084J41581K161533K307988O42324j222184
37717I55367k008890j622180m39939J027806J883343J532726P17139O19593Q83760
37708C548725O59k036247l171770k197606o06721k72367o69780j36234J105486
$$ plain form
37770 -464887 2296097 3591646 2687863 1193997 -69044 -1368060 -1939597 -592033 1681771
37761 1681771 2454225 1366852 323859 33587 -873283 -2723640 -3633846 -2615954 -1377485
37752 -1377485 -1545967 -2222315 -1980557 -1469703 -2065799 -3258694 -3368066 -2059467 -462601
37743 -462601 589527 998444 739265 156787 254225 1273046 1699955 300603 -1499600
37734 -1499600 -1208335 1009020 2281239 1019116 -943772 -963528 1125894 3254713 3572489
37725 3572489 1794331 -1014791 -3075875 -2934294 -772761 1535227 2177551 955367
37717 955367 -1053523 -2675703 -3115642 -2087836 -204493 1328233 2045372 2664965 3548725
37708 3548725 3549384 1513137 -1658633 -3856239 -4462960 -4735327 -5405107 -5541341 -4435855
37699d435855J339430M57769L83706J878543K928171J555745j078772j963510
37691A065227j28120K153597K186776q0410k262014k351702q00225L47093Q1269
37682B11491m49803J93390J466802J546125R8392j130131r41402l87247p75559
37673a67942j314389m67262J145337J333750k31646j334790n39376Q01841R77960
37664B03483N55992Q86480J381788N42781j022001j152464K38583O77819r27898
37655A384563k298182j282731P03318R57317l11370p86810j81484l63646j336715
37646c515740o03247K231015L539574Q23966k764115k401008J353878L287031
37638A951354J081760j733846j440303P22796J277000j12259r00731q7544O22727
$$ plain form
37699 -4435855 -3096425 -2638656 -2254950 -376407 2551764 4107509 3028737 1065227
37691 1065227 937107 3090704 5277480 5197070 2935056 583354 -216871 130222 211491
37682 211491 -238312 -44922 1421880 2968005 3066397 1936266 994864 607617 -167942
37673 -167942 -1482331 -1949593 -804256 529494 297848 -1036942 -1576318 -774477 203483
37664 203483 759475 1645955 3027743 3570524 2548523 1396059 1634642 2312461 1384563
37655 1384563 -913619 -2196350 -1493032 -535715 -847085 -1633895 -1815379 -2179025 -3515740
37646 -3515740 -4118987 -1887972 1651602 2475568 -288547 -2689555 -1335677 1951354
37638 1951354 3033114 1299268 -141035 581761 1858761 1746502 845771 758227 1380954
37629A380954J7588q09202n84289N2966k50821j353070j808323q50924P37625
37620c467496J655672J357677L10875n37194m60153M98217J489344J597126P67433
37611C211501j82486n81287n73756m90525n3429J016541J855674J089492j077919
37602D213806k550320j884823k27322L28704m00816p62466J62614J405081J583030
37593A867488M70985j044081j785237j105320L70774J042637J69015j014377r77232
37584b005348o6264L41539J79490L75506O83403M6702j005472q13503L10549J43833
37574a809565j555139k071123j8956K124440J739309o1817o46453L9176L00820
37565a959308J47726R50988K386080K494230O96443j414697k274525j692293l13878
$$ plain form
37629 1380954 1398542 589340 5051 58017 -192804 -1545874 -3354197 -4205121 -3467496
37620 -3467496 -1811824 -454147 -143272 -680466 -1140619 -642402 846942 2444068 3211501
37611 3211501 3029015 2447728 1873972 1383447 1330018 2346559 4202233 5291725 4213806
37602 4213806 1663486 -221337 -448659 -119955 -520771 -1283237 -1120623 284458 1867488
37593 1867488 2338473 1294392 -490845 -1596165 -1225391 -182754 -13739 -1028116 -2005348
37584 -2005348 -2071612 -1730073 -1550583 -1175077 -491674 -444972 -1450444 -2263947 -1953398 -1809565
37574 -1809565 -3364704 -5435827 -5454783 -3330343 -1591034 -1652851 -2299304 -2260128 -1959308
37565 -1959308 -1811582 -860594 1525486 4019716 4716159 3301462 1026937 -665356 -979234
37556i79234P58970L89589j052256j417581L21432K065543J542335l7762J649
37547A592685J172143N75248j992856l241714j302044J665561K784808J775313
37539C029144m1598j590829j847967j85655J893613J652112r77353k671316j385037
37530b124886O20445M18640j070051q76496J100125J983015M54419j275388p31985
37521a502162J403986K335217Q63981j108014j096319O40133J411799o0084j612875
37512A275662p31424J623786K421282J065540j64035j21453k94778j571537k366367
37503A136676j406765L7964M33814L99593R67452J305421L27527r20283p63795
37494A517604K72231L55842o45712j132094l56601P48029J125313N49996p02204
$$ plain form
37556 -979234 -220264 169325 -882931 -2300512 -1979080 86463 1628798 1591036 1592685
37547 1592685 2764828 3340076 1347220 -1894494 -3196538 -1530977 1253831 3029144
37539 3029144 2987546 1396717 -451250 -636905 1256708 2908820 1931467 -739849 -2124886
37530 -2124886 -1504441 -1085801 -2155852 -3032348 -1932223 50792 505211 -770177 -1502162
37521 -1502162 -98176 2237041 3101022 1993008 896689 1536822 2948621 2888537 1275662
37512 1275662 544238 2168024 4589306 5654846 5490811 5369358 5074580 3503043 1136676
37503 1136676 -270089 -232125 201689 601282 1568734 2874155 3201682 2281399 1517604
37494 1517604 1789835 2145677 1499965 367871 11270 759299 1884612 2434608 1732404
37485A732404j926532k087920r03955N96728J393872J598414J514826P73652n38673
37476B152816j212845p29850l88642j060205j295194K93811K109554J589327o78482
37467G80290j628954k94538J008180M29692r03008j025367M9701Q22815N74831
37458a86358J13263N00464J470265J401528n81404k733374k426581n8672R66213
37449a534656p26891k043163j78375K677597K641177K48588p22151M95618R72992
37440A830736m32550j353267n14735P1117r26498j640366m71969J040188J091267
37431a306077O96510J429633K232839J129736j320376k675087j817755K83370
37423a347207K137981K620574J313560p52675j739037j326124j016739j319160
$$ plain form
37485 1732404 -194128 -2282048 -3186003 -2589275 -1195403 403011 1917837 2691489 2152816
37476 2152816 939971 210121 -178521 -1238726 -2533920 -2240109 -130555 1458772 780290
37467 780290 -848664 -1143202 -135022 294670 -608338 -1633705 -1584004 -761189 -186358
37458 -186358 -73095 427369 1897634 3299162 2717758 -15616 -2442197 -2500869 -1534656
37449 -1534656 -2261547 -4304710 -4483085 -1805488 835689 1084277 362126 857744 1830736
37440 1830736 1398186 44919 -469816 -398699 -1325197 -2965563 -3437532 -2397344 -1306077
37431 -1306077 -609567 820066 3052905 4182641 2862265 187178 -1630577 -1347207
37423 -1347207 790774 3411348 4724908 3972233 2233196 907072 -109667 -1428827
37415a428827o89822J411255K735577J516455n38656q83036M0768K03728l75632
37406A991810l16399M3070o12061j542947q88174P46871Q62901p14044j362370
37397a791343P0599J525354J196991Q5266j78624J84355J98436p3606j78577k66039
37387G72812l22806J86310R33821N32102j139747k007480o77244J185794J172424
37378F35986k56386o04675P03631J494754L13679j292960j110042M38156R60613
37369A282756k73873j144741J62393K169423J930502o31614k307578j069382J087337
37360A205223J198699m69278j405932q88697m09334n12199n2663J060291J127156
37351H53266l82748j570980j113603k96040m17112k89809J438827L153775K225345
$$ plain form
37415 -1428827 -2118649 -707394 2028183 3544638 3005982 2122946 2163714 2367442 1991810
37406 1991810 1675411 1718481 1106420 -436527 -1324701 -577830 285071 -428973 -1791343
37397 -1791343 -1720744 -195390 1001601 1086867 908243 1092598 1291034 1217428 1038851 772812
37387 772812 450006 636316 1570137 2102239 962492 -1044988 -1722232 -536438 635986
37378 635986 379600 -225075 478556 1973310 2286989 994029 -116013 322143 1282756
37369 1282756 1008883 -135858 26535 2195958 4126460 3494846 1187268 117886 1205223
37360 1205223 2403922 1934644 528712 -359985 -769319 -1281518 -1334181 -273890 853266
37351 853266 470518 -1100462 -2214065 -2510105 -2927217 -3217026 -1778199 1375576 3600921
37342C600921p18890k280281j032286P43877O43300o86363j080774p3568Q60359
37333b3705O34530j40131k40798N17115J134610P91825r2412n16537k96728o8516
37323A699253J7354N10795J290603J258943J47315o51657j98333K69794o73783
37314C670284j950688j393831O13574J321622k95030j930569j354298M91482J168822
37305C41368J54152r74141r60080k8174R98952J478191R42706o12512k265692
37296i25230k699053j459099O03633K153732K389009J401911p0276j179129j440513
37287a225015q48651K46621J198495J328322O53444J41815N42854J113694M85568
37278C637147j127772j821605o36284R16845R69728o0072l62699L07781L22387
$$ plain form
37342 3600921 2882031 601750 -430536 313341 956641 270278 -810496 -884064 -23705
37333 -23705 610825 470694 229896 747011 1881621 2673446 2581034 2064497 1767769 1699253
37323 1699253 1716607 2227402 3518005 4776948 4924263 4272606 4074273 4344067 3670284
37314 3670284 1719596 325765 939339 2260961 1965931 35362 -1318936 -827454 341368
37305 341368 495520 -478621 -1438701 -1466875 -467923 1010268 1952974 1340462 -925230
37296 -925230 -3624283 -5083382 -4479749 -2326017 62992 1464903 1394627 215498 -1225015
37287 -1225015 -2073666 -1827045 -628550 699772 1353216 1495031 2037885 3151579 3637147
37278 3637147 2509375 687770 51486 968331 1938059 1877987 1515288 1823069 2145456
37269B145456j036929k168775j423060L82160J026810j7874r79195m35743P26296
37260a780854Q34630l728j89942P88835J581940J141232K29060r9071k09609p53854
37250A538639r30303K47531J620040J065168j094572k279650j635889j214854
37242b683890k108948k128705N66506L718386L710506P84777j506805j474155
37234a122328p92090p65776l21680J220663K161754J043319o89717p47711M59562
37225D45996M62689j507410l290292k618194O3010K173364J917620J86277n70187
37216b737127O79242K233859J964430L20550m16515K69296L55167j165652k172790
37207f69540o41528J771440J923397L2847o57735Q79525J653790o50042l737662
$$ plain form
37269 2145456 1108527 -1060248 -2483308 -2101148 -1074338 -1092212 -2071407 -2507150 -1780854
37260 -1780854 -946224 -949952 -1139894 -351059 1230881 2372113 2601173 2502102 2292493 1538639
37250 1538639 608336 855867 2475907 3541075 2446503 166853 -1469036 -2683890
37242 -2683890 -4792838 -6921543 -6355037 -2636651 1073855 1858632 351827 -1122328
37234 -1122328 -1914418 -2680194 -3001874 -1781211 380543 1423862 734145 -13566 445996
37225 445996 908685 -598725 -3889017 -6507211 -6444201 -4270837 -2353217 -2166940 -2737127
37216 -2737127 -2057885 175974 2140404 2460954 2044439 2313735 2668902 1503250 -669540
37207 -669540 -1311068 460372 2383769 2416616 1758881 2638406 4292196 3642154 -95508
37198i5508l717553n81451J905433J423993k51868m25547P43539J107744L9882
37189A48664q02192j71662R29602Q21376n18201j710387j951786j568693q69852
37180e693131K45501J369633J551332P30329J36343N36619J057458O40572k39952
37171C34704m42875J9243L39300N01153R91083J285747L35231j420989k209162
37162b66565j412592l19710R9570N28558J575149K212008J193910r61385k607506
37153D1437k912866k215569j117530j54806K38491K86478P99134J843118K285346
37144i06767J454157L08712m2783L875l86241p34644j18234R03664R32329l5262
37134A378806n88497K3368J138315J807310J486290K1974j794229k268116q57537
$$ plain form
37198 -95508 -3813061 -4394512 -2489079 -1065086 -1316954 -1742501 -998962 108782 148664
37189 148664 -653528 -825190 104412 925788 407587 -1302800 -3254586 -4823279 -5693131
37180 -5693131 -5447630 -4077997 -2526665 -1796336 -1659993 -1123374 -65916 574656 334704
37171 334704 -108171 -88928 250372 751525 1742608 3028355 3363586 1942597 -266565
37162 -266565 -1679157 -1998867 -1899297 -1370739 204410 2416418 3610328 2648943 41437
37153 41437 -2871429 -5086998 -6204528 -6359334 -6120843 -5834365 -5035231 -3192113 -906767
37144 -906767 547390 856102 813319 817194 430953 -303691 -421925 481739 1414068 1378806
37134 1378806 790309 813677 1951992 3759302 5245592 5267566 3473337 1205221 347684
37125C47684N58088J89667p93622j90321J256267Q09851j499504k416274m48224
37116b186388J839745J789886J37093j012438j223250j038848m17873L77844K51611
37107a482618p33170p36760Q97181K133057J421334J90789J62961M23946m22139
37098A854581j281907n24837Q48150Q70327l8557k54400p5411o60251j111274
37089c73579J79094K197939K454578P47756j036459j963760k072120o69160K108136
37080A572425L367227Q41555k913780l644977j571980j13925K87415J841821L696545
37071C362326K551261q56183k070995n33589m31906k540192k208545J859704L947048
37062C078929N64092l184728j769015J889021J861746j057982j840417j00642
$$ plain form
37125 347684 905772 1095439 301817 111496 1367763 2177614 678110 -1738164 -2186388
37116 -2186388 -346643 1443243 1580336 567898 -655352 -1694200 -2112073 -1734229 -1482618
37107 -1482618 -2215788 -2952548 -2055367 77690 1499024 1689813 1852774 2276720 1854581
37098 1854581 572674 47837 895987 1766314 1727757 1473357 1397946 737695 -373579
37089 -373579 -194485 2003454 4458032 5205788 4169329 2205569 133449 -535711 1572425
37080 1572425 4939652 5781207 2867427 -777550 -2349530 -2463455 -2176040 -334219 3362326
37071 3362326 5913587 5057404 2986409 2452820 2020914 -519278 -2727823 -868119 3078929
37062 3078929 3643021 458293 -1310722 578299 2440045 1382063 -458354 -558996
37054e58996L90649j019134j579764q53935q00854j086548J73996J842690J304067
37045b187829k38133N07194K602737K112578o81191j457012M15840P12294j836917
37036e0439k901638n7235K831340J937307o77882j201905q6079q191q52654o61871
37026a729247M22387P06579J54554J35504Q38334J227718Q80086J64924o52497
37017B148342j262324j214780q59244j125573j675907r68906R77471J859704L85789
37008a735428j545709j495551J80935J192819M09825j173507j747983k42836K467240
36999c690195L655946J505960k043729l103267p84989J853290K255058J168833
36991H16907K11157n03080r14375k6190J753094J864794n66450k526696j350547
$$ plain form
37054 -558996 -168347 -1187481 -2767245 -3621180 -4422034 -5508582 -5334586 -3491896 -2187829
37045 -2187829 -2425962 -1918768 683969 2796547 2115356 658344 1074184 1786478 -50439
37036 -50439 -2952077 -3009312 -177972 1759335 1081453 -120452 -206531 -214722 -1067376 -1729247
37026 -1729247 -1306860 -600281 -445727 -310223 528111 1755829 2635915 2800839 2148342
37017 2148342 886018 -328762 -1188006 -2313579 -3989486 -4958392 -3980921 -2121217 -1735428
37008 -1735428 -3281137 -4776688 -4595753 -3402934 -2993109 -4166616 -5914599 -6157435 -3690195
36999 -3690195 -34249 1471711 -572018 -3675285 -4460274 -2606984 -351926 816907
36991 816907 1028064 524984 -389391 -415581 1337513 3202307 2635857 109161 -1241386
36982a241386R49710P37045j388182j427799J677519M093370K408643j691899
36974D117021l741793k105470N63616J278849M17150L48376J365453J216009r08518
36965B550693k469199j410874L84096J92583r15965j54327J635806J139100j405281
36956d53368k192210k99677Q69244j86788n36928J380483K494158O89733j016867
36947G47780K62196J975659N62862k216913k311146j23054Q81114M24461J010336
36938A213295K325389J338730k005341l923513k362656M28863J810222J945830
36930G70819K010214J875277Q67860q24548k275721k408455p09849J605092K088953
36921B999642J53099j610853r91920M97170J59243j534871k012904q81704k5772
$$ plain form
36982 -1241386 -291676 445369 -942813 -2370612 -693093 3400277 5808920 4117021
36974 4117021 375228 -1730242 -1166626 112223 529373 877749 2243202 3459211 2550693
36965 2550693 81494 -1329380 -945284 -752701 -1668666 -1822993 -187187 951913 -453368
36956 -453368 -2645578 -2945255 -2076011 -2262799 -2799727 -1419244 1074914 1764647 747780
36947 747780 1009976 2985635 3548497 1331584 -979562 -1102616 -221502 202959 1213295
36938 1213295 3538684 4877414 2872073 -1051440 -3414096 -2985233 -1175011 770819
36930 770819 2781033 4656310 5524170 4699622 2423901 15446 -694403 910689 2999642
36921 2999642 3152741 1541888 549968 1047138 1206381 -328490 -2341394 -3223098 -3248870
36912c248870r5741O6785Q25578J314685J341491J299187P18680o56290j179400
36903C86105N26531K496074J630231j499531l234129k035046l7929O17758J11086
36894a038850n62086q20143j48870J220787J632532K11132j142737n07345O39263
36885e16317m5166j290331l38006J632756J060327j488318j708890J082525K465379
36876H53959K34859k031074j074469J022064R40409n60458q05844J65853M39279
36867h15422k48855o50819l66611P7755M51206O70861N20011L47124P41697J200431
36857A927378Q18893K30617O14217J104519J30733j035368J73422K556972K098928
36848H620311j378973l343723j654071M43764L14601k34758L12212r0792k169179
$$ plain form
36912 -3248870 -3344611 -3277826 -2452248 -1137563 203928 1503115 2221795 1565505 386105
36903 386105 912636 3408710 5038941 3539410 305281 -1729765 -1767694 -1149936 -1038850
36894 -1038850 -1600936 -2421079 -2569949 -1349162 283370 494502 -648235 -1155580 -516317
36885 -516317 -561483 -1851814 -2189820 -557064 503263 -985055 -2693945 -1611420 853959
36876 853959 1088818 -942256 -2016725 -994661 -54252 -614710 -1420554 -1254701 -815422
36867 -815422 -1064277 -1715096 -2081707 -2003952 -1552746 -881885 -361874 -14750 726947 1927378
36857 1927378 2746271 2976888 3591105 4695624 4826357 3790989 3964411 6521383 8620311
36848 8620311 7241338 3897615 2243544 2687308 3001909 2767151 3079363 2988571 819392
36839H19392k334060J123668L628333J182208k649668k406583L22812K55045k039864
36830b098717j358736K544774M104974J201951j549870n69188J410834N14477
36822D200499k251105l196432j280722J356482K397015J208046r06577j553387
36814b6181J77986J965460J097045j231216j291610J409195L075440J242921j738600
36805D680440k406983o87467J152009J837000J385176k01786k457697l738702
36797d38010k791086m29877J554633K434800K464074J698715K33720r87969r89287
36788B749713k50905k52615j356995k056330q73139J465355K594464J432672l19321
36779C132899m39455P00039P42929j079041k827631k738889j293054L94172K118598
$$ plain form
36839 819392 -1514668 -391000 3237333 4419541 1769873 -636710 -313898 -58853 -2098717
36830 -2098717 -3457453 -912679 3192295 4394246 2844376 2275188 3686022 4200499
36822 4200499 1949394 -1247038 -2527760 -1171278 1225737 2433783 1527206 -26181
36814 -26181 151805 2117265 3214310 1983094 691484 2100679 5176119 6419040 4680440
36805 4680440 2273457 1585990 2737999 4574999 5960175 5758389 3300692 -438010
36797 -438010 -3229096 -3658973 -2104340 330460 2794534 4493249 4726969 3739000 2749713
36788 2749713 2498808 2246193 889198 -1167132 -2040271 -574916 2019548 3452220 3132899
36779 3132899 2693444 3393483 4136412 3057371 229740 -2509149 -3802203 -3408031 -1289433
36770a289433L232132K062783j231576l314594j854084O70427M81388j572652
36762b815609j398207J659579L681350K199700n03258j358893m59928N31786J059170
36753B595690R94951k01300j843351j850806o1158O75292j107107k430635j47317
36744c375741L702479M434776J564285q36698n75968j26162j785219l636725k758697
36735c393670j0846J362778O57819K06284J208256J938995Q16359j072577j771265
36726e7867j061953J16290J374014K348939J814094n62706k492603j568282R83392
36717H93318J774074L70327k52772J037739J432279q96635l164917k175192M95548
36708d86231J072928m60187r37649M25271J175893K67555m36504M5995K37410
$$ plain form
36770 -1289433 1942699 4005482 2773906 -540688 -2394772 -1724345 -1242957 -2815609
36762 -2815609 -4213816 -2554237 1127113 3326813 2823555 1464662 1004734 1536520 2595690
36753 2595690 3590641 3389341 1545990 -304816 -365974 309318 -797789 -3228424 -3375741
36744 -3375741 326738 4761514 6325799 5489101 4913133 4786971 3001752 -634973 -3393670
36735 -3393670 -3404516 -2041738 -1383919 -1177635 30621 1969616 2785975 1713398 -57867
36726 -57867 -1119820 -1003530 370484 2719423 4533517 3970811 1478208 -90074 893318
36717 893318 2667392 3037719 2784947 3822686 5254965 4358330 1193413 -981779 -486231
36708 -486231 586697 126510 -811139 -385868 790025 1057580 621076 667071 904481
36699I04481m35177k12757J377912J758241n63650k903676k212120K58105J144767
36690h83874J67850j82297Q36785J421588P44082J00795J51880j81409j292058
36681H83342j816722j004324k1529K23927N57969J523901J822961M78146j060515
36672A587156r46691J74646L96900l24850n24635L6832L96159O43421J491273
36663B930211J831974j60265l126041l182135K47907K725216J122575j561155
36655H28287r30233J884896K248199m70304k102381m36869J664720J152052q77357
36646B961010j663511q39437J56116P04139R25737M40785q09098j533826o85410
36637c43495O50085N63787r14634j786324p14826J353345K349850J380290l09961
$$ plain form
36699 904481 469304 256547 1634459 3392700 2829050 -74626 -2286746 -2028641 -883874
36690 -883874 -716024 -898321 -61536 1360052 2104134 2204929 2356809 2175400 883342
36681 883342 -933380 -1937704 -1959233 -1735306 -1177337 346564 2169525 2647671 1587156
36672 1587156 640465 815111 1212011 887161 362526 399358 795517 1438938 2930211
36663 2930211 4762185 4601920 1475879 -1706256 -1458349 1266867 2389442 828287
36655 828287 -101946 1782950 4031149 3560845 1458464 1021595 2686315 3838367 2961010
36646 2961010 1297499 458062 614178 1318317 2244054 2684839 1875741 341915 -343495
36637 -343495 306590 870377 -44257 -1830581 -2545407 -1192062 1157788 2538078 2228117
36628B228117p91465P6807M00782q64587j970844r11881J159657J492611J63915
36619I83112p6831J425108J916732k22945k694884k776086j073891J72575M21138
36610a925972M32714L30596K8974J29166O94598O00800m30363q65236R1736R40548
36600B7561N36502J42502Q33511J062778p11893k905253l016424j402451j95850
36591e629017J21788M33949O36485K37099O3010P87576J074211j88055j293003
36582c755957k71066J460826J255793k77169m75724P42941J184520N66086N46727
36573I76977J012333K90908j012468m27751J797460K498071P24411p56993k51461
36564D851487K35806j124792k647482j862147O42956K208160J558754k72716j565978
$$ plain form
36628 2228117 1436652 1513459 1914241 1049654 -921190 -1833071 -673414 819197 983112
36619 983112 906281 2331389 4248121 4025176 1330292 -1445794 -2519685 -2347110 -1925972
36610 -1925972 -1493258 -1162662 -1133688 -1004522 -309924 290876 -139487 -1004723 -912987 27561
36600 27561 564063 706565 1540076 2602854 1890961 -1014292 -4030716 -5433167 -5629017
36591 -5629017 -5507229 -5073280 -4436795 -4199696 -4136686 -3349110 -2274899 -2462954 -3755957
36582 -3755957 -4027023 -2566197 -1310404 -1587573 -2063297 -1320356 -135836 430250 976977
36573 976977 1989310 2280218 1267750 839999 2637459 5135530 5859941 5102948 4851487
36564 4851487 5087293 3962501 1315019 -547128 95828 2303988 3862742 3590026 2024048
36555B024048j499280p27381n89650j175554q51846J203063L152394K908249J159496
36546E603539p9895n74253j089699j108361k51152k43680j931275k222477J518513
36537c78740N682178M519141q26511l552471j546460J14328j757014l634978k185170
36528c565697J60829K07760n54471M22503J825640J217282o53244j788364k090688
36519d818450j631172P01299L852170L874791j9473k795641q96058K014224J208452
36510A490142j380301j177323R28849R08842o79206j29636J954335J638144p27310
36501B826536r01465J199222R38248k487955l882100p22735K338511J030529j863659
36492a524868j534820J337551K636993J450491J58688k53096p13924q72105O39717
$$ plain form
36555 2024048 524768 -202613 -792263 -1967817 -2819663 -1616600 1535794 4444043 5603539
36546 5603539 5523644 4949391 3859692 2751331 2500179 2256499 325224 -1897253 -378740
36537 -378740 5303438 9822579 8996068 5443597 3897137 4011465 2254451 -1380527 -3565697
36528 -3565697 -3404868 -3197108 -3751579 -3329076 -1503436 -286154 -939398 -2727762 -4818450
36519 -4818450 -6449622 -5748323 -1896153 1978638 1959165 -836476 -1732534 281690 1490142
36510 1490142 109841 -1067482 -138633 770209 91003 -38633 1915702 3553846 2826536
36501 2826536 1925071 3124293 4062541 1574586 -2307514 -3030249 -691738 338791 -1524868
36492 -1524868 -3059688 -1722137 914856 2365347 2524035 2270939 1557015 684910 1324627
36483A324627K809720K591724n84091l302558k437676Q34164K760959J772402
36475E769271p1754l10550O86769O72127r88982k335355j728516l11615k60252
36466A121143j436600j561416L11228K228258J988516J50762p84737K62954J643096
36457C923204J343553k32023q56018L62659J706511J302674l84313j660575k081779
36448C423893k096295j143733J436678L899954L351375J9462k448305j877899
36440D565130r2682O41416Q61024J810581K770579K750428K561577K829942K193032
36431B0891027J08389q62440J222546L809464L527697K044252L703477Q075639
36423D2520051R692684N655453q63068n698572q158349q885397p312034l887167
$$ plain form
36483 1324627 4134347 6726071 6141980 2839422 401746 1235910 3996869 5769271
36475 5769271 5697517 5386967 6073736 6745863 5756881 3421526 1693010 1381395 1121143
36466 1121143 -315457 -1876873 -1565645 662613 2651129 2801891 2017154 2280108 3923204
36457 3923204 5266757 5034734 4178716 4541375 6247886 7550560 7166247 5505672 3423893
36448 3423893 1327598 183865 1620543 5520497 8871872 8891334 6443029 4565130
36440 4565130 4472448 5113864 5974888 7785469 10556048 13306476 15868053 18697995 20891027
36431 20891027 20999416 20136976 21359522 25168986 28696683 30740935 34444412 42520051
36423 42520051 52212735 57868188 57005120 51306548 43148199 34262802 26950768 23063601
36415B3063601j778091l168587n652150n195513j600093J556706J780404R4397
36407I100674j226071j291307o34293j30515m14012j405700k042263j262435M15867
36398A109945J124039O564j367841r05266J078353K113766R83745n67129m70157
36389C106019O14141N58655p08387j138725J0965R62525K98935r07222r21241
36380A875665K16340J171841J067445n6154j375730j426313M00043K182472J345393
36371E401002j306119k051199K42182K129638R09110j231583j112241K60692L046
36362C244528j323912q72474J159099J574055o12599k741035k634919j033187
36354c240444N39371J552211J657017O13660n12231l34284M06928l20641k310296
$$ plain form
36415 23063601 21285510 18116923 12464773 7269260 5669167 7225873 9006277 9100674
36407 9100674 7874603 6583296 5949003 5818488 5404476 3998776 1956513 694078 1109945
36398 1109945 2233984 2240548 872707 -32559 1045794 3159560 4143305 3576176 3106019
36389 3106019 3720160 4278815 3570428 2431703 2442668 3405193 3704128 2796906 1875665
36380 1875665 2092005 3263846 4331291 4275137 2899407 1473094 1873137 4055609 5401002
36371 5401002 4094883 2043684 2285866 4415504 5324614 4093031 2980790 3241482 3244528
36362 3244528 1920616 1048142 2207241 3781296 3168697 427662 -2207257 -3240444
36354 -3240444 -2701073 -1148862 508155 1121815 609584 275300 682228 361587 -1948709
36345a948709k873193p17670K145968L177182K167032N83466m22218o19658l50093
36336A142107n6919K70216Q53434J051269j26557j716800j159447J555756K725998
36327D539057L26900k292825j557946L50495o41400l022222k020684J829794L123155
36318F34324O88518o15242J420156K714466N71338j485876l68443Q73007j192450
36309C239798l764385k522659P55742J259617p03959p28022J829794K950152Q76192
36300C192270j342801j115336J94652L53127n12340j118360r06455L24202K474327
36291A543286M047135L086651J8992k298354k097719n85883K92197K15061j83556
36282D037810p03822j220692j138561k77866M92977L70903k54763m90498k26819
$$ plain form
36345 -1948709 -4821902 -5539572 -3393604 -216422 1950610 2534076 2111858 1492200 1142107
36336 1142107 1085188 1355404 2208838 3260107 3133550 1416750 257303 1813059 4539057
36327 4539057 4865957 2573132 1015186 1365681 724281 -2297941 -4318625 -2488831 634324
36318 634324 1322842 707600 2127756 4842222 5413560 3927684 3559241 4432248 3239798
36309 3239798 -524587 -3047246 -2291504 -1031887 -1735846 -2463868 -634074 2316078 3192270
36300 3192270 1849469 734133 928785 1281912 769572 -348788 -1255243 -931041 1543286
36291 1543286 5590421 8677072 8696064 6397710 4299991 3714108 4006305 4221366 4037810
36282 4037810 3333988 2113296 974735 696869 1189846 1560749 1305986 815488 588669
36273E88669n8573k35888l09420J78835R70906J226889M74514o42076r35415j59984
36263A098457N46283R6455j105629j732119j240022l41304J45517K41825M30387
36254a860150Q17328J041239Q78808O17469O82634J013450J039495L45971p67871
36245C808373j437367r17219O26222J807449J093545j107005k123858j89957K559492
36236D119675K340106r80754l428419k520553m01408K10020J12530J010537J631633
36227B093367J20001j768375j072803J127701J364349j73090j45754J554244J285157
36218D384797j619461l005713p52856J516579M08593j931311j887969o6298Q32409
36209b121230P60154J037720Q96540o07352j348440Q66564L624452K781839q79552
$$ plain form
36273 588669 530096 294208 -15212 163623 1134529 2361418 2835932 2193856 1258441 1098457
36263 1098457 1644740 1741195 635566 -1096553 -2336575 -2677879 -2532362 -2290537 -1860150
36254 -1860150 -1042822 -1583 877225 1494694 2177328 3190778 4230273 4576244 3808373
36245 3808373 2371006 1453787 2080009 3887458 4981003 3873998 1750140 1560183 4119675
36236 4119675 6459781 5479027 2050608 -469945 -871353 -661333 -548803 461734 2093367
36227 2093367 2213368 444993 -627810 499891 1864240 1691150 1545396 3099640 4384797
36218 4384797 2765336 -240377 -993233 523346 931939 -999372 -2887341 -2953639 -2121230
36209 -2121230 -1361076 -323356 573184 -34168 -1382608 -516044 3108408 5890247 5010695
36200E010695k547263q10537N33130r67124k500877q07979K516566L469849J357024
36191E253484r46429j568153j624239k358708k651708q01090K378908M039042
36183A721107K857214N69935o26223p54794j002451j299033p60472K61827O48540
36174A615650O14698J177627J758629P41263j468986k488583j492926j83656L34040
36165F07756R14990J760910J354030n95361j851792j040119J13768k10355r79660
36156G4167m35446Q60946J284695Q14144M55914L99295L66722M10594J68589r55340
36146C444280j990174j121715R07830J198410l07170p8603K727691L658227m3603
36137H395173m075104l250954M89013J591502l10145j090889N5520j05698k088641
$$ plain form
36200 5010695 2463432 1652895 2186025 1218901 -1281976 -2089955 426611 3896460 5253484
36191 5253484 4307055 2738902 1114663 -1244045 -3895753 -4696843 -2317935 1721107
36183 1721107 4578321 5148256 4522033 3767239 2764788 1465755 705283 967110 1615650
36174 1615650 2230348 3407975 5166604 5907867 4438881 1950298 457372 273716 607756
36165 607756 1522746 3283656 4637686 4042325 2190533 1150414 1264182 1053827 74167
36156 74167 -361279 499667 1784362 2598506 3054420 3453715 3820437 4231031 4399620 3444280
36146 3444280 1454106 332391 1240221 2438631 2131461 2052858 4780549 8438776 8395173
36137 8395173 4320069 1069115 1558128 3149630 2839485 1748596 1804116 1698418 -390223
36128c90223k388780J25803J934151O60782j326392j129945N00403J324377J123592
36119D33768J026527J288809J324114O89182o52982j939475j682333L60297J995546
36110B843453J356960j51621j93254M05939p81510k963809k804801J18840K417604
36101B47801J960985L09796n74539o89117l30848O66039J240513j95594k558708
36092G6328k689148K3554K626341K960420J966021R41205k42308j302127j134036
36083C226250j85029j93146r07823l47234J229411J400940J68578J47174J364854
36074E903975P43328j877874k550113k00607P97537j840084l803468j415870J867821
36065b375355J411870p08611J27177K616036J993611j319464k417668k12996J472518
$$ plain form
36128 -390223 -2779003 -2653200 -719049 -58267 -1384659 -2514604 -2014201 -689824 433768
36119 433768 1460295 2749104 4073218 4762400 4109418 2169943 487610 847907 2843453
36110 2843453 4200413 4048792 3855538 4261477 3479967 516158 -2288643 -2169803 247801
36101 247801 2208786 2518582 1944043 1254926 924078 1590117 2830630 2635036 76328
36092 76328 -2612820 -2589266 37075 2997495 4963516 5904721 5662413 4360286 3226250
36083 3226250 3041221 2848075 1940252 1593018 2822429 4223369 4391947 4539121 5903975
36074 5903975 6647303 4769429 2219316 2018709 2816246 976162 -2827306 -4243176 -2375355
36065 -2375355 -963485 -1672096 -1544919 1071117 3064728 1745264 -672404 -885400 587118
36056E87118Q79195K44715M33139m65494k189304j592004J444765K583409j52067
36047A773472k755590j366389J869006K495903M15202q12359L83589J993549J842405
36038E838788N2814j772424k211657j028763N16271P71457l38021j231828r61742
36029c65105l59860l16648l38752K48801R66324J132775J048678J165153J102345
36020D283711N30056j4558k46711r33266k313566k884057j411629P13161J042592
36011a234267m42759j357088l80692J176221J623404R87248K10604k63962k80301
36002C8408L84919J206678Q79898p99049k038397j305281M38564J238713J054347
35993A098800J264405J782747J029345r94089k007768q02960P76207O20075n59310
$$ plain form
36056 587118 1466313 1711028 2144167 1678673 -510631 -2102635 -657870 1925539 1773472
36047 1773472 -982118 -2348507 -479501 2016402 2431604 1619245 2002834 3996383 5838788
36038 5838788 5891602 4119178 1907521 878758 1395029 2166486 1828465 596637 -365105
36029 -365105 -724965 -1041613 -1380365 -1131564 -165240 967535 2016213 3181366 4283711
36020 4283711 4813767 4799209 4552498 3619232 1305666 -1578391 -2990020 -2276859 -1234267
36011 -1234267 -1677026 -3034114 -3414806 -2238585 -615181 372067 582671 318709 38408
36002 38408 423327 1630005 2509903 1710854 -327543 -1632824 -1194260 44453 1098800
35993 1098800 2363205 4145952 5175297 4181208 2173440 1370480 2146687 2766762 2207452
35984B207452o71207M45134J065136K83023j027281j643522j096235K90551J425821
35975A278872J134308k38008q64980j12515L13239n85201p98604J391527L491938
35966E010576J767568k593108m325906j504243J778811J432075j337675k658321
35958b430223j206683J338013L024241K850143Q75285j242250j322293L93167
35950B279400J085407n70415k230794j433872P47505J690593J078813M50724K99336
35941C396697K656l44518k15978o097k46902l39195K35316N21546k93126j070096
35931A640303m93905N49178M66061l91195p95841j024013j608499j133969J557739
35922a234141M048043K915832q02935k580356r71224P04790J8268j184383o41379
$$ plain form
35984 2207452 1536245 1981379 3046515 3329538 2302257 658735 -437500 -146949 1278872
35975 1278872 2413180 2175172 1310192 1197677 1510916 925715 127111 1518638 5010576
35966 5010576 6778144 4185036 -140870 -1645113 133698 1565773 228098 -2430223
35958 -2430223 -3636906 -2298893 725348 3575491 4450776 3208526 1886233 2279400
35950 2279400 3364807 2794392 563598 -870274 -122769 1567824 2646637 3097361 3396697
35941 3396697 3399353 3054835 2838857 2832760 2585858 2246663 2481979 3003525 2710399 1640303
35931 1640303 1146398 1695576 2161637 1770442 974601 -49412 -1657911 -2791880 -1234141
35922 -1234141 2813902 5729734 4926799 2346443 1375219 2080009 2098277 913894 272515
35913B72515O40126Q14745M38328P69897J107528L45303o72663q17448r76062
35904A922269k091832k535486m87256K253853K304316K5376q45842Q63114J967573
35895C376085K92373j740001j148111Q83880J318115K22892m4407O32507K22421
35886D015754j174888j128058M64082N55925j609211k241705R67553M062161K209117
35877F120730k484964l539711L87256L770480K592078m99805j307727r6939M58240
35868E399638J52520N55245J362048Q93501o42590j329788o54970k8287k81302
35859E426015o86777n87026l25092k77385j77330L08240J050596J589124J482997
35850G803362Q33499N03952J036636J395743J45740j976107k486312o72387J350578
$$ plain form
35913 272515 912641 1727386 2165714 2935611 4043139 4388442 3715779 2898331 1922269
35904 1922269 -169563 -2705049 -3192305 -938452 1365864 1391240 545398 1408512 3376085
35895 3376085 3668458 1928457 780346 1664226 2982341 3205233 3160826 3793333 4015754
35886 4015754 2840866 1712808 2176890 2732815 1123604 -1118101 -150548 3911613 6120730
35877 6120730 3635766 96055 483311 4253791 6845869 6346064 5038337 4941398 5399638
35868 5399638 5552158 6107403 7469451 8362952 7720362 6390574 5735604 5707317 5426015
35859 5426015 4739238 4152212 3827120 3549735 3372405 3680645 4731241 6320365 7803362
35850 7803362 8636861 9140813 10177449 11573192 11718932 9742825 7256513 6584126 7934704
35841G934704J889656J685315J538145N29128j586138k709166j446248L53063
35833H188459N56040R0807O49842J315819O88045K29001J723268L265926K098557
35824A8805764O15R86713M412454N662414L774423K837041M631975N308241J799437
35815D8219077l023326m737887l419947k106766j937452k025016k197885k839479
35807B5931319l199046k286664o38314M63530N99460k9267j079927j433446R2188
35798A8419833K441397K860115Q07366j072409j093976q17727j543420j690114
35790A8311065j18604J004618j63665j354484K28657K751349K436807j02262q20471
35781B2173010J115725K283488Q66571q00702o17667J47861k55529j029554m63816
$$ plain form
35841 7934704 9824360 11509675 13047820 13576948 11990810 9281644 7835396 8188459
35833 8188459 8744499 8835306 9485148 10800967 11489012 11718013 13441281 16707207 18805764
35824 18805764 18806379 19793092 24205546 29867960 33642383 36479424 41111399 46419640 48219077
35815 48219077 45195751 40457864 37037917 34931151 32993699 30968683 28770798 25931319
35807 25931319 22732273 20445609 19807295 20270825 20870285 20841018 19761091 18327645 18419833
35798 18419833 20861230 23721345 24528711 23456302 22362326 21544599 20001179 18311065
35790 18311065 18192461 19197079 19033414 17678930 17907587 20658936 23095743 22993481 22173010
35781 22173010 23288735 25572223 26438794 25638092 25020425 25168286 24912757 23883203 23419387
35772B3419387J553928M041931O083431O569763M846693K487173K202112M064939
35764E5269357N260806M661886M754016P244177R798642R959234R719908J2482505
35756A19150531J7109877J9282313J8293073J8111074K0979152K4079771K4328294
35749B61334085K2819571K1678823J9289136J2399366J695290q377655j5078289
35742C15760327j9395542k2474833k3478471k2192625k0708533k0454006j9782989
35735A67273328j6825698j3007460j1118931j1035903j0165359p639412n276349
35728I2204216m334883l992120l562188l727401m613322m845095l777830k806376
35720F0545001l068853l500225k736325j507563j327475j901404j808544j069487
$$ plain form
35772 23419387 24973315 29015246 35098677 41668440 46515133 49002306 51204418 55269357
35764 55269357 60530163 65192049 69946065 77190242 86988884 96948118 106668026 119150531
35756 119150531 136260408 155542721 173835794 191946868 212926020 237005791 261334085
35749 261334085 284153656 305832479 325121615 337520981 339216271 330838616 315760327
35742 315760327 296364785 273889952 250411481 228218856 207510323 187056317 167273328
35735 167273328 150447630 137440170 126321239 115285336 105119977 97480565 92204216
35728 92204216 87869333 83877213 80315025 76587624 71974302 67129207 63351377 60545001
35720 60545001 57476148 53975923 51239598 49732035 48404560 46503156 44694612 43625125
35712D3625125r95400j684218j618784j06981J424500J258732m45422j956762
35704C9500790j919009n53871Q08621J139271O69295L69131N44822M94879j96395
35695D0857534p25697r8855J318893K016455J021544j053958k549805k177276
35687C8608835k58574J326878R74518p81505k029854k146432k331074k998190
35679C0364602k472307J78573K516386J360664k471596m637574k897471O0249
35671B2001526N69977j155350k005492p28257O11503L9202j539434k090572j596563
35662A4106540j606902k121229j180863J664457L516842J620001k524028m824578
35654H650240l822751j686863j25119J520370L198251K606099r00405l608258
$$ plain form
35712 43625125 42629725 40945507 39326723 39219742 40644242 41902974 41457552 39500790
35704 39500790 37581781 37027910 37836531 38975802 39645097 40014228 40559050 41053929 40857534
35695 40857534 40131837 40032982 41351875 43368330 44389874 43335916 40786111 38608835
35687 38608835 38350261 39677139 40651657 39870152 37840298 35693866 33362792 30364602
35679 30364602 27892295 28070868 30587254 31947918 29476322 24838748 21941277 22001526
35671 22001526 22571503 21416153 19410661 18682404 19293907 19333109 17793675 15703103 14106540
35662 14106540 12499638 10378409 9197546 10862003 14378845 15998846 13474818 8650240
35654 8650240 4827489 3140626 3015507 4535877 7734128 10340227 9439822 5831564
35646E831564k035026J481095J631978k063859m396633j974833K216216L463859
35638D154361J464827o14848j075056q49929p77337m21454L73626P89204L76029
35629C419423j58626L5249Q51970J343973N57863j498713l301428k842683m5889
35620a638861K480281K289583K50840o45521N24105J481447L08693j736455k285340
35611A028772j331139p71867j165366j029395M66840K003382K112873J265872
35603B579972Q08277P83993J82638j089700j871429j452231n05969K1624J03030
35594d39795K14783L69406K33112n6926J17222Q87579J390039P00026p92459j529028
35584A093959o39656Q72704J447502R72116M24985r4540j311899k604169j993055
$$ plain form
35646 5831564 3796538 5277633 6909611 4845752 449119 -1525714 690502 4154361
35638 4154361 5619188 5004340 3929284 3079355 2302018 1880564 2254190 3043394 3419423
35629 3419423 3260797 3296046 4148016 5491989 6049852 4551139 1249711 -1592972 -1638861
35620 -1638861 841420 3131003 3381843 2736322 3260427 4741874 5050567 3314112 1028772
35611 1028772 -302367 -1074234 -2239600 -3268995 -2802155 -798773 1314100 2579972
35603 2579972 3388249 4172242 4354880 3265180 1393751 -58480 -564449 -542825 -439795
35594 -439795 -225012 144394 377506 320580 437802 1325381 2715420 3415446 2622987 1093959
35584 1093959 454303 1327007 2774509 3746625 4171610 4077070 2765171 161002 -1832053
35575a832053O36586K353190J071859j047477n94613J863585K627532N86994j270582
35566D395021p51665L28364n15918k367385k447144l11895J660382J425318o31192
35557G83886k454379k215804J38509K603420K967535J304546l16561q13593j249921
35548G47638k410363l040804j789764N33810K075855K209948J472323L98508l49808
35539a52657M9964J186746J285331k07428j414087r23879j35782o82379j294954
35530b289125N5599K245708K400608N26823n37475K49595P80942l23927j427266
35521A681482p11648R09774J234077k23190j888320k073587n91539J123759J421652
35512H82460L33801m81429k07759j7134o76602p94850N68792J400387k56453k312284
$$ plain form
35575 -1832053 -1195467 1157723 2229582 1182105 587492 2451077 5078609 5665603 4395021
35566 4395021 3643356 3971720 3455802 1088417 -1358727 -1670622 -10240 1415078 783886
35557 783886 -1670493 -3886297 -3747788 -1144368 1823167 3127713 2811152 1997559 747638
35548 747638 -1662725 -4703529 -6493293 -5959483 -3883628 -1673680 -201357 197151 -152657
35539 -152657 -102693 1084053 2369384 2161956 747869 -176010 -311792 -994171 -2289125
35530 -2289125 -2233526 12182 2412790 2939613 2402138 2651733 3432675 3108748 1681482
35521 1681482 969834 1879608 3113685 2890495 1002175 -1071412 -1662951 -539192 882460
35512 882460 1216261 734832 527073 509939 -166663 -961513 -392721 1007666 751213 -1561071
35502a561071j347377J614169K309890M9166j308111R9996J349571J82894j243488
35493A45639o02139N80692K35207l62672M78298J021858p99580k741931j140929
35484c185557K823432M168147J191846k358340k671789k82100J705568J417489
35476B808696n62432k131801j428291J139529K821090J728438n73389j271473
35468B530367k15673M23541l40144j487063k181103k346455j429854P80056K290330
35459a975998Q11722k198217k506016R59941M096108L112705m60500k276710q40109
35450a277074J525360K260359J074586o50926j381683n35064Q79026R89395p84037
35441B099942k736155k777502q64732J196240J882743J075977n18773k025537
$$ plain form
35502 -1561071 -2908448 -1294279 1015611 1064777 -243334 -143338 1206233 1389127 145639
35493 145639 -456500 124192 359399 -3273 475025 1496883 697303 -2044628 -3185557
35484 -3185557 -362125 3806022 4997868 2639528 -32261 -314361 1391207 2808696
35476 2808696 2246264 114463 -1313828 -174299 2646791 4375229 3801840 2530367
35468 2530367 2314694 2738235 2398091 911028 -1270075 -3616530 -5046384 -4266328 -1975998
35459 -1975998 -1164276 -3362493 -5868509 -4908568 -812460 2300245 1839745 -436965 -1277074
35450 -1277074 248286 2508645 3583231 2932305 1550622 1015558 1894584 2883979 2099942
35441 2099942 -636213 -3413715 -4278447 -3082207 -1199464 -123487 -642260 -2667797
35433b667797k438962r69293J984740M437418M159072R98027k423161l201209
35425a21165j407568K13062O9689l18380Q11746K362953K103372K95925q55021
35416C154613p64933q07087j255462p79186N82932Q38803n84087j589802q72774
35407b076983j7576m20449o49343Q08409K324960J486608q11881j586277k25235
35398a167767J091586J005080L54474O0564L8592K47742O56089K79455j461312
35389A104503k644894q85402K390157K896263l66126l160969j981782R80330J427168
35380b40752p70838k106387r64128P27799J078938M36269l53610j246999j775821
35371e215529p85555J431228K567232J274231o85965q03803O79122J345522J79704
$$ plain form
35433 -2667797 -5106759 -6076052 -4091312 346106 4505178 5503205 3080044 -121165
35425 -121165 -1528733 -1315671 -1245982 -1564362 -752616 1610337 3713709 4009634 3154613
35416 3154613 2389680 1582593 327131 -452055 130877 969680 385593 -1204209 -2076983
35407 -2076983 -2094559 -2515008 -3164351 -2355942 -30982 1455626 643745 -942532 -1167767
35398 -1167767 -76181 928899 1283373 1343937 1382529 1630271 2286360 2565815 1104503
35389 1104503 -1540391 -2425793 -35636 2860627 2494501 -666468 -2648250 -1667920 -240752
35380 -240752 -1011590 -3117977 -4082105 -3354306 -2275368 -1839099 -2192709 -3439708 -5215529
35371 -5215529 -6001084 -4569856 -2002624 -728393 -1414358 -2218161 -1539039 -193517 -13813
35362a3813j192235j018982K47975Q24442l4442j320998j645780o89095P48610
35353d094318J678728J617644O26679p76450j649873j211241J35697Q99149L25238
35344b448747m05548J63057J393477J397269J36576l07659Q91846J812214R04335
35335C536820m56387m87182k26750j533893l129884k027743J355965L064094J312122
35326A407162r04134l88233J824928K589762J071863j074866k362451k308263
35318a44232r56672O10578O01985r14632j324265P06379K538712J301691j376358
35309A043186j694868M18998J560403N80108k8524J036844J675720L67374j164901
35300C794340j157654o68674j079173j348688j97715J116479P98529l57025l82489
$$ plain form
35362 -13813 -1206048 -2225030 -1977055 -1152613 -1187055 -2508053 -4153833 -4842928 -4094318
35353 -4094318 -2415590 -797946 -171267 -947717 -2597590 -3808831 -3673134 -2773985 -2448747
35344 -2448747 -2854295 -2691238 -1297761 99508 236084 -71575 820271 2632485 3536820
35335 3536820 3080433 2593251 2366501 832608 -2297276 -4325019 -2969054 95040 1407162
35326 1407162 503028 114795 1939723 4529485 5601348 4526482 2164031 -144232
35318 -144232 -1100904 -490326 111659 -802973 -2127238 -1420859 1117853 2419544 1043186
35309 1043186 -651682 -232684 1327719 1907827 1879303 2916147 4591867 4959241 3794340
35300 3794340 2636686 1968012 888839 -459849 -657564 458915 1257444 900419 517930
35291E17930O03226R96555N21943Q0000l15576j094133j389137j88479J286676
35282A019005Q32071j277930k420613j308113N75849J429575J107365L93152J9467
35273C69828N57357J658377J516029j012973l871374l698037n04447K034198J635006
35264a316036J97533L24890J490539J563122L25789p01547q46905o87316n36679
35255a86610k77734k60535q37451j311000p12534N74819J190386O78832m9513
35246a191340q5211M98525R63062O00257o40629j754501j452876J16507J187225
35237a758981O36921m91281p01845k32155j54457k75527K71762J027189Q44599
35228h33775J56249L59203J037545L28032j549059j889688K18688J901244P14616
$$ plain form
35291 517930 1121156 2117711 2639654 2719654 2404078 1309945 -79192 -267671 1019005
35282 1019005 1851076 573146 -1847467 -3155580 -2579731 -1150156 -42791 350361 369828
35273 369828 927185 2585562 4101591 3088618 -782756 -4480793 -4985240 -2951042 -1316036
35264 -1316036 -1118503 -793613 696926 2260048 2585837 1884290 1037385 350069 -186610
35255 -186610 -464344 -724879 -1562330 -2873330 -3585864 -3011045 -1820659 -1141827 -1191340
35246 -1191340 -1276551 -778026 185036 785293 144664 -1609837 -3062713 -2946206 -1758981
35237 -1758981 -1122060 -1613341 -2315186 -2547341 -2701798 -2977325 -2705563 -1678374 -833775
35228 -833775 -677526 -318323 719222 1047254 -501805 -2391493 -2172805 -271561 443055
35219D43055j423896j173590R83885J635695q1023j269437J1649J865701J729102
35210B721141R4192p34033n1406R14862J106651L96967r99213k267245j845946
35201f64030N97559K499004R41340k967923m626326j772708K358429L315279J067337
35192G47961q97306r01914n55294r83849p22544J335973L324993K842217N26740
35183D716977j060745j240081j456634k068997j588034L41075J711344J180157
35175E35062K58629P69287J791640J269799m96986j368906p84416k20011l51483
35166A402615j96858N96472R83192P00425R17719J756144J485046m15058j650574
35157E579123m83792J287111J034779o70159j390154q56865o74935q80535j38600
$$ plain form
35219 443055 -980841 -2154431 -1170546 465149 384126 -885311 -873662 992039 2721141
35210 2721141 2815333 2081300 2029894 2944756 4051407 4448374 3449161 1181916 -664030
35201 -664030 -66471 2432533 3373873 405950 -4220376 -5993084 -3634655 -319376 747961
35192 747961 -149345 -1051259 -1606553 -2590402 -3312946 -1976973 1348020 4190237 4716977
35183 4716977 3656232 2416151 959517 -1109480 -2697514 -2356439 -645095 535062
35175 535062 793691 1562978 3354618 4624417 4127431 2758525 1974109 1754098 1402615
35166 1402615 1205757 1802229 2785421 3485846 4403565 6159709 7644755 7229697 5579123
35157 5579123 5095331 6382442 7417221 6747062 5356908 4500043 3825108 2944573 2805973
35148B805973R00182j6155k513014l181965n98696K295305K450509O80697n25740
35139B297096p62569r72701q94927J53048J158615N40508j280170k416846k006822
35130d184768n18705J515384L276554L171726P12829j844997j972019m30940m9359
35121c24295j302460j742250l4546J994314K162628P28917o48377j154010r53594
35112a273673k86884N37113R65388P50612K26731k36628n45508o34998n16536
35103a014383m40619m14363L6371R04283J202429M37144l03377q3530Q2997r77256
35093e70304j995251r15839J393468J931244J15114j319569n21775J097770J587063
35084H01921J030903K83318n82504j313236j043658m3505J00403q06706q08284
$$ plain form
35148 2805973 3706155 3690000 1176986 -2004979 -2603675 -308370 2142139 2822836 2297096
35139 2297096 1534527 561826 -333101 -180053 978562 1519070 238900 -2177946 -4184768
35130 -4184768 -4703473 -3188089 88465 3260191 3973020 2128023 156004 -274936 -324295
35121 -324295 -1626755 -3369005 -3403551 -1409237 753391 1482308 833931 -320079 -1273673
35112 -1273673 -1560557 -1023444 -58056 692556 919287 682659 137151 -497847 -1014383
35103 -1014383 -1455002 -1869365 -1832994 -928711 273718 710862 407485 323955 406952 -570304
35093 -570304 -2565555 -3481394 -2087926 -156682 -41568 -1361137 -1882912 -785142 801921
35084 801921 1832824 2116142 1533638 220402 -823256 -866761 -766358 -1573064 -2381348
35075b381348R66992K532068K077548O64643J26656K69376N8059k63790k19820
35066C830384n02909j331805j208461N22597J713927M83305j484376j486566j48927
35057C87169j16261j505666j984720q48909K05306K91939L59379Q41142R66727
35048a403894O97720R11329J381428Q92682l89582r49083n52297n27065j112773
35039a051535r47499K94908J141620Q87655O22843Q58564M23515j122101k054547
35030i46577r01738J320418K616407K397606J216550m77908k008826k109084l88898
35021G17950J537273J660643o5403j868211k291302j442357l41073L61271Q73092
35012h58117J536875J864150J048504l42953m73695J017060J794213M3640k359982
$$ plain form
35075 -2381348 -1414356 1117712 3195260 3859903 3986559 4255935 4313994 4050204 3830384
35066 3830384 3327475 1995670 787209 1309806 3023733 3507038 2022662 536096 387169
35057 387169 270908 -1234758 -3219478 -4068387 -3863081 -3571142 -3211763 -2370621 -1403894
35048 -1403894 -706174 205155 1586583 2479265 2089683 1140600 588303 61238 -1051535
35039 -1051535 -1999034 -1704126 -562506 325149 947992 1806556 2230071 1107970 -946577
35030 -946577 -1848315 -527897 2088510 4486116 5702666 5224758 3215932 1106848 717950
35021 717950 2255223 3915866 3850463 1982252 -309050 -1751407 -2092480 -1731209 -858117
35012 -858117 678758 2542908 3591412 3248459 2774764 3791824 5586037 5629677 3269695
35003C269695k273818l4714J075620j34823j406156j129821o03938r85280r60770
34994c184005N92591J982259J138149q52406j114816Q11549K341069J423113q81419
34985B256084j932508q06229O46220J97202j693043k245277k12286K070484J864494
34976A45141m6937p61507K88783R27892J1955j121324j218402o12891K08056J200827
34966i78407J674350R68115K56854J035246J975306N70389k136671k468818k11618
34957F84746P56159r23654j818625r1545J053682n34407j509177R75526L343757
34948A936462J088177l304438l918666n62201J752916J054225M9569J45723j71525
34939a929758p85454M76336K812810K389567j173178l244833j215937J440501
$$ plain form
35003 3269695 995877 961163 2036783 1901960 495804 -634017 -1237955 -2223235 -3184005
34994 -3184005 -2591414 -609155 528994 -323412 -1438228 -626679 1714390 3137503 2256084
34985 2256084 323576 -482653 163567 360769 -1332274 -3577551 -3789837 -1719353 145141
34976 145141 98204 -663303 -374520 553372 565327 -555997 -1774399 -2387290 -2179234 -978407
34966 -978407 695943 1664058 1920912 2956158 4931464 5501853 3365182 896364 684746
34957 684746 1440905 517251 -1301374 -1392919 -339237 -873644 -2382821 -1407295 1936462
34948 1936462 3024639 -279799 -4198465 -4760666 -3007750 -1953525 -1903956 -1758233 -1929758
34939 -1929758 -2715212 -2238876 573934 2963501 1790323 -1454510 -2670447 -1229946
34931a229946Q55042j344336j151494J525704L156457J788832q52176j963436
34923G84647n92086J712473K310477J19232k851892l593506j708141M85607J291199
34914b041990J097354M58792q64031k301596k226375l74008J366530J579993J017907
34905b287424P69496N31935k01300q21798o74170k09958o9561n5657K03264N28685
34895b286488P06444Q54312R75291R64037R74452Q81006m9493j678567k160843
34886h19849m75685J304542Q24400n46951J50849K070251J460454j906944l779012
34877a717945k015548L39150M88827O7356J152694K016891M28224j823869j604881
34868b669101M43907J212269J19527o79409j37568P58143J256872J348398O23070
$$ plain form
34931 -1229946 -374904 -1719240 -2870734 -1345030 1811427 3600259 2748083 784647
34923 784647 192561 1905034 4215511 4334743 1482851 -2110655 -3818796 -3333189 -2041990
34914 -2041990 -944636 -485844 -1349875 -3651471 -5877846 -6251854 -4885324 -3305331 -2287424
34905 -2287424 -1517928 -985993 -1187293 -2009091 -2683261 -2893219 -2962780 -3018437 -2815173 -2286488
34895 -2286488 -1580044 -725732 249559 1213596 2188048 3069054 3019561 1340994 -819849
34886 -819849 -1295534 9008 833408 286457 437306 2507557 3968011 2061067 -1717945
34877 -1717945 -3733493 -3394343 -2905516 -2838160 -1685466 331425 759649 -1064220 -2669101
34868 -2669101 -2225194 -1012925 -893398 -1572807 -1710375 -952232 304640 1653038 2276108
34859B276108r56536j851829q29002P22639O48204o06666q80388J85164J008204
34850b84102R09782N67079l3991j515895k957799k327636L88445K471447J669312
34841a113358j152678l117229k324720M12214K337679J548483o61783j115697
34833e187089J164705L561791L356864J021739j144547j975381j552051o4042
34825h18011J650288J938099N23009o17025k29908K42040m10506o05916J008008
34816B680078K296835Q07160j696922j704978M40830J486013P66570M26929O92868
34807F195383m76547k822709l317201j088733J086182J176218K48279l79904q30628
34798b09660p60374O10312J791632K18511k918929l238725R1718K602174J423408
$$ plain form
34859 2276108 1319572 -532257 -1361259 -638620 9584 -597082 -1477470 -1292306 -284102
34850 -284102 625680 1192759 1158768 -357127 -3314926 -5642562 -5254117 -2782670 -1113358
34841 -1113358 -2266036 -5383265 -7707985 -7295771 -4958092 -3409609 -4071392 -5187089
34833 -5187089 -4022384 -460593 2896271 3918010 2773463 798082 -753969 -818011
34825 -818011 832277 2770376 3293385 2676360 2446452 2688492 2277986 1672070 2680078
34816 2680078 4976913 5784073 4087151 2382173 2823003 4309016 5075586 5502515 6195383
34807 6195383 5718836 2896127 -421074 -1509807 -423625 752593 1000872 620968 -209660
34798 -209660 -970034 -359722 1431910 1650421 -1268508 -4507233 -4415515 -1813341 -389933
34789c89933n70636j45806J163590P41969j81186O52991J890790R89489j106216
34780C045052j840502j578256k164537k741629j280099J077195J544201O09893
34772c328682J069640K744635K671341N23144o69745J62853M05414j393063k870401
34763f84864j902876j694N34905K19226P43295J702963J394907k04226j333136
34754D68500r18575K08413M43813q21000k330701j996890M82444K595882K037720
34745A69606R5250k26611R31154M73166k042881k713313O99027M316786L123827
34736D826011j625376l935093j348848K239910K638385O56904m11459O0648Q2308
34727C183390j046268j722890j021938k95016p56618j184664K37357K628104L070167
$$ plain form
34789 -389933 -960569 -1106375 57215 799184 617998 1270989 3161779 4151268 3045052
34780 3045052 1204550 -373706 -2538243 -5279872 -6559971 -5482776 -3938575 -3328682
34772 -3328682 -2259042 485593 3156934 3680078 3010333 3173186 3578600 2185537 -684864
34763 -684864 -2587740 -2589434 -2054529 -1835303 -1092008 610955 2005862 1801636 468500
34754 468500 -450075 -241662 202151 -618849 -2949550 -4946440 -4463996 -1868114 169606
34745 169606 264856 38245 969399 1442565 -600316 -3313629 -2614602 1702184 4826011
34736 4826011 3200635 -734458 -2083306 156604 2794989 3451893 3040434 3101082 3183390
34727 3183390 2137122 414232 -607706 -902722 -1659340 -2844004 -2606647 21457 3091624
34718C091624P41465j628803j458648K01508N69982o66423j321214m50103M06067
34709e14545J54676j02033N51708Q28627n01716j840000o61281K372261L644770
34700C932467J292252k295273l549916j859181N14075J624995J499752R43139
34692B102310K51763l46123p2243J437983K896067K361407j51430k152503j616715
34683D710516L80625J199946K54279o08737l56076l86428j940865l585726k974647
34674c307113k52835K039836K171855Q05668n37241j110266q22661J39719J019437
34665A46399Q34028l65245j296306r82722J38630R90653J041823L71548o67363
34656B11445j380470j099982j89504R5323n69628p51276P07736K527527K311701
$$ plain form
34718 3091624 3833089 2204286 745638 947146 1517128 850705 -470509 -920612 -514545
34709 -514545 -359869 -461902 89806 918433 416717 -1423283 -2084564 287697 3932467
34700 3932467 5224719 2929446 -620470 -2479651 -1965576 -340581 1159171 2102310
34692 2102310 2354073 2007950 1935707 3373690 6269757 8631164 8479734 6327231 4710516
34683 4710516 5091141 6291087 6545366 5936629 5580553 5194125 3253260 -332466 -3307113
34674 -3307113 -3559948 -1520112 651743 1457411 920170 -190096 -1012757 -873038 146399
34665 146399 980427 615182 -681124 -1663846 -1525216 -534563 507260 878808 211445
34656 211445 -1169025 -2269007 -2458511 -2363188 -2932816 -3684092 -2976356 -448829 1862872
34647A862872r5403k046662j373745Q78091J844261L90742j653058j795458K54326
34638a734034K387837K525801P63859j116459j863951j802777j692654j469131
34630d001509o86300M44100J263489J566637J541896J124289K32493n92923p00398
34621A91774l39810k44859l59265n0496N09864M67156j40269l56064q4775k28204
34611f34948n48831N80118L115199M084137J416634k491995l578393j577367J02610
34602D67164l26683r37791P8934J413283J098384j71116k93350Q65887J378804
34593C573516J00384j934227k853864j736635O78334K369455J695642n65833j621855
34584b95083p6713J947167J502071j061529k489941j056709J265193J664150Q2266
$$ plain form
34647 1862872 1767469 -279193 -1652938 -774847 1069414 1460156 -192902 -1988360 -1734034
34638 -1734034 653803 3179604 3943463 2827004 963053 -839724 -2532378 -4001509
34630 -4001509 -4687809 -4243709 -2980220 -1413583 128313 1252602 1485095 892172 191774
34621 191774 -148036 -392895 -752160 -802656 -292792 174364 34095 -321969 -406744 -634948
34611 -634948 -1183779 -603661 2511538 6595675 8012309 5520314 1941921 364554 467164
34602 467164 140481 -797310 -718376 694907 1793291 1622175 1328825 2194712 3573516
34593 3573516 3673900 1739673 -1114191 -2850826 -2172492 196963 1892605 1326772 -295083
34584 -295083 -371796 1575371 3077442 2015913 -474028 -1530737 -265544 1398606 1480872
34575A480872j112278l55441J243342J353552o71900k745408k296714N26326K812515
34566B34866K454161O38178k16253J18393q042j079915j776719j351010o38337
34557a624678l42822j69895j46927q77414j753909r79695J427313K642077P89996
34548a035954j909993j873742J038496L626801L655428J911159J98054o54789
34540D955460n85490J29440O12000k6744j435667k325797k136513j439413p32013
34531b984737O3503Q62160J236560J067151N62143j58782o76158p3026J671303
34522A570117K795196J825192j50612j113565j222599j904407k546016j255326
34514b002020J178184J723626J74084j03153K039952K997434K14645l167462l016456
$$ plain form
34575 1480872 368594 13153 1256495 2610047 1938147 -807261 -3103975 -2577649 234866
34566 234866 2689027 3327205 3110952 3229345 3221303 2141388 364669 -986341 -1624678
34557 -1624678 -1967500 -2137395 -2284322 -3161736 -4915645 -5895340 -4468027 -1825950 -1035954
34548 -1035954 -2945947 -4819689 -3781193 -154392 3501036 5412195 5610249 4955460
34540 4955460 4369970 4499410 5111410 5084666 3648999 1323202 -813311 -2252724 -2984737
34531 -2984737 -2921234 -2059074 -822514 244637 806780 647998 -28160 -101186 1570117
34522 1570117 4365313 6190505 6039893 4926328 3703729 1799322 -746694 -2002020
34514 -2002020 -823836 899790 1073874 970721 3010673 6008107 6222752 3055290 38834
34505C8834n62674J91175p75186j83532K156256K713542K93301j851430j209729
34496H10557M84789O57296l19617p74717p83968j386268k288464k260180r91139
34487f851711O60763J615098J199706k41736j114026j51922J651380K194426J349895
34478C11873R37680J436901J144274o33881k023288j526071l36863j28266m44782
34469a262423j03532M44590J49847m38380K217J252251J767808Q50587o03032
34460B059933j217952l53343J220715J616754j02937k065646j541380R77899K018490
34451B612533K29642j520124p00016J031587Q93964m98542o20698O75133J410992
34442C514471R35138K97315p1574n53429q95598p66245r17788j776866k068220
$$ plain form
34505 38834 -523840 -332665 -1107851 -1291383 864873 3578415 3871716 2020286 810557
34496 810557 1295346 1952642 1633025 858308 74340 -1311928 -3600392 -5860572 -6851711
34487 -6851711 -6190948 -4575850 -3376144 -3617880 -4731906 -4883828 -3232448 -1038022 311873
34478 311873 1249553 2686454 3830728 3196847 1173559 -352512 -689375 -817641 -1262423
34469 -1262423 -1365955 -921365 -771518 -1209898 -1207681 44570 1812378 2662965 2059933
34460 2059933 841981 488638 1709353 3326107 3223170 1157524 -383856 594043 2612533
34451 2612533 2842175 1322051 622035 1653622 2547586 2049044 1428346 2103479 3514471
34442 3514471 4449609 4746924 4675350 4121921 3226323 2460078 1542290 -234576 -2302796
34433b302796r53356L3450l89280o17202Q46474J909073K63038j766771n60783
34424c538153K123196J558715j486557j262229L152613N371894J601527l223164
34416D297842l118024L35393J811338N74654l03467j84046q52443j902210j239591
34407e80554N24792P13568o91752j068991J69133Q34447J40866j39919O74580
34398E76170R10163r6746o17566J95828O46658l15215r79977Q2642J262013N51428
34388B215398r17649o85486Q89689J185019l74451j389461l21725J242697J327772
34379C171803N67830O94069J328103N61463j570275k527660r17941J165091R10547
34370C383030j253267k270511o67128J596211J836553p9605j926516j942252p19130
$$ plain form
34433 -2302796 -3256152 -3222702 -3611982 -4229184 -3382710 -1473637 -1210599 -2977370 -3538153
34424 -3538153 -1414957 143758 -1342799 -2605028 547585 5919479 7521006 4297842
34416 4297842 1179818 1515211 3326549 3901203 3597736 3413690 2561247 659037 -580554
34407 -580554 -55762 657806 -33946 -1102937 -933804 -99357 41509 -98410 576170
34398 576170 1486333 1389587 772021 967849 1614507 1299292 319315 401957 1663970 2215398
34388 2215398 1297749 612263 1501952 2686971 2312520 923059 601334 1844031 3171803
34379 3171803 3739633 4433702 5761805 6323268 4752993 2225333 1307392 2472483 3383030
34370 3383030 2129763 -140748 -807876 788335 2624888 2545283 618767 -1323485 -2042615
34361b042615k08735j077620j596107O4544K711218L007172J31415k444446j547388
34352c002562J119881J593101m20719j551854l39145Q52224J54183r59696n91433
34343c146020O37182J272080J316346J139142K76241r35357o74643J433064K704773
34334D022808R70324j910234k462726k65454K039235K383041Q93551j184846k332864
34325B152835j432057P36936J665571K29987j661678j904053r17548M8416J113964
34316C2373K138592J333175j651406l541250j740177J249529J537086J4522K59574
34307c67982J826652J079057j776052k323707N96632K634578R40652j558486j390728
34298c39384K70976N75834m19478j164091j636371k017268r82957J757763L570296
$$ plain form
34361 -2042615 -2251350 -3328970 -4925077 -4860533 -2149315 857857 989272 -1455174 -3002562
34352 -3002562 -1882681 -289580 -710299 -2262153 -2601298 -1749074 -1594891 -2554587 -3146020
34343 -3146020 -2508838 -1236758 79588 1218730 1494971 559614 -115029 1318035 4022808
34334 4022808 4993132 3082898 620172 354718 2393953 4776994 5670545 4485699 2152835
34325 2152835 720778 1457714 3123285 3353272 1691594 -212459 -1130007 -1081591 32373
34316 32373 2170965 3504140 1852734 -1688516 -3428693 -2179164 -642078 -627556 -367982
34307 -367982 1458670 2537727 761675 -1562032 -965400 1669178 2609830 1051344 -339384
34298 -339384 -68408 507426 87948 -1076143 -2712514 -4729782 -5712739 -3954976 -384680
34289c84680K423814K03458k92349M37270L39197k45619L05974J357574R61677
34280E106316o44381j578003j500687j379014r94218K76817J070810k56084k110774
34271b009218j362779J597834L069636J552875n22704j203521j464633k039579
34263b382089j448452P82466K128144R06033n01784P03078K889905K286932j028085
34254D336148l082204j824035M07407Q94550N5443l28607M2028O08171J517680
34245B626581K623074K378749n3241k591530k547234o09276J29989r28426j041396
34236a2710R59501K135552J8110k916577k579941N09591K100687Q02059k31075
34227G85197J058208K210955N61851k154449k499218o33441L99584k86338n07845
$$ plain form
34289 -384680 2039134 2242592 1950243 2387513 2726710 2481091 2787065 4144639 5106316
34280 5106316 4461935 2883932 1383245 4231 -989987 -713170 357640 101556 -2009218
34271 -2009218 -3371997 -1774163 1295473 2848348 2325644 1122123 -342510 -2382089
34263 -2382089 -3830541 -3048075 -919931 -13898 -515682 187396 3077301 5364233 4336148
34254 4336148 1253944 -570091 -162684 731866 787309 458702 500730 1108901 2626581
34245 2626581 5249655 7628404 7575163 4983633 2436399 1827123 1957112 1028686 -12710
34236 -12710 946791 3082343 3100453 183876 -2396065 -1886474 214213 1016272 785197
34227 785197 1843405 4054360 4616211 2461762 -37456 -670897 -271313 -557651 -1065496
34218a065496Q13152J747475O85903r36145r25669L13553O42971m45459j250523
34209d20238n74790N96800O53694m49683j290306p57550Q56342K286353K407216
34200C307838J178125j87733l71742L62184K58547j446729k940283k088922K85426
34191a643289J348927M13718k68521N03015Q64781n37449j710033o63162P50572
34182i41441j74022j952804j154934J282724J037711k029551k749073J048785
34174e632605M281473K091384k628138l648986m56754K050426J346377j85429
34166b782252j92460O37188J119524J427226J367070j47831k670157l718826j979018
34157f939536Q57260K393190K023286N33556r74987j161647O27308K760673K553531
$$ plain form
34218 -1065496 -252344 1495131 2181034 1244889 319220 632773 1275744 830285 -420238
34209 -420238 -995028 -398228 255466 -194217 -1484523 -2242073 -1385731 900622 3307838
34200 3307838 4485963 4298230 3926488 4288672 4547219 3100490 160207 -1928715 -1643289
34191 -1643289 -294362 119356 -149165 353850 1218631 681182 -1028851 -1692013 -941441
34182 -941441 -1115463 -3068267 -4223201 -2940477 -1902766 -3932317 -6681390 -5632605
34174 -5632605 -1351132 740252 -1887886 -5536872 -5993626 -3943200 -2596823 -2782252
34166 -2782252 -2974712 -2337524 -1218000 209226 1576296 1428465 -1241692 -4960518 -6939536
34157 -6939536 -6082276 -3689086 -1665800 -1132244 -2107231 -3268878 -2641570 119103 2672634
34148B672634q6505k193423j836706n31264k56463l23977P49889K098244J865566
34139B157995O73710R00893K650819L120632P34286k204231k379827K33951K510919
34130H399147K230790N59665J07523J602967L519982M535384M923047N169462
34122C1047967M688071L072347J481193J036722N33339k066321n934378p634244
34114B6224696n750818k910850j944306k285434k045328j570018k216424k974779
34106D526739j624011J077512J726452n52086k357141r26320J784075K113849
34098E769069l0972j527722p60559O36928P56343j42154p96470q68296p76320
34089B259847o52824l13365L09066J182705K124990K535963J866662N27724m38017
$$ plain form
34148 2672634 2586129 392706 -1444000 -1975264 -2231727 -2555704 -1805815 292429 2157995
34139 2157995 2831705 3732598 6383417 9504049 10238335 8034104 5654277 5888228 8399147
34130 8399147 10629937 11189602 11297125 12900092 16420074 20955458 25878505 31047967
34122 31047967 35736038 38808385 40289578 41326300 41859639 39793318 33858940 26224696
34114 26224696 20473878 17563028 15618722 13333288 11287960 9717942 7501518 4526739
34106 4526739 2902728 3980240 5706692 5154606 2797465 1871145 3655220 5769069
34098 5769069 5738097 4210375 3449816 4086744 4843087 4700933 3904463 3036167 2259847
34089 2259847 1607023 1293658 1602724 2785429 4910419 7446382 9313044 9840768 9402751
34080I402751p22761q92987j092279q36292l62558o86714j720670j969316j013509
34071A05665m80644j161760j135102J077263L237067K247480p93366j854599l9090
34062A202914J265477p5392j842511j432677J89265O98217J61178J07429N30118
34053H04018K57036p20880j336691j109878k10741J144331K030930R43795j809633
34044g713l346743j772149R04686J547297K44915n13349J49152R60587J158873
34035f74444J044058M80001o16840r26032N23566J941813R93437j194717j431196
34026A39646N56911K028659J974793K127136K870652K183081k96547j955028j394190
34017H235113m19452m19324m26650l78411k173585n145149m793906N04686N341313
$$ plain form
34080 9402751 8679990 7787003 6694724 5858432 5495874 4809160 3088490 1119174 105665
34071 105665 -374979 -1536739 -2671841 -1594578 1642489 3889969 3096603 1242004 1202914
34062 1202914 2468391 2392999 550488 -882189 -692924 5293 166471 273900 804018
34053 804018 1061054 340174 -996517 -2106395 -2317136 -1172805 858125 1801920 -7713
34044 -7713 -3354456 -5126605 -4221919 -2674622 -2429707 -2943056 -2793904 -1833317 -674444
34035 -674444 369614 849615 232775 -693257 -169691 1772122 2765559 1570842 139646
34026 139646 696557 2725216 4700009 6827145 9697797 11880878 11584331 9629303 8235113
34017 8235113 7815661 7396337 6969687 6591276 4417691 -727458 -5521364 -5016678 324635
34008C24635M092632j097353l808649k449644p41793o06868j08218J601973K365733
33999d27552J039565n59786q59399m36492J21469J156224J941701Q59481j447303
33990A387908k081725j74563J720306J737958J286615J926039K438951J104352
33982I345841j278165k723360k726039j838834k95265J227547J219812m19920
33974B511617j393574j92594J351094Q76117o90743p20239Q15768J456353K31525
33965D245324j146068j177694l95174J15721K12221K62614N10374J024967J269691
33956D921976J55620k125231l081023p88764K684782L278886M80599j848065r20723
33947B758057J452355K286385J852798K321202L631871L523581J202498j422810
$$ plain form
34008 324635 4417267 3319914 -488735 -2938379 -3680172 -4287040 -4395258 -2793285 -427552
33999 -427552 612013 52227 -807172 -1243664 -1122195 34029 1975730 2835211 1387908
33990 1387908 -693817 -868380 851926 2589884 3876499 5802538 8241489 9345841
33982 9345841 8067676 5344316 2618277 779443 484178 1711725 2931537 2511617
33974 2511617 1118043 925449 2276543 3152660 2461917 1741678 2557446 4013799 4245324
33965 4245324 3099256 1921562 1526388 1642109 1854330 2116944 2627318 3652285 4921976
33956 4921976 5077596 2952365 -128658 -917422 1767360 5046246 5526845 3678780 2758057
33947 2758057 4210412 6496797 8349595 10670797 14302668 17826249 19028747 17605937
33939A7605937k378054j717134o33027O8555Q8175o53889j766010k466486k331220
33930E816847j572335n32389N10311J031106N66424m03791o34251L41430J402307
33921F525659J181432j12131r23196m36146K74698k38321j459016j169849J392921
33912E036051L676697K635416q96747k714129p66397J962401J712991p66306j719055
33903H160922n369J909351K371009K608354L686832M577690M658781N149755O083156
33894C9200481M744308o4067m665600m991545k707592k782814n808122p225404
33886A5699645m494066o13716Q63873M26047J02598k75580j567343k566142j761786
33877E813530k41565n7575q81605q99456j08773q9271r97766j299204m07939N35895
$$ plain form
33939 17605937 15227883 13510749 12877722 12946277 13034452 12380563 10614553 8148067 5816847
33930 5816847 4244512 3712123 4222434 5253540 5819964 5416173 4781922 5123352 6525659
33921 6525659 7707091 7594960 6671764 6235618 6510316 6271995 4812979 3643130 5036051
33912 5036051 8712748 11348164 10451417 7737288 6970891 8933292 10646283 9879977 8160922
33903 8160922 8155553 10064904 12435913 15044267 18731099 23308789 27967570 33117325 39200481
33894 39200481 43944789 43880722 39215122 34223577 31515985 28733171 22925049 15699645
33886 15699645 11205579 10591863 11455736 11881783 11984381 11708801 10141458 7575316 5813530
33877 5813530 5571965 5514390 4632785 3733329 3624556 3535285 2537519 1238315 830376 1366271
33867A366271O14064J30506l17572k85829P43917K539177L477730K368989M76691
33858A1113944m3261P13942P87237m22778j428540j148041j39556P30087J050139
33849A1213173M05069j008926j625271m21229R38809L70754q62738R4426K496675
33840A1600742K572524k05638j796222L0842K330133K224187J286421J652826
33832A9695815J734008k48281j794610J69662L600816M250727K538564K451514
33824C2398215M650708N886346N024685M567082N755869O994548Q011119J0953114
33816H4241686J5992022K0192777K2426515K5255748K9947868L3569705L3243811
33809B64870132K9333142K1904503Q506296j0464236k7691174l5283437l3537646
$$ plain form
33867 1366271 1980335 2110841 1793269 1507440 2251357 4790534 8268264 10637253 11113944
33858 11113944 11070683 11784625 12571862 12149084 10720544 9572503 9432947 10163034 11213173
33849 11213173 11618242 10609316 8984045 8562816 9501625 9872379 9009641 9104067 11600742
33840 11600742 14173266 13967628 12171406 12202248 14532381 16756568 18042989 19695815
33832 19695815 21429823 21181542 19386932 19556594 23157410 27408137 29946701 32398215
33824 32398215 37048923 42935269 47959954 52527036 58282905 65277453 73288572 84241686
33816 84241686 100233708 120426485 142853000 168108748 198056616 231626321 264870132
33809 264870132 294203274 316107777 324614073 314149837 286458663 251175226 217637580
33802B17637580k9136555k6085403k2958714j8381730j4261187j2481576j2028907
33795H2303508j1023824r307113p707826o411580n135863l878043k859742k359806
33787C3619711k581058l055508k720685j442218o34195j260640k197578j893730
33779A7834099n72728O83538J750729K594410K033447m01737k697039k920746
33771A8303973k246550k638966l003656j204001J245887Q49325j834583k485129
33763F986300O5494J869891K67048k106345j881153K16997J595672J646385Q72823
33754I533112q62290k683526k209549N55229J730903r27375l822978k504212J520641
33745C29955L157292J257768o62128m08087N63169P79312P53384P89485J21578
$$ plain form
33802 217637580 188501025 162415622 139456908 121075178 106813991 94332415 82303508
33795 82303508 71279684 61972571 54264745 47853165 42717302 38839259 35979517 33619711
33787 33619711 31038653 27983145 25262460 23820242 23186047 21925407 19727829 17834099
33779 17834099 17261371 17944909 19695638 22290048 24323495 23921758 21224719 18303973
33771 18303973 16057423 13418457 10414801 9210800 10456687 11306012 9471429 6986300
33763 6986300 7051794 8921685 9188733 7082388 5201235 5418232 7013904 8660289 9533112
33754 9533112 8670822 5987296 3777747 4332976 6063879 5136504 1313526 -1190686 329955
33745 329955 3487247 4745015 4082887 3674800 4237969 5017281 5770665 6560150 6681728
33736F681728j006082j172732l36552q5027q52527j271553p14946j23416J12790
33727A231683P17726J492977J094170n19564j639418j449307r64245p53715j1030
33718h00723J331109J799902P02772o92554j195620j090715q13628j99108L12718
33709f45847j35131p81983J66658K149970K278474j9186j463130L7851J889414
33700C477090J114556n45680N41848L718818M697761J894155j582032k601555
33692A0714961j600685o76251n96391q86933j150436j121826m84389N13357R68645
33683E680052L60964q46196j786864j841888q42195O47223J391994O47113q10867
33674B599336j502343r32581J92189J081584J346282P11175o88272j793398j426366
$$ plain form
33736 6681728 5675646 4502914 4166362 4081335 3228808 1957255 1242309 1118893 1231683
33727 1231683 1949409 3442386 4536556 4016992 2377574 928267 -35978 -789693 -800723
33718 -800723 530386 2330288 3033060 2340506 1144886 54171 -759457 -958565 -645847
33709 -645847 -780978 -1562961 -1396303 753667 3032141 3012955 1549825 1587676 3477090
33700 3477090 4591646 4045966 4587814 8306632 13004393 14898548 13316516 10714961
33692 10714961 9114276 8438025 7841634 6954701 5804265 4682439 4198050 4711407 5680052
33683 5680052 6041016 5194820 3407956 1566068 723873 1371096 2763090 3410203 2599336
33674 2599336 1096993 164412 356601 1438185 2784467 3495642 2807370 1013972 -412394
33665d12394K02116J502320J196573m46352k013713k145793n12393J851430L216743
33656B438537K573592M54085j625010k311523j270778M24384R78977n3844o71689
33647I36731J071951L603236L158513p97987m073994l221755j41936J044692k34944
33638A344507j220574n21465N25015P53942N55290K88163k58415o38852j01162
33629G26449P27561M92104n47290q11664J0437P14478Q03504Q04326N43707m81932
33619B981680j146944J73527K434476K820744J112389j7070M27261M76120n06674
33610H755509k09419K026151K886605J98061l057688l231797j546298j248827
33602D572297j796327n07254J696287J327165j441481k657142j070520J32762
$$ plain form
33665 -412394 -210278 1292042 2488615 2042263 28550 -2117243 -2629636 -778206 2438537
33656 2438537 5012129 5466214 3841204 1529681 258903 683287 1662264 1608420 936731
33647 936731 2008682 5611918 8770431 7972444 3898450 676695 534759 1579451 1344507
33638 1344507 123933 -397532 127483 881425 1436715 1724878 1466463 827611 726449
33629 726449 1454010 1946114 1398824 587160 597597 1312075 2115579 2919905 3463612 2981680
33619 2981680 1834736 2008263 4442739 7263483 8375872 8358802 8786063 9262183 8755509
33610 8755509 8546090 10572241 13458846 13656907 10599219 7367422 5821124 4572297
33602 4572297 2775970 2268716 3965003 5292168 3850687 1193545 123025 255787
33594B55787p50396j027809J185368L094103J768810p43357p27700J024070O59095
33585D737971k129770l374108j101801J643800J634723J36445K90816J931233
33577C769309K040192l76605k782571k794750j011394O90591J664803J965018
33569C164593J007627j282485k999202k141409L06757J286170j76462j739097
33561b573508j261923L59314R75875K96881j83126N21663J903114K782772K322716
33552E143778P10893p15455p85854j91996o75702k202548k648522j068395O84448
33543a749353R01510N52487J012527J244526j57907j686463q71231J322502J483206
33534B051804r39090k698739j714395K06946P61796M37292P38536J384969J205557
$$ plain form
33594 255787 -494609 -1522418 -337050 2757053 4525863 3782506 3054806 4078876 4737971
33585 4737971 2608201 -765907 -1867708 -223908 1410815 1547260 1838076 3769309
33577 3769309 5809501 5432896 2650325 -144425 -1155819 -465228 1199575 3164593
33569 3164593 4172220 2889735 -109467 -2250876 -1944119 -657949 -834411 -2573508
33561 -2573508 -3835431 -3476117 -2500242 -2203361 -2386487 -1864824 38290 2821062 5143778
33552 5143778 5854671 5139216 4353362 4161366 3485664 1283116 -1365406 -2433801 -1749353
33543 -1749353 -847843 -295356 717171 1961697 1803790 117327 -753904 568598 2051804
33534 2051804 1112714 -1586025 -3300420 -3093474 -2331678 -1894386 -1155850 229119 1434676
33525A434676K80369n46671j120980j486263j036519M32897J735202J630664M12608
33516A735983q24543j601073j796446j039810N08735J674935J650264J020045
33508A328090N43150J8386o71673p76415k33542n06021k118944k827026n95253
33499e839248K647287L074616M60367j371219o9818K075495J790787n95140k093955
33490G9172j272055M05123R73144J53473r28075j175726l96745P25216J271834
33481a64639Q74162k5199o45516n63401o2421J16006m15866j063314q85056m492
33471b839736L83195j55038m67051K75828R50239K72270o83512J04664K015209
33462a43932K150659k34934k248801j571418J42484N0868j472127j767345k24556
$$ plain form
33525 1434676 1715045 1168374 47394 -1438869 -2475388 -2042491 -307289 1323375 1735983
33516 1735983 911440 -689633 -2486079 -3525889 -3017154 -1342219 308045 1328090
33508 1328090 1871240 1889626 1217953 441538 207996 -298025 -2416969 -5243995 -5839248
33499 -5839248 -3191961 -117345 343022 -1028197 -1098015 977480 2768267 2173127 79172
33490 79172 -1192883 -787760 185384 338857 -589218 -1764944 -2161689 -1436473 -164639
33481 -164639 709523 684324 38808 -524593 -587014 -471008 -886874 -1950188 -2835244 -2839736
33471 -2839736 -2456541 -2611579 -3078630 -2802802 -1852563 -1580293 -2263805 -2159141 -143932
33462 -143932 2006727 1771793 -477008 -2048426 -1905942 -1855074 -3327201 -5094546 -5319102
33453e319102J106020J090278R97509J800449K369438J587110L82891O8243O1387
33444D144223q55220j961892j447176M66672J432079L55941j116732j265692n90043
33435h37840k56406o522O41264O03766r84098k221960o50560K257832K243502
33426G88978j297114l526293q73548L510532M087965N40886k657022l002030k139643
33417d567289j484399j6689K402894L385335J804822K05309Q66022J895721K52215
33408D743941l046707m066299j595176J496459K531532J832628P49407n40728
33400B105057k064482k764338j713401L28230J759352K004191J698872J452375
33392B805856J182800N42873m79731j406443j614958r66744n6538L73213J99805
$$ plain form
33453 -5319102 -4213082 -3122804 -2125295 -324846 2044592 3631702 4014593 4082836 4144223
33444 4144223 3289003 1327111 -120065 346607 1778686 2134627 1017895 -247797 -837840
33435 -837840 -1094246 -1100768 -459504 144262 -839836 -3061796 -3712356 -1454524 788978
33426 788978 -508136 -4034429 -4907977 -1397445 2690520 3231406 574384 -2427646 -4567289
33417 -4567289 -6051688 -6068377 -3665483 -280148 1524674 1729983 2596005 4491726 4743941
33408 4743941 1697234 -2369065 -3964241 -2467782 63750 1896378 2645785 2105057
33400 2105057 40575 -2723763 -4437164 -4108934 -2349582 -345391 1353481 2805856
33392 2805856 3988656 4531529 4051798 2645355 1030397 63653 7115 380328 580133
33383E80133o9428J16600Q70075J618051J287617n57387k564289k634188o76708
33374b029524R34888O20904j48050N56664J716860J025627q97223j032114J138704
33365A886736K360810L58280k751182l469991j415257R88436J870664J231161
33357A059657l3418q22762l26580R24826J290261K39474p66327n54858O5752R0284
33347A166309O9547M66129P6456j765243l085963j946887K33594R07103N85579
33338c293376J395031K544663J371230j449718k254857m38471M81556r35308j552670
33329d131920M86727K103809O96005j058505N4124J884716P42883j714666j131151
33320b067978J745550K065955p90251k139694k6872J701450L06533j374486l46289
$$ plain form
33383 580133 510705 627305 1497380 3115431 4403048 3845661 1281372 -1352816 -2029524
33374 -2029524 -1094636 -473732 -621782 -65118 1651742 2677369 1780146 748032 1886736
33365 1886736 4247546 4605826 1854644 -1615347 -3030604 -2042168 -171504 1059657
33357 1059657 1026239 203477 -123103 801723 2091984 2331458 1565131 1010273 1076025 1166309
33347 1166309 1235856 1701985 1778441 13198 -3072765 -5019652 -4786058 -3878955 -3293376
33338 -3293376 -1898345 646318 2017548 567830 -1687027 -2125498 -1643942 -2579250 -4131920
33329 -4131920 -3645193 -1541384 -845379 -1903884 -1849760 34956 777839 -936827 -2067978
33320 -2067978 -322428 1743527 953276 -1186418 -1213290 488160 794693 -579793 -926082
33311i26082J388593P96046q87566r14857p6028o47238j584604l45606J971891
33302a225451J975713j71978p86680J298989K931570J694834r08931k507385k831433
33293e30752k264853m56660J855284K280032J20015j824035r52611J342387J831411
33284A400218O3427j534585j389233l22003M10787O21326N18234N6786n84447
33275g59490q20468l22766O03392J319223J215290J18567j201404j379201O5744
33266a161113J913577K484029J435490j15667r47146p77728k42734j15882l41546
33257B131280K1755J301805K054781P39883j530610j813444M81834K262037R38218
33248F587539j872142k764534j309810l8264l41060q72423j99760J027310J273800
$$ plain form
33311 -926082 462511 1258557 370991 -543866 -619894 -1267132 -2851736 -3197342 -1225451
33302 -1225451 750262 578284 -208396 1090593 4022163 5716997 4808066 2300681 -530752
33293 -530752 -2795605 -3252265 -1396981 883051 1003066 -820969 -1773580 -431193 1400218
33284 1400218 1463645 -70940 -1460173 -1782176 -1371389 -750063 -231829 -175043 -759490
33275 -759490 -1579958 -1902724 -1299332 19891 1235181 1353748 152344 -1226857 -1161113
33266 -1161113 752464 3236493 4671983 4556316 3609170 2831442 2588708 2472826 2131280
33257 2131280 2153035 3454840 5509621 6249504 4718894 2905450 3387284 5649321 6587539
33248 6587539 4715397 1950863 641053 602789 261729 -610694 -810454 216856 1490656
33239A490656K00960j107208j344422k10327J111486R72088p07537k008178j366993
33230b969475L99830J388512J055042K01368n26781o92950L99047K509658L709627
33221E473878K719547J049619O40499N11482j346429l640048l075921L2631J527230
33212C892488k69075j964122o40128J712514J905604N30432n548M4622j071686
33203D135101k562612k026774K35332J395472N48000k25043L60339R02801J46469
33194B909085q12502n22149M47585N93835k31940r16834p30226J19232J032579
33185A888665J361662O64527p22195j724595j669623j033966n88741k37685N72522
33176a489429J518619J455789J36941r67817m09978J135602J625233M27281r65888
$$ plain form
33239 1490656 1691616 584408 -760014 -970341 141145 1113233 405696 -1602482 -2969475
33230 -2969475 -2569645 -1181133 -126091 75277 -451504 -1144454 -745407 1764251 5473878
33221 5473878 8193425 9243044 9883543 10395025 9048596 5408548 2332627 2365258 3892488
33212 3892488 3623413 1659291 1019163 2731677 4637281 5167713 5162165 5206787 4135101
33203 4135101 1572489 -454285 -218953 1176519 1724519 1499476 1859815 2762616 2909085
33194 2909085 2096583 1574434 2022019 2615854 2383914 1467080 736854 856086 1888665
33185 1888665 3250327 3914854 3192659 1468064 -201559 -1235525 -1824266 -2061951 -1489429
33176 -1489429 29190 1484979 1621920 654103 244125 1379727 3004960 3432241 2466353
33167B466353j288752j007524p03855K61449J938597K336336J17609k448243k071946
33158c99976O27990J876414L03043j527528j514414n51063J68272R02518J198787
33149A084043l98862k741641j986821K384491N193734K532948k236930l406697
33141D24265r19299J104362J404692J833772K057290j73854l580093l767264q9170
33132a705299K773183J662013q87812j285485K0812M61574m93908j473747j532040
33123b460709n41170J120732K115874J148543p76907j174265J70694P50774m89002
33114a35436j364576k54957J107379O43608o43235n86254N33705O76924o38192
33105f61034j678346p72904J827870L983368L367228J07033k567827j989761J40343
$$ plain form
33167 2466353 1177601 170077 -533778 -272329 1666268 4002604 4120213 1671970 -399976
33158 -399976 228014 2104428 2407471 879943 -634471 -1185534 -1017262 -114744 1084043
33149 1084043 685181 -2056460 -4043281 -1658790 3534944 6067892 3830962 424265
33141 424265 -495034 609328 2014020 3847792 5905082 5731228 2151135 -1616129 -1705299
33132 -1705299 1067884 2729897 1842085 556600 577412 1038986 545078 -928669 -2460709
33123 -2460709 -3001879 -1881147 234727 1383270 606363 -567902 -397208 353566 -135436
33114 -135436 -1500012 -1754969 -647590 -3982 -647217 -1233471 -699766 -22842 -661034
33105 -661034 -2339380 -3112284 -1284414 2698954 6066182 6173215 3605388 1615627 1755970
33096A755970J20434k011519k611810n36742J074472L54169l29588Q23672J513719
$$ plain form
33096 1755970 1876404 -135115 -2746925 -3283667 -2209195 -1855026 -2184614 -1360942 152777
$$ [...]
##END NTUPLES=NMR SPECTRUM
##END=
