##TITLE=31Pdec_LR-736-RC-RM2
 , 24 sc
 5.04.2021
##JCAMPDX= 6.0         $$ Bruker NMR JCAMP-DX V2.0
##DATA TYPE= NMR SPECTRUM
##DATA CLASS= NTUPLES
##ORIGIN= UXNMR, Bruker Analytische Messtechnik GmbH
##OWNER= root
$$ XWIN-NMR		Version 3.5
$$ Mon Apr  5 12:53:28 2021 Russian Standard Time (UT+4h)  she@DPX200
##.OBSERVE FREQUENCY= 81.013821
##.OBSERVE NUCLEUS= ^31P
##.ACQUISITION MODE= SIMULTANEOUS
##.ACQUISITION SCHEME= undefined
##.AVERAGES= 24
##.DIGITISER RES= 16
##SPECTROMETER/DATA SYSTEM= spect
##.PULSE SEQUENCE= zgpg30
##.SOLVENT NAME= DMSO
##.SHIFT REFERENCE= (INTERNAL, DMSO, 0, 248.564)
##AUDIT TRAIL= $$ (NUMBER, WHEN, WHO, WHERE, WHAT)
$$ ##TITLE= Audit trail, XWIN-NMR		Version 3.5
$$ ##JCAMPDX= 5.01
$$ ##ORIGIN= Bruker BioSpin GmbH
$$ ##OWNER= she
$$ F:/spectra/data/she/nmr/P31/1/pdata/1/auditp.txt
$$ ##AUDIT TRAIL=  $$ (NUMBER, WHEN, WHO, WHERE, WHAT)
(   1,<2021-04-05 12:52:16.29 +0400>,<she>,<DPX200>,
      <created by zg, POWCHK disabled, PULCHK disabled
       configuration hash MD5:
       00 E9 B6 7A A2 85 ED C7 34 08 36 98 17 FE 4E 26
       data hash MD5: 32K
       40 9F 64 19 12 49 53 DC E3 48 BB E0 3C 31 AC D8>)
(   2,<2021-04-05 12:52:22.51 +0400>,<she>,<DPX200>,
      <Start of raw data processing
       efp BC_mod = 2 LB = 1 FT_mod = 6 PKNL = 1 PHC0 = -4421.521 PHC1 = 68.20113 SI = 64K 
       data hash MD5: 64K
       8F 09 2A 47 93 35 9E 2E 38 2D F7 13 D8 C7 70 C3>)
(   3,<2021-04-05 12:52:44.50 +0400>,<she>,<DPX200>,
      <pk PHC0 = -152.6697 PHC1 = 361.0002 
       data hash MD5: 64K
       63 5C 26 FF 5C AF 02 BD 97 7B 7F D4 DE 5E 0F 8C>)
(   4,<2021-04-05 12:52:54.35 +0400>,<she>,<DPX200>,
      <abs ABSG = 5 
       data hash MD5: 64K
       79 21 BC 02 BE 2B B5 D8 58 57 2B CC 82 1A 22 1C>)
$$ ##END=
$$ 
$$ hash MD5
$$ 8F 0C DD F4 68 E2 59 93 F2 93 4B 31 47 4C A4 89
##$RELAX= 
##$RELAX= 
##$RELAX= 
##$RELAX= 
##$RELAX= 
##$RELAX= 
##$RELAX= 
##$RELAX= 
$$ Bruker specific parameters
$$ --------------------------
##$DU= <F:/spectra>
##$EXPNO= 1
##$NAME= <P31>
##$PROCNO= 1
##$TYPE= <nmr>
##$USER= <she>
##$AMP= (0..31)
100 100 100 100 100 100 100 100 100 100 100 100 100 100 100 100 100 100 
100 100 100 100 100 100 100 100 100 100 100 100 100 100 
##$AQSEQ= 0
##$AQ_mod= 1
##$AUNM= <au_zg>
##$AUTOPOS= <>
##$BF1= 81.014009
##$BF2= 200.13
##$BF3= 200.13
##$BF4= 200.13
##$BF5= 200.13
##$BF6= 200.13
##$BF7= 200.13
##$BF8= 200.13
##$BYTORDA= 1
##$CFDGTYP= 0
##$CFRGTYP= 5
##$CHEMSTR= <none>
##$CNST= (0..31)
1 1 145 1 1 1 1 1 1 1 1 1 1 1 1 1 1 1 1 1 1 1 1 1 1 1 1 1 1 1 1 1 
##$CPDPRG= <waltz16>
##$CPDPRG1= <>
##$CPDPRG2= <waltz16>
##$CPDPRG3= <>
##$CPDPRG4= <mlev>
##$CPDPRG5= <mlev>
##$CPDPRG6= <mlev>
##$CPDPRG7= <mlev>
##$CPDPRG8= <mlev>
##$CPDPRGB= <>
##$CPDPRGT= <>
##$D= (0..31)
0 1 0 0 0 0 0 0 0 0 0 0.03 2e-05 3e-06 0 0 0 0 0 0 0 0 0 0 0 0 0 0 0 0 
0 0 
##$DATE= 1617612735
##$DBL= (0..7)
120 120 120 11 120 120 24 19 
##$DBP= (0..7)
150 150 150 150 150 150 150 150 
##$DBP07= 0
##$DBPNAM0= <>
##$DBPNAM1= <>
##$DBPNAM2= <>
$$ [...]
##$SUBNAM3= <"">
##$SUBNAM4= <"">
##$SUBNAM5= <"">
##$SUBNAM6= <"">
##$SUBNAM7= <"">
##$SUBNAM8= <"">
##$SUBNAM9= <"">
##$SW= 501.771253377433
##$SWIBOX= (0..15)
0 1 3 0 0 0 0 0 0 0 0 0 0 0 0 0 
##$SW_h= 40650.406504065
##$TD= 32768
##$TD0= 1
##$TE= 0
##$TE2= 300
##$TE3= 300
##$TEG= 300
##$TL= (0..7)
0 120 53 12 22 120 120 120 
##$TP= (0..7)
150 150 150 150 150 150 150 150 
##$TP07= 0
##$TPNAME0= <>
##$TPNAME1= <>
##$TPNAME2= <>
##$TPNAME3= <>
##$TPNAME4= <>
##$TPNAME5= <>
##$TPNAME6= <>
##$TPNAME7= <>
##$TPOAL= (0..7)
0.5 0.5 0.5 0.5 0.5 0.5 0.5 0.5 
##$TPOFFS= (0..7)
0 0 0 0 0 0 0 0 
##$TUNHIN= 0
##$TUNHOUT= 0
##$TUNXOUT= 0
##$USERA1= <user>
##$USERA2= <user>
##$USERA3= <user>
##$USERA4= <user>
##$USERA5= <user>
##$V9= 5
##$VALIST= <valist>
##$VCLIST= <CCCCCCCCCCCCCCC>
##$VD= 0
##$VDLIST= <DDDDDDDDDDDDDDD>
##$VPLIST= <PPPPPPPPPPPPPPP>
##$VTLIST= <TTTTTTTTTTTTTTT>
##$WBST= 1024
##$WBSW= 4
##$XGAIN= (0..3)
0 0 0 0 
##$XL= 0
##$YL= 0
##$YMAX_a= 21370
##$YMIN_a= -23611
##$ZGOPTNS= <>
##$ZL1= 120
##$ZL2= 120
##$ZL3= 120
##$ZL4= 120
##$ABSF1= 248.5645
##$ABSF2= -253.2056
##$ABSG= 5
##$ABSL= 3
##$ALPHA= 0
##$AQORDER= 0
##$ASSFAC= 0
##$ASSFACI= 0
##$ASSFACX= 0
##$ASSWID= 0
##$AUNMP= <proc_1d>
##$AZFE= 0.1
##$AZFW= 0.5
##$BCFW= 0
##$BC_mod= 2
##$BYTORDP= 0
##$COROFFS= 0
##$CY= -3
##$DATMOD= 1
##$DC= 0
##$DFILT= <>
##$DTYPP= 0
##$F1P= 0
##$F2P= 0
##$FCOR= 1
##$FTSIZE= 65536
##$FT_mod= 6
##$GAMMA= 0
##$GB= 0
##$INTBC= 1
##$INTSCL= 5.30512e-09
##$ISEN= 30
##$LB= 1
##$LEV0= 0
##$LPBIN= 0
##$MAXI= 10000
##$MC2= 0
##$MEAN= 0
##$ME_mod= 0
##$MI= 50
##$NCOEF= 0
##$NC_proc= -6
##$NLEV= 6
##$NOISF1= 182.463
##$NOISF2= 159.3651
##$NSP= 0
##$NTH_PI= 0
##$NZP= 0
##$OFFSET= 248.5645
##$PC= 4
##$PHC0= -4574.191
##$PHC1= 429.2014
##$PH_mod= 1
##$PKNL= yes
##$PPARMOD= 0
##$PSCAL= 0
##$PSIGN= 0
##$REVERSE= no
##$SF= 81.014009
##$SI= 65536
##$SIGF1= 159.3651
##$SIGF2= -187.1042
##$SINO= 113.3802
##$SIOLD= 16384
##$SREGLST= <1H.CDCl3>
##$SSB= 0
##$STSI= 65536
##$STSR= 0
##$SW_p= 40650.406504065
##$SYMM= 0
##$S_DEV= 0
##$TDeff= 32768
##$TDoff= 0
##$TI= <>
##$TILT= no
##$TM1= 0
##$TM2= 0
##$TOPLEV= 0
##$USERP1= <user>
##$USERP2= <user>
##$USERP3= <user>
##$USERP4= <user>
##$USERP5= <user>
##$WDW= 1
##$XDIM= 65536
##$YMAX_p= 310387432
##$YMIN_p= -52130156
$$ End of Bruker specific parameters
$$ ---------------------------------
##NTUPLES= NMR SPECTRUM
##VAR_NAME=  FREQUENCY,     SPECTRUM/REAL,   SPECTRUM/IMAG
##SYMBOL=    X,             R,               I
##VAR_TYPE=  INDEPENDENT,   DEPENDENT,       DEPENDENT
##VAR_FORM=  AFFN,          ASDF,            ASDF
##VAR_DIM=   65536,         65536,           65536
##UNITS=     HZ,            ARBITRARY UNITS, ARBITRARY UNITS
##FACTOR=    0.620285442955139, 1,           1
##FIRST=     20137.2065510759, 0,            0
##LAST=      -20513.1999529892, 0,           0
##MIN=       -20513.1999529892, -52130156,   0
##MAX=       20137.2065510759, 310387432,    0
$$ Real data points
##PAGE= N=1
##DATA TABLE= (X++(R..R)), XYDATA
$$ [...]
##PAGE= N=2
##DATA TABLE= (X++(I..I)), XYDATA
13112D007607j879492l371559k254295J005927K826756J813846L66123K95361
13104B810274L12742q93647k149925k047322j289987j028431p42366M42662J740519
13095b845481J714148M36408o85486o47456M79963J934588K552979J408908j000903
13086C347668k731304k307798l77589J094646J048224K73147J51861P97413Q75072
13077B171340m48788j915998j597748K22677J176639K83547n88915Q1061P78979
13068A62794m45822k200493j418470J697378L333565J197250k333771l267273
13060c274842p53711K257076K424270n26163l525361l373089l08045K349419K344192
13051b386254Q63312L4220o4578l39417m66239P3289K51548p62049j465121k91315
$$ plain form
13112 4007607 2128115 -1243444 -3497739 -2491812 334944 2148790 2514913 2810274
13104 2810274 3123016 2229369 79444 -1967878 -3257865 -4286296 -5028662 -4586000 -2845481
13095 -2845481 -1131333 -694925 -1380411 -2027867 -1547904 386684 2939663 4348571 3347668
13086 3347668 616364 -1691434 -2069023 -974377 73847 346994 498855 1296268 2171340
13077 2171340 1722552 -193446 -1791194 -1568517 -391878 -108331 -697246 -616185 162794
13068 162794 -283028 -2483521 -3901991 -2204613 1128952 2326202 -7569 -3274842
13060 -3274842 -4028553 -1771477 652793 126630 -3398731 -6771820 -7079865 -4730446 -2386254
13051 -2386254 -1522942 -1488722 -1553300 -1892717 -2358956 -2285667 -2034119 -2796168 -4261289 -4552604
13041d552604J290224R50148m10458j26181J626088K356976J665270J174987P05747
13032D680197j062524k444761l31996L740740M491887R15889k103109j788106
13024F098217j181999k403525k434563M73273K086029q98061m201542k303172
13016d765343K528482M062128J869902L11403L4656j909181m416485k710920K836911
13007b158447N582306K388829j794634j924668J58526K73870j234382j392072
12999a00672j19021L89074q6048J40044J273176J701988O98420o59409j164426
12990B073126p41223j04607J79731L88121J210370K155767J411770j306100l135240
12981B131715j760717N20414j24024k729628k669590P58872K826357Q01464j968818
$$ plain form
13041 -4552604 -3262380 -2312232 -2722690 -2848871 -1222783 1134193 2799463 3974450 4680197
13032 4680197 3617673 1172912 840916 4581656 9073543 9989432 7886323 6098217
13024 6098217 4916218 2512693 78130 551403 2637432 1739371 -2462171 -4765343
13016 -4765343 -2236861 1825267 3695169 4006572 4041228 2132047 -2284438 -4995358 -2158447
13007 -2158447 3423859 5812688 4018054 2093386 2251912 2525782 1291400 -100672
12999 -100672 -219693 169381 83333 223377 1496553 3198541 3896961 3237552 2073126
12990 2073126 1331903 1227296 1407027 1795148 3005518 5161285 6573055 5266955 2131715
12981 2131715 370998 891412 767388 -1962240 -4631830 -3872958 -1046601 -245137 -2213955
12972b213955j792422m0391K66435n52447p60351q38223j536687j222437J039883
12963g650595K517057R84517p67660Q14174L631393L039098k50544j186847J212623
12954B343216K400953l7790k762134k440606m96357K17338j97357n5047Q99684
12945a28100J895028K345909J330505j704422m625734l947136N1552K636207J002233
12936a143958j724974j415524R83097J582270l12195j898794j634690o81901J57899
12927f088770J593132L317299L151038J26089l305731l750032r05166K119345
12919c742796K525944R68717K92866J477652K195954K61512k770731l416190j175402
12910c382474Q30667N13935m49314K32061J833783K068012O60035o07028o18045
$$ plain form
12972 -2213955 -4006377 -4046768 -3780333 -4332780 -5093131 -5931354 -7468041 -8690478 -7650595
12963 -7650595 -5133538 -4149021 -4916681 -4102507 -471114 2567984 2317440 1130593 2343216
12954 2343216 4744169 4706379 1944245 -496361 -992718 -775380 -972737 -1027784 -128100
12945 -128100 1766928 4112837 5443342 3738920 -886814 -4833950 -4782398 -2146191 -1143958
12936 -1143958 -2868932 -4284456 -3301359 -1719089 -2031284 -3930078 -5564768 -6246669 -6088770
12927 -6088770 -4495638 -1178339 1972699 2098788 -1206943 -4956975 -5862141 -3742796
12919 -3742796 -1216852 -248135 44731 1522383 3718337 3979849 1209118 -2207072 -3382474
12910 -3382474 -2551807 -2037872 -2487186 -2255125 -421342 1646670 2306705 1699677 1081632
12901A081632R0805O13144N21777j78905q66068n94943M93904Q44243m27112k017986
12891d39509k190441j109628j09426M57486J059422J411012Q22774k38568n98117
12882i34995k23158j11862m36397l45923K59707L01111o12221j136112Q1047K257613
12872i01190L050594J378777j022621j627507n23133m15209k457535l746268j130004
12863g394096L560983N234900K455645q27326j305522m09221o01391j185117o07407
12854a078552J16377l60390o13658P66958J651316j88363k188621n03871K998983
12845F00179K881669j093064l287598j111104J315386M50340j259054m56328J352540
12836f07034J132488j98794J5293J090601N43190j050431j042119M33976O64706
$$ plain form
12901 1081632 1172437 1785581 2307358 2128453 1262385 667442 1161346 2005589 1578477 -439509
12891 -439509 -2629950 -3739578 -3849004 -3391518 -2332096 -921084 -98310 -336878 -934995
12882 -934995 -1158153 -1270015 -1706412 -2052335 -1792628 -1491517 -2103738 -3239850 -3158803 -901190
12872 -901190 2149404 3528181 2505560 878053 354920 -60289 -2517824 -6264092 -7394096
12863 -7394096 -3833113 1401787 3857432 3030106 1724584 1315363 713972 -471145 -1078552
12854 -1078552 -962175 -1322565 -1936223 -1169265 482051 293688 -1894933 -2398804 600179
12845 600179 3481848 2388784 -898814 -2009918 -694532 -244192 -1503246 -1959574 -607034
12836 -607034 525454 326660 341953 1432554 1975744 925313 -116806 317170 981876
12827I81876r15809j888652r09609N97058J226407J260134J003102M8100j045128
12818C57479o84080J170203K360608J523557o9081p85467j020213j772891k235625
12809a155510q57236J677748K605100P15796j682501j592923O50931J749401k1228
12800B089578k285086j866139N54658J319136p87066k629749j383967J287375
12792c701260J939155N67371J33819J462501J926447o8076k232062j755661N59374
12783a168392J681327O02219j001654j693682j645176j203027k07715Q74527R71562
12774b790011J82906q3565N73142Q07158r623n04869J30171L20964j063263j975484
12764d412474k00952K347139K012747o13077j291191J063915K724786J538123
$$ plain form
12827 981876 66067 -1822585 -2732194 -2135136 -908729 351405 1354507 1402607 357479
12818 357479 -326601 843602 3204210 4727767 4658686 3873219 2853006 1080115 -1155510
12809 -1155510 -2012746 -334998 2270102 2985898 1303397 -289526 361405 2110806 2089578
12800 2089578 -195508 -2061647 -1506989 -187853 -974919 -3604668 -4988635 -3701260
12792 -3701260 -1762105 -1194734 -1060915 401586 2328033 2259957 27895 -1727766 -1168392
12783 -1168392 512935 1115154 113500 -1580182 -3225358 -4428385 -4636100 -3761573 -2790011
12774 -2790011 -2607105 -2690670 -2117528 -1310370 -1319993 -1824862 -1694691 -1373727 -2436990 -4412474
12764 -4412474 -4613426 -2266287 -253540 -866617 -2157808 -1093893 1630893 3169016
12756C169016L14727J431539K452184O46859j899403j978121r24812j708016k878877
12747a374904j025912K354288K553414l22967j316930R07734J911040n75533k698667
12738D11563j295737Q52676K95077j267429p86786L44761p93848k714379j616009
12729f570111K089063M113822K591514o9606j498260j888447j917450j274187
12721d423662m7393O54468K35322o12918r50048m88317L23184N05249l62690q81700
12711f048505O65119K958580K403019j321720l557431j054536K965312L668484
12703F78322J819816J524235K670344J252572l025256n154358k300255J763653
12695g70927K055028j176819l910556l810052j783928L23090J431931J354784
$$ plain form
12756 3169016 3483743 4915282 7367466 8014325 6114922 4136801 3211989 1503973 -1374904
12747 -1374904 -2400816 -46528 2506886 2183919 866989 1774723 3685763 3110230 411563
12738 411563 -884174 -31498 263579 -1003850 -1790636 -1445875 -2239723 -4954102 -6570111
12729 -6570111 -4481048 -367226 2224288 2154682 656422 -1232025 -3149475 -4423662
12721 -4423662 -4471055 -3816587 -3581265 -4194183 -5144231 -5632548 -5309364 -4804115 -5166805 -6048505
12711 -6048505 -5383386 -2424806 -21787 -1343507 -4900938 -5955474 -2990162 678322
12703 678322 2498138 4022373 6692717 7945289 4920033 -234325 -2534580 -770927
12695 -770927 1284101 107282 -3803274 -7613326 -9397254 -9074164 -7642233 -6287449
12687f287449O33781k4192n00205q32422l52893J368104K978819K588072O07405
12678A79020n79946m4423N85247n6335j079689r96063J74957J283529J425567
12669H91864M55681r15889j438901p19405j419l68088q54331k8954J358505J530068
12659i0869P63378O27505O57696r22103l132115k630085Q58377L130326J379808
12650F41918j586956j449013J578014L463107J859916j469001l270513k278078
12642b510606j53633N20232n18567n29319K301237N144796L580043j699803m777593
12633A356787k296531K006454K627537o22984l445113k955403j55112K241581
12625a242784K278077q940k271368j880909O15069J767531R9766j640749q45001
$$ plain form
12687 -6287449 -5653668 -5677860 -6178065 -7010487 -7363380 -5995276 -3016457 -428385 179020
12678 179020 -400926 -445349 139898 83563 -996126 -1992189 -1817232 -533703 891864
12669 891864 1347545 431656 -1007245 -1726650 -1728069 -2096157 -2950488 -2979442 -1620937 -90869
12659 -90869 672509 1300014 1957710 1035607 -2096508 -4726593 -3868216 -737890 641918
12650 641918 -945038 -2394051 -816037 2647070 4506986 3037985 -232528 -2510606
12642 -2510606 -2664239 -2144007 -2662574 -3191893 -890656 4254140 7834183 6134380 1356787
12633 1356787 -939744 1066710 3694247 3071263 -373850 -3329253 -3484365 -1242784
12625 -1242784 1035293 1026353 -1245015 -3125924 -2510855 -743324 -643558 -2284307 -3129308
12616c129308R83777J245758Q19415K099632M054396L254230n42195l542970l147828
12607B094907r53354L49338M98693P28768J142457O72037j017525k752722l020397
12598b257798j548079M22532J514959J591741J275666O30538m77374j107945k11723
12589a67483J122761O65828j275045j782385J35492J777605J033810m79567o73927
12580C57089m88765j346061j718599K88198K854068K646340j19514k264986k281733
12571b073963j109070O01109K473301K663026k9552k934983k359576P14859J882542
12562a72307J36152j026658J99492J256390J42823j201644m75588J417013K410389
12553B686062K047971N49577k035997m188029l429738j97868J807461Q88114k58340
$$ plain form
12616 -3129308 -2145531 -899773 -80358 2019274 6073670 9327900 8785705 5242735 2094907
12607 2094907 1141553 1490891 1989584 2718352 3860809 4532846 3515321 762599 -2257798
12598 -2257798 -3805877 -3383345 -1868386 -276645 999021 1629559 1152185 44240 -167483
12589 -167483 955278 1621106 346061 -1436324 -1300832 476773 1510583 1031016 357089
12580 357089 -131676 -1477737 -3196336 -2908138 -54070 2592270 2472756 207770 -2073963
12571 -2073963 -3183033 -2581924 -108623 2554403 2524851 -410132 -2769708 -2054849 -172307
12562 -172307 -36155 -1062813 -863321 393069 535892 -665752 -1141340 275673 2686062
12553 2686062 4734033 5283610 3247613 -940416 -4370154 -4568022 -2760561 -1872447 -2130787
12544b130787O20061J678557Q40545k56805L46779Q16782j023513k786355r16619
12535b811355K782844L257564Q6279k021930q34907M94112n83701j912664r04527
12526b448285R72490J015404k02905l55060N09186N55999k17950o5102J123225
12517H87002J269294o30162k791868k951861j020968J194755J971360R59223o89131
12508a802356j222779m7089J392413J338537J87413p7712J027976J704013P87543
12499C287959l96512l87663n3706p72257j559844n88868J206793J032015j232486
12490E35431k451818r65128J028066J175242L35269L05386O26423J28903l22450
12481C95324N01112J252029j17248k417329k428284J74197K198630J528423m51123
$$ plain form
12544 -2130787 -1510726 167831 1008376 751571 1098350 1915132 891619 -1894736 -2811355
12535 -2811355 -28511 3229053 3315332 1293402 458495 952607 368906 -1543758 -2448285
12526 -2448285 -1475795 -460391 -663296 -1018356 -509170 46829 -171121 -236223 887002
12517 887002 2156296 1526134 -1265734 -4217595 -5238563 -4043808 -2072448 -1113225 -1802356
12508 -1802356 -3025135 -3072224 -1679811 -341274 -153861 -231573 796403 2500416 3287959
12499 3287959 2891447 2503784 2450078 1677821 117977 -470891 735902 1767917 535431
12490 535431 -1916387 -2881515 -1853449 -678207 -342938 -37552 588871 717774 395324
12481 395324 896436 2148465 2031217 -386112 -2814396 -2640199 -441569 1086854 635731
12472F35731j575717j540596j041426m49869j92284o68301j188162o40532N31790
12463f129366Q94328O06654J121048K129532J614728m14935j277400Q3615J187732
12454a84064J91245r27475K06694K182655J972966l72505k157152k135746j433192
12445b656574r65989m60566J60160M95750O92013J097185J165611K40630r36701
12436a168481j025311n9686P57452Q21621L77930l99024j142717p58499J198955
12427a397760L065864K681222K54331j877201k176192j210469k22194K53145L62356
12418b66898N39138J007008J124492p551j684630j791141N424J048561m68237
12409d93834k306789j473069Q75325J233601m53206p79033J277370K624882J316967
$$ plain form
12472 635731 -939986 -2480582 -3522008 -3971877 -4164161 -4832462 -6020624 -6661156 -6129366
12463 -6129366 -5235038 -4628384 -3507336 -1377804 236924 -178011 -1455411 -1371796 -184064
12454 -184064 7181 -920294 -713600 1469055 3442021 3069516 912364 -1223382 -2656574
12445 -2656574 -3622563 -4083129 -3922969 -3427219 -2735206 -1638021 -472410 -231780 -1168481
12436 -1168481 -2193792 -2253478 -1496026 -674405 -296475 -695499 -1838216 -2596715 -1397760
12427 -1397760 1668104 4349326 4603657 2726456 550264 -660205 -882399 -629254 -266898
12418 -266898 272240 1279248 2403740 2396189 711559 -1079582 -1074158 -25597 -493834
12409 -493834 -2800623 -4273692 -3398367 -2164766 -2617972 -3397005 -2119635 505247 1822214
12400A822214k74257L75271J714659Q25386j731682k725593r02764J706416K755953
12391C565603J883932J66728j160754j382683p99556n46165j183145j786368j205091
12382b447499K17468J109723R00315J55560o79158j647785k211181j096108J836082
12373c862583M277442L456071k82265l113015k007822J397926K779896P25678
12365C371328j695549j561043k0906J50043q78627n77220J484864K668877J196454
12356D138221j318795k271732j286977O3600N04358p5452j093620j606000p73961
12347c720358J124813K511137K014204K5161j645847j579496o5310J296874J275235
12338A236413J92269q39243j552724k399935k824850j378193J615862L290933
$$ plain form
12400 1822214 1547957 1923228 3637887 4463273 2731591 5998 -896766 809650 3565603
12391 3565603 5449535 5616263 4455509 3072826 2273270 1727105 543960 -1242408 -2447499
12382 -2447499 -2230031 -1120308 -219993 -64433 -743591 -2391376 -4602557 -5698665 -3862583
12373 -3862583 414859 3870930 3588665 475650 -1532172 -134246 2645650 3371328
12365 3371328 1675779 114736 93830 243873 -634754 -1211974 272890 2941767 4138221
12356 4138221 2819426 547694 -739283 -675683 -171325 -246777 -1340397 -2946397 -3720358
12347 -3720358 -2595545 -84408 1929796 1954957 309110 -1270386 -1335696 -38822 1236413
12338 1236413 1428682 589439 -963285 -3363220 -6188070 -7566263 -5950401 -2659468
12330b659468J741880j100983j996574o06519R21346J442927J371757O60742q44846
12321a069738j571658O5374K263867J626022j346810k352691Q7200K076450M82910
12312B60926k042957j339270J731555K836359P76111j321954j127962K3906R6376
12303a06910n29151l31430N99318Q03464q5199o40264K00560J350490J053763
12294B314641l22901o34118O52773J427234L94437n92712L17370J492383L97361
12285E446468j843443k020397j22929Q29563n8797o78135l57871q43771k093749
12276a743061j591950P94926J749634R8864j016193J93016R83167m83153j205488
12267b220238J236882L583599J931105j603353k372441n70958K31160k78995L46150
$$ plain form
12330 -2659468 -917588 -2018571 -4015145 -4621664 -3700318 -2257391 -885634 -224892 -1069738
12321 -1069738 -2641396 -2576022 -312155 1313867 -32943 -2385634 -2298434 -221984 260926
12312 260926 -1782031 -3121301 -1389746 1446613 2222724 900770 -227192 -203286 -106910
12303 -106910 -636061 -967491 -368173 435291 350092 -290172 -89612 1260878 2314641
12294 2314641 1991740 1357622 2010395 3437629 3832066 3239354 3556724 5049107 5446468
12285 5446468 3603025 1582628 1459699 2289262 2230465 1552330 1194459 350688 -1743061
12276 -1743061 -3335011 -2540085 -790451 -691587 -1707780 -1514764 -531597 -1014750 -2220238
12267 -2220238 -983356 2600243 4531348 2927995 555554 -15404 215756 -63239 282911
12258B82911J616257O99156j786499k104009K71326J755353P22889l24189K51969
12249A385164N52174q34232j953182p85898J398286K035368O48399j318612k516257
12240a388790k380372r96023Q87502K346833K897734K265440M49963j318833j289434
12231A474020R2447K99388j095454j292576O11749J115518j685390l547361m39311
12222d466970M059853L859963J14123j188179N16722M65895j814029j621733J438414
12213A364059J881545j541661k762593R67905L526153K0941m796468m388047o85617
12204f413783M18124q20308J80013L343533M060073J056755k034576k585247j439848
12195d235264J86204J890862K419071P34242j359540j045777J221104K224737
$$ plain form
12258 282911 1899168 2598324 811825 -1292184 -1020858 734495 1457384 1133195 1385164
12249 1385164 1937338 1103106 -850076 -1635974 -237688 1797680 2446079 1127467 -1388790
12240 -1388790 -3769162 -4765185 -3877683 -1530850 1366884 3632324 4082287 2763454 1474020
12231 1474020 1566467 1865855 770401 -522175 89574 1205092 -480298 -4027659 -4466970
12222 -4466970 -407117 3452846 3566969 2378790 2895512 3361407 1547378 -74355 1364059
12213 1364059 3245604 1703943 -1058650 -90745 3435408 3456349 -1340119 -5728166 -6413783
12204 -6413783 -5995659 -6815967 -6635954 -3292421 767652 1824407 -210169 -2795416 -4235264
12195 -4235264 -4049060 -2158198 260873 995115 -364425 -1410202 -189098 2035639
12187B035639N33310k047127l198719k109994N19340K569179J748164j321551
12179a271759k796490m64711K914987L472582J419468l45188q20242r53846q20123
12170C34678o9185J38671j160068k308474j344622N96434J270858J188827K049681
12161F96800K769050R99511k273893l634373k337904p76001m2678J190428L088940
12152c20120L506912J378046j372157k230837p15016J641500K550223P06860k340560
12143B804851l143820p22380J725666J452996J96712O95618J603038p6150l164473
12134A372058l566597p02776J737409J465061K7868o61651o11503k02373M65972
12125f76532M96631o71076j337741K52030K404405K055357k95544j423565n55794
$$ plain form
12187 2035639 2568949 521822 -2676897 -4786891 -4267551 -1698372 49792 -1271759
12179 -1271759 -4068249 -4532960 -1617973 1854609 3274077 2928889 2108647 1154801 334678
12170 334678 265493 404164 -755904 -3064378 -4409000 -3812566 -2541708 -1352881 696800
12161 696800 3465850 4465361 2191468 -1442905 -3780809 -4556810 -4599488 -3409060 -320120
12152 -320120 3186792 4564838 3192681 961844 246828 1888328 4438551 5145411 2804851
12143 2804851 -338969 -1061349 664317 2117313 2314025 3009643 4612681 4536531 1372058
12134 1372058 -2194539 -2897315 -1159906 305155 333023 -328628 -940131 -1142504 -676532
12125 -676532 -179901 -850977 -2188718 -1936688 467717 2523074 2227530 803965 248171
12116B48171K74314N38653J513640K473700J209783j430279k144768p48977m32597
12107A501640j861301k036692r1528R68038l8027j75730J918337L010337Q53925
12098D048999j652163j287868L19040r866j667069j938213o65153K15842Q7392
12089b549059k59251m97694m81953L65021J559171J308329n47916j506785j28029
12080b738166J507795J122308k45517m08383K50300j81254j691364k316613r72560
12071e673454J250319K278277J034912j088706j163980J435327L254837J429628
12063B757160j318475m91956K438049J790647k622939m211406J2577M423460L653948
12054F431065L32860o63763k00904j490015l209806k308024l69966q13772k164619
$$ plain form
12116 248171 522485 1061138 2574778 5048478 6258261 4827982 2683214 1934237 1501640
12107 1501640 -359661 -2396353 -2487881 -1519843 -1557870 -1733600 184737 3195074 4048999
12098 4048999 2396836 1108968 1428008 1418142 -248927 -2187140 -2852293 -2636451 -2549059
12089 -2549059 -2808310 -3306004 -3787957 -3422936 -1863765 -555436 -1103352 -2610137 -2738166
12080 -2738166 -1230371 -108063 -353580 -761963 -511663 -692917 -2384281 -4700894 -5673454
12071 -5673454 -4423135 -2144858 -1109946 -2198652 -3362632 -1927305 1327532 2757160
12063 2757160 1438685 946729 3384778 5175425 2552486 -1658920 -1646343 2777117 6431065
12054 6431065 6763925 6100162 5899258 4409243 1199437 -1108587 -1478553 -2292325 -4456944
12045d456944n39791K824020L031811j57994j735204N38676L116898K690138M68982
12036E780592r24693j023698o35555l71305r44904k456006l130858j329079J333068
12027c702438J734337o441o55438J108698K930542K597993Q00715p12539j361213
12018B734216j325805q20187l95221n18316o55234k6339R69175J342771R85635
12009B290695L42987m92886j199805j053040m95765r66153j848050l88503L285240
12000e25280M512699P74881l387047k616115J034225J608580j143169j972250
11992a713476Q68112L230358K155629l91342j913078k421910j971300R5079K272386
11983B10458J791448o17463j398916l17333p35717k756032k073471K184365M549154
$$ plain form
12045 -4456944 -4996735 -2172715 859096 701102 -1034102 -495426 2621472 5311610 5780592
12036 5780592 4855899 3832201 3196646 2825341 1880437 -575569 -3706427 -5035506 -3702438
12027 -3702438 -1968101 -1974542 -2629980 -1521282 1409260 4007253 4807968 4095429 2734216
12018 2734216 1408411 588224 193003 -325313 -980547 -1006886 -37711 1305060 2290695
12009 2290695 2633682 2140796 940991 -112049 -607814 -1573967 -3422017 -3810520 -525280
12000 -525280 3987419 4762300 1375253 -1240862 -206637 1401943 258774 -1713476
11992 -1713476 -845364 2384994 4540623 4149281 2236203 -185707 -2157007 -2061928 210458
11983 210458 2001906 1384443 -14473 -331806 -1067523 -3823555 -5897026 -3712661 836493
11974H36493J525355k623026k559615L12321J375535K68074j93180L02374o2899
11965h18568j023591q03918M18994J248114J783343K358260J513785j230320k713549
11956G32550l88203K615175J392488k963348m578211j483650K021708K333355
11948c18136R72565M46389O3965j448586k437043p25815K224081K709688p8332
11939A408776k735866j936140J421479L309187J424517k062814l267527j448236
11931c886624M22609Q3604j069121o90722P54685J122822K96567J99131J457386
11922a309663K455198J889271K74034j348597k389934k182337l25808K001461
11914i36375K788316J745441N48815J63930k74681j309898j796830p57714R53943
$$ plain form
11974 836493 2361848 -261178 -2820793 -2508472 -1132937 -864863 -1058043 -755669 -818568
11965 -818568 -1842159 -2646077 -2227083 -978969 804374 3162634 4676419 3446099 732550
11956 732550 344347 2959522 4352010 1388662 -3189549 -4673199 -2651491 -318136
11948 -318136 654429 1100818 1164783 -283803 -2720846 -3446661 -1222580 1487108 1408776
11939 1408776 -1327090 -3263230 -1841751 1467436 2891953 829139 -2438388 -3886624
11931 -3886624 -3464015 -3380411 -4449532 -5140254 -4385569 -3262747 -2966180 -2767049 -1309663
11922 -1309663 1145535 3034806 3308840 1960243 -429691 -2612028 -2937836 -936375
11914 -936375 1851941 3597382 4146197 4310127 4035446 2725548 928718 171004 1124947
11905A124947J968323K040316J373000k08813k163226k773405j339370L76205
11897C97977M85711m07736o60074l94687o66878q80903K69270J856459J687624
11888A686763J42816j03463J379342J879858K44729j018701k07044M33758j206160
11879C231898k940672j853386M08572K74343j390755n01550L076927M646753J835249
11870F787379j920849k724330j163411J39780N43350O12479J62543n65214j75342
11861A696385J315333J600211j71640j444651m12666P35361k97843j557806j41117
11852A321567K315084J805874j545335l516827k067115L19819Q89102r3504r04300
11843a475635o02849P61903K148208J794864n44048k244574r99983J471188J691961
$$ plain form
11905 1124947 3093270 5133586 6506586 6297773 4134547 1361142 21772 397977
11897 397977 883688 475952 -184122 -578809 -1245687 -2126590 -1857320 -861 1686763
11888 1686763 1829579 1726116 3105458 4985316 5230045 4211344 4004300 4438058 3231898
11879 3231898 291226 -1562160 -1153588 -879245 -2270000 -2771550 305377 4952130 6787379
11870 6787379 4866530 2142200 978789 1118569 1661919 2274398 2436941 1871727 1696385
11861 1696385 3011718 4611929 4440289 2995638 2582972 3318333 3020490 1462684 1321567
11852 1321567 3636651 5442525 3897190 380363 -1686752 -1366933 -477831 -571335 -1475635
11843 -1475635 -2078484 -1316581 831627 2626491 2082443 -162131 -1162114 309074 2001035
11834B001035l63657j581579q00335k2362m08799o29625J18628O76317M04784
11825f05593K53305M73393o0119j385072j810296n68603J087790J911228J642102
11816I38135R2066k136880k470834O47541L867630K305886k824449m810305r85147
11807e376357L345877K904095m23211j818382p72740N1864P7787N35281J001639
11798d74147K85496o57050k33861O65125L46630k65960O93816K152812J513897
11789D026758p96143j785179o22080M55900K6023q00181q70971n14957j27798
11780a008628M55845Q25931K83986n69994m94817K28501L95864L82807J472471
11771A971966K719045J572241j646113l050447n95886K548207K326343n63961
$$ plain form
11834 2001035 1637378 55799 -744536 -766898 -1175697 -1805322 -1686694 -1010377 -605593
11825 -605593 -352288 121105 60986 -1324086 -3134382 -3702985 -2615195 -703967 938135
11816 938135 1030201 -1106679 -3577513 -2929972 937658 3243544 419095 -4391210 -5376357
11807 -5376357 -2030480 873615 450404 -1367978 -2140718 -2088854 -2011067 -1475786 -474147
11798 -474147 -188651 -845701 -1079562 -414437 -67807 -333767 360049 2512861 4026758
11789 4026758 3230615 1445436 823356 1279256 1305279 505098 -365873 -880830 -1008628
11780 -1008628 -552783 273148 557134 -12860 -507677 -279176 116688 499495 1971966
11771 1971966 4691011 6263252 4617139 1566692 970806 3519013 5845356 5281395
11763E281395k136707r61352N53453M79345j13407J66265M52988m39974j285754
11754A996252r6907K200183K356594n90340l585494l479104q80734J289496J625547
11745H35493R08836O0353o08167o27890K88029J277245J172297J38195p67722
11736B676669j216597j462253j214782k21772O50550N68378K39989N00427L69374
11727H89983j231488k794337k035109K64422J275611O10824M97946J519012J685927
11718F82791K14398j171997j381827j156876n47386J309371L122596J982863j746902
11709A307031l803385j888652J370801K907037K906829K232079K14805k510329
11701B736216k897781k18786J627700k58192l101584k797683P4235K118667K284353
$$ plain form
11763 5281395 3144688 2183336 2736789 3216134 3102727 3268992 3721980 3282006 1996252
11754 1996252 1899345 4099528 6456122 5865782 2280288 -1198816 -2079550 -790054 835493
11745 835493 1744329 1804682 1196515 568625 856654 2133899 3306196 3444391 2676669
11736 2676669 1460072 -2181 -1216963 -1438735 -788185 -219807 20182 520609 889983
11727 889983 -341505 -3135842 -5170951 -4906529 -3630918 -3020094 -2522148 -1003136 682791
11718 682791 897189 -274808 -1656635 -2813511 -3360897 -2051526 1071070 3053933 1307031
11709 1307031 -2496354 -4385006 -3014205 -107168 2799661 5031740 5246545 2736216
11701 2736216 -161565 -380351 1247349 989157 -2112427 -4910110 -4835875 -2717208 -432855
11692d32855J612098L65470j068568q64797J215131K063005l0832j803277j35847
11683I19528K379388J741922m84951j22076J880588R22025k995960m760692k118071
11674b638299J411851K366813J253977k56610j638582j992006j95837K354937
11666F66244K627850L79739j464088j251634j74270P46282J695964J868585o1405
11657E033267k794530l307526j387866J64352J09535r8164J04206l14398p59656
11648c250780O64048L029591L150756R81039j47786M83911j13214k383958k519660
11639a06053N92182K332121k38826l063097j545778K081531K858587R92120J90211
11630D092998P02341k29118k403870k772950j154954p04254k224938k604870o1934
$$ plain form
11692 -432855 1179243 1544713 476145 -388652 826479 2889484 2858652 1055375 919528
11683 919528 3298916 5040838 4555887 4433811 6314399 7236424 4240464 -520228 -2638299
11674 -2638299 -1226448 1140365 2394342 2137732 499150 -1492856 -1688693 666244
11666 666244 3294094 3673833 2209745 958111 783841 1530123 3226087 5094672 5033267
11657 5033267 2238737 -1068789 -2456655 -2292303 -2182768 -2280932 -2176726 -2491124 -3250780
11648 -3250780 -2586732 442859 3593615 4574654 4426868 4910779 4797565 2413607 -106053
11639 -106053 486129 2818250 2579424 -483673 -2029451 52080 2910667 3902787 4092998
11630 4092998 4795339 4566221 2162351 -610599 -1765553 -2469807 -4694745 -7299615 -7361549
11621g361549K915741L468381K137238R98777M86294k4656k93076J09443L32095
11612B768688n97192j671428q55595J659434K859802O65076k795927l465793p66336
11603b199271J449954K98563j987118j488574J432483K796103J141449n73818
11595H69771M4104J287617N75516j392569k056617r01119L75468O24263J77660
11586c95906l89849p48932m21815P39970J893021J967507Q36982q04583k084836
11577E91559k023745o2639K661499L689093J985392o02242j731028j428934j219294
11568A859661j295697m82415J150224J588992l89128k979254l078404n1323L230158
11559d47186L550792R58043j607337k032023j153512q13925j175077j094401k15711
$$ plain form
11621 -7361549 -4445808 -977427 1159811 2158588 2644882 2620226 2327150 2436593 2768688
11612 2768688 2171496 500068 -355527 1303907 4163709 4828785 2032858 -1432935 -2199271
11603 -2199271 -749317 -450754 -2437872 -3926446 -2493963 302140 1443589 869771
11595 869771 913875 2201492 2777008 1384439 -672178 -1573297 -1197829 -573566 -395906
11586 -395906 -785755 -1534687 -1956502 -1216532 676489 2643996 3480978 2676395 591559
11577 591559 -1432186 -1494825 1166674 4855767 6841159 6238917 4507889 3078955 1859661
11568 1859661 563964 81549 1231773 2820765 2431637 -547617 -3626021 -3677344 -447186
11559 -447186 3103606 4061649 2454312 422289 -731223 -1545148 -2720225 -3814626 -4030337
11550d030337P25412J170857J039194K06080j071564j694349r92052L5499J15270
11541d495990k40457L51364J695860K247137J441223P9268j235495k215692j894822
11532d267604L22778K766664K877036O46970j302831j268939j96200L09972q0813
11523a92967o57940l88386J349844L369152K958623n00023l502604k669438K86615
11514E2876J182226k45716p46165L56378M08280r93971q84818J308524J864315
11505B301929j223812m667139m748735k015794J110905L627863M606849K597810
11497A589876r63806j742688J154123K876826K11853k999230k031374J126204
11489g78216J481956q32921j813362p27532k06070n15823N28757K428317K188325
$$ plain form
11550 -4030337 -3304925 -2134068 -1094874 -888794 -1960358 -3654707 -4646759 -4611260 -4495990
11541 -4495990 -4736447 -4385083 -2689223 -442086 999137 1078405 -157090 -2372782 -4267604
11532 -4267604 -3944826 -1178162 1698874 2345844 1043013 -225926 -422126 -112154 -192967
11523 -192967 -850907 -1239293 110551 3479703 6438326 5938303 2435699 -233739 52876
11514 52876 1235102 989386 243221 599599 1007879 13908 -870910 437614 2301929
11505 2301929 1078117 -3589022 -8337757 -10353551 -9242646 -5614783 -1007934 1589876
11497 1589876 626070 -1116618 37505 2914331 3126184 126954 -1904420 -778216
11489 -778216 703740 -129181 -1942543 -2670075 -2876145 -3391968 -2863211 -434894 1753431
11480A753431j72432j230884J13090R91130l91879k034983j701497M0263J456689
11471a177072J702713O27966j021265j169552J087289K871794P98596l305536
11463D14933l993180m5634L518224K649297n64446k019128j267511l64112Q7192
11454a584365O98020J035121L81595n15204o66845n85813q89138o03004J030815
11445a698818K442647J813068J49642k65889L69778N5243j036293n65670J508813
11436B772521J890131r38879l453682j737140K470499L842995J013780j654799
11428D205426o52667J801380J642846r18920k337336j392787l96155q75387j393129
11419c16729n44530O02691N26880k75992m20896J44962M76487K07902l31250p72356
$$ plain form
11480 1753431 1580999 350115 463205 1454335 1062456 -972527 -2674024 -2633761 -1177072
11471 -1177072 525641 1153607 132342 -1037210 50079 2921873 3720469 414933
11463 414933 -3578247 -3623881 -105657 2543640 1979194 -39934 -1307445 -1671557 -1584365
11454 -1584365 -886345 148776 530371 15167 -651678 -1237491 -2126629 -2729633 -1698818
11445 -1698818 743829 2556897 2706539 2440650 2810428 2865671 1829378 1263708 2772521
11436 2772521 4662652 3723773 270091 -1467049 1003450 4846445 5860225 4205426
11428 4205426 3552759 5354139 6996985 6078065 3740729 2347942 1951787 1076400 -316729
11419 -316729 -861259 -258568 268312 -7680 -428576 -283614 192873 400775 69525 -702831
11409g02831o99079J40879J055995Q84680k82292j005052m54657Q26568K185765
11400A949976L114158K282984j125404m674498m311499J9634L437251K536226
11392C228828k90137j176281l20173j16408m63072K58887J356350R12554m22357
11383B968191m64656M81355K88139q97277r56340P0915q585j258339j238086L80856
11373f33827O89734j508064l087666j120254K626474M159444K501082J18295q53581
11364B891637o65194n32656q26576r87530m69248N41596J238953J045120K10980
11355B447082o08831j060581j068636n82030K01533Q11075J058558J051975N35791
11346B785936p32900j791578j257757K00239K07462j522143k109145N2203K214896
$$ plain form
11409 -702831 -1401910 -1261031 -205036 679644 397352 -607700 -1062357 -235789 1949976
11400 1949976 5064134 7347118 6221714 1547216 -2764283 -2744649 692602 3228828
11392 3228828 2938691 1762410 1442237 1325829 862757 1121644 2477994 3390548 2968191
11383 2968191 2503535 2984890 3273029 2375752 1419412 1490327 1481742 223403 -1014683 -633827
11373 -633827 55907 -1452157 -4539823 -5660077 -3033603 1125841 3626923 3745218 2891637
11364 2891637 2226443 1693787 867211 -120319 -589567 -47971 1190982 2236102 2447082
11355 2447082 1838251 777670 -290966 -872996 -671463 139612 1198170 2250145 2785936
11346 2785936 2053036 261458 -996299 -796060 -588598 -2110741 -4219886 -4167683 -1952787
11337a952787J261506j236735j291368J317982K746319Q57495j969344k468120
11329b735052m33544J871698K557018J542393J45883l44796o1667j90851j091172
11320A259910j943488k468075l006284k465627Q14450M909105M785777n16903
11312A368865m989801l566237P11141K061914R74997J734495L580140J848218
11304C723732k794166m044099k7919L456641K076604j010456j405401j60711l22590
11295e08365j275595q31386K67163J7961q89064l44386J461537K381770J271011
11286A550646j191037l293162k902063O20772M252600L875681J20700j729543
11278A304594O78109L072572J099263k954823l594419J35577M017719M382017
$$ plain form
11337 -1952787 -691281 -1928016 -3219384 -1901402 844917 1702412 -266932 -2735052
11329 -2735052 -3168596 -1296898 1260120 2802513 2948396 2603600 2541933 2351082 1259910
11320 1259910 -683578 -3151653 -6157937 -8623564 -7809114 -2900009 1885768 1368865
11312 1368865 -3620936 -7187173 -6476032 -4414118 -3439121 -1704626 1875514 3723732
11304 3723732 929566 -3114533 -3142452 314189 2390793 1380337 -25064 -185775 -508365
11295 -508365 -1783960 -2615346 -2348183 -2330222 -3219286 -3563672 -2102135 279635 1550646
11286 1550646 359609 -2933553 -5835616 -5214844 -962244 2913437 3034137 1304594
11278 1304594 1982703 5055275 6154538 3199715 -394704 -259127 3758592 8140609
11270H140609J408645k261766l803655k117043O73996R76768j524886k939064
11262a446396p63072K169783J975866m18697j077892Q57297K437731J627557l50947
11253E011230j364628p33984P88981J746644Q88986j378880k951136k380916m77017
11244h50720J132908J708010J029633p86745k232420j382032R31150J441564o09424
11235C81924j758861L94108L157933K780929q0223k084818k206086j652460o77722
11226a745276R43477J666306L0974k140172j787208P88431K499174K085259J116682
11217C457647P55850M21127l63101j178849j719845j785157q38548P90604J364639
11208I04367J62497j003656n99249J72102o5125j03863J219402K034534N05612
$$ plain form
11270 8140609 9549254 7287488 3483833 1366790 2040786 3017554 1492668 -1446396
11262 -1446396 -2209468 -39685 1936181 1517484 439592 1296889 3734620 5362177 5011230
11253 5011230 3646602 2912618 3701599 5448243 6337229 4958349 2007213 -373703 -850720
11244 -850720 282188 1990198 3019831 2233086 666 -1381366 -450216 991348 381924
11235 381924 -1376937 -982829 2175104 4956033 4875810 2790992 584906 -1067554 -1745276
11226 -1745276 -801799 864507 895481 -1244691 -3031899 -2243468 255706 2340965 3457647
11217 3457647 4213497 4634624 4271523 3092674 1372829 -412328 -1250876 -460272 904367
11208 904367 1066864 63208 -536041 -363939 -429064 -532927 686475 2721009 3226621
11199C226621j395870j089003j18988j201915k646802j042066K054746K097668
11191a15609n44443j067193J270625J835736r59400k622333m65614J642247N178
11182a020806k621722j770737J686155L583893K661368P34248j003487k203102
11174D5810j817506L09224J899007J186494k35106k01033L08650p41351k400267
11165a646078k162671k43172R03653N72724J83387J79581l58890j122852n17518
11156d211836J435459K611384J802135K40615n17793n81338q71544j508037j757113
11147c358068r48872Q56493K690403L263922K211654N02535p74430j493624j880754
11138A069259j597115k85747J463312K463711J989192K09638j808463k430510
$$ plain form
11199 3226621 1830751 741748 622760 -579155 -3225957 -4268023 -2213277 -115609
11191 -115609 -660052 -1727245 -456620 1379116 419716 -2202617 -2668231 -1025984 -1020806
11182 -1020806 -3642528 -5413265 -3727110 -143217 2518151 3252399 2248912 45810
11174 45810 -1771696 -1462472 436535 1623029 1387923 1186890 1495540 754189 -1646078
11165 -1646078 -3808749 -4051921 -3148268 -2575544 -2392157 -2212576 -2571466 -3694318 -4211836
11156 -4211836 -2776377 -164993 1637142 1877757 1359964 778626 -92918 -1600955 -3358068
11147 -3358068 -4306940 -3450447 -760044 2503878 4715532 5218067 4443637 2950013 1069259
11138 1069259 -527856 -813603 649709 3113420 5102612 5312250 3503787 1073277
11130A073277q97746J220869J358832p13899k365721j639134L60780J616367J869095
11121A882720J665906O16879j315831k329354j066760O70311J67193j892817k230388
11112c832141K0008K055380J726686L02832l18240o26358j709528k312041m05390
11103e098792K918004L872845R39839k725177l209981p05687J431533J578934
11095i98482J247471J481985Q69836j290374k526382p21383J784757J266056j240522
11086a27038j190620J983282L459377O39070k523695j751132J053478J546742
11078C089464j4782l58832L33406q74029l249212k503357J796624M319160J730509
11069D268951k107071j907571J448553K955691J034129j078514q61327L54895
$$ plain form
11130 1073277 175531 1396400 2755232 2041333 -324388 -1963522 -1602742 13625 1882720
11121 1882720 3548626 4165505 2849674 520320 -546440 123871 291064 -1601753 -3832141
11112 -3832141 -3812133 -1756753 -30067 272765 -45475 -671833 -2381361 -4693402 -5098792
11103 -5098792 -2180788 1692057 2631896 -93281 -3303262 -4008949 -2577416 -998482
11095 -998482 248989 1730974 2600810 1310436 -1215946 -1937329 -152572 1113484 -127038
11086 -127038 -1317658 665624 4125001 4764071 2240376 489244 1542722 3089464
11078 3089464 3074682 2715850 3049256 2175227 -1073985 -3577342 -1780718 2538442 4268951
11069 4268951 2161880 254309 1702862 4658553 5692682 4614168 3752841 4107736
11061D107736M51214k34505k54881K17763q7354j059744j129374J48532J029920
11052C189307Q6450j364899r88461R03633J552611m9112j525457q93999L62522
11043A272595J21151n32976O76892K698261K344573l34269j758816m68201P46187
11034D765397k72914j639265j073346K17705J65519k30443R86643K457575J111374
11025F488245k633480m783376l044254O48241L180015L330801J450637j401464
11017C235365l235034k286888N53577K243854J395655j46039l94360O7092j84557
11008A248665p87208o14046j36548n71978j327109n84080J532753K552681J159969
10999B473099o89443n00844J087820J196883j003835k854318j861645P39629J750623
$$ plain form
11061 4107736 4558950 4324445 4069564 4287327 4199973 3140229 2010855 2159387 3189307
11052 3189307 3275757 1910858 922397 1826030 3378641 3329529 1804072 910073 1272595
11043 1272595 1393746 860770 1537662 4235923 6580496 6246227 4487411 4019210 4765397
11034 4765397 4492483 2853218 1779872 1997577 2163096 1932653 2919296 5376871 6488245
11025 6488245 3854765 -928611 -3972865 -3324624 -144609 3186192 4636829 3235365
11017 3235365 331 -2286557 -1732980 510874 1906529 1760490 1366130 1433222 1248665
11008 1248665 461457 -152589 -289137 -861115 -2188224 -2772304 -1239551 1313130 2473099
10999 2473099 1783656 1282812 2370632 3567515 2563680 -290638 -2152283 -1412654 337969
10990C37969N53276l52665M22623R22659o22543k165617n42226L153113M217385
10981E923974P93374l374010m002713j519648P80526J677725K293247K627374
10973E199849J173721j765289l236206j385567J722585K490753R4245k770078
10965A524013l072711o28229J829243J504702j395522l669374k639724P31602
10957e816000L072610K529303L01991j402477j410647L21205K776215L737843
10949D110043J608128j908601k987887o05679J854940J366822o58536j201948
10941A577282l85046l98925j244871j072485q179L6084p44058j02367J831386
10932e11179J997331n17815k464815j314534J096053K010225J839339K132504
$$ plain form
10990 337969 891245 538580 961203 1883862 1261319 -904298 -1446524 1706589 5923974
10981 5923974 6717348 3343338 -659375 -2179023 -1398497 279228 2572475 5199849
10973 5199849 6373570 4608281 1372075 -13492 1709093 4199846 4294091 1524013
10965 1524013 -1548698 -2176927 -347684 1157018 -238504 -3907878 -6547602 -5816000
10957 -5816000 -2743390 -214087 87904 -1314573 -2725220 -2404015 372200 4110043
10949 4110043 5718171 3809570 821683 216004 2070944 3437766 2779230 1577282
10941 1577282 1192236 793311 -451560 -1524045 -1532224 -1496140 -2240198 -2342565 -511179
10932 -511179 1486152 968337 -1496478 -2811012 -1714959 295266 2134605 4267109
10924D267109K100636L23784j998564k633737j715975p71611J23872J385245J803642
10915B884401N52484l74277P72870J758896j87011k877506k174593O78262O96455
10906A729981k099066k286319J466602L559144Q59775j854227j45737K515057
10898C745210J077200k237378k087938O46323R38263j239960j309724J280331
10890H12327K169485J35658r76813L52220O52777j623549k758187m72143J602060
10881a06165J12555k129975j093111J530908J515134n47380o20138J556233K136187
10872B354248j39939j940121q70014J180738J658993R14175L79387q6158j025194
10863B426115j566437q08466L84594P80190P62905J080912P50736j406177l673058
$$ plain form
10924 4267109 6367745 6691529 4692965 2059228 343253 -428358 -304486 1080759 2884401
10915 2884401 3436885 3062608 3835478 5594374 5407363 2529857 355264 1033526 1729981
10906 1729981 -369085 -2655404 -1188802 2370342 3230117 1375890 1230153 3745210
10898 3745210 4822410 2585032 497094 1143417 2081680 841720 -468004 812327
10890 812327 2981812 3117470 2140657 2492877 3145654 1522105 -1236082 -1708225 -106165
10881 -106165 6390 -2123585 -3216696 -1685788 -170654 -718034 -1338172 218061 2354248
10872 2354248 2214309 274188 -595826 584912 2243905 3158080 3537467 3451309 2426115
10863 2426115 859678 51212 435806 1215996 1978901 3059813 3810549 2404372 -1268686
10854a268686k727953J360201M083088K139569j869862k849035j20217K088604
10846H35709R46014j414627j714063r7523J070233Q85249R5785q40301j524737
10837a758261p42984J633696L006151J204645j585180j394901J454112K668762
10829D486040O89733j096610k69352O40714j151555l375713k009636J999416L598599
10820C511636R49211j983233j215786J883012L061784J210067p54990p02622k28983
10811E730096j444243k936395j753485J321988K061202p70738k890608p55308
10803a437491K843209K968667r9251k042697j457347o78606l58032J307959L439314
10794D485725K181651k606917n465466k897683J474581K541555P65233r0593O69684
$$ plain form
10854 -1268686 -3996639 -2636438 1446650 3586219 1716357 -1132678 -1252895 835709
10846 835709 1781723 367096 -1346967 -1444490 -374257 510992 606777 -233524 -1758261
10837 -1758261 -2501245 -867549 2138602 3343247 1758067 363166 1817278 4486040
10829 4486040 5175773 4079163 3809811 4450525 3298970 -76743 -2086379 -86963 3511636
10820 3511636 4460847 2477614 1261828 3144840 6206624 7416691 6661701 5959079 5730096
10811 5730096 4285853 1349458 -404027 917961 2979163 2208425 -682183 -1437491
10803 -1437491 1405718 4374385 4275134 2232437 775090 96484 -261548 1046411 4485725
10794 4485725 6667376 4060459 -1405007 -4302690 -2828109 -286554 478679 388086 1057770
10785A057770O58869r68485k521170k564965j098770J200081K949592K477580
10777A190502J6689j823231j241300O01225J735320J725949Q43860o65918j446592
10768I36504l9292J934411J131318j760483k050563J274895L099544M73406k179700
10759B820040o51218J608627l81694m076612l599090K12065J582587l16890j032616
10750c834801M60265M63226j652112j746725J464333L654222K021670l68364L480
10741D65194J916545K293482P37562j120543k114461j810122n39456J54871o44799
10732f61727j178299M41739K409246J534361j402867k769101j908000j223954
10724d758602r43474R35768L435373L010440n1316j259734P82154K220517P11486
$$ plain form
10785 1057770 1716639 748154 -1773016 -4337981 -5436751 -4236670 -1287078 1190502
10777 1190502 1207191 -616040 -1857340 -1256115 479205 2205154 3049014 2383096 936504
10768 936504 897212 2831623 3962941 2202458 151895 1426790 4526334 4999740 2820040
10759 2820040 2168822 3777449 3395755 -680857 -4279947 -4067882 -2485295 -2802185 -3834801
10750 -3834801 -3374536 -2911310 -4563422 -6310147 -4845814 -1191592 830078 461714 465194
10741 465194 2381739 4675221 5412783 4292240 2177779 367657 -171799 -16928 -661727
10732 -661727 -1840026 -1398287 1010959 2545320 1142453 -1626648 -3534648 -4758602
10724 -4758602 -5702076 -4766308 -1330935 1679505 1628189 368455 1150609 3371126 4082612
10715D082612j141446j174557j122862k143263j948054O21337K702659K127991
10707B004417Q93668J051401J209627K1774q85524m59196o74683k338828k529322
10698a706666L04250K677933J429770r41938o04735J177662O44129j909591k977836
10689a907022j678221l12560k1915K39830R06190J226157J161218J283517J284876
10680B182070P38987N35485J437435K087138O44224k150586l507058j989800R37976
10671I15871K616369J730523n33605j719788r51835O3938j47425m18759O42171
10662B197460J510737K03843j548502o84589J594043J404215j024462j507605
10654B145140P71119J802714j47705j682532n28057P40664k02227j508345j113495
$$ plain form
10715 4082612 2941166 1766609 643747 -1499516 -3447570 -2826233 -123574 2004417
10707 2004417 2898085 3949486 5159113 5180887 4295363 3836167 3161484 822656 -1706666
10698 -1706666 -1402416 1275517 2705287 1763349 1158614 2336276 2980405 1070814 -1907022
10689 -1907022 -3585243 -3897803 -3919718 -3679888 -2773698 -1547541 -386323 897194 2182070
10680 2182070 2921057 3456542 4893977 6981115 7625339 5474753 1967695 -22105 915871
10671 915871 3532240 5262763 4729158 3009370 2057535 2121473 1974048 1555289 2197460
10662 2197460 3708197 3912040 2363538 1678949 3272992 4677207 3652745 2145140
10654 2145140 2916259 4718973 4571268 2888736 2360679 3101343 2899116 1390771 277276
10645B77276k15960j42412J04105P88117J69341j523667j324912J135191K332655
10636A599734J036566M95404K004318K093292p80388k721934j296463O4474j172670
10627A322333j546187J632691M244930K091209j475108j215821R90350j77703
10619E866694l971896m803056j250578K395576K859155J237978P6767N41885J817739
10610D770264J409306k035841n251811l488341J745824L482693j25290k567062
10602b060258K98466L339205J002374l510296m043415r05952J749378L003000
10594a127498L605537K179879j131805k122158O97605K156375r19928l276007
10586F2000j72570L661506J913601k430670k731209N4858P42889j52203R94816
$$ plain form
10645 277276 61316 -81096 23009 811126 980467 -543200 -1868112 -732921 1599734
10636 1599734 2636300 3131704 5136022 7229314 6448926 3726992 2430529 2495003 1322333
10627 1322333 -223854 1408837 5653767 7744976 6269868 5054047 6044397 5866694
10619 5866694 1894798 -2908258 -4158836 -1763260 1095895 2333873 2410640 2952525 4770264
10610 4770264 6179570 4143729 -1108082 -4596423 -2850599 632094 506804 -2060258
10602 -2060258 -1761792 1577413 2579787 -930509 -4973924 -5879876 -4130498 -1127498
10594 -1127498 2478039 4657918 3526113 1403955 2101560 4257935 3338007 62000
10586 62000 -110570 3550936 5464537 3033867 302658 357516 1100405 948202 1943018
10577A943018K535867Q25905j824915j184826O77352k99210j808478J25487K555484
10568C545684R21499j629620P1351K903001J164328k078253m96990L042339J477468
10559H920807k862019k310533J609070R20174l690907l943700Q96647L186361
10551B725900J034677M42601K802017K570794j355485l290999j206862N87093
10543D309736J03439k03114O1176p08785p85292J707964L072328K83955j606715
10534F234692J718628L820509j691402p300236k988092N267355M896655j521641
10526H436468k096493K259916J314399l365275j791683L390634J176489n185745
10518D138710k756213O002260O623707m55000j497951L317848J129909n857839
$$ plain form
10577 1943018 4478885 5304790 3479875 2295049 2972401 2673191 864713 990200 3545684
10568 3545684 4467183 2837563 2908914 5811915 6976243 4897990 4401000 7443339 8920807
10559 8920807 6058788 3748255 5357325 6277499 2586592 -1357108 -460461 2725900
10551 2725900 3760577 4203178 7005195 9575989 8220504 4929505 3722643 4309736
10543 4309736 4413175 4210061 4271237 3562452 2777160 4485124 7557452 7841407 6234692
10534 6234692 7953320 11773829 10082427 2782191 -205901 5061454 9958109 8436468
10526 8436468 6339975 8599891 9914290 6549015 4757332 8147966 9324455 4138710
10518 4138710 1382497 7384757 14008464 13553464 12055513 15373361 16503270 10645431
10510A0645431k682917P885002P678772k691785m301043L674722L062502n322599
10502A7948085j666503J0864505P463319q606852o219757J3876925J4591611p091022
10494D1160311q109921J8617724K2250886q012488m410924N7045128P7323643
10487A95864359k6031434j61134337j64344342l2875526P1773430N4420432n912615
10480f8240033r334153K2726102K1954413l930832n050858J4025451J2629247
10473a5220663o744147q862763O541989R395185k552325m517262N488613O035125
10465a0436248l988953m441587N992187P873872j602454m737497K416144M305294
10457d619242l404550o755593n79541L601732O64616o43099K787237K807582k218164
$$ plain form
10510 10645431 7962514 15847516 23526288 20834503 16533460 20208182 23270684 17948085
10502 17948085 16281582 27146087 34609406 26002554 19782797 33659722 48251333 41160311
10494 41160311 33050390 51668114 73919000 65906512 61495588 118540716 195864359
10487 195864359 169832925 8698588 -155645754 -188521280 -116747850 -62327418 -68240033
10480 -68240033 -77574186 -54848084 -32893671 -36824503 -41875361 -27849910 -15220663
10473 -15220663 -21964810 -30827573 -24285584 -14890399 -17442724 -21959986 -16471373 -10436248
10465 -10436248 -14425201 -18866788 -12874601 -5000729 -6603183 -11340680 -8924536 -4619242
10457 -4619242 -8023792 -14779385 -15358926 -11757194 -11092578 -11735677 -8948440 -6140858 -8359022
10448h359022l399522J321019L398251K20342j046140J497225J376391k197778
10440g189234k296505J748145K770331k31975o03121K205422J497051k715766
10432d815652k833970J533205K093855k513950l747766J058568L696143K8532
10424e501035l023797n32634K216524L41379k133842n11092K424408K253939K295
10415d463855j356358j582897r72404R93878K596844J130064j558130q94492K435466
10406c671884L186544O95421k89225J285802R91846k228630l601499j195552O70165
10397d157012o28013j851212m80516J229520J512808K034412K974799J456367
10389B091153k429049m110866j834707L79525j55898n64939J561280L405948J899102
$$ plain form
10448 -8359022 -11758544 -10437525 -7039274 -6818932 -7865072 -6367847 -4991456 -7189234
10440 -7189234 -9485739 -7737594 -4967263 -5199238 -5802359 -3596937 -2099886 -4815652
10432 -4815652 -7649622 -6116417 -4022562 -6536512 -10284278 -9225710 -5529567 -5501035
10424 -5501035 -8524832 -9057466 -6840942 -6499563 -8633405 -9144497 -6720089 -4466150 -4463855
10415 -4463855 -5820213 -7403110 -8375514 -7381636 -4784792 -3654728 -5212858 -6107350 -3671884
10406 -3671884 -485340 210081 -79144 1206658 2198504 -30126 -3631625 -4827177 -4157012
10397 -4157012 -4785025 -6636237 -7116753 -5887233 -4374425 -2340013 634786 2091153
10389 2091153 -337896 -4448762 -6283469 -5903944 -6059842 -6624781 -5063501 -1657553 241549
10380B41549j046424j876077n21792P03680N16874r90552k811452k885715l46380
10371i016289K031338J091811j493021j578769O18280J315500K65969Q39450K805097
10362c120634J892651k111199l669672k60525L441692L071970N83698m77176n24225
10353a173420j190745j503083m54007K22211q51083j894618j069458M49928Q56896
10344f607379M96212L38640K67976L22059R50529J147366n33660k504480j459108
10335g581845K098629L836523K108407O2054K3670M98992L45061R48902K137056
10326D477449R76170k620812m036808j023933K047019R57990j608123p86660K422778
10317H05070L102571L40105j988569j626043n53674q52435j551546q10370R81318
$$ plain form
10380 241549 -804875 -2680952 -3202744 -2499064 -1982190 -2972742 -5784194 -8669909 -9016289
10371 -9016289 -6984951 -5893140 -7386161 -8964930 -8346650 -7031150 -6765181 -5925731 -3120634
10362 -3120634 -1227983 -3339182 -7008854 -7269379 -3827687 -755717 -172019 -649195 -1173420
10353 -1173420 -2364165 -3867248 -4321255 -4099044 -4950127 -6844745 -7914203 -7464275 -6607379
10344 -6607379 -6111167 -5772527 -5504551 -5182492 -4231963 -3084597 -3618257 -6122737 -7581845
10335 -7581845 -5483216 -1646693 461714 523768 547438 1046430 1391491 2340393 4477449
10326 4477449 5453619 2832807 -1204001 -2227934 -180915 777075 -831048 -1617708 805070
10317 805070 3907641 4247746 2259177 633134 79460 -772975 -2324521 -3134891 -2153573
10308b153573J774783Q02198k20417O19567K376744K032376j017143l328521k082506
10299a196492P16799J445565K54966k99780k10103j162986k052646m22179K249137
10290f77719K064484o47785j789983o80490o76121k050657j040721K445584L282323
10281B28915j451j843041J024046L583361Q96438l498081l531682j87140J298629
10272b030006K45254J9777J105858R34894o44561j207963l51723J44959M4002
10263a739509M66620Q33512j78228j506088j188522l4663k19439j181715n74855
10254e322887J475912K640703K306858J859261J578127M94362j081314j869542
10246B081480k008432k415305k486224j169046N45068J036114R77476J839856
$$ plain form
10308 -2153573 -378790 423408 202991 822558 3199302 5231678 4214535 886014 -1196492
10299 -1196492 -479693 965872 1220838 921058 710955 -452031 -2504677 -2926856 -677719
10290 -677719 1386765 738980 -1051003 -1731493 -2407614 -4458271 -5498992 -3053408 228915
10281 228915 227464 -1615577 -591531 2991830 3888268 390187 -3141495 -3328635 -2030006
10272 -2030006 -1784752 -1764975 -659117 275777 -368784 -1576747 -1928470 -1783511 -1739509
10263 -1739509 -1272889 -439377 -617605 -2123693 -3312215 -3346878 -3566317 -4748032 -5322887
10254 -5322887 -3846975 -1206272 1100586 2959847 4537974 5032336 3951022 2081480
10246 2081480 73048 -2342257 -4828481 -5997527 -5452459 -4416345 -3438869 -1599013
10238a599013K510483P82731k443884l859519k376069l8552J352638J653086R15784
10229c102315n30727j054936L32249J683431P26161j216954j294633j1595m3577
10220d512896j048556l04272J764199J747781n78860j400832O17586K037118P56012
10211i22720n14190N03658J533178J65764j669626j428319n97901j454656k230275
10202f615087k07569K676562K392653m21582j414931L29230J258841k04165j227376
10193c433424O4346J315908K72746j327753r36864N83154Q45791m6824k92937
10184b955857L05368O16629O61939J135426J269126j10813j900677j830614r7268
10175b906741Q40343K26215m8065R58399J520976L17958j284357j560283r10152
$$ plain form
10238 -1599013 911470 1694201 -749683 -4609202 -6985271 -7023823 -5671185 -4018099 -3102315
10229 -3102315 -3633042 -4687978 -4355729 -2672298 -1946137 -3163091 -4457724 -4469319 -4512896
10220 -4512896 -5561452 -5865724 -4101525 -2353744 -2932604 -4333436 -3715850 -1678732 -922720
10211 -922720 -1436910 -933252 599926 765690 -903936 -2332255 -2930156 -4384812 -6615087
10202 -6615087 -6822656 -4146094 -1753441 -2175023 -3589954 -3260724 -2001883 -2206048 -3433424
10193 -3433424 -3369078 -2053170 -1780424 -3108177 -4045041 -3461887 -2616096 -2662920 -2955857
10184 -2955857 -2650489 -2033860 -1371921 -236495 1032631 921818 -978859 -2809473 -2906741
10175 -2906741 -2066398 -1840183 -1888248 -929849 591127 909085 -375272 -1935555 -2845707
10166b845707l52270M71117J845154K354339R71060o83170n92261L04241l90322
10157A082181k515817l553768k401839l31329J525027K940125L023915Q99792
10149F68287j743799j822473O90126K428752J685089N78841O92324K0536l010906
10140A86777n409261l298451J795246M292118J943292j599556k123919J77867
10132d035887K236830K336726J198376J32043l39289m18751n46902q96745j068830
10123a402429n90970K08402L87292l57543j171137j048758M0256J234110J613477
10114a087300Q31120o51860j749764j568408l27808P84681R18072M78680M76134
10105a896453J132708J537397P77677q36708j929371j451272K18942J650567J777196
$$ plain form
10166 -2845707 -3197977 -2726860 -881706 1472633 2443693 1760523 1168262 1472503 1082181
10157 1082181 -1433636 -4987404 -7389243 -7720572 -6195545 -3255420 -231505 668287
10149 668287 -1075512 -2897985 -2207859 220893 1905982 2484823 3177147 3197683 186777
10140 186777 -5222484 -8520935 -6725689 -2433571 -490279 -2089835 -4213754 -4035887
10132 -4035887 -1799057 537669 1736045 1868088 1528799 1110048 563146 -333599 -1402429
10123 -1402429 -1993399 -1784997 -1397705 -1755248 -2926385 -3975143 -3934887 -2700777 -1087300
10114 -1087300 -256180 -908040 -2657804 -4226212 -4554020 -3769339 -2851267 -2372587 -1896453
10105 -1896453 -763745 773652 1551329 714621 -1214750 -2666022 -2447080 -796513 980683
10096I80683Q43775n2692k32951n6521k06260o24183o17529k1393M01781Q0221
10086D94931n23478q24163j136108j731107j575531L39968K700233K966871J091724
10077A803340q9822R28929J972007N88783k194003l601698l000251j729089l54882
10068e676686J278795K177508J223504l32110j71974J451318K099503J077792
10060C127650N2135l66850j372095k673823j971285Q98299K599156J118616r59861
10051D51942m56789J624689K112205M65278j370744k342071k545838j445482R98577
10042b508233K428719P51299j875646j396268J807528K900955j50575l237548
10034a279769k119566J469607K749819P86113j003575l98998Q78157M10455j388330
$$ plain form
10096 980683 1824458 1771766 1538815 1482294 1276034 651851 34322 12929 414710 494931
10086 494931 -28547 -852710 -1988818 -3719925 -5295456 -4955488 -2255255 711616 1803340
10077 1803340 1713518 2642447 4614454 5203237 3009234 -592464 -3592715 -5321804 -5676686
10068 -5676686 -4397891 -2220383 -996879 -1328989 -1500963 -49645 2049858 3127650
10060 3127650 3179785 2812935 1440840 -1232983 -3204268 -2305969 293187 1411803 451942
10051 451942 -4847 1619842 3732047 4197325 2826581 484510 -2061328 -3506810 -2508233
10042 -2508233 -79514 671785 -1203861 -2600129 -792601 2108354 1957779 -1279769
10034 -1279769 -3399335 -1929728 820091 1606204 602629 203631 1081788 1492243 103913
10025A03913k135571o20183J837647K697378O64658k672121l913502j404222K528222
10016b913781L982194J968268q46120j870685j375219j013803j299410j674781
10008e043337j749002j168864N76868K819008L375457J355630p65335j41843K114564
9999A373146K340671j59574k162644j679588p01317j188021j520908K93564K350038
9990a054633J397236j617826k447018J09523K426761J485996j155373k410003
9982c265337j950213j229536k95719J614884L401686K971944O51933r37658p86871
9973A75113o60728j420106r45831K136064M850806L189124j875694n059253l602301
9964c212806k66008J276247Q97032L33203n4643n62805m41187O01450R92980k01641
$$ plain form
10025 103913 -2031658 -2651841 -814194 1883184 2547842 -124279 -4037781 -5442003 -2913781
10016 -2913781 1068413 3036681 2190561 319876 -1055343 -2069146 -3368556 -5043337
10008 -5043337 -6792339 -7961203 -7384335 -4565327 -1189870 165760 -599575 -741418 1373146
9999 1373146 3713817 3554243 1391599 -287989 -989306 -2177327 -3698235 -3404671 -1054633
9990 -1054633 342603 -1275223 -3722241 -3612718 -1185957 300039 -855334 -3265337
9982 -3265337 -5215550 -6445086 -6740805 -5125921 -1724235 1247709 1899642 961984 175113
9973 175113 -485615 -1905721 -2851552 -715488 4135318 7324442 5448748 389495 -3212806
9964 -3212806 -3478814 -2202567 -1305535 -972332 -1026975 -1589780 -2030967 -1429517 -436537 -638178
9954f38178j201747m52981M16646l92463j085180O26751K617841J288334j894443
9945g15420k194733M94915J366054j138111k774714p29968K148127K653070J687551
9936G96771P89652r60758l485046l683579l67448K724037K260281J5455r52622
9927b863257r48046j144450m99451J215668J397522n59135p81058K462176M348132
9918B628101R02854l734203l558418j78194P98154n25478J98644K646215K224487
9909A402162j449931l676094k279216L7944R62822Q18096r2070j444739j153584
9900f874610J555939L068715N22900k395929p81782L007625L026316n65592k820995
9891b257413k588982k075383o57248K399330K502767l098936o819341j743663
$$ plain form
9954 -638178 -1839925 -2292906 -1876260 -2268723 -3353903 -2727152 -109311 1179023 -715420
9945 -715420 -2910153 -2415238 -1049184 -2187295 -4962009 -5691977 -3543850 -890780 796771
9936 796771 1586423 625665 -2859381 -6542960 -6910408 -4186371 -1926090 -1910635 -2863257
9927 -2863257 -3811303 -4955753 -5455204 -4239536 -2842014 -3401149 -4182207 -1720031 2628101
9918 2628101 3530955 -203248 -3761666 -3939860 -3141706 -3667184 -3468540 -822325 1402162
9909 1402162 -47769 -3723863 -6003079 -5965135 -5002313 -4184217 -4276287 -5721026 -6874610
9900 -6874610 -5318671 -2249956 -1727056 -4122985 -4904767 -1897142 1129174 563582 -2257413
9891 -2257413 -4846395 -6921778 -7579026 -5179696 -2676929 -5775865 -12595206 -14338869
9883a4338869L086394n192809j7769362j1366807J5189806L3017286K1893468
9876B4519107j968769j1101660l834491J622816j552785l916144p67043J434925
9868D435956m73262j310636J088406J998218m26731j823464j64792J160122M51719
9859D935536J0909J86842j396543l710019k714308J074273K416519j05139k066951
9850a368881r66386M52074J14521k06873O30256R07676k7322l80303K70694K18358
9840c56186n29790j15161J010400M55045j210090q02904J688322K596170N86911
9831C322717j547519j865308j468690j060002J55451J496171J185393J50273R37547
9822A306033K658262J925815r48525k063393p32162m32291j939260j562047J853921
$$ plain form
9883 -14338869 -11252475 -16445284 -34214646 -45581453 -30391647 2625639 24519107
9876 24519107 22550338 11448678 7614187 9237003 7684218 3768074 3001031 4435956
9868 4435956 3962694 2652058 3740464 5738682 5311951 3488487 3323695 4483817 4935536
9859 4935536 4946445 5133287 3736744 26725 -2687583 -1613310 803209 698070 -1368881
9850 -1368881 -2335267 -1883193 -1768672 -1975545 -1345289 -437613 -464935 -845238 -574544 -356186
9840 -356186 -885976 -1001137 9263 464308 -745782 -1548686 139636 2735806 3322717
9831 3322717 1775198 -90110 -1558800 -2618802 -2463351 -967180 218213 368486 1306033
9822 1306033 3964295 5890110 4941585 2878192 2146030 1713739 -225521 -1787568 66353
9813F6353L980831J804003j670348k461436j001651L75160J291873J786121N93319
9804D764225k088353l281870j398455J061559J295495l0719q83984j012322r70247
9795b544671n64129q3079o04003j599600r41452J358332K402100R01701p06377
9786b381178l66605N14734J18752o28561k65808L89583J5116o99586n01669J49313
9776c655909J45474l15452l31763K76767J050211J331135M54440j148685j495703
9767c689485L81405K273433J756170J74804L01435J234290L0834k367134k101809
9758b006057P05576J735340l3285n60925J803541L091029O43167k234874j951494
9749A192018j36171J63445n13244n46506q13381k019621k092746P3500J768225
$$ plain form
9813 66353 4047184 5851187 4180839 1719403 717752 1092912 2384785 4170906 4764225
9804 4764225 2675872 -605998 -2004453 -942894 352601 321882 -562102 -1574424 -2544671
9795 -2544671 -3108800 -3191879 -3795882 -5395482 -6336934 -4978602 -2576502 -1674801 -2381178
9786 -2381178 -2747783 -2233049 -2114297 -2742858 -3008666 -2619083 -2603967 -3303553 -3805222 -3655909
9776 -3655909 -3510435 -3825887 -4157650 -3880883 -2830672 -1499537 -1045097 -2193782 -3689485
9767 -3689485 -3308080 -1034647 721523 896327 1197762 2432052 2462886 95752 -2006057
9758 -2006057 -1300481 434859 401574 -159351 1644190 4735219 5378386 3143512 1192018
9749 1192018 1055847 1219292 706048 159542 -653839 -2673460 -4766206 -4692706 -2924481
9740b924481R78332J38562J527867K668374P64623j755052j168269R83711O78590
9731A892257j452200j412891J055255K232250Q68668k66706M02094J025252J34099
9722D478078j081993j377075j320163j466779j011531O25998K422232K794711
9714D063478J299502q26123j517148O147J752854J051488j552498k717374j317863
9705B42463j03939r18581j608314j59045J312898J11846k070185j668437R79074
9696c882220K290208Q65144j302257k334839j969506j93875K496593L968960K535642
9687B473850j74461j091608J802O68564j92976j269445j482036j174380p52413
9678b993103l15791l94456j089254j050794O20515K208678J435509r77848k242181
$$ plain form
9740 -2924481 -1946149 -1807587 -279720 2388654 3153277 1398225 229956 1213667 1892257
9731 1892257 440057 -972834 82421 2314671 3183339 2916633 3318727 4343979 4478078
9722 4478078 3396085 2019010 698847 -767932 -1779463 -1153465 1268767 4063478
9714 4063478 5362980 4536857 3019709 3025856 4778710 5830198 4277700 1560326 242463
9705 242463 138524 -780057 -2388371 -2547416 -1234518 -1122672 -3192857 -4861294 -3882220
9696 -3882220 -1592012 -726868 -2029125 -4363964 -6333470 -6527345 -4030752 -61792 2473850
9687 2473850 2299389 1207781 1209583 1878147 1685171 415726 -1066310 -2240690 -2993103
9678 -2993103 -3308894 -3703350 -4792604 -5843398 -5222883 -3014205 -1578696 -2556544 -4798725
9669d798725j486595l41320R4652L30336O04398L50505k32662j48805N48808O28693
9659d450715k83439r98682m55601Q80631J562009O96112q70959j017671J044897
9650c893418K954379J916013q90050j504244P30974J932697k5752j983619q43557
9641a606577J388280J428707J78544J76949N16509r42004k572498j380388J159002
9632a653476J018980j453346j938227N99576K321685R22621j145157j180824O7362
9623b440806P70199P95120O46927K61846n0986L25568P86934K01208q36639q05061
9613c45690l8634p5257o70902m27931J13887o40460j802902j058918R23315J116021
9603b907471o85394j413299K8763J206755P01271J73283P25310J013640K90896
$$ plain form
9669 -4798725 -6285320 -6626640 -6531988 -6201652 -5597254 -5246749 -5479411 -5628216 -5079408 -4450715
9659 -4450715 -4734154 -5732836 -6188437 -5307806 -3745797 -3049685 -3920644 -4938315 -3893418
9650 -3893418 -939039 976974 86924 -1417320 -686346 1246351 1220599 -763020 -1606577
9641 -1606577 -218297 1210410 1388954 1565903 2082412 1140408 -1432090 -2812478 -1653476
9632 -1653476 -634496 -2087842 -4026069 -3426493 -1104808 -182187 -1327344 -2508168 -2440806
9623 -2440806 -1670607 -875487 -228560 33286 -17700 307868 1094802 1296010 459371 -345690
9613 -345690 -384324 -459581 -1130483 -1558414 -1444527 -2084987 -3887889 -4946807 -4023492 -2907471
9603 -2907471 -3592865 -5006164 -4977401 -3770646 -3069375 -2896092 -2170782 -1157142 -866246
9594h66246k27112k02939q47385j777951j035865P82708O76680j256423j239632
9585e994165J437299K291142q36940l257332n72010L978234M319591O03480j821895
9576A47404o44818J270680J240887j29642j223203j424108o99118L75014L82849
9567g04055j106965k155917q50823J821861L407406L144166J798137j29196j810607
9558C414007j467390R13291J906111j006360m744095m104810P13108M113535K832426
9549B569823k71328j182070P5884J055191R29850N26417m2672j365639k868126
9540e72670k849696o98597J906589K583109Q88048j073768j082191M88483J328023
9531I17330M68997o06644o30582m88088j208796j688603l73656J866170K635003
$$ plain form
9594 -866246 -1093358 -1296297 -2143682 -3921633 -4957498 -4174790 -3498110 -4754533 -5994165
9585 -5994165 -4556866 -2265724 -3102664 -6359996 -6932006 -2953772 1365819 1969299 147404
9576 147404 -497414 773266 2014153 1884511 661308 -762800 -1461918 -1086904 -704055
9567 -704055 -1811020 -3966937 -4817760 -2995899 411507 3555673 5353810 5224614 3414007
9558 3414007 1946617 2859908 4766019 3759659 -984436 -5089246 -4376138 -262603 2569823
9549 2569823 2298495 1116425 1192309 2247500 3177350 3703767 3661095 2295456 -572670
9540 -572670 -3422366 -4120963 -2214374 368735 1256783 183015 -899176 -410693 917330
9531 917330 1386327 779683 149101 -338987 -1547783 -3236386 -3610042 -1743872 891131
9522H91131J174053j184861l018286l386108j374410K402541M477177J834223
9514A815460l251149m889327j121209L209380K917241p76371k550995l42242K671077
9505b318135K971180P68318j376211j847872q21654P87414J934212J700456J20317
9496A918025j408188j388495M7698J264332J025814k40672j192087j081378k97295
9487a352246K45885M4700m38659j80906J047181J928384J055401q66564j519297
9478c6121j14866J380709J122590M6355R6153R80612P89369p70974j994465j893975
9468c94613j170582m05135N69146J259620P25753l61323k07777R36312P02137
9459A653538j284975k109912j88836J653664M73308j749777r74282K272296L226861
$$ plain form
9522 891131 2065184 880323 -2137963 -5524071 -6898481 -4495940 -18763 1815460
9514 1815460 -1435689 -6325016 -7446225 -4236845 -1319604 -2095975 -4646970 -4989212 -2318135
9505 -2318135 653045 1421363 45152 -1802720 -2624374 -1836960 97252 1797708 1918025
9496 1918025 509837 -878658 -830960 433372 1459186 1218514 26427 -1054951 -1352246
9487 -1352246 -1106361 -1061661 -1500320 -1681226 -634045 1294339 2349740 1483176 -36121
9478 -36121 -150987 1229722 2352312 2398667 2494820 3475432 4264801 3493827 1499362 -394613
9468 -394613 -1565195 -1970330 -1401184 -141564 584189 222866 15089 951401 1653538
9459 1653538 368563 -1741349 -1930185 -276521 196787 -1552990 -2527272 -254976 2971885
9450B971885K5333l330006k677639N22321J606327o00514k401900p44392K333110
9441b295475K574423k78897j889847L42068L113429J916293k000495l260566m60656
9432b239723J928665Q49495q23408K68998K158535J259803j166524j158525J072503
9423B149819J503611j008581l193741k755407r42814Q03148K556823L392186J404157
9414C909201k307562l660354j408468Q33864M38816k55047J434757L582613K897605
9405E465425R4861j736055j925060j684571q17050J021558J482377j534096n090650
9396d723261m130542R51345M325324K884252j43217r75614k70522j66465j95434
9387b444134Q19729J591415M11759j377041j104913R82835K003389O20974j364608
$$ plain form
9450 2971885 2997218 -332788 -3010427 -2488106 -881779 -1482293 -3884193 -4628585 -2295475
9441 -2295475 278948 51 -1889796 -1547728 1565701 3481994 1481499 -1779067 -2239723
9432 -2239723 -311058 538437 -284971 -15973 2142562 3402365 2235841 1077316 2149819
9423 2149819 3653430 2644849 -548892 -3304299 -4247113 -3443965 -887142 2505044 3909201
9414 3909201 1601639 -2058715 -3467183 -2633319 -2194503 -2449550 -1014793 2567820 5465425
9405 5465425 5560286 3824231 1899171 214600 -602450 419108 1901485 367389 -4723261
9396 -4723261 -8853803 -7902458 -3577134 -692882 -836099 -1811713 -2082235 -2248700 -2444134
9387 -2444134 -1624405 -32990 378769 -998272 -2103185 -1120350 883039 1504013 139405
9378A39405j717104l63271R75384P48376r04189k139925j331583P58314J684688
9369b149905N41688r60868j267954r58304p57422L27980K792376M272923K237854
9360D078368j773243l463556j296137J783105K439602O12381j426611j840059
9352h86150m10130J629491K433040J299441k79844l99653P11047J318124Q89203
9343F304569K60332n63410k331212m090466l490798m37783J993121J602959j00263
9334h52951o53938k65952p02728j945450k135925l27560K343511M000398L553584
9325C012989J394425o45047p42782P58460J511819J83140j805378k417146j639811
9316c89331q21312n16291l60804j97121J5446O60627J617678J736906L93860j188829
$$ plain form
9378 139405 -1577699 -1940970 -965586 -217210 -1121399 -3261324 -4592907 -3834593 -2149905
9369 -2149905 -1608217 -2569085 -3837039 -4795343 -5552765 -5224785 -2432409 1840514 4078368
9360 4078368 2305125 -1158431 -2454568 -671463 1768139 2380520 953909 -886150
9352 -886150 -1296280 333211 2766251 4065692 3785848 3386195 4097242 5415366 6304569
9343 6304569 6564901 6001491 3670279 -420187 -3910985 -4348768 -2355647 -752688 -852951
9334 -852951 -1506889 -1772841 -2475569 -4421019 -6556944 -6884504 -4540993 -540595 3012989
9325 3012989 4407414 3762367 3019585 3778045 5289864 5473004 3667626 1250480 -389331
9316 -389331 -1210643 -1726934 -2087738 -2284859 -2269413 -1608786 8892 1745798 2139658 950829
9306I50829j411999m02335M94642N63762l7980r78422j486149m14378J993832
9297g28198L368422J876690j127125k731014k056552o05150K76181M76409J69085
9288a081252m06623m76841L58385J054383M86116n15660j23019J775577L376899
9279D447965L245806J435632j198592l345032l491107j488436O41395J028460
9271A276091L56391K63041M14550n30565j931706j896023n57471K00093R7751
9262b307848N92277J629619J438901L5562k87474J084066J724767J36576j746954
9253B299492j732149n83642j66687m31231k35170M27350Q33201Q56298M32140
9244A699602q92497k504708k393916J29760K794125L085444J369209k70189j015809
$$ plain form
9306 950829 -461170 -863505 -368863 194899 156919 -821503 -2307652 -2722030 -728198
9297 -728198 2640224 4516914 3389789 658775 -1397777 -2002927 -1726746 -1250337 -1081252
9288 -1081252 -1487875 -1964716 -1606331 -551948 -65832 -581492 -704511 1071066 4447965
9279 4447965 7693771 9129403 7930811 4585779 1094672 -393764 247631 1276091
9271 1276091 1632482 1895523 2310073 1779508 -152198 -2048221 -2605692 -2405599 -2307848
9262 -2307848 -1715571 -85952 1352949 1388511 1101037 2185103 3909870 4046446 2299492
9253 2299492 567343 -16299 -182986 -614217 -849387 -422037 411164 1267462 1699602
9244 1699602 807105 -1697603 -4091519 -3961759 -1167634 1917810 3287019 3016830 2001021
9235B001021j387839j442478q49364j37439j39789n34619k99077O56743J339492
9226g93349Q59569q40508k809801l240715r75218K466028L763611J734838r62001
9217g97546j272133M17376J338494J72281j715728k191367l62953K598378L919420
9208B106222J754973j964550l004965l27160K103155R21484j611870j242935J469715
9199B04069K046895p49692k960225j546336J308463K013956Q28970N91460J848058
9190C585618K204876K78564k152459k671896j343908j66645j65785l60088L22510
9181d69213J331775J480535Q13786K85741k7666r10763k129609k159122m05715
9172b190251J612671K110920R89731p53111k346936l085150k105492L64131K415080
$$ plain form
9235 2001021 613182 -829296 -1678660 -1816099 -1955888 -2490507 -2789584 -2132841 -793349
9226 -793349 66220 -774288 -3584089 -6824804 -7800022 -5333994 -1570383 164455 -797546
9217 -797546 -2069679 -1652303 -313809 -141528 -1857256 -4048623 -4411576 -1813198 2106222
9208 2106222 3861195 1896645 -1108320 -1435480 667675 1589159 -22711 -1265646 204069
9199 204069 2250964 1501272 -1458953 -3005289 -1696826 317130 1146100 1737560 3585618
9190 3585618 5790494 6069058 3916599 1244703 -99205 -265850 -431635 -791723 -469213
9181 -469213 862562 2343097 3156883 3442624 3414958 2504195 374586 -1784536 -2190251
9172 -2190251 -577580 1533340 2523071 1769960 -576976 -3662126 -5767618 -5403487 -2988407
9163b988407K415286J004770J09918N38583J469933J743072Q43464p66384j684823
9154B685412p98348R88768J427270n6535j506141j416684p50357p54389p78662
9145i59666l2168M27625l20529q47767K95331J631106J054605l36907q7661J046580
9135A870549K74576j981914k305359r1773J223919n0684j094667L35786J898216
9126G8649P04867j687972j838723J38538J343176R93677Q68924J356925P24800
9117B682861j221934k003452k62410J787377J409385q60582k283734j673908j75918
9108b602315J154171K476289L602677L203057P22039k085132k994307k119675
9100A356804j379564j430251r25821Q43404K424548K309095J081664K08837o5208
$$ plain form
9163 -2988407 -573121 431649 541567 1080150 2550083 4293155 5136619 4370235 2685412
9154 2685412 1887064 2875832 4303102 4246567 2740426 1323742 573385 -181004 -959666
9145 -959666 -991834 -564209 -884738 -1732505 -1437174 193932 1248537 911630 823969 1870549
9135 1870549 2145125 163211 -2142148 -2233921 -1010002 -1060686 -2155353 -1819567 78649
9126 78649 783516 -904456 -2743179 -2604641 -1261465 -267788 601136 1958061 2682861
9117 2682861 1460927 -542525 -804935 982442 2391827 1531245 -752489 -2426397 -2602315
9108 -2602315 -1448144 1028145 4630822 7833879 8555918 6470786 3476479 1356804
9100 1356804 -22760 -1453011 -2378832 -1535428 889120 3198215 4279879 4488716 4423508
9091D423508k08033R516O87049N98004j138293k946293k612287p03217L10662
9082a579384O6619N57647K116874K336634J35962k031711j820094l59598R5123
9073d81928l26591m00965o64680k027366k923151j171089J965324K942402J125559
9064a962485m97441k28242J61476o60691r31534P67579K347540J496540p6667
9055D16075O81989K653671J987364j163324k056586J083964L443951O83287l923481
9046C806910m003120K00347K106889j069861m030905j615096L243625L960331
9038B599120j0305k909166j386882J443751J733847L86538K53934R44544k882
9029C052499k250754k720942m99937J612569J379578J69856J32556O70166O8118
$$ plain form
9091 4423508 4215475 4224991 4912040 5510044 4371751 1425458 -1186829 -1890046 -1579384
9082 -1579384 -1512765 -955118 1161756 3498390 3634352 1602641 -217453 -577051 -481928
9073 -481928 -808519 -1209484 -1874164 -3901530 -6824681 -7995770 -6030446 -3088044 -1962485
9064 -1962485 -2459926 -2688168 -2526692 -3187383 -4118917 -3351338 -1003798 492742 416075
9055 416075 1098064 3751735 5739099 4575775 2519189 3603153 7047104 7730391 3806910
9046 3806910 -196210 4137 2111026 1041165 -2989740 -4604836 -1361211 2599120
9038 2599120 2588815 -320351 -1707233 -263482 1470365 1856903 2110837 3055381 3052499
9029 3052499 801745 -1919197 -2419134 -806565 573013 742869 875425 1545591 1613709
9020A613709r98054n13084J019450R34339j115054k157397n56391J192712L40478
9011b39292j748857j774606M82712K262631K169918J494517J356557J258685P41151
9002F003416R8711q48046k424564l344969j813562J188055K425759J002368l28263
8993A958905M87697J953803J984337R42694r5414j420796k878537k594805p2864
8984B65020J843337R23541q41485p35028l7212j297540k877795j123661K852778
8975a028045L787657J67573l291126k537843N35373J769478L87769j369254j813313
8966c391731q24384Q94685J856687P34948j391938j620306O22920K185880P22576
8957b10663j559642j108351J667203L140541J702141n82988j526018j439128j436053
$$ plain form
9020 1613709 615655 102571 1122021 2056360 941306 -1216091 -1772482 -579770 -239292
9011 -239292 -1988149 -3762755 -3280043 -1017412 1152506 2647023 4003580 5262265 6003416
9002 6003416 6102127 5254081 2829517 -515452 -2329014 -1140959 1284800 2287168 1958905
8993 1958905 2446602 4400405 6384742 7327436 7232022 5811226 2932689 337884 265020
8984 265020 2108357 3031898 2190413 1455385 1418173 120633 -2757162 -3880823 -1028045
8975 -1028045 2759612 2927185 -363941 -2901784 -2366411 -596933 -209164 -1578418 -3391731
8966 -3391731 -4216115 -3321430 -1464743 -729795 -2121733 -3742039 -3119119 -933239 -210663
8957 -210663 -1770305 -2878656 -1211453 1929088 3631229 3048241 1522223 83095 -1352958
8948a352958j123145M83264K606709K931957N58456k261338k414520J82354K256534
8939A867313J309494j206309k106872q34590L15486q5083q29881m01422Q10499
8930a161365J452015J068074K07023m73136o66019o20732r96707j817109j854327
8921d862283j35087K266927L265683K330428O54595q12932j863030k013935r74671
8912b144305J54339J54040k13797M06408J078248p0403k002731j741585O75701
8903c704085J954455Q89197j4986N72658M94398j398041k501042q36368J460297
8894c083517J917264J567798J885419J326794j341328l410163k156573K63088
8886c031218L22135q69227J6716K078268J644804r18146j499856Q39634K587235
$$ plain form
8948 -1352958 -2476103 -1992839 613870 3545827 4104283 1842945 -571575 -389221 1867313
8939 1867313 3176807 1970498 -136374 -970964 -655478 -740561 -1570442 -1971864 -1161365
8930 -1161365 290650 1358724 1565747 1092611 426592 -194140 -1190847 -3007956 -4862283
8921 -4862283 -4997370 -2730443 535240 2865668 3520263 2707331 844301 -1169634 -2144305
8912 -2144305 -1989966 -1835926 -2049723 -1643315 -565067 -635470 -2638201 -4379786 -3704085
8903 -3704085 -1749630 -860433 -875419 -302761 191637 -1206404 -3707446 -4543814 -3083517
8894 -3083517 -1166253 401545 2286964 3613758 2272430 -1137733 -3294306 -3031218
8886 -3031218 -2709083 -3578310 -3561594 -1483326 161478 -756668 -2256524 -1416890 1170345
8877A170345J804500M19191k39593j322824k719375k096173O84366K373458J317825
8868A391720k27927m39551o16428j615145j611165J42041J087672k94928j395424
8859c579135J81665K368291K166578N88167K83426O49226n21910k243581j615542
8850a722815R02584J761111p4298j567999m01595J773340K074077K13072j686942
8841A270535j887921p18001J28644k51161o47639N55229K425237K225865k19015
8832B881773j551188M7981J624095L7998k735959k578285L24169K184841J703439
8823A938864J001502Q70995k60767k174845k205608N7986J521390N90279m23547
8814I16249K43086P10726p65057k309077j592025K94459J062716R43795J240328
$$ plain form
8877 1170345 2974845 3394036 3154443 1831619 -887756 -2983929 -2299563 73895 1391720
8868 1391720 1163793 724242 107814 -1507331 -3118496 -2976455 -1888783 -2183711 -3579135
8859 -3579135 -3397470 -1029179 1137399 1725566 2008992 2658218 2136308 -107273 -1722815
8850 -1722815 -820231 940880 866582 -701417 -1103012 670328 2744405 2957477 1270535
8841 1270535 -617386 -1335387 -1206743 -1457904 -2105543 -1550314 874923 3100788 2881773
8832 2881773 1330585 1378566 3002661 3040659 304700 -2273585 -1949416 235425 1938864
8823 1938864 2940366 3811361 3550594 1375749 -829859 -771873 749517 1339796 916249
8814 916249 1159335 1870061 1105004 -1204073 -2796098 -2501639 -1438923 -495128 745200
8805G45200J331136J69418j114278j150153j075125k197046k754835o33049K243100
8796d435632K324014K47200j47414J761807K529939O49515j120288o85810K66877
8787A390208l6018l29802P56629J742352R22725n45981q82126q50680j867451
8778B99856k731173j352288J403762K634354J540805j07544j195868k124168k535769
8769d168033j147932J479475K616713J046962r61248q74205N16289O06600q66690
8760a752069j402414M09066K553089K247789j92707j789050r77483N12441N35541
8751A44203l46000j74666J041244J415170L54851n87341l98422l2727l75008p43603
8741B97701n46853o02102j347992j393021L26739K237413K057136K32465o79880
$$ plain form
8805 745200 2076336 2245754 1131476 -18677 -1093802 -3290848 -6045683 -6678732 -4435632
8796 -4435632 -2111618 -1864418 -2011832 -250025 2279914 2929429 1809141 1123331 1390208
8787 1390208 1354190 1024388 1781017 3523369 4446094 3900113 3017987 2167307 299856
8778 299856 -2431317 -3783605 -2379843 254511 1795316 1687772 491904 -1632264 -4168033
8769 -4168033 -5315965 -3836490 -1219777 -172815 -1134063 -2008268 -1491979 -885379 -1752069
8760 -1752069 -3154483 -2745417 -192328 2055461 1862754 73704 -903779 -391338 144203
8751 144203 -201797 -376463 664781 2079951 2434802 1847461 1449039 1416312 1041304 297701
8741 297701 -249152 -851254 -2199246 -3592267 -3265528 -1028115 1029021 1261486 581606
8732E81606K41111J156748K94723j711539k882743k326241j003635l46124m24525
8723f420619J15413J907005L376727K742662R40113L91179J004396L23358j793095
8714B587139k210647J38103J718589m084j976802m63373K439807K033487j259439
8705C002780k759851j148157K68269j53005k26312J126845J782262O58071l51602
8696B199300j87057k82808j033138p70836K82302m91809k890700k919801N73264
8687e521283L119757J569480r06960n35405Q48854r6680j868758j153687R02648
8678c642034J019636j5095Q52270K724673K155018l49202j017993M94715Q17619
8669C039607p44728j169386L61501R81772k90043p44569O44686J024506j017940
$$ plain form
8732 581606 822717 1979465 2274188 562649 -2320094 -4646335 -5649970 -5996094 -6420619
8723 -6420619 -6305206 -4398201 -1021474 1721188 2661301 3052480 4056876 4380234 2587139
8714 2587139 376492 514595 2233184 2229100 252298 -211075 2228732 4262219 3002780
8705 3002780 242929 -905228 -636959 -789964 -1016276 110569 1892831 2550902 2199300
8696 2199300 2012243 1729435 696297 -74539 207763 -284046 -3174746 -6094547 -5521283
8687 -5521283 -2401526 -832046 -1739006 -2274411 -1425557 -1522237 -3390995 -4544682 -3642034
8678 -3642034 -2622398 -2637493 -1785223 939450 3094468 2745266 1727273 2221988 3039607
8669 3039607 2294879 1125493 1486994 2468766 2178723 1434154 2078840 3103346 2085406
8660B085406k501875j018611J304523J559810L40505m52390r18506j498999r64419
8651b064556J002327J871050l0823k241781j740909L41359R52719K16299N30064
8642a164251J714487J057150j829923l755915k438575L82152J602169Q30518L40864
8633c261324J546299K841044J717978j268364k332212M04230L277008J605951
8625D530610k982196m073407O4054L502031J543856k300316k408962P810j43891
8616b260411k547522j986855K264833M373212R39034l640334l766376l03711J858802
8607e069328R17957q38647j392256r40464j26518R44495J852626J857702J025571
8598a768862L63702P15654J889990K622443J441197j583678m020366l371132l99552
$$ plain form
8660 2085406 -416469 -1435080 -130557 1429253 1769758 1317368 398862 -1100137 -2064556
8651 -2064556 -1062229 808821 777998 -1463783 -3204692 -2863333 -1910614 -1694315 -1164251
8642 -1164251 550236 1607386 -222537 -3978452 -6417027 -6034875 -4432706 -3602188 -3261324
8633 -3261324 -1715025 1126019 2843997 1575633 -756579 -352349 2924659 4530610
8625 4530610 1548414 -2524993 -2460939 1041092 2584948 284632 -2124330 -2116520 -2260411
8616 -2260411 -4807933 -6794788 -4529955 -156743 782291 -2858043 -6624419 -6928130 -5069328
8607 -5069328 -4151371 -4990018 -6382274 -7322738 -7449256 -6504761 -4652135 -2794433 -1768862
8598 -1768862 -1405160 -689506 1200484 3822927 5264124 3680446 -339920 -3711052 -4110604
8589d110604J456553M92435j239915j177047L56412J379993J301565R68955P12471
8580A40818P1429j037188k138906k688425j918972P46286M044714M935907K001434
8571D157097k118510l491319j482408J194050K439166K652952K681791K063742
8563H096561J56083k346692l951115l855893k509952j061896k80061K41944J381721
8554d129300K716812K562752O58692o31910M00223J582699l59379m267955n162169
8545f629535j239074K961417K554714r04682j737303J768116M991151L408641
8537E173445j335045l776574j702287J592653K175963K50294j319580j469213
8529d10344j409418j319086K30783K741701K816108j076114n199955m877202p68895
$$ plain form
8589 -4110604 -2654051 -2161616 -3401531 -4578578 -4222166 -2842173 -1540608 -571653 140818
8580 140818 212247 -824941 -2963847 -5652272 -7571244 -6824958 -2780244 2155663 4157097
8571 4157097 2038587 -1452732 -2935140 -1741090 698076 3351028 6032819 8096561
8563 8096561 8252644 5905952 1954837 -1901056 -4411008 -5472904 -5752965 -5511021 -4129300
8554 -4129300 -1412488 1150264 1808956 1177046 1577269 3159968 2800589 -1467366 -6629535
8545 -6629535 -7868609 -4907192 -2352478 -3257160 -4994463 -3226347 1764804 5173445
8537 5173445 3838400 61826 -1640461 -47808 2128155 2378449 1058869 -410344
8529 -410344 -1819762 -3138848 -2908065 -166364 2649744 1573630 -3626325 -8503527 -9272422
8520i272422K349073K248893J196913J326419J708641R86632j67587o94690q62090
8511a180218r64943m17196O01578O52146n41434j203643k95030R24139J364653
8502a059948J699473J930018J93125l566643n347439j862395M067823O347849
8494B401863L058602j922708m177484k789171M32642K910861K505223o91986l589954
8485a862112l225320n54056R65719K49550m39155O08717K277031K833275K239943
8476C093592J450127R36341N20523l30683j982972l508191k975563l11669J472465
8467a636030J38662k063013j508850J123029K037209O03857R0690J726536K552353
8458C064443O40764j645773j723937o08039l07705m92991k12959j00831l22675
$$ plain form
8520 -9272422 -6923349 -4674456 -3477543 -2151124 -442483 544149 376562 -318128 -1180218
8511 -1180218 -2145161 -2562357 -1960779 -1308633 -1850067 -3053710 -3348740 -2424601 -1059948
8502 -1059948 639525 2569543 2762668 -803975 -6151414 -8013809 -3945986 2401863
8494 2401863 5460465 3537757 -639727 -3428898 -2996256 -85395 2419828 1727842 -1862112
8485 -1862112 -5087432 -5641488 -4675769 -4426219 -4865374 -4256657 -1979626 853649 3093592
8476 3093592 4543719 5480060 6000583 5669900 3686928 178737 -2796826 -3108495 -1636030
8467 -1636030 -1497368 -3560381 -5069231 -3946202 -1908993 -1305136 -1214446 512090 3064443
8458 3064443 3705207 2059434 335497 -272542 -580247 -1073238 -1286197 -1387028 -1709703
8449a709703Q44459L497683L977792j22488n049372n158487p76917K484910J761500
8440b50623p5439P8884J213942J038103o0501l03362K06716o236r68755j215774
8430c43045l94653N2458p16707j462348q23635L87585M15072n33811o15649L92607
8420c642126N65816o02316p45166J399962L092922J588444r91739n75845K291781
8411B381733L159832O73442j709362j672806j197643k183238l009679j741638
8403e299359N18028J738721J677261O80463j293042k774990j269266K393196L787653
8394A58665J298458j125021m47360N55366j177759k811252l05104L911765M095912
8385D153670K06965k373219j389839m3776o16174j372197r01165o39822j382256
$$ plain form
8449 -1709703 -865244 2632439 6610231 6487743 1438371 -3720116 -4497033 -2012123 -250623
8440 -250623 -326062 -247178 966764 2004867 1944366 1641004 1847720 1841484 872729 -343045
8430 -343045 -737698 -685240 -1401947 -2864295 -3687930 -3300345 -2885273 -3419084 -4034733 -3642126
8420 -3642126 -3076310 -3678626 -4423792 -3023830 69092 1657536 665797 89952 2381733
8411 2381733 5541565 6215007 4505645 2832839 1635196 -548042 -3557721 -5299359
8403 -5299359 -4781331 -3042610 -1365349 -684886 -1977928 -4752918 -6022184 -3628988 158665
8394 158665 1457123 332102 -115258 440108 -737651 -3548903 -3854007 57758 4153670
8385 4153670 4360635 1987416 597577 553801 -62373 -1434570 -2335735 -2975557 -4357813
8376d357813j300274O25066K344784J782978j86154j290498o74184P70280J550548
8367g35267P86751n99170n14372J149641J512660r99397l342647k058219J087898
8358c712122J826740K98831K47724J982550J792611j075284k538248n05939J562169
8349a20968M98196j566136j145966J091122K035981R18718n12706q73483m1483
8340B83275J275878J424769q41393l723363l510713K28391L222769K111153j005175
8331e34409j831104L69563K649601K547271K92108k147444k694968p81417J669441
8322d61358J975646k325j749810j605929m25458O33574J589218K200638J529996
8313C684192j08767j067803j031787j345694k047482j436473N18316J432238L84497
$$ plain form
8376 -4357813 -5658087 -5033021 -2688237 -905259 -1091413 -2381911 -3056095 -2285815 -735267
8367 -735267 51484 -547686 -1062058 87583 1600243 600846 -2741801 -4800020 -3712122
8358 -3712122 -1885382 -1586551 -1338827 643723 2436334 1361050 -1177198 -1683137 -120968
8349 -120968 377228 -1188908 -2334874 -1243752 792229 1710947 1198241 324758 283275
8340 283275 1559153 2983922 2142529 -1580834 -5091547 -4863156 -1640387 470766 -534409
8331 -534409 -2365513 -1995950 653651 3200922 3493030 1345586 -1349382 -2130799 -461358
8322 -461358 1514288 1511963 -237847 -1843776 -2269234 -1635660 -46442 2154196 3684192
8313 3684192 3575425 2507622 1475835 130141 -1917341 -3353814 -2835498 -1403260 -1018763
8304a018763n14562K02742J159973J003434L68419l57885j855818l080957j527933
8295e621350J965981K954878K21894j705507Q1453J827334l59851l438185k304066
8286f377419J710278L219195J413543K24892J058562J261709l21084j545447j218795
8277e74566p33063q23138m64370M75675Q17826N84674Q23397R44794n18787k554332
8267b021890k475896k49463J351588J203879J069368J846105J948826M43281j116658
8258A999140j197444l39409K52351J98581n78824j926185k576227j179953J358854
8249c989116K454097J107019j069861k203204j876368o36629M66293J59610j402946
8240f991105j849489L94339K989115K275558j327033l417082j332082K839525
$$ plain form
8304 -1018763 -1533325 -1330583 -170610 832824 1201243 843358 -1012460 -4093417 -5621350
8295 -5621350 -3655369 -700491 -478597 -2184104 -2102651 -275317 -635168 -4073353 -6377419
8286 -6377419 -4667141 -1447946 -34403 190489 1249051 2510760 2189676 644229 -574566
8277 -574566 -1307629 -2130767 -2595137 -2119462 -1301636 -716962 106435 1051229 532442 -2021890
8267 -2021890 -4497786 -4747249 -3395661 -2191782 -1122414 723691 2672517 3115798 1999140
8258 1999140 801696 462287 714638 913219 334395 -1591790 -4168017 -5347970 -3989116
8249 -3989116 -1535019 -428000 -1497861 -3701065 -5577433 -6214062 -5747769 -5588159 -6991105
8240 -6991105 -8840594 -8446255 -5457140 -3181582 -4508615 -7925697 -9257779 -6418254
8232f418254N349945M550374J237052k450858l993368k343217P07393K435353
8224i25580K222376J207493q2515j508719j809023k07904J262494K50479j770920
8215a361819j457519P49384J101874j109729k196648j95203J978247J453370l07079
8206a345122o19793J87223M49296N85120J844556L237923K548210k75306k853481
8197C758626l233850j655539K76779J283472J381442J409371J493534O84266j145964
8188D252137k223363j209301N59796J129689R55146J423996J721456K97837j650699
8179E256694j750116o27510o47354j334577n23415O68222o50759k871679j330702
8170c811196L176534M118450l91895l844715j514989K209922J636197r87595l12030
$$ plain form
8232 -6418254 -1068309 3482065 4719117 2268259 -1725109 -4068326 -3360933 -925580
8224 -925580 1296796 2504289 2421774 913055 -895968 -1103872 158622 409101 -1361819
8215 -1361819 -2819338 -2069954 -968080 -2077809 -4274457 -4469660 -2491413 -1038043 -1345122
8206 -1345122 -1964915 -1777692 -1328396 -743276 1101280 4339203 6887413 6612107 3758626
8197 3758626 524776 -1130763 -853984 429488 1810930 3220301 4713835 5398101 4252137
8188 4252137 2028774 819473 1379269 2508958 3464104 4888100 6609556 6907393 5256694
8179 5256694 3506578 2879068 2231714 897137 373722 1041944 391185 -2480494 -3811196
8170 -3811196 -634662 3483788 3091893 -752822 -2267811 -57889 1578308 590713 278683
8161B78683K582601K622878j68764j240196K05954L67623j803899k633582j38933
8152G2365K694691K639921L39340j784698k642527k267721j042859j15904n12210
8143b619602j284953m99970J683374K890291J708309p75684k619661k595434n03083
8134d616413K284675L151147J117450j223396q59531J255500J622127m20072j763700
8125E47787l19973K093816K612709R09099j175677k052860j485354k79057M63014
8116A313504L01732k57751p59358j356155j782827j034118P84645J724991P47444
8107c17893k30222Q92358K869008K809841M70443j737480k379768k099722j547466
8098a270901o93681P6987L96438R54250K021930J941319l42699k431201j425209
$$ plain form
8161 278683 2861284 5484162 5315398 4075202 4281156 4648779 2844880 211298 72365
8152 72365 2767056 5406977 5746317 3961619 1319092 -948629 -1991488 -2107392 -2619602
8143 -2619602 -3904555 -4404525 -2721151 169140 1877449 1101765 -1517896 -4113330 -4616413
8134 -4616413 -2331738 819409 1936859 713463 -146068 1109432 2731559 2311487 547787
8125 547787 227814 2321630 4934339 5843438 4667761 2614901 1129547 850490 1313504
8116 1313504 1615236 1357485 598127 -758028 -2540855 -3574973 -2790328 -1065337 -317893
8107 -317893 -548115 344243 3213251 6023092 6493535 4756055 2376287 276565 -1270901
8098 -1270901 -1964582 -1887595 -1491157 -536907 1485023 3426342 3083643 652442 -772767
8089g72767J204791J530434n53756j288505N07741J586255M3291j493741n25642
8080B38101J308918J439728L94704j22222m94968j628068k283502r84766R74506
8071a157569J257105J06614l30034N22072J235347Q82682q7948j086191j748231
8062d06153j497544l02987N76923O1561j034558j155563l10120K98849M67168
8053c302424J078760K060056J929410m5242k311733k493930k16099K045852J492629
8044B37279j399686k754988j2994M038968M257188J24079l271295k343981J51549
8035i73881o6429k000153j411719J773059K922649M7733k798310j551080J899710
8026b158421K858685P42112p36451M74348K094372J342396j272975l186304k938947
$$ plain form
8089 -772767 432024 1962458 1408702 120197 627938 2214193 2257484 763743 238101
8080 238101 1547019 2986747 3381451 3259229 2764261 1136193 -1147309 -2132075 -1157569
8071 -1157569 99536 206150 -123884 398188 1633535 2516217 2428269 1342078 -406153
8062 -406153 -1903697 -2206684 -1629761 -1568200 -2602758 -3758321 -4068441 -3769592 -3302424
8053 -3302424 -2223664 -163608 1765802 1720560 -591173 -3085103 -3301202 -1255350 237279
8044 237279 -1162407 -3917395 -3930389 108579 4365767 4489846 1218551 -1125430 -973881
8035 -973881 -1040310 -3040463 -4452182 -2679123 243526 291259 -2507051 -4058131 -2158421
8026 -2158421 700264 1442376 705925 1180273 3274645 4617041 3344066 157762 -2781185
8017b781185r11443J580718K711931J183513j655325k218498P71549L527841J784190
8008C993291k722862l987820k02583L541706K669035o33637j665179n64774j006120
7999e78943l199082l286693j6296K657077J474600j180048r57051K073680L754212
7990G41456J752901j533117k384738l33837J688990J181742j026966k185701j290035
7981c389305k0002J69821J35617J009941J732728P52283q66133o79863J125685
7972b9228J755724J22507j571466j391756k85072J73020M21442J499409K562945
7963C257525J834309o20421k626727k341584k13731J426528O92154j572613k333596
7954b498156j08807K706279K938004J106730J81917M56367p54838l822707n130499
$$ plain form
8017 -2781185 -3692628 -2111910 600021 1783534 128209 -2090289 -1318740 2209101 3993291
8008 3993291 1270429 -2717391 -2919974 621732 3290767 2657130 991951 427177 -578943
7999 -578943 -3778025 -7064718 -7081014 -4423937 -2949337 -4129385 -5086436 -3012756 741456
7990 741456 2494357 961240 -1423498 -1757335 -68345 1113397 86431 -2099270 -3389305
7981 -3389305 -3409307 -3239486 -3103869 -2093928 -361200 391083 -475050 -1154913 -29228
7972 -29228 1726496 1849003 277537 -1114219 -1399291 -1226271 -804829 694580 3257525
7963 3257525 5091834 4471413 1844686 -496898 -710629 715899 1408053 -164560 -2498156
7954 -2498156 -2606963 99316 3037320 4144050 4325967 4782334 4027496 204789 -4925710
7945d925710k443166J426770K706313J628293P13422N67610K93915K3773j329
7936a0109j079230l593884m549735j180575M044273N821648L034644k43745p71571
7927A471716L77429Q51202K44414p05580j445718j169629N74828K111259R68389
7918C278310k183109l554894j343570J767624K616259J500683L17243p09850j972702
7909b84006k215858l22771J874939J615217n62142j522356k94048Q47783M12773
7900d50469k12216J76197K78438r80744j704890K37008L147944L381982Q34344
7891D707594q44048l1497M03997j781125l867261k180861J674446K730510J52120
7882I63875j571349K70648K536153J509183j226858j643496K00077N61582j695051
$$ plain form
7945 -4925710 -7368876 -5942106 -3235793 -1607500 -894078 -326468 -32553 -8780 -10109
7936 -10109 -1089339 -4683223 -9232958 -10413533 -6369260 -547612 2487032 2243287 1471716
7927 1471716 1849145 2700347 2944761 2239181 793463 -376166 198662 2309921 3278310
7918 3278310 1095201 -2459693 -3803263 -2035639 580620 2081303 2398546 1688696 -284006
7909 -284006 -2499864 -2822635 -947696 667521 105379 -1416977 -1711025 -863242 -450469
7900 -450469 -662685 -486488 -208050 -1188794 -2893684 -2656676 491268 3873250 4707594
7891 4707594 3863546 3832049 4236046 2454921 -1412340 -3593201 -1918755 811755 963875
7882 963875 -607474 -336826 2199327 3708510 2481652 838156 1038233 1599815 -95236
7873i5236l229233j471562J503076K158698L96896r60946m93964L76905L08263
7864a507103K94013J775604L651792L111740l60114l600750l555213j137527M12576
7855i14982O0018m87407l23085m57788r50247j30537J927779K319801m7986j689390
7845f93824L85942L315350K273091j828770l390983o37865J950977Q44024j608556
7836F09386j804897m91351l76602j016353m8546J993228K112820j91227j972806
7827a186348j406063k40203m55987j023544N9548K211270L074587K081298Q44982
7818C959540J10979j185722l059249l189859m64560K114015J008697k267806k700204
$$ plain form
7873 -95236 -3324469 -4796031 -3292955 -1134257 -737361 -1698307 -2192271 -1815366 -1507103
7864 -1507103 -1213090 562514 4214306 7326046 6965932 3365182 -190031 -1327558 -914982
7855 -914982 -854964 -1342371 -1665456 -2123244 -3073491 -3204028 -1276249 1043552 995566 -693824
7845 -693824 -307882 3007468 5280559 3451789 60806 -577059 1373918 2217942 609386
7836 609386 -1195511 -1686862 -2063464 -3079817 -3128363 -1135135 977685 786458 -1186348
7827 -1186348 -2592411 -2832614 -3288601 -4312145 -4252597 -2041327 1033260 3114558 3959540
7818 3959540 4070519 2884797 -174452 -3364311 -3828871 -1714856 -706159 -2973965 -5674169
$$ [...]
##END NTUPLES=NMR SPECTRUM
##END=
