##TITLE=31Pdec_LR-736-RC-RM1
 , 24 sc
 2.04.2021
##JCAMPDX= 6.0         $$ Bruker NMR JCAMP-DX V2.0
##DATA TYPE= NMR SPECTRUM
##DATA CLASS= NTUPLES
##ORIGIN= UXNMR, Bruker Analytische Messtechnik GmbH
##OWNER= root
$$ XWIN-NMR		Version 3.5
$$ Fri Apr  2 12:49:15 2021 Russian Standard Time (UT+4h)  she@DPX200
##.OBSERVE FREQUENCY= 81.013821
##.OBSERVE NUCLEUS= ^31P
##.ACQUISITION MODE= SIMULTANEOUS
##.ACQUISITION SCHEME= undefined
##.AVERAGES= 24
##.DIGITISER RES= 16
##SPECTROMETER/DATA SYSTEM= spect
##.PULSE SEQUENCE= zgpg30
##.SOLVENT NAME= CDCl3
##.SHIFT REFERENCE= (INTERNAL, CDCl3, 0, 248.564)
##AUDIT TRAIL= $$ (NUMBER, WHEN, WHO, WHERE, WHAT)
$$ ##TITLE= Audit trail, XWIN-NMR		Version 3.5
$$ ##JCAMPDX= 5.01
$$ ##ORIGIN= Bruker BioSpin GmbH
$$ ##OWNER= she
$$ F:/spectra/data/she/nmr/P31/1/pdata/1/auditp.txt
$$ ##AUDIT TRAIL=  $$ (NUMBER, WHEN, WHO, WHERE, WHAT)
(   1,<2021-04-02 12:47:59.37 +0400>,<she>,<DPX200>,
      <created by zg, POWCHK disabled, PULCHK disabled
       configuration hash MD5:
       00 E9 B6 7A A2 85 ED C7 34 08 36 98 17 FE 4E 26
       data hash MD5: 32K
       E9 6B 9B 62 D7 52 04 85 AF A1 51 76 25 CE 76 51>)
(   2,<2021-04-02 12:48:08.64 +0400>,<she>,<DPX200>,
      <Start of raw data processing
       efp BC_mod = 2 LB = 1 FT_mod = 6 PKNL = 1 PHC0 = -4461.271 PHC1 = 217.4011 SI = 64K 
       data hash MD5: 64K
       36 B6 ED 84 92 3F 95 30 99 0C 9D E0 FF F2 4A D5>)
(   3,<2021-04-02 12:48:39.17 +0400>,<she>,<DPX200>,
      <pk PHC0 = -157.7104 PHC1 = 339.6 
       data hash MD5: 64K
       CD 3F E5 8C 7E 8D F1 81 B1 D7 F5 B1 A0 80 A3 1A>)
(   4,<2021-04-02 12:48:41.96 +0400>,<she>,<DPX200>,
      <abs ABSG = 5 
       data hash MD5: 64K
       48 33 A5 07 CF A0 21 0D D4 0C FD EE EA 13 85 D0>)
$$ ##END=
$$ 
$$ hash MD5
$$ BA DE A4 39 F7 25 B8 F6 4B 11 F0 42 14 20 EF 9C
##$RELAX= 
##$RELAX= 
##$RELAX= 
##$RELAX= 
##$RELAX= 
##$RELAX= 
##$RELAX= 
##$RELAX= 
$$ Bruker specific parameters
$$ --------------------------
##$DU= <F:/spectra>
##$EXPNO= 1
##$NAME= <P31>
##$PROCNO= 1
##$TYPE= <nmr>
##$USER= <she>
##$AMP= (0..31)
100 100 100 100 100 100 100 100 100 100 100 100 100 100 100 100 100 100 
100 100 100 100 100 100 100 100 100 100 100 100 100 100 
##$AQSEQ= 0
##$AQ_mod= 1
##$AUNM= <au_zg>
##$AUTOPOS= <>
##$BF1= 81.014009
##$BF2= 200.13
##$BF3= 200.13
##$BF4= 200.13
##$BF5= 200.13
##$BF6= 200.13
##$BF7= 200.13
##$BF8= 200.13
##$BYTORDA= 1
##$CFDGTYP= 0
##$CFRGTYP= 5
##$CHEMSTR= <none>
##$CNST= (0..31)
1 1 145 1 1 1 1 1 1 1 1 1 1 1 1 1 1 1 1 1 1 1 1 1 1 1 1 1 1 1 1 1 
##$CPDPRG= <waltz16>
##$CPDPRG1= <>
##$CPDPRG2= <waltz16>
##$CPDPRG3= <>
##$CPDPRG4= <mlev>
##$CPDPRG5= <mlev>
##$CPDPRG6= <mlev>
##$CPDPRG7= <mlev>
##$CPDPRG8= <mlev>
##$CPDPRGB= <>
##$CPDPRGT= <>
##$D= (0..31)
0 1 0 0 0 0 0 0 0 0 0 0.03 2e-05 3e-06 0 0 0 0 0 0 0 0 0 0 0 0 0 0 0 0 
0 0 
##$DATE= 1617353279
##$DBL= (0..7)
120 120 120 11 120 120 24 19 
##$DBP= (0..7)
150 150 150 150 150 150 150 150 
##$DBP07= 0
##$DBPNAM0= <>
##$DBPNAM1= <>
##$DBPNAM2= <>
$$ [...]
##$SUBNAM3= <"">
##$SUBNAM4= <"">
##$SUBNAM5= <"">
##$SUBNAM6= <"">
##$SUBNAM7= <"">
##$SUBNAM8= <"">
##$SUBNAM9= <"">
##$SW= 501.771253377433
##$SWIBOX= (0..15)
0 1 3 0 0 0 0 0 0 0 0 0 0 0 0 0 
##$SW_h= 40650.406504065
##$TD= 32768
##$TD0= 1
##$TE= 0
##$TE2= 300
##$TE3= 300
##$TEG= 300
##$TL= (0..7)
0 120 53 12 22 120 120 120 
##$TP= (0..7)
150 150 150 150 150 150 150 150 
##$TP07= 0
##$TPNAME0= <>
##$TPNAME1= <>
##$TPNAME2= <>
##$TPNAME3= <>
##$TPNAME4= <>
##$TPNAME5= <>
##$TPNAME6= <>
##$TPNAME7= <>
##$TPOAL= (0..7)
0.5 0.5 0.5 0.5 0.5 0.5 0.5 0.5 
##$TPOFFS= (0..7)
0 0 0 0 0 0 0 0 
##$TUNHIN= 0
##$TUNHOUT= 0
##$TUNXOUT= 0
##$USERA1= <user>
##$USERA2= <user>
##$USERA3= <user>
##$USERA4= <user>
##$USERA5= <user>
##$V9= 5
##$VALIST= <valist>
##$VCLIST= <CCCCCCCCCCCCCCC>
##$VD= 0
##$VDLIST= <DDDDDDDDDDDDDDD>
##$VPLIST= <PPPPPPPPPPPPPPP>
##$VTLIST= <TTTTTTTTTTTTTTT>
##$WBST= 1024
##$WBSW= 4
##$XGAIN= (0..3)
0 0 0 0 
##$XL= 0
##$YL= 0
##$YMAX_a= 23653
##$YMIN_a= -24972
##$ZGOPTNS= <>
##$ZL1= 120
##$ZL2= 120
##$ZL3= 120
##$ZL4= 120
##$ABSF1= 248.5645
##$ABSF2= -253.2056
##$ABSG= 5
##$ABSL= 3
##$ALPHA= 0
##$AQORDER= 0
##$ASSFAC= 0
##$ASSFACI= 0
##$ASSFACX= 0
##$ASSWID= 0
##$AUNMP= <proc_1d>
##$AZFE= 0.1
##$AZFW= 0.5
##$BCFW= 0
##$BC_mod= 2
##$BYTORDP= 0
##$COROFFS= 0
##$CY= -3
##$DATMOD= 1
##$DC= 0
##$DFILT= <>
##$DTYPP= 0
##$F1P= 0
##$F2P= 0
##$FCOR= 1
##$FTSIZE= 65536
##$FT_mod= 6
##$GAMMA= 0
##$GB= 0
##$INTBC= 1
##$INTSCL= 5.30512e-09
##$ISEN= 30
##$LB= 1
##$LEV0= 0
##$LPBIN= 0
##$MAXI= 10000
##$MC2= 0
##$MEAN= 0
##$ME_mod= 0
##$MI= 50
##$NCOEF= 0
##$NC_proc= -6
##$NLEV= 6
##$NOISF1= 182.463
##$NOISF2= 159.3651
##$NSP= 0
##$NTH_PI= 0
##$NZP= 0
##$OFFSET= 248.5645
##$PC= 4
##$PHC0= -4618.981
##$PHC1= 557.0011
##$PH_mod= 1
##$PKNL= yes
##$PPARMOD= 0
##$PSCAL= 0
##$PSIGN= 0
##$REVERSE= no
##$SF= 81.014009
##$SI= 65536
##$SIGF1= 159.3651
##$SIGF2= -187.1042
##$SINO= 113.3802
##$SIOLD= 16384
##$SREGLST= <1H.CDCl3>
##$SSB= 0
##$STSI= 65536
##$STSR= 0
##$SW_p= 40650.406504065
##$SYMM= 0
##$S_DEV= 0
##$TDeff= 32768
##$TDoff= 0
##$TI= <>
##$TILT= no
##$TM1= 0
##$TM2= 0
##$TOPLEV= 0
##$USERP1= <user>
##$USERP2= <user>
##$USERP3= <user>
##$USERP4= <user>
##$USERP5= <user>
##$WDW= 1
##$XDIM= 65536
##$YMAX_p= 347495354
##$YMIN_p= -13882255
$$ End of Bruker specific parameters
$$ ---------------------------------
##NTUPLES= NMR SPECTRUM
##VAR_NAME=  FREQUENCY,     SPECTRUM/REAL,   SPECTRUM/IMAG
##SYMBOL=    X,             R,               I
##VAR_TYPE=  INDEPENDENT,   DEPENDENT,       DEPENDENT
##VAR_FORM=  AFFN,          ASDF,            ASDF
##VAR_DIM=   65536,         65536,           65536
##UNITS=     HZ,            ARBITRARY UNITS, ARBITRARY UNITS
##FACTOR=    0.620285442955139, 1,           1
##FIRST=     20137.2065510759, 0,            0
##LAST=      -20513.1999529892, 0,           0
##MIN=       -20513.1999529892, -13882255,   0
##MAX=       20137.2065510759, 347495354,    0
$$ Real data points
##PAGE= N=1
##DATA TABLE= (X++(R..R)), XYDATA
$$ [...]
42435a805988O8614J982366J433907q55896k035915n20269J520293J110995p28356
42426A69751l96322K061445K277760j532875n100938m081341j25777K150688J635794
42417b941815P65339J030732J840022K593385K829996J377575j740274l619331
42409B135629j780438J682986K516897L33319j244349l98972O27483j07560j160610
42400B604385o78827L44371J3143j167941j207656K36651J575974J536869K22557
42391C479526j530931k647427k269142q58959j44081p94374j063502P08164L110192
42382b010534L269982J011052r76101j156383p19726n54890M20164K402044K986598
42373D672206P54688j696832j348392L97310P1372j914657k001667J67390R62022
$$ plain form
42435 -1805988 -1737374 244992 1678899 823003 -1212912 -1733181 -212888 898107 169751
42426 169751 -226571 1834874 4112634 2579759 -2521179 -6602520 -6728297 -4577609 -2941815
42417 -2941815 -2176476 -1145744 694278 3287663 6117659 7495234 5754960 2135629
42409 2135629 355191 2038177 4555074 4888393 3644044 3245072 3872555 3764995 2604385
42400 2604385 1925558 2269929 2283072 1115131 -92525 144126 1720100 3256969 3479526
42391 3479526 1948595 -698832 -2967974 -3826933 -3971014 -4765388 -5828890 -5120726 -2010534
42382 -2010534 1259448 2270500 1294399 138016 -581710 -1136600 -716436 1685608 4672206
42373 4672206 5426894 3730062 2381670 2778980 2850352 935695 -1065972 -898582 63440
42364F3440p52830j254441J630146M193058K417389j575892k823161q58485O87455
42355A726679L69493K23472J167902J428082J58473r07232m94652K28575k23572
42346C677220j587584k668321k566326q07632K005938L602845K065930j317094
42338B404976l082196j718453Q87027K170512J395682m68306j722414j031952
42330a165124R27737J618295P6850j170577M6612J643338P23354q19489R86380
42321B867376M677658M398329q08117m722194l144518K04079L34040j402994q62653
42312A541006J479457J853516k27943j700502j288121p33660r55923q12271k574
42303h47015L7596j060078j387052N52003L478570M683739L102035M85160n14398
$$ plain form
42364 63440 -689390 -1943831 -313685 3879373 6296762 4720870 1897709 1039224 1726679
42355 1726679 2096172 2319644 3487546 4915628 5074101 4166869 3672217 3900792 3677220
42346 3677220 2089636 -578685 -3145011 -3952643 -1946705 1656140 3722070 2404976
42338 2404976 -677220 -2395673 -1508646 661866 2057548 1589242 -133172 -1165124
42330 -1165124 -237387 1380908 1457758 287181 333793 1977131 2700485 1880996 2867376
42321 2867376 7545034 11943363 11135246 6413052 3268534 3472613 3806653 2403659 1541006
42312 1541006 3020463 4873979 4646036 2945534 1657413 923753 -32170 -844441 -847015
42303 -847015 -809419 -1869497 -3256549 -2704546 774024 5457763 8559798 9044958 8530560
42294H530560N49220J287641k04915k303485k104937j01260M13808j246629j996985
42285B823018l54107R00049l82098j844175p86597R93662M09511j323453p22737
42276b86927J822130K552536N39070j004591q7090J243914O87349p93477r91620
42267C681294P6676N98400j61808j003964p00149K72000N23210J4650L43896J999883
42257E644088K739590O81900k099273k069992K34070R79186n41455q49477J199771
42248E918408J973736l48507j867324N11502L282952K017313j036967q08486J969675
42239A1612302K232267r66322l595999l464066k169361o79039J478357K738893
42231G187032Q03214k314539k029447J438880K961088P35092j066695L90556K206866
$$ plain form
42294 8530560 9079780 10367421 10162506 7859021 5754084 5652824 6066632 4820003 2823018
42285 2823018 2468911 3368960 2986862 1142687 356090 1349752 1759263 435810 -286927
42276 -286927 1535203 4087739 4626809 3622218 3535128 4779042 5466391 4672914 3681294
42267 3681294 3757970 4356370 4194562 3190598 2490449 2762449 3285659 3300309 3644205 5644088
42257 5644088 8383678 9065578 6966305 4896313 5130383 6109569 5568114 4718637 5918408
42248 5918408 7892144 7543637 5676313 6187815 9470767 11488080 10451113 9642627 11612302
42239 11612302 13844569 12878247 9282248 5818182 3648821 2969782 4448139 7187032
42231 7187032 7990246 5675707 3646260 5085140 8046228 8781320 7714625 8105181 10312047
42222A0312047J309255m80318k24426J174860J226781J66051j06645O64960J250671
42213A5293236P71143j022159l371116l765758l93752L999969M271632K8892l328762
42204A2483325k324425J97073P84088R07691L062370N266138M212361J339147
42196B5927768Q38078L004630M198949K881896J392408J410696J365767n51723
42188D0468469l479282n298909n267638m122843k650953j182579j11944o2777
42180A8291544j076057j821515o09374K132459L452493J303901k568721m937823
42172A4166907n232908m978870m199011j781207J024084J464520n958j7900J844357
42163B284014J938594r92617k922090q92750J944362J391852j107134j217137
$$ plain form
42222 10312047 11621302 11140984 10916558 12091418 13318199 13484250 13377605 14042565 15293236
42213 15293236 16064379 15042220 11671104 7905346 7511594 11511563 15783195 15812087 12483325
42204 12483325 10158900 10355973 11140061 12047752 15110122 20376260 24588621 25927768
42196 25927768 26765846 29770476 33969425 36851321 38243729 39654425 41020192 40468469
42188 40468469 36989187 31690278 26422640 22299797 19648844 18466265 18354321 18291544
42180 18291544 17215487 15393972 14784598 16917057 20369550 21673451 19104730 14166907
42172 14166907 8933999 3955129 -243882 -2025089 -1001005 463515 457557 439657 2284014
42163 2284014 4222608 3229991 307901 -584849 1359513 2751365 1644231 427094
42155D27094J189796K265700M38935j704306j724408l38797K74771q15865k509491
42146b496571k626271k13015K635809K793544M83143o83593R90817K802789K032393
42137E719045j89360j441166j452530p21774J118383K954901J716057k502910
42129E200646m430525p91909L910469L606955l88533k249051j037088q04121k519497
42120D97346k630889R1499K397110K240434J271610N54983j037344k809724j781573
42111a206548J805656L338634O37152k434165j907135P13238J922969J688165
42103D557966J820784J762062K811k102414j845501L62662J419465J56800j363463
42094D771172j330491m74021k39588n69055n21465o879K07643q7832n6243Q95131
$$ plain form
42155 427094 1616890 3882590 4321525 2617219 892811 554014 828785 12920 -2496571
42146 -2496571 -5122842 -5335857 -2700048 93496 576639 -106954 883863 3686652 5719045
42137 5719045 5529685 4088519 2635989 1914215 3032598 5987499 7703556 5200646
42129 5200646 770121 -21788 3888681 7495636 7107103 4858052 3820964 3016843 497346
42120 497346 -2133543 -2042044 355066 2595500 3867110 4422093 3384749 575025 -1206548
42111 -1206548 599108 3937742 4574894 2140729 233594 946832 2869801 4557966
42103 4557966 6378750 8140812 8143623 6041209 4195708 4558370 5977835 6134635 4771172
42094 4771172 3440681 2966660 2727072 2158017 1636552 1629673 1837316 1749484 1693241 2588372
42084B588372J887886J516925j874p50395L18471J808551J701586j94372k431269
42075F443881l482342k323846J016899M292837M197316M84517k732634j925217
42067E971411J216059K502519R68627j028510j981360k154004j385748M63498
42059D572492J544170O7976k172991j952446K25601R97226k34229q39712k7772
42050B180315K90635j030J144166K985000J970674j758883l224050l26049K500807
42041E761585J453591p96307l07433J571989J466735J23561K82343J195597L75477
42032A1127138j205015o53480J472903K062920P50407j52135k46690j108563k203765
42023I843720j265425J164648J881966J92466j111479o77124n07057j769254k498664
$$ plain form
42084 2588372 4476258 5993183 5991309 5240914 5559385 7367936 9069522 8875150 6443881
42075 6443881 2961539 637693 1654592 5947429 10144745 10629262 7896628 5971411
42067 5971411 7187470 9689989 10658616 9630106 7648746 5494742 4108994 4572492
42059 4572492 6116662 6184638 4011647 2059201 2284802 3282028 3047799 2208087 2180315
42050 2180315 2470950 2469920 3614086 6599086 8569760 6810877 3586827 3260778 5761585
42041 5761585 7215176 6418869 6111436 7683425 9150160 9273721 9556064 10751661 11127138
42032 11127138 9922123 9268643 10741546 12804466 13554873 13402738 13156048 12047485 9843720
42023 9843720 8578295 9742943 11624909 11817375 10705896 10028772 9521715 7752461 5253797
42014E253797j251356K43661J97010k50978M97878J304407K21935j842723k043453
42005B330178L93084L196019M022083K865167J390773R30852J334291J263012
41997A7725459l32719k739837l891067k747833q24988n38533k177082l443349
41989A030051k353854K03292J676960J223413N44160J044616J652234O68889j358168
41980D331593k403028j933635j084362k51384J072207K076656J090551j116982
41972A781616j494220N72743J759546o6731k271909j701754L03027O20228k40148
41963g37602L59975J822252J198083j116080j521491M84590J094622j206184k543739
41954b165574R9060L511681K911225p22023k197905K86446L209225L283923J313247
$$ plain form
42014 5253797 4002441 4246102 4443112 4192134 4690012 5994419 6216354 4373631 2330178
42005 2330178 2723262 5919281 9941364 12806531 14197304 15128156 16462447 17725459
41997 17725459 17392740 14652903 10761836 8014003 7189015 6650482 4473400 1030051
41989 1030051 -1323803 -1120511 556449 1779862 2324022 3368638 5020872 5689761 4331593
41980 4331593 1928565 -5070 -1089432 -1340816 -268609 1808047 2898598 1781616
41972 1781616 287396 860139 2619685 2552954 281045 -1420709 -1117682 -497454 -737602
41963 -737602 -377627 1444625 2642708 1526628 5137 489727 1584349 378165 -2165574
41954 -2165574 -2066514 1445167 4356392 3634369 1436464 1722910 4932135 8216058 9529305
41945I529305l61486j252036j898128j744163o4533J845538J572889j071432l233231
41936C322723k433412K33738J625103P71737j31110P49858K175340J869903o8912
41927H114968j537166j458895n94938L21673J289141J842614J132210l94240j182634
41918G532733r43093r88678j607514j252673N06796J447976k7827j944145j492446
41909A231129O01450J255075j06552r17393J58033J229741N57952o70896n78185
41900B760354L92474O93533M92787R98052J689287O43330k174942l966418k353560
41891h25103J569432M354270L838847J086281j019289p70415O80836P09554j554133
41882H070280l877224l404020J6225L846568N682559M911488K203503q35675j777372
$$ plain form
41945 9529305 9167819 7915783 6017655 4273492 4208959 6054497 7627386 6555954 3322723
41936 3322723 889311 1123049 2748152 3519889 3388779 4138637 6313977 8183880 8114968
41927 8114968 6577802 5118907 4523969 4845642 6134783 7977397 9109607 8715367 7532733
41918 7532733 6589640 5600962 3993448 2740775 3247571 4695547 4667720 2723575 1231129
41909 1231129 1832579 3087654 2981102 2063709 2221742 3451483 4009435 3338539 2760354
41900 2760354 3152828 3846361 4339148 5337200 7026487 7669817 5494875 1528457 -825103
41891 -825103 744329 5098599 8937446 10023727 9004438 8234023 8914859 9624413 8070280
41882 8070280 4193056 789036 805261 4651829 10334388 15245876 17449379 16613704 14836332
41873A4836332N38603L640930L599807L99845j543297L51027L102752L211068
41865B8137067K377261M268484P850645R080529Q190714R167873J1215121P390970
41857H7678664m806873j6977041j9220717j2596742o478630n604929o129047m148555
41849A1716130j416358n45449j58494J600546K721913O50822k710912l625142
41841H233056k439534k426135l586100k528990J010964K516233l89125l629015
41833c238646k597693Q70807J678416m72529j123827J353695L286453J925492
41825A682168l24625k15379J373848J793293J262844J628558K206915O81410k431331
41816G657701l768826j916635O72140J262090m612j387939k006028j928253j228044
$$ plain form
41873 14836332 15374935 19015865 22615672 23015517 21472220 21823247 24925999 28137067
41865 28137067 30514328 34782812 42633457 51713986 59904700 69072573 80287694 87678664
41857 87678664 82871791 65894750 46674033 34077291 27598661 21993732 15864685 11716130
41849 11716130 10299772 9754323 9595829 11196375 13918288 14569110 11858198 8233056
41841 8233056 5793522 3367387 -218713 -2747703 -1736739 779494 390369 -3238646
41833 -3238646 -5836339 -4965532 -3287116 -3759645 -4883472 -3529777 -243324 1682168
41825 1682168 1357543 1142164 2516012 4309305 5572149 7200707 9407622 10089032 7657701
41816 7657701 3888875 1972240 2644380 3906470 3901858 2513919 507891 -1420362 -2648406
41807b648406j8294J277960K192635K278209J134697q01603k000242j536185m58556
41798e79785j17666k0862P77334J169100m34376k597894k176097P06618K386481
41789h87147J185583k11948N62361J745395O65367j717675k258387j28195K525815
41780A481169L465256K102354o13064k490616j472954J714101L495491J611464
41772I293201j896368l487975k563574j184686n80604k39866J16392r7865q85331
41763a526676j159131n7973J880998K873330J309489k090970l841852j314262
41755c927047L103419M150631P77041k183543j180299Q15305n27618l595411l332910
41746e900432N61261L062216J490322r59504p06831J051103R88384j057486k133162
$$ plain form
41807 -2648406 -2666700 -1388740 803895 3082104 4216801 3415198 1414956 -121229 -579785
41798 -579785 -697451 -718313 59021 1228121 793745 -1804149 -3980246 -3273628 -887147
41789 -887147 298436 86488 648849 2394244 3059611 1341936 -916451 -1044646 1481169
41780 1481169 4946425 7048779 6435715 3945099 2472145 4186246 7681737 9293201
41772 9293201 7396833 3908858 1345284 160598 -420006 -659872 -543480 -641345 -1526676
41763 -1526676 -2685807 -2743780 -862782 2010548 3320037 1229067 -2612785 -3927047
41755 -3927047 -823628 3327003 4104044 1920501 740202 1555507 1027889 -2567522 -5900432
41746 -5900432 -5339171 -2276955 -786633 -1746137 -2452968 -1401865 -413481 -1470967 -3604129
41737c604129n72445J808493K162867J72361j623725j142121M03560K25628j719148
41728c888659k252301L51734L437833L514481R73973r76230q55285L7115L67208
41719G09869K05213n7918l28627m06018k43269k15230k19161M60012J435601J022309
41709B362781q80982j730915r6529J617784O70071j751261k586908j486088l01256
41700d183303L60877Q95537O16617o97111q28088J624733L772446K422608k09524
41691C774792K52073K781148K433431j155714l068938j472417l24614k018331
41683A201430l305853j316949J467164J549018k99559j267296q05517K3990P45555
41674b008017R13271J6893p04897N17742K119780O43593l001117l797347p49383
$$ plain form
41737 -3604129 -4176574 -2368081 -205214 -32853 -1656578 -2798699 -2395139 -2169511 -3888659
41728 -3888659 -6140960 -5789226 -2351393 1163088 2137061 1160831 305546 342661 709869
41719 709869 915082 857164 528537 122519 -120750 -335980 -555141 -95129 1340472 2362781
41709 2362781 1481799 -249116 -345645 1272139 1942210 190949 -2395959 -3882047 -4183303
41700 -4183303 -3822426 -2926889 -2310272 -3007383 -3835471 -2210738 1561708 3984316 3774792
41691 3774792 4026865 6808013 9241444 8085730 5016792 3544375 3219761 1201430
41683 1201430 -2104423 -3421372 -1954208 -405190 -704749 -1972045 -2777562 -2753572 -2008017
41674 -2008017 -1094746 -1077853 -1782750 -1265008 854772 1498365 -1502752 -5300099 -6049482
41665f049482J085994o94882j494810J857159M699242K275977j679771j091103
41657a091676K111512J649451k053677k858689L66937K301014O26733q26295K08797
41648D34107O57449j500863l112854j341808J509877K053174R48457O88840J178870
41639A515249P68666l08469m39534N41863J161957L61437j353166k238102p39444
41630g29543K203474K881644q54889n455860n123500K95227M555535L341217l87939
41621G25366j508789K09086J277144K84710j049485j415506j213036o69474N92901
41612b767083J960968J976593N01199q41726q13502J166K67274m09024j178154
41603a302289r31495M37015J605990J108255p15121j833290j151212n0488k84353
$$ plain form
41665 -6049482 -4963488 -5658370 -7153180 -5296021 -596779 1679198 -573 -1091676
41657 -1091676 1019836 2669287 615610 -2243079 -1876142 424872 1051605 225310 434107
41648 434107 1091556 -409307 -3522161 -4863969 -3354092 -1300918 -352461 336379 1515249
41639 1515249 2283915 1975446 1535912 2077775 3239732 3601169 2248003 9901 -729543
41630 -729543 1473931 4355575 3500686 -1955174 -7078674 -6783447 -2227912 1113305 725366
41621 725366 -783423 -574337 702807 987517 -61968 -1477474 -2690510 -3359984 -2767083
41612 -2767083 -806115 1170478 1671677 829951 16449 17615 284889 -124135 -1302289
41603 -1302289 -2233784 -1796769 -190779 917476 202355 -1630935 -2782147 -2832635 -3116988
41594c116988j225884q46731Q79433J540381j07177j845746q81471J936684K887772
41585g79727N00589k204582j789938R36044K329211J049502p09184j007486m46590
41576b122161M4606R65324K242035J972333n47596k569755j460678J020881J218179
41567G63168o98485j185683P60561K102323R25708o34944k75566Q61673O36432
41558C255187n51314j066274q99543q21838l60077Q95051J435660n512j636093
41549B45247r10746J162381J304991p08055j583881O9478J492539N16424p56453
41540H31925L75123K377125J724488j342287k961871j456469M48045J41098j091191
41531i54014o29120J268182K154724J155880k91912j001833j147888q07292M38219
$$ plain form
41594 -3116988 -4342872 -5189603 -4310170 -2769789 -2876966 -4722712 -5604183 -3667499 -779727
41585 -779727 -279138 -2483720 -4273658 -3337614 -1008403 41099 -668085 -1675571 -2122161
41576 -2122161 -2077555 -1112231 1129804 3102137 2554541 -15214 -1475892 -455011 763168
41567 763168 64683 -1121000 -360439 1741884 2667592 2032648 1757082 2618755 3255187
41558 3255187 2703873 1637599 738056 -83782 -443859 451192 1886852 1881340 245247
41549 245247 -665499 496882 1801873 1093818 -490063 -420585 1071954 1588378 831925
41540 831925 1207048 3584173 5308661 3966374 1004503 -451966 -3921 137177 -954014
41531 -954014 -1583134 -314952 1839772 2995652 2703740 1701907 554019 -253273 184946
41522A84946J839408J415480j184943l263312k204588Q58247K395417J177044
41514A217699m09740j36404R70985O40436r45364j454583j3458J519750J327258
41505B716579j6856q78399q48770m55059K29071J045743P28870j500445l700625
41496b679891k925986N57592L074534K282496r0669j305087j154466q54859m43819
41487c540155N58741J363851R82779J6766n09211q52580j210143l78141J779044
41478a789049K410484m01444l382197j973429K348725L583978K49550k355328
41470a308710m76153K572151K121286p93080j928478n03867O92081K17341p12342
41461a19771j085453j213205j236166p94484j8875P09372J459838K012397J446884
$$ plain form
41522 184946 2024354 3439834 2254891 -1008421 -3213009 -2354762 40655 1217699
41514 1217699 807959 671555 1642540 2282976 1337612 -116971 -130429 1389321 2716579
41505 2716579 2699723 1821324 972554 517495 746566 1792309 2521179 1020734 -2679891
41496 -2679891 -5605877 -5048285 -1973751 308745 218076 -1087011 -2241477 -3096336 -3540155
41487 -3540155 -2981414 -1617563 -634784 -618018 -1127229 -1979809 -3189952 -3568093 -1789049
41478 -1789049 621435 219991 -3162206 -5135635 -2786910 797068 1046618 -1308710
41470 -1308710 -1784863 787288 2908574 2115494 187016 -316851 375230 592571 -119771
41461 -119771 -1205224 -2418429 -3654595 -4449079 -4467954 -3758582 -2298744 -286347 1160537
41452A160537k36485j339038p14827N19599R18008Q20559J017440R83228K00589
41443C329610m20163k78642m88097j609401j943443l48467J252281P98741m35124
41434a42705k49103N22750j21282j197515l57901J468767J199456j132029k281423
41425b290985r62475P00102J112670R46588N22835r12913k551018k046365P77429
41416d704132L149126L137171J556465l75048k313187l219408j765231Q68973
41408c665271J752512N89855O9301J013190R70499r64967j949076k28813J519670
41399h93100N60896j355400j072521Q87141J729307R78629L17524K20823j05801
41390A267498m42577r0169J50648p78592j747165r20667R02638J183715l53935
$$ plain form
41452 1160537 924052 -414986 -1129813 -610214 307794 1128353 2145793 3129021 3329610
41443 3329610 2909447 2630805 2142708 533307 -1410136 -1758603 -506322 292419 -142705
41434 -142705 -391808 130942 9660 -1187855 -1545756 -76989 1122467 -9562 -2290985
41425 -2290985 -3253460 -2553358 -1440688 -494100 28735 -884178 -3435196 -5481561 -4704132
41416 -4704132 -1555006 1582165 3138630 2763582 450395 -2769013 -4534244 -3665271
41408 -3665271 -1912759 -1322904 -1253603 -240413 730086 -234881 -2183957 -2412770 -893100
41399 -893100 -332204 -1687604 -2760125 -1872984 -143677 834952 1152476 1373299 1267498
41390 1267498 824921 734752 885400 106808 -1640357 -2561024 -1658386 -474671 -828606
41381h28606j244599j1782J886591K334590J052637o39564j274267k49828J540225
41372B565397K156537O85852j450236k286382j823573j429668j379962p52985
41364c715020M68835J029003L27215p93430j423876j368331l75347J798043L991565
41355f1343L915384J004397k077295k299326k29323M95656j934315m637156l506870
41346i330191J152936M558114L501168L46529o59157P05095J133794o65634k302428
41337a559774j905241o29631K79772J683312L667418L467715n22249m796249m618465
41328d933392p53914J695040Q57839J35658J801074K992000O85669k739242k687627
41319b946895O77996K674925J023690j237368p40967J457715K136586P64379m77475
$$ plain form
41381 -828606 -2073205 -2084987 -198396 2136194 3188831 2549267 1275000 1025172 2565397
41372 2565397 4721934 5407786 3957550 1671168 -152405 -1582073 -2962035 -3715020
41364 -3715020 -3246185 -2217182 -1889967 -2683397 -4107273 -5475604 -5850951 -4052908 -61343
41355 -61343 3854041 4858438 2781143 481817 252494 748150 -1186165 -5823321 -9330191
41346 -9330191 -8177255 -3619141 -117973 228556 -430601 274494 1408288 742654 -1559774
41337 -1559774 -3465015 -4094646 -3814874 -2131562 1535856 5003571 4481322 -314927 -4933392
41328 -4933392 -5687306 -3992266 -3134427 -2998769 -1197695 1794305 2479974 -259268 -2946895
41319 -2946895 -2268899 406026 1429716 192348 -548619 909096 3045682 3810061 3332586
41310C332586m95885m49559j147580j628485j012044J0131M46338M10989L75362
41301a58147K30215j4126K05751Q16772P98489R9959K86651J811237K393771L19457
41291F790029k170860j690811R88167J759292p80770l439452l197186q32298J256258
41282a317631K100273J755355L62584r39714m91920J050078P80712j894662l423872
41273b018797j154785K274587K636782K97263q32315N78848J913293J199204l78269
41264D515811j147661j250912j293405r91655k85909m0673o15809j135637r41320
41255c187170m22384J86385J265236K301971J676969p47210k364630r75547J794996
41246d71384K327277p1430k251997j650348L92793R65984k52806j035216j84950
$$ plain form
41310 3332586 2836701 2387142 1239562 -388923 -1400967 -1390836 -944498 -533509 -158147
41301 -158147 72068 57942 263693 1080465 1878954 1978913 2265564 4076801 6470572 6790029
41291 6790029 4619169 2928358 3916525 5675817 4895047 1455595 -1741591 -2573889 -1317631
41282 -1317631 782642 2537997 2900581 1960867 1468947 2519025 3299737 1405075 -2018797
41273 -2018797 -3173582 -898995 1737787 2035050 1202735 1781583 3694876 4894080 4515811
41264 4515811 3368150 2117238 823833 -167822 -453731 -494404 -1110213 -2245850 -3187170
41255 -3187170 -3609554 -3423169 -2157933 144038 1821007 1073797 -1290833 -2266380 -471384
41246 -471384 1855893 1784463 -467534 -2117882 -1725089 -759105 -1011911 -2047127 -2232077
41237b232077R50817Q06833l06680j182927j389892j035405j38721O71142J53480
41228c703430j429072j582771J052934L849397L300306J79870j524800n98162
41220d55728O0227j326248k593525j668765L1871N65811P96331J929555K383784
41211b76687M93144j793130j653029j99782m83185j856479r27451K177738L364247
41202a154614J151360r40678k12942J304481J107306M24596J046555J341139o95506
41193C371697k970286k204949L63903P83009j000621j214672R36762J667919p22577
41184i89815k415352j48268L229585L093960O3988j673823j187743j118575j921609
41175c067652r75899J835869K669563k5327k153829j45307L026290K256629j565641
$$ plain form
41237 -2232077 -1281260 -474427 -781107 -1964034 -3353926 -4389331 -4528052 -3856910 -3703430
41228 -3703430 -5132502 -6715273 -5662339 -1812942 1487364 1667234 142434 -455728
41220 -455728 -395501 -1721749 -4315274 -5984039 -5952168 -5386357 -4590026 -2660471 -276687
41211 -276687 216457 -1576673 -3229702 -3429484 -3912669 -5769148 -6696599 -4518861 -1154614
41202 -1154614 -3254 -943932 -1156874 147607 1254913 1679509 2726064 4067203 3371697
41193 3371697 401411 -1803538 -1439635 -656626 -1657247 -2871919 -1935157 -267238 -989815
41184 -989815 -3405167 -3553435 -323850 2770110 2834098 1160275 -27468 -1146043 -3067652
41175 -3067652 -4043551 -2207682 461881 436554 -1717275 -1862582 1163708 3420337 1854696
41166A854696k855296k8672K263689O12566k062815j447647J547861K610185O64780
41157C159347j028071k03850J241801N02466j951287l201282j901556K95677J278525
41148a808230R71051O54367Q09595P83190K63443j27366R0425N86181R70612J261657
41138D454925J171151J7420j913866k988726k252604r49754p87925j420039j101680
41129e771098N49848J940993J643351j4073j584337j908874r38466K46825N28412
41120e307419K59670Q77104K462469L063008J605479o756M59143K033287J923176
41111G369161l05127k277714k229992p26895Q08579J304415J42196j914701k418337
41102b48415j10463K542606K304156l3404j021258k77992q38969l310598m001160
$$ plain form
41166 1854696 -1000600 -1029272 1234417 1846983 -215832 -1663479 -115618 2494567 3159347
41157 3159347 2131276 1927426 3169227 3671693 1720406 -1480876 -3382432 -3086755 -1808230
41148 -1808230 -837179 -182812 626783 1409973 1673416 1546050 1636475 2222656 3193268 4454925
41138 4454925 5626076 5643496 3729630 740904 -1511700 -2461454 -3249379 -4669418 -5771098
41129 -5771098 -5221250 -3280257 -1636906 -1650979 -3235316 -5144190 -6082656 -5835831 -5307419
41120 -5307419 -5047749 -4170645 -1708176 1354832 2960311 2953555 3412698 5445985 7369161
41111 7369161 7064034 4786320 2556328 1829433 2638012 3942427 4084623 2169922 -248415
41102 -248415 -358878 2183728 4487884 4454480 3433222 3155230 2316261 -994337 -4995497
41093d995497p11530L257062L490342K93041k452086k449405o78518Q41702J042896
41084b361993K99111J7320R07706J447625k24595k783898k726419L73129K624509
41075b427505J323913j232204j538282R4416Q86771K8057r08387p25487M88806
41066d009902K185029L228503K113735r01173l050716k250154P3362J090742M35909
41057a084665P7132J066434K236854J976408J47140j752157k037913q26567j85916
41048c83250j278687k230230q54892J417050J418851l84869k96992K437494M082770
41039C927245K341332k56963p96244l4430J44684j63041n23914j538866k531334
41030E68469j427779J118509J537638o64028j435743P61094J836406n33639k233266
$$ plain form
41093 -4995497 -5707027 -2449965 1040377 1333418 -1118668 -3568073 -4246591 -3404889 -2361993
41084 -2361993 -2062882 -2045562 -1137856 309769 85174 -2698724 -5425143 -5052014 -2427505
41075 -2427505 -1103592 -2335796 -3874078 -3779662 -2892891 -2864834 -3773221 -4498708 -4009902
41066 -4009902 -1824873 1403630 3517365 2616192 -434524 -2684678 -2611316 -1520574 -1084665
41057 -1084665 -1007533 58901 2295755 4272163 4419303 2667146 629233 -197334 -383250
41048 -383250 -1661937 -3892167 -4747059 -3330009 -1911158 -2296027 -2593019 -155525 3927245
41039 3927245 6268577 6011614 5215370 5180940 5325624 5162583 4638669 3099803 568469
41030 568469 -859310 259199 1796837 1132809 -302934 458160 2294566 1760927 -472339
41021d72339j00506J878339k50338k572791K597L940329K476996k615435l849586
41012a562734n11298J152772o02343j023602J127434J099622k273146l411516
41004f004811L19232L627460K054261j105879j175679M15516j04493k170449k715504
40995f860346j291240O03456K354953L214593J600076j634378k598809m0139J947396
40986b704438J97927k252304j261383J374352R59476k185534l159188j48455L161453
40977f018094L351038J528345N40894P74207N64791o71873j535070p30034J061026
40968a134770K027582J521660M89149l69705j311218j891508p59647J482164J715594
40959A769301r53053k479641M55044M339380L255470j942316m587013k240418
$$ plain form
41021 -472339 -572845 1305494 1055156 -1517635 -1515038 2425291 4902287 2286852 -1562734
41012 -1562734 -2074032 -921260 -1523603 -2547205 -1419771 -320149 -2593295 -6004811
41004 -6004811 -5685579 -2058119 -3858 -1109737 -2285416 -1869900 -1974393 -4144842 -6860346
40995 -6860346 -8151586 -7548130 -5193177 -1978584 -378508 -2012886 -4611695 -4651834 -2704438
40986 -2704438 -2506511 -4758815 -6020198 -4645846 -3686370 -5871904 -9031092 -9179547 -6018094
40977 -6018094 -2667056 -1138711 -597817 176390 741181 69308 -1465762 -2195796 -1134770
40968 -1134770 892812 2414472 2903621 2533916 1222698 -668810 -1428457 53707 1769301
40959 1769301 816248 -1663393 -1208349 3131031 6386501 4444185 -142828 -2383246
40951b383246K90076p25949k484244j229967J619548K495852J255385J93158m861
40942i74248k04912m93357l52484J41192P74398J402332J088114q15250k490452
40933a924667j527500P92176Q51282j142305r96342K110411L334385q7485l786610
40924b376655k798464J012577K516804J054808j13924K08389M03491q0312k22611
40915c95897l9476l17388m80247L64598J140403L41472j027739p76392R09370
40906b81296J753402P54045q84076j748453j422281k39681P78059M70915q94566
40897a713932j578777o90752P43825J610986J857624J331669k68851j706159j138252
40888a552619N43486M21844j505597j771939P65796K661235J553817m2541M99835
$$ plain form
40951 -2383246 -2093170 -2819119 -5303363 -6533330 -4913782 -2417930 -1162545 -969387 -974248
40942 -974248 -1179160 -1672517 -2025001 -1883809 -1109411 292921 1381035 565785 -1924667
40933 -1924667 -3452167 -2659991 -1808709 -2951014 -3947356 -1836945 1497440 1409955 -2376655
40924 -2376655 -5175119 -4162542 -1645738 -590930 -704854 -496465 -92974 -173286 -395897
40915 -395897 -435373 -752761 -1233008 -868410 271993 613465 -414274 -1190666 -281296
40906 -281296 1472106 2226151 1342075 -406378 -1828659 -2068340 -1290281 -819366 -1713932
40897 -1713932 -3292709 -3983461 -3239636 -1628650 228974 1560643 1291792 -414367 -1552619
40888 -1552619 -1009133 -587289 -2092886 -3864825 -3099029 -437794 1116023 1073482 1573317
40879A573317J347044o2186k191101k230695q40814j55090L28627J894322L002325
40870B665749J583105r95700k016912j613245j368539q14607R98428K499202J914668
40861B852149N68686K10175n46605l020643m294218j200984L494552M229287P42427
40852C034826k120691j883722o33394j68839Q4073K52158m19894j015328O6539
40843b804272J684526J367479k70756n32799N31655N99534k01297K94845J551657
40834B220572J024563m70675N26757L500385L648781l82580l809762k936236k78084
40825C043721K53309q38825q03955N34674J302694Q43262n9452p22171o66018
40816B887239L01689J077062J75775j613586j769441O667J016339j46587j296779
$$ plain form
40879 1573317 2920361 2858175 667074 -1563621 -2404435 -2559525 -2230898 -336576 2665749
40870 2665749 4248854 3253154 1236242 -377003 -1745542 -2560149 -1561721 937481 2852149
40861 2852149 3420835 3631010 3084405 63762 -4230456 -5431440 -1936888 2292399 3034826
40852 3034826 914135 -969587 -1602981 -1771820 -1687747 -1435589 -1855483 -2870811 -2804272
40843 -2804272 -1119746 247733 -23023 -555822 -24167 575367 374070 668915 2220572
40834 2220572 3245135 2774460 3301217 6801602 10450383 10067803 6258041 3321805 3043721
40825 3043721 3297030 2458205 1654250 2188924 3491618 4334880 4275428 3553257 2887239
40816 2887239 3188928 4265990 4441765 2828179 1058738 1065405 2081744 1935157 638378
40807F38378k94706J471121J321129p44360k383146k191565r49942q2236k6448
40798c241775p3924N22922J335552J221740K67836n5428M97053Q3058j876075
40789a319041k719984n16885K089209J454863j246058j811517L66124J823785
40781a879504R25730r3739N82846J909939K489842K161095O98762j759590k936013
40772B099368p38020K551892K436041j134981l509669k311191j70054M72212O18128
40763C13726J226546R79817m42476r31340J64755O04081l72286l26438J575693
40754B792078K356293M36305j234203l53433O30314p33575k044242l51037K079887
40745C578387J276749j652692k425073o57345J51608j010486j371549K76142J466100
$$ plain form
40807 638378 343672 1814793 3135922 2391562 8416 -2183149 -3133091 -3215327 -3241775
40798 -3241775 -3315699 -2792777 -1457225 -235485 32351 -23077 473976 557034 -1319041
40789 -1319041 -4039025 -4555910 -2466701 -1011838 -2257896 -4069413 -3703289 -1879504
40781 -1879504 -953774 -1047513 -464667 1445272 3935114 6096209 6794971 5035381 2099368
40772 2099368 1361348 3913240 6349281 5214300 1704631 -606560 -776614 -304402 313726
40763 313726 1540272 2520089 2077613 1146273 1311028 1915109 1542823 1216385 2792078
40754 2792078 5148371 5584676 4350473 3997040 4627354 3893779 1849537 1498500 3578387
40745 3578387 4855136 3202444 777371 120026 271634 -738852 -2110401 -1834259 -368159
40736c68159M64185q62538k75509J361706J681361K50493j247047j444306o14952
40727a054766K12865N77964P27013P87388M19321m63063j248139j431449j148821
40718b621687k92266J661183L799525L493341R3932k799304j827521Q20305N64459
40709B891967k049674k003311J791576M241136J967957j670806k303714q52421
40701B012710n69592j370466j099550J09256N66739L42116N50219Q08433K13497
40692A563362n95419p47872q48178j240757o92029R79668J518487N2456n95010
40683f05292J396065K872140N15577l069742k959587L50716K117321J085032M32202
40674B134432J241068Q10032j555013k449161r6231K312454J579380p48368j326472
$$ plain form
40736 -368159 96026 -766512 -1042021 319685 2001046 2251539 1004492 -439814 -1054766
40727 -1054766 -841901 -263937 463076 1250464 1669785 1206722 -41417 -1472866 -2621687
40718 -2621687 -2913953 -1252770 2546755 6040096 6134028 3334724 1507203 2327508 2891967
40709 2891967 842293 -1161018 630558 4871694 6839651 5168845 2865131 2012710
40701 2012710 1443118 72652 -1026898 -917642 -350903 -8787 541432 1349865 1563362
40692 1563362 967943 220071 -628107 -1868864 -2560893 -1581225 -62738 -10282 -605292
40683 -605292 790773 3662913 4178490 1108748 -1850839 -1500123 617198 1702230 2134432
40674 2134432 3375500 4185532 2630519 181358 85127 2397581 3976961 3228593 1902121
40665A902121O9867J320196J521366J123183O8422j697577k880016k181820l55570
40656a109828Q19346R59897R10076Q46524K67761n34963o61088j14763L21393
40647A704355N63715J035601J131718j86553j942738j548865J206238K783350
40639D746821N60507k908183l152621k11549J676149N81090q26363l39921M45800
40630E71730j67052o45953N54946J618002N90683p42692M2898J562181J424251
40621D808994J002440K460302L319978J47285l805158j913004M739436P270828
40613A8031101J896178m411289m539626r46071q5866k509640m059160l243826
40605A31801j921612q64558O10056J998634K302111K044485J831992P73560j183970
$$ plain form
40665 1902121 1971988 3292184 4813550 5936733 6005155 4307578 1427562 -754258 -1109828
40656 -1109828 -290482 669415 1579491 2426015 2693776 2158813 1497725 1382962 1704355
40647 1704355 2268070 3303671 4435389 4248836 2306098 757233 1963471 4746821
40639 4746821 5307328 2399145 -753476 -965025 711124 1292214 465851 125930 571730
40630 571730 404678 -241275 313671 1931673 2522356 1779664 1822562 3384743 4808994
40621 4808994 5811434 8271736 11591714 11738999 7933841 6020837 10760273 18031101
40613 18031101 19927279 15515990 10976364 10030293 9944427 7434787 3375627 131801
40605 131801 -1789811 -2654369 -2044313 -45679 2256432 4300917 6132909 6906469 5722499
40596E722499j868053n30944K4286j927521l425353j542894J385404J602829K18913
40587c40834P37324K479500J841092j110875k555068j056508Q81984J401986J297832
40578C576433J311695J037920O43779O32496K03241j323903k342867j283979J65925
40569B620740l40162j435848l72278J578725Q45467j980531k524817L10372K571855
40560A273523J445572j092417j971200o95741J638890L673440L521553M98088
40552H291708k574747k270757J82854N08181j709707k371249J90261K562661K072063
40543D881268N26869J09078m3493p25643l13552J641095K261761n0348k208025
40534F079010j002137J804962K446565P84387o19712j119463j978900k997321
$$ plain form
40596 5722499 3854446 3323502 3347788 1420267 -2005086 -3547980 -2162576 -559747 -340834
40587 -340834 396490 2875990 4717082 3606207 1051139 -5369 876615 2278601 3576433
40578 3576433 4888128 5926048 6569827 7202323 7405564 6081661 3738794 2454815 2620740
40569 2620740 2280578 844730 472452 2051177 2896644 916113 -1608704 -1298332 1273523
40560 1273523 2719095 1626678 -344522 -1040263 598627 4272067 7793620 8291708
40552 8291708 5716961 3446204 3629058 4137239 2427532 56283 246544 2809205 4881268
40543 4881268 5408137 5517215 5473722 4748079 4434527 6075622 8337383 8287035 6079010
40534 6079010 5076873 6881835 9328400 10112787 9493075 8373612 6394712 3397391
40526C397391k610830p98862R13172J890426K491260K377860J056986l91364l77293
40517G948746O74004Q82163j50008q22613l6992J357172J857924R57485o38107
40508A2029774j665655j263238J16148R90094N19988n45549j032551p86573l94352
40499G968086j72862j49052m53299r73901j039956j59751J136211J735112J217810
40490I108398M54826P93450K438898L768877L046446R92495L35070K013210L454150
40481B6405820K249607J5550J16563K485216L653888J793487j183778k896861
40473C2639492l102339k368201q71149L84619l25024k620538l466240j202645
40465A9067975J605596J294203k111911n133139n198917l049328r22599J66853
$$ plain form
40526 3397391 786561 -12301 900871 2791297 5282557 7660417 8717403 8326039 7948746
40517 7948746 8622750 9504913 9354905 8532292 8495300 9852472 11710396 12667881 12029774
40508 12029774 10364119 9100881 9217029 10207123 10727111 10181562 9149011 8362438 7968086
40499 7968086 7795224 7646172 7192873 6218972 5179016 5019265 6155476 7890588 9108398
40490 9108398 9563224 10356674 12795572 16564449 19610895 20603390 20938460 22951670 26405820
40481 26405820 28655427 28670977 28787540 31272756 34926644 36720131 35536353 32639492
40473 32639492 29537153 27168952 26297803 26682422 26357398 23736860 20270620 19067975
40465 19067975 20673571 21967774 19855863 14722724 9523807 6474479 5551880 5718733
40457E718733P46248J198041Q65729n54563j548986m39990J529210J218443j431433
40448G301432k474746o0075J893578l10224l544186k415606J615525K056014k141929
40439A919783m778008k257504J438819K131022J503429K160798K313494Q1966
40431D513799j633778J05754K447439J221991j815588k093641j65479k19964k122673
40422B37860j624160J657812L018397N46493j686243l84351K099878K327485R60169
40413G153340L01579O4771j048600k054377j341307N8802o692j092756q56409
40404A178351J070484K513074J983699K92508j226922k172665k341712j271400
40396B5417O35529J758846J114057r6184J50116J961285L159377J940732q19559
$$ plain form
40457 5718733 6464981 7663022 8528751 7974188 6425202 5985212 7514422 8732865 7301432
40448 7301432 4826686 4766611 6660189 6349965 2805779 390173 2005698 4061712 1919783
40439 1919783 -2858225 -5115729 -3676910 -1545888 -42459 2118339 4431833 4513799
40431 4513799 2880021 2985775 5433214 6655205 4839617 2745976 2580497 2360533 237860
40422 237860 -1386300 271512 3289909 3836402 2150159 1765808 3865686 6193171 7153340
40413 7153340 7454919 7519690 6471090 4416713 3075406 3134208 3127516 2034760 1178351
40404 1178351 2248835 4761909 6745608 7038116 5811194 3638529 1296817 25417
40396 25417 660946 2419792 3533849 3437665 3587781 5549066 8708443 10649175 9829616
40387I829616k577306k069486m22359O56508P87679N54503J69989m69084q54842
40378E605218j90557J305443K430916K582719K357792K154404J238877q17753
40370A6667059k570630k123353q2766N85305j564909m130731l831066q59537J609676
40361C699048J854282J273110J329359J328019M92762r086Q24032J416910j16418
40352A2092018k396878k340578J47758K003172J668760R49545J405527J755714
40344A5285038M56835j392141j734706o97331j09222o97413j356821q22119R76664
40335I908784K901878L515598K680941K266151L817689N453622L406060k413547
40327C1537176p002586o347493k637926q17953j822598k537657j333980J35082
$$ plain form
40387 9829616 7252310 5182824 4760465 5416973 6204652 6759155 6929144 6460060 5605218
40378 5605218 5414661 6720104 9151020 11733739 14091531 16245935 17484812 16667059
40370 16667059 14096429 11973076 11890310 12475615 10910706 6779975 2948909 2089372 3699048
40361 3699048 5553330 6826440 8155799 9483818 9976580 9967494 10791526 12208436 12092018
40352 12092018 9695140 7354562 7502320 9505492 11174252 12123797 13529324 15285038
40344 15285038 15741873 14349732 12615026 11917695 11808473 11111060 9754239 8932120 9908784
40335 9908784 12810662 16326260 19007201 21273352 25091041 30544663 33950723 31537176
40327 31537176 24534590 18187097 15549171 14731218 12908620 10370963 9036983 9172065
40319I172065N45392O36501O63596m70558k268239k016594R65581L287801K212948
40310A2728493N9835P59322L700757M656017K110003j096399k562331l010170
40302A7345527l229804k022631P91406K361848N23360k602184l457810j822464
40294G887248j8658R91459J581665R66081j543355l594926k154280J341482K307791
40285G764507j70390k128086j179215L58908M41002P78618K701124L714155J619502
40276A3900125j321284j927055q81326m29229j86469Q68347R80676j420716l703763
40267E879306k635251k2227J34569j582719j364866R09254J720139L53595l06787
40258C085013N09574M32024q84948q91817P40095J277876J91923J57471J654572
$$ plain form
40319 9172065 9717457 10353958 11017554 10546996 8278757 6262163 7227744 10515545 12728493
40310 12728493 12788328 13547650 17248407 21904424 24014427 22918028 20355697 17345527
40302 17345527 14115723 12093092 12884498 15246346 15769706 13167522 9709712 7887248
40294 7887248 7868590 8860049 10441714 11407795 9864440 6269514 4115234 5456716 7764507
40285 7764507 7594117 5466031 4286816 4645724 5086726 5865344 8566468 12280623 13900125
40276 13900125 12578841 10651786 9770460 9341231 9154762 10023109 11003785 9583069 5879306
40267 5879306 3244055 3221828 3356397 1773678 408812 1318066 3038205 3391800 3085013
40258 3085013 3594587 4026611 3141663 2249846 2989941 4267817 4459740 4617211 6271783
40249F271783J784670r2827q63186M44144P01536j184431j773842M56265J734027
40240G478139l75333k277944n72546J894181J112366j159592r54352Q29583O07655
40231F582157j157088j119287O68072J075679l65760r81171J49175J097559P53505
40222F702841p8266r69128j971449j957568o0379J866097J419036m30949q31086
40213C689149L06014O15101l33177o13950K05107L65753n92189q57331M67130
40204C251607J858554J790313O05887n09576q33953k78085M83631M45653j66288
40195F647743L5366Q47723m6367k914617l960976o03911L650839L648622Q9546
40186G393968j942612p39707O93115N90392N56420J309767J220118J65309L06247
$$ plain form
40249 6271783 8056453 7963626 7100440 7544584 8246120 7061689 5287847 5744112 7478139
40240 7478139 7102806 4824862 4252316 6146497 7258863 6099271 5144919 5974502 6582157
40231 6582157 5425069 4305782 4973854 6049533 5683773 4702602 4851777 5949336 6702841
40222 6702841 6624575 5655447 3683998 1726430 1666051 3532148 4951184 4520235 3689149
40213 3689149 3995163 4610264 4277087 3663137 3868244 4233997 3641808 2784477 3251607
40204 3251607 5110161 6900474 7506361 6996785 6162832 5884747 6368378 6814031 6647743
40195 6647743 6683109 7530832 7484465 4569848 608872 4961 3655800 7304422 7393968
40186 7393968 5451356 4711649 5404764 5995156 6551576 7861343 9081461 9246770 9553017
40177I553017J633873J154702j679587l040716o64198K183253J683764q78939
40169I945169j832549q38429j95517k50763O41830K395744K982857J952355J168138
40160A5968835J553653J627872K28336j268655p57296J776436M523996O240868
40152B9894045P149987P827061Q423789Q950936Q989058O859236Q31224p668811
40144G1256525j3674810j3596659r576110o549148n705181m040836m05478J921522
40136A9629825K39619l316252m876311l706932j630336J77923J256736O96262
40128H470534j333953k421765q93070J411854J796742O62474K12218O64172N59955
40119I129161l21102j039400j408853j449777l65663J502880J614674r56186k754119
$$ plain form
40177 9553017 11186890 12341592 10662005 7621289 6957091 9140344 10824108 9945169
40169 9945169 8112620 7274191 7078674 6827911 7469741 9865485 12848342 14800697 15968835
40160 15968835 17522488 19150360 19378696 18110041 17352745 19129181 23653177 29894045
40152 29894045 37044032 44871093 53294882 62245818 71234876 78094112 78925336 71256525
40144 71256525 57581715 43985056 34408946 27859798 22154617 18113781 17708303 19629825
40136 19629825 19869444 16553192 11676881 7969949 6339613 6517536 7774272 8470534
40128 8470534 7136581 4714816 3821746 5233600 7030342 7692816 7905034 8569206 9129161
40119 9129161 8808059 7768659 6359806 4910029 4544366 6047246 7661920 6705734 3951615
40110C951615n91584K997921L176729J25268j724747q09065J29547n55830j369252
40101E330602j309266j193589r84653J39064R26766m75999k207831o10306L216087
40092B830875L995614M12400k675856j874335J29971L6966q69965j99226R80867
40083B767311O06115m83861m25159L78550O62244P25231J044817P73622k06712
40074E842158j82409J320717J963511L37285j362616q70435M77115K96143q46562
40065F974907p96553N75556J704154J903246J532998Q83610L99563M98887K23476
40056A3899844j729265l856284k827439J157981L598642K094644k94991l97552
40048A1645580M49564Q9007l08452M68996K24835k381929l841352j166560K084841
$$ plain form
40110 3951615 3360031 6357952 9534681 9659949 7935202 7126137 7255684 6699854 5330602
40101 5330602 4021336 2827747 1843094 1982158 2908924 2432925 225094 -385212 2830875
40092 2830875 6826489 7238889 4563033 2688698 2818669 2855635 1985670 1786444 2767311
40083 2767311 3373426 2889565 2464406 2842956 3505200 4230431 5275248 6048870 5842158
40074 5842158 5659749 6980466 8943977 9281262 7918646 7048211 7525326 7821469 6974907
40065 6974907 6178354 6753910 8458064 10361310 11894308 12777918 13177481 13676368 13899844
40056 13899844 12170579 8314295 5486856 6644837 10243479 12338123 12043132 11645580
40048 11645580 12095144 12184151 11875699 12344695 12569530 10187601 6346249 5179689 7264530
40039G264530J008724k188141j535777K689781M419978J711346r16444o59986
40031A1794011q6287r89144j015272R76729J839472l38086k384285j197915J323323
40022I922546K050796J632818J937975J814172l36883k422886j696034q810j234970
40013A1658724m535699n122460j623503K044591K885261K420728K524627J860951
40005A2113220p78521k840486j299031K233878L267808O35706k239560k309319
39997H783695l47498J121600J016427q2788j121557j089859K05913J276353M14005
39988A0176291j476967j523493Q09528K450793J314056l25881M50672K209766
39980A4084765J326212j925519l308817r17803J939950J443827j697621l614978
$$ plain form
40039 7264530 8273254 6085113 4549336 7239117 11659095 13370441 12453997 11794011
40031 11794011 11707724 10718580 9703308 10680037 12519509 12181423 9797138 8599223 9922546
40022 9922546 11973342 13606160 15544135 17358307 17021424 14598538 12902504 12893694 11658724
40013 11658724 7123025 2000565 377062 2421653 5306914 7727642 10252269 12113220
40005 12113220 11334699 8494213 7195182 9429060 12696868 13332574 11093014 8783695
39997 8783695 8436197 9557797 10574224 10491436 9369879 8280020 8485933 9762286 10176291
39988 10176291 8699324 7175831 7985359 10436152 11750208 11424327 11874999 14084765
39980 14084765 15410977 13485458 10176641 9258838 11198788 12642615 10944994 7330016
39972G330016k199667R02661K630570J833234J57050l52090r7445r78850k455538
39963F769941j312226K899616N308810K191347k485707j987191L000578N064416
39955A9449584J317722k303884l04686M319192N069715J036840l183065m173504
39947B1227914k509858l96251M65889l31816j211494j9710K535711L056103N21438
39938B3337926j694892r44344P11685L97198q03325m72861L96875o70161k878308
39929A7379793l371320j852093k54724R19173K209177K416720K50445k149998
39921A5547173j482573J380829K382762M52436j324916r30665R1953N3577m44626
39912A5725950m39563j23949L05330Q90352Q07378m62112j110154Q05707L423914
$$ plain form
39972 7330016 5130349 6033010 8663580 10496814 10653864 10301774 10204329 9225479 6769941
39963 6769941 5457715 8357331 13666141 15857488 13371781 11384590 14385168 19449584
39955 19449584 20767306 18463422 18158736 22477928 27547643 28584483 25401418 21227914
39947 21227914 18718056 18321805 18787694 18455878 17244384 17224674 19760385 22816488 23337926
39938 23337926 21643034 20698690 21410375 21807573 21004248 20531387 20928262 20258101 17379793
39929 17379793 14008473 12156380 11901656 12820829 15030006 17446726 17697171 15547173
39921 15547173 14064600 15445429 17828191 18280627 16955711 16025046 16116999 16170576 15725950
39912 15725950 15286387 15162438 15467768 16358120 17165498 16703386 15593232 16398939 19822853
39903A9822853K969675k62682j788267M28846L171740L147899J248121j15255
39895B8622930n24557m23354M44725J389814M99821j808297j898350J866736N803822
39886C3973290N880219L650261L647688O390254P758762M909136m31465m731354
39878F1046791o167960n047119k782856j002503l50009M0005J037829K010909
39870D8785087J990134J572696J957537K545484J441557j599703m480741n345486
39862D6866565m414410k909094j565457p62019q54170j566749j901515j352337
39854C1540814n43337j02480L11592J070137J362396J04737k093850l074799j664955
39845B6910255P64721J938478J337413L99764L31112P46202P24116K80982J19644
$$ plain form
39903 19822853 22792528 22529846 20741579 21170425 24342165 27490064 28738185 28622930
39895 28622930 28098373 27675019 28119744 29509558 30009379 28201082 26302732 28169468 33973290
39886 33973290 39853509 43503770 47151458 53541712 61300474 66209610 65778145 61046791
39878 61046791 54878831 49831712 47048856 46046353 45696344 45736349 46774178 48785087
39870 48785087 50775221 52347917 54305454 56850938 58292495 56692792 52212051 46866565
39862 46866565 42452155 39543061 37977604 37215585 36361415 34794666 32893151 31540814
39854 31540814 30997477 30894997 31206589 32276726 33639122 33743859 31650009 28575210 26910255
39845 26910255 27674976 29613454 30950867 31350631 31681743 32427945 33152061 33433043 33552687
39836C3552687M60397Q95908J201977J617614K322121L106342L589435L498144
39828E0244625K887949K346087K635702L718421M523062M300479L865080M667661
39820G9189066O783414Q763812R645208J0228083J1914626J4940252J8479575
39813A59944036K2318062K7556490L4723796M0763378L8827574K3362018l030170
39806C44465184k8928027m2714632m2343694l5146195k8314117k2512325j5781284
39799A28724910r636012p131965o956081m780796m06015K163248L165579Q794890
39791A13937758J9773603K4398493J1607222j1484706k4822057j9306891o555283
39784A07548139j704176n310329q257876p000001n097071m102443k411218j447302
$$ plain form
39836 33552687 34013084 34908992 36110969 37728583 40050704 43157046 46746481 50244625
39828 50244625 53132574 55478661 58114363 61832784 66355846 70656325 74521405 79189066
39820 79189066 85972480 94736292 104381500 114609583 126524209 141464461 159944036
39813 159944036 182262098 209818588 244542384 285305762 324133336 347495354 344465184
39806 344465184 315537157 272822525 230478831 195332636 167018519 144506194 128724910
39799 128724910 119088898 111956933 105000852 100220056 99814041 101977289 105142868 113937758
39791 113937758 133711361 158109854 169717076 158232370 133410313 114103422 107548139
39784 107548139 105843963 100533634 92275758 85275757 80178686 76076243 73665025 72217723
39776G2217723m238003q126779p054077j663943P36103k340543m898104k650398
39768D1981979O22746M23534j466017j577716o29973m58618j40277O96468l04922
39759C9147204l019330k802489J866680N441673M240394L183510P009072J0880463
39751F5947177Q228316K773290K574642N651567K972562n563255j0122220o984918
39743F5477161l838909n676302o543706j202315M577379L344909j461922j255713
39735E3420582L738131N342977N31278m689009n021289k593135j783322k537381
39727D6408832k152769o90968q95152l362552m787199k237528K298188L767478
39719C8348330N38237l252930l185173k80908J181576l4039j315827r53245p5126
$$ plain form
39776 72217723 67979720 59852941 52798864 51134921 51871024 49530481 44632377 41981979
39768 41981979 42604725 43028259 41562242 39984526 39354553 38895935 38755658 39452126 39147204
39759 39147204 36127874 33325385 35192065 40633738 44874132 48057642 55066714 65947177
39751 65947177 74175493 76948783 79523425 85174992 88147554 82584299 72462079 65477161
39743 65477161 61638252 55961950 49418244 48215929 52793308 56138217 54676295 53420582
39735 53420582 57158713 62501690 63032968 58343959 53322670 50729535 48946213 46408832
39727 46408832 44256063 43565095 42669943 39307391 34520192 32282664 34580852 38348330
39719 38348330 38886567 35633637 32448464 32167556 33349132 33315093 31999266 31046021 30970895
39710C0970895K61418M76689M25561q23527k444246k184943j6520J632809J960902
39701C0259038K660711L839376L042400M385j623905K20900K343232J145407j812190
39692D0079354k466584k58374J823893J705470o9855j856624j932472M92293L425431
39683D0942532L349201L29782r31614K040135M756573K061497l537077n324349
39675D3686680k671362j383871l391966k995036L563720J0501853R677363K118872
39667E9106253l435877k564575q65j251398m434218m009124L60270L334234J756642
39658D8861342j371335k073941j040646j474360l571478m447838k776624m20175
39650C1684945P15951R08205J155656J667194K549147M047135N134384L676843
$$ plain form
39710 30970895 31232313 31709002 32134563 31311036 28866790 26681847 26665327 28298136 30259038
39701 30259038 32919749 36759125 39801525 39805910 38182005 38402905 40746137 41891544 40079354
39692 40079354 37612770 37354396 39178289 40883759 40813904 38957280 37024808 37517101 40942532
39683 40942532 44291733 44621515 43689901 45730036 50486609 52548106 49011029 43686680
39675 43686680 41015318 39631447 36239481 33244445 36808165 47310018 56987381 59106253
39667 59106253 55670376 53105801 53104936 51853538 47419320 43410196 43770466 47104700 48861342
39658 48861342 47490007 45416066 44375420 42901060 39329582 34881744 32105120 31684945
39650 31684945 32400896 33309101 34464757 36131951 38681098 42728233 47862617 51539460
39642E1539460n74909m482985m691286j698890P48331K32961j738063k202499
39634C7132120p24839L89998l09426j301635n81730J153562J728882J017205Q11128
39625C9315265J603089K279918K845362M280294N951925P195141J0958182J9577401
39617I4006577K6058340J8254392l571654k1666482k1051238q276709n29717j740399
39609H1483110j676855M408302R612724R919075J1141629J7128733K3069189K6225592
39601A81311499L1885862M0743344M0615060K1417219q284443l0273856l7782930
39594B39631755l7749617l5913770l0996244k3023846j6805845j4662747j3155841
39587F7323845r591173o050923m744169m243817k733152j246577j483168l039598
$$ plain form
39642 51539460 50964551 46481566 41790280 40091390 40839721 41072682 39334619 37132120
39634 37132120 36407281 36797279 36487853 35186218 34604488 35758050 37486932 38504137 39315265
39625 39315265 40918354 43198272 46043634 50323928 56275853 63470994 74429176 94006577
39617 94006577 120064917 138319309 134747655 113081173 92029935 83753226 83223509 81483110
39609 81483110 79806255 84214557 93827281 103746356 114887985 132016718 155085907 181311499
39601 181311499 213197361 253940705 294555765 315972984 307688541 277414685 239631755
39594 239631755 201882138 165968368 134972124 111948278 95142433 80479686 67323845
39587 67323845 57732672 51681749 46937580 42693763 39960611 38714034 37230866 34191268
39579C4191268m347340m354777k572246N27612K770910K024260q65369k618658
39571B4755660j422453J032881J701102m05583l029438k937295M4010K113339
39563B1852223M42707k183249j126418K594338L605266J121514L12544L148718
39555B9767643M905016L039751K209322N310722O630017J024801o013466n944124
39547D0929682m51144J889179p97891k725201j379789j37685l60150L44109J556485
39538C8867595k6603l273464l085783O55978K270684j43003j920440n45033M38270
39529C3238201j152750k060315k19862J175332j23921j226204Q7280R78323r87694
39520B9708390l072766k187788j8826O25099N12501J238711J530098l9909j948817
$$ plain form
39579 34191268 29843928 25489151 22916905 23444517 26215427 28239687 27374318 24755660
39571 24755660 23333207 24366088 26067190 25661607 22632169 19694874 19738884 21852223
39563 21852223 22294930 20111681 18985263 21579601 25184867 26306381 26618925 29767643
39555 29767643 34672659 37712410 39921732 45232454 51862471 52887272 46873806 40929682
39547 40929682 40478538 42367717 41569826 38844625 37464836 37327151 36967001 37311110 38867595
39538 38867595 38840992 35567528 32481745 33137723 35408407 35265404 33344964 32799931 33238201
39529 33238201 32085451 30025136 29805274 30980606 30856685 29630481 29717761 30696084 29708390
39520 29708390 26635624 24447836 24429010 25054109 25566610 26805321 28335419 28295510 26346693
39511B6346693k498106k479999k521677j419027M79656L79841j891731k449510
39503A3946140J16610J641584o33643k913082j071987K382456K529214k83540
39495A5713752j786385m3827L717063P641222Q984657M790939l308320q586433
39487B7122668p363425l597022j504178R65404N802845P904474K275641n906997
39479B5699410p336229k235164R51146q95068k595102j202899j71308j361080
39471A0853706j455720Q51776J676754o44856j804438Q44328L082134R22968k388379
39462A1938273j775109J416551K208158K12702n78483J211930K772830K321431
39454A9728283J549264K138846L020600K259951k07236k622325l186436j491265
$$ plain form
39511 26346693 23848587 21368588 18846911 17427884 17907540 18287381 16395650 13946140
39503 13946140 14062750 15704334 15070691 12157609 11085622 13468078 15997292 15713752
39495 15713752 13927367 13883540 17600603 25241825 34226482 39017421 35709101 27122668
39487 27122668 19759243 16162221 14658043 15623447 21426292 29330766 31606407 25699410
39479 25699410 18363181 16128017 17079163 16184095 13588993 12386094 12214786 10853706
39471 10853706 9397986 10249762 11926516 11281660 9477222 10321550 13403684 14326652 11938273
39462 11938273 10163164 11579715 13787873 14000575 13422092 14634022 17406852 19728283
39454 19728283 21277547 23416393 26436993 28696944 28489708 25867383 22680947 21189682
39446B1189682J111713K612110K386862J857929K536113L817196L486186M05384
39438C9403175l749433n753529m137773j134738m46357k768220m907530m246712
39430A2258883k274304j756226k126256p85143J873602K466109k033k337922j986857
39421E329853m82288k13355n23112L97284J725953J183091q89014j614916L1057
39412D944553J429782K9731k780230l246362k62229K956100K898892J44993j789033
39403D326197j248678O3909M55119N30458J037588Q91014o92471k045025j362815
39394A955296L56293J066792R15917J169390J371607N26429k22415O32818J732431
39385I504558J013903j13018R67323K605929Q14518l504082m884214j697127J464483
$$ plain form
39446 21189682 22301395 24913505 27300367 29158296 31694409 35511605 38997791 39403175
39438 39403175 35653742 29900213 25762440 24627702 24181345 21413125 16505595 12258883
39430 12258883 9984579 8228353 6102097 5316954 7190556 9656665 9654632 7316710 5329853
39421 5329853 4847565 4634210 4111098 4508382 6234335 7417426 6528412 4913496 4944553
39412 4944553 6374335 6404066 3623836 377474 115245 3071345 5970237 6115230 4326197
39403 4326197 3077519 3141428 3596547 4127005 5164593 6055607 5363136 3318111 1955296
39394 1955296 2311589 3378381 4294298 5463688 6835295 7361724 7139309 7772127 9504558
39385 9504558 10518461 10405443 11372766 13978695 14793213 11289131 6404917 4707790 6172273
39376F172273J402735N34368J073238Q72033j371536k287578K29396K183182r4523
39367H713588l008809j379922K423799K072290k118780l594190j07050L198103
39359F199029K177339r62809k441921j975574j036951r5502N06328R8624o34451
39350A834112l61169J28069q46786j943706k96784K969353L646350J483590P75611
39341G388640K543884K313800j611344l971110r56852K817645J396153k859594
39333G061222l162399J032334L970957K875571R38814J130994K505498L344885
39325A9697876L502271K762897N35616k124476l209162k707709k146413j626627
39317A4684273l76005M95058o25285k359241k123248p79143j138890k336515q59499
$$ plain form
39376 6172273 7575008 8109376 9182614 10054647 8683111 6395533 6624929 8808111 8713588
39367 8713588 5704779 4324857 6748656 8820946 6702166 3107976 3000926 6199029
39359 6199029 8376368 7413559 4971638 2996064 1959113 1863611 2369939 2468563 1834112
39350 1834112 1472943 1601012 754226 -1189480 -1486264 1483089 5129439 6613029 7388640
39341 7388640 9932524 12246324 10634980 6663870 5707018 8524663 9920816 7061222
39333 7061222 3898823 4931157 8902114 11777685 12716499 13847493 16352991 19697876
39325 19697876 23200147 25963044 26498660 24374184 21165022 18457313 16310900 14684273
39317 14684273 14308268 14803326 14178041 11818800 9695552 8916409 7777519 5441004 4581505
39308D581505K592564L001196q35020l643270j552333K407660L667402K447872
39300A2667576J246445q980k286656m013524l338138j609250j077230j112874
39292D67369M1348J653800J803516O60069l32798q65057r00405M50250K607416
39283E585508K561163p62560l708625k835214j12626N93922k84909K27183J826918
39274C090760J808675M15615L26542J522028J420045k51270j229802j088000j439365
39265D575228k043539j117414O79714J035096M71862J304602K404640M01776l629574
39256D082391m474544q47893K529475K539068J684139K266652K134402n92277
39248I321413l342484l128966q88025J161437K659604K991339L80169l898707
$$ plain form
39308 4581505 7174069 10175265 9340245 5696975 4144642 6552302 10219704 12667576
39300 12667576 13914021 13905041 11618385 7604861 4266723 2657473 1580243 467369
39292 467369 508717 2162517 3966033 4626102 4293304 3428247 2527842 2978092 5585508
39283 5585508 8146671 7384111 3675486 840272 727646 1321568 1036659 1263842 3090760
39274 3090760 4899435 5315050 5641592 7163620 8583665 8332395 7102593 6014593 4575228
39265 4575228 2531689 1414275 2093989 3129085 3600947 4905549 7310189 7711965 4082391
39256 4082391 -392153 -1240046 1289429 3828497 5512636 7779288 9913690 9321413
39248 9321413 5978929 2849963 1961938 3123375 5782979 8774318 9154487 5255780
39240E255780m938027j325418J731442L57771j736069J07806L264417K454086
39232E171788j049957j823191M69705J401251Q4920q002J664635J574642r01841
39223F583950j874783M8396J150653o22562j811471L70968K730136J103833k727548
39214D951572l647937p83541J823554J445767k35295p11347k49865m24159r41333
39205A227416j15018J848125K234513l25575k961797j882572J925363L384137
39197E334592M48956k709055j652296K072110L625483J696389q67571j895843
39189F052765j706639p37456J054997K457799J843739j8913p14186J93521Q68679
39180I294306M40410j34202k97787l04938K75331J641918J958197j93209k281266
$$ plain form
39240 5255780 317753 -1007665 723777 1081548 -654521 -546715 2717702 5171788
39232 5171788 4121831 2298640 2768345 4169596 4254516 4246514 5911149 7485791 6583950
39223 6583950 4709167 4757563 5908216 5285654 3474183 3845151 6575287 7679120 4951572
39214 4951572 1303635 520094 2343648 3789415 3554120 2842773 2592908 2168749 1227416
39205 1227416 1112398 2960523 5195036 4869461 1907664 25092 1950455 5334592
39197 5334592 5783548 3074493 1422197 3494307 7119790 8816179 7948608 6052765
39189 6052765 4346126 3608670 4663667 7121466 8965205 8946292 8232106 8425627 9294306
39180 9294306 9734716 9600514 9302727 8997789 9273120 10915038 12873235 12680026 10398760
39171A0398760r03402K089579J707326j567126j384230M133944P820501L408422
39163B5703774m854948p954212m253827p6800K35863j033571m97187J191583J422293
39154I882968l36794k445882l296600k374567k56691J646723K060251R85237m34964
39145E429681j033709l44997J168909K198267J696546L20662k51116K55641M32741
39136I872625k50324n61298O8504N79942R20794K815395N888275O049753R79838
39127B6363504n212179o764465l975710j791940j931447j537440M68923J233326
39119F852572m87212j705709m84460O40905m74143j362234N68745K766120J448891
39110G763475j658040j812446Q00511J280247j759251l856746k119835K83050
$$ plain form
39171 10398760 9495358 11584937 13292263 11725137 10340907 14474851 22295352 25703774
39163 25703774 20848826 12894614 8640787 8563987 8799850 7766279 7269092 8460675 9882968
39154 9882968 9546174 7100292 3803692 1429125 1172434 2819157 4879408 5864645 5429681
39145 5429681 4395972 4050975 5219884 7418151 9114697 9435359 9184243 9439884 9872625
39136 9872625 9622301 9061003 9129507 9709449 10630243 13445638 19333913 25383666 26363504
39127 26363504 21151325 14386860 10411150 8619210 6687763 5150323 5619246 6852572
39119 6852572 6365360 4659651 4175191 4816096 4341953 2979719 3548464 6314584 7763475
39110 7763475 6105435 4292989 5093500 6373747 4614496 757750 -1362085 -1079035
39102a079035r9979j202175N45108L625907L685473O65480j215339k29525P84043
39093E479958k01956j271187n32097M28936m22239j808021j271107P92398K079751
39084C274436K055107J844664J397046k21965k036348j747549M90894J674912
39076F731197K18952j815714k004473r19497n37691r58882p11733N95897J815843
39067B413899K077146J570057P19199j71918o04304l50392j22819o95697j481043
39058C354128j183516R5528P50819M0162p74027m13348M74818N24095j29491l95168
39048B344000m78975j602964l250914k848826N66550M068100M166837J415924
39040D379732n63680k38419K59110q44882k021482j102158J061975J822889O77732
$$ plain form
39102 -1079035 -1179014 -2381189 -1836081 1789826 5475299 6140779 4925440 4695915 5479958
39093 5479958 5278002 4006815 3474718 3903654 3481415 1673394 402287 1194685 3274436
39084 3274436 5329543 7174207 8571253 8349288 6312940 4565391 5056285 6731197
39076 6731197 6950149 5134435 3129962 2210465 1672774 713892 2159 598056 2413899
39067 2413899 4491045 6061102 6780301 6608383 6004079 5653687 5530868 4835171 3354128
39058 3354128 2170612 2266140 3016959 3057121 2283094 1869746 2344564 2868659 2739168 2344000
39048 2344000 1865025 262061 -2988853 -5837679 -5271129 -1203029 2963808 4379732
39040 4379732 3816052 3577633 3836743 2991861 970379 -131779 930196 2753085 3430817
39031C430817k31746N47910J824570J645845r2086j684381j780279q92785n69800
39022B198065j180263j188449O12806K772118K736071O93788l36770R68162K038525
39013I314053M22361k214587k654123j089150m14106j348483j610015q6934J297299
39004A616315Q13164m89203p03299K46988J097977J127659N08886k97063q09496
38995C111928q85616r92294j350874j141309J96941J361671O68922j168047j829534
38986b028212q40426J06203L05627Q01795J600260J183503k08445k4728K190477
38977C086054K995148J37749l300132l036480J62934J953618Q86508m02046j47600
38968B335753J97238o66143j405348n34669R11160J019638r7130p81881m00497
$$ plain form
39031 3430817 3199071 3746981 5571551 7217396 7125310 5440929 3660650 2767865 2198065
39022 2198065 1017802 -170647 442159 3214277 5950348 6644136 6307366 7275528 9314053
39013 9314053 9736414 7521827 4867704 3778554 3364448 2015965 405950 319016 1616315
39004 1616315 2429479 1940276 1236977 1483965 2581942 3709601 4218487 3921424 3111928
38995 3111928 2226312 1234018 -116856 -1258165 -1061224 300447 969369 -198678 -2028212
38986 -2028212 -2868638 -2762435 -2456808 -1655013 -54753 1128750 920305 895577 3086054
38977 3086054 6081202 6218951 2918819 -117661 45273 1998891 2885399 2483353 2335753
38968 2335753 2532991 1866848 461500 -73169 837991 1857629 1760499 978618 578121
38959E78121J56600K08804J01932J73270P6250l61635m87823J70602Q46758N58489
38949B021368j17783K58564J383821J082973j339497l412760k711810k02510J589706
38940a447928K245187K692651K160172n60962l364525k471198J610019L803946
38932D667362J504776j943377k695683j535712q98708l39819J427357K732172
38924B918368J279906j485684k298009j105997m24304p01623l07377M94405k73662
38915a903977k129302k197754k5031J506483J056367R13580K635732L971341K386171
38906F213610q54620k528395j719474j88857L22845m88204j791831k097877m08843
38897c541646K187360L257858K104998O12050K46555J55017n63383q57761R8547
$$ plain form
38959 578121 734721 943525 1045457 1218727 1294977 933342 445519 616121 1462879 2021368
38949 2021368 1903585 2162149 3545970 4628943 3289446 -123314 -2835124 -3037634 -1447928
38940 -1447928 797259 3489910 5650082 5089120 1724595 -746603 863416 4667362
38932 4667362 6172138 4228761 1533078 -2634 -901342 -1241161 186196 2918368
38924 2918368 4198274 2712590 414581 -691416 -1115720 -1817343 -2124720 -1630315 -1903977
38915 -1903977 -4033279 -6231033 -6256064 -4749581 -3693214 -2779634 -143902 3827439 6213610
38906 6213610 5358990 2830595 1111121 922264 1245109 756905 -1034926 -3132803 -3541646
38897 -3541646 -1354286 1903572 4008570 4620620 4867175 5022192 4458809 3601048 3699595
38888C699595O81636p32032k523892j912673N51410J623683L01496r71046m71772
38879B46405M81861N14776O13072J654611J969074J0412k247889j744642O74618
38870B172298J124299j327050l013650j234992J689548K103199K60634r58049
38862H16237q70934j168207j969456j223503J497735L582002K872433M03392j450144
38853B489555j751441r32707L72182J369330J373310Q50967Q50226R70327k35342
38844E356407k305403k691219o12296J345842J039163j73000r5049P90927P96436
38835C451808J12076j18180k64165j183667k022911j551216n29411l33515m42130
38826b881311K34111Q50241J71974o41218K80609K144856K745369J975423J097776
$$ plain form
38888 3699595 4381231 3649199 1125307 -787366 -235956 1387727 1689223 718177 246405
38879 246405 728266 1243042 1856114 3510725 5479799 5490211 3242322 1497680 2172298
38870 2172298 3296597 1969547 -1044103 -2279095 -589547 1513652 1774286 816237
38862 816237 -54697 -1222904 -3192360 -4415863 -2918128 663874 3536307 3939699 2489555
38853 2489555 738114 -194593 177589 1546919 2920229 3771196 4621422 5591749 5356407
38844 5356407 3051004 359785 -252511 1093331 2132494 1959494 1864445 2655372 3451808
38835 3451808 3563884 3445704 3181539 1997872 -25039 -1576255 -2105666 -2439181 -2881311
38826 -2881311 -2647200 -1796959 -1624985 -2266203 -1985594 159262 2904631 4880054 5977830
38817E977830j49566k296856l384613j481642J125791O90082j795246j922076
38809c236296R68958L035863K399315J027864k18829k629319m753524k756210
38801f162178K398308M444889J279227j419288L77826K503295M20445k588653
38793A253871j507262J252190K88349k872739k381890J597503L305081J276530
38785B211633j07289Q20947O26860j696393k098993J103735L599754K142889k71017
38776F332126l7712J010370m82583l158182l294857r91444M32891j07532n01987
38767g98910N86114J943195K022896P38463r67139j854910j017715R98490K180627
38758C831111J192625r87295k291752j703669K83069K253520K503837M79932j917503
$$ plain form
38817 5977830 5828264 3531408 146795 -1334847 -209056 481026 -1314220 -3236296
38809 -3236296 -2267338 768525 3167840 4195704 3976875 1347556 -3405968 -6162178
38801 -6162178 -3763870 681019 1960246 540958 918784 3422079 3842524 1253871
38793 1253871 -253391 998799 1287148 -1585591 -3967481 -2369978 935103 2211633
38785 2211633 2104344 2925291 3552151 1855758 -243235 860500 4460254 6603143 6332126
38776 6332126 6294414 7304784 6822201 3664019 369162 -622282 -189391 -296923 -798910
38767 -798910 -212796 1730399 3753295 4491758 3524619 1669709 651994 1650484 3831111
38758 3831111 5023736 4036441 1744689 41020 324089 2577609 5081446 5561378 3643875
38749C643875k048079l8291J322974P37382K7134O17059J169958M82481l0302
38740E884191P47726P40786j977880m773513l341124J609556M476225K090173
38732E456140k383433m095320k450206n71070m41304p68453L78603K360952K592199
38723G8108L35559j558844k31731K708800K928982k12797k297921m35173K183831
38714C498814J285957j726913k129673O56943K513403J114624j410500k693570
38706A109085k912972k434349n00379K218828L110364J437822j57827L07405J303465
38697C481442P24538q93961j948297k120953j415696N29537K341912J198976k420692
38688e23194l632537j8114L759234K516431j260101j356503K012306K694372r22536
$$ plain form
38749 3643875 1595796 1557505 2880479 3617861 3644995 4262054 5432012 5914493 5884191
38740 5884191 6631917 7372703 5394823 621310 -2719814 -1110258 3365967 5456140
38732 5456140 3072707 -1022613 -3472819 -4043889 -4485193 -5253646 -4875043 -2514091 78108
38723 78108 413667 -1145177 -1376908 1331892 4260874 4048077 1750156 1314983 3498814
38714 3498814 4784771 3057858 928185 1585128 4098531 5213155 3802655 1109085
38706 1109085 -1803887 -4238236 -4738615 -2519787 590577 2028399 1870572 2177977 3481442
38697 3481442 4205980 3312019 1363722 -757231 -2172927 -1643390 698522 1897498 -523194
38688 -523194 -4155731 -4173845 -414611 2101820 841719 -514784 1497522 4191894 3269358
38679C269358l029225j3008L468436J923559k406657l451065o35516J145785l94060
38670a22393k056479p65001K097508L410865K539250J091710K30260r5223j30850
38661F199647L9241N9115n45600j607128k134924j243663O48395J844394J099728
38652D359205p36017j522783m26571J120564J404649M44393n87531j033375r31883
38643B090651k68003Q45162J616282J234483n4123j249977j738838j511605o88777
38634B75255L87964R68922O32172p3841m15730m65008n58774l91989L18956Q09474
38624A487401J40429j244632k060400j938960j336469j08736K086102M065530
38616A090265L799507J289127j005045j317578n18020o3274K50994J152810J937550
$$ plain form
38679 3269358 240133 227125 3695561 5619120 3212463 -238602 -874118 271667 -122393
38670 -122393 -2178872 -2943873 -846365 2564500 5103750 6195460 6425720 6330497 6199647
38661 6199647 6238888 6298003 5752403 4145275 2010351 766688 1415083 3259477 4359205
38652 4359205 3623188 2100405 1673834 2794398 4199047 4643440 4055909 3022534 2090651
38643 2090651 1822648 2667810 4284092 5518575 5464452 4214475 2475637 964032 275255
38634 275255 663219 1632141 2264313 2190472 1774742 1309734 750960 358971 677927 1487401
38624 1487401 1627830 383198 -1677202 -3616162 -4952631 -5061367 -2975265 1090265
38616 1090265 4889772 6178899 5173854 3856276 3338256 3274982 3525976 4678786 6616336
38607F616336J375785j95441j241229j067403k72437L85365M58256l14912j431725
38598D312595j497711J2500J406083P11326j392375k262438q17379J328891K359629
38589D161121K126509J183735k44447j594190j831960r12386r0951j7075J08526
38580B888882O85810O75546m05873j103425k51801Q59160M69542p01596o65119
38571B451126N84909J347605J095667O54849p04j465750k646019j695104O37561
38562I64140J621266R07318R23855K080417J452687j854701l896771j538532K252805
38553B912484K630466N9117j057066M78213J510584K45853j314771j327624p27066
38544C410190p18656p24699j29247M28087O32100J144153J774990J231837m50372
$$ plain form
38607 6616336 7992121 7796680 6555451 5488048 5215611 5600976 6059232 5744320 4312595
38598 4312595 2814884 2827384 4233467 4944793 3552418 1289980 472601 1801492 4161121
38589 4161121 6287630 7471365 7226918 5632728 3800768 2888382 2797431 2780356 2888882
38580 2888882 3574692 4250238 3844365 2740940 2489139 3348299 3817841 3116245 2451126
38571 2451126 3036035 4383640 5479307 6134156 6133452 4667702 2021683 326579 964140
38562 964140 2585406 3492724 4416579 6496996 7949683 6094982 2198211 659679 2912484
38553 2912484 5542950 5602067 4545001 5023214 6533798 6779651 5464880 4137256 3410190
38544 3410190 2691534 1966835 1837588 2265675 2897775 4041928 5816918 7048755 6598383
38535F598383j455567j014077m40586n42047l96522L49073M83360l33907o46673
38526B601437O2459K70420o56211j144065m64559j58216p19502j13392K199692
38517A878063L203197J174209q00852K60221K014675Q24972j785738j792370L00100
38508E276477O81394p73667o62001J208715J340627o89344j087420J126776J927967
38499H349524n33580k256383k25759K208823J042875j581142j248049J229031
38491F985340J527454q83333k388108j344179J81309O38531P28244O45003n71632
38482E518629k293879k313143m16382J060506J041220J059003J823676J571091
38474G050721n65416k357108j745721l7360M24996j19281o771O31384N33649J26021
$$ plain form
38535 6598383 5142816 4128739 3688153 3146106 2749584 3098657 3582017 3248110 2601437
38526 2601437 2663896 2934316 2278105 1134040 669481 511265 -208237 -321629 1878063
38517 1878063 5081260 6255469 5454617 5714838 7729513 8554485 6768747 4976377 5276477
38508 5276477 5957871 5184204 4522203 5730918 7071545 6382201 5294781 6421557 8349524
38499 8349524 7815944 5559561 5333802 7542625 8585500 7004358 5756309 6985340
38491 6985340 8512794 7629461 5241353 3897174 4078483 4717014 5445258 6090261 5518629
38482 5518629 3224750 911607 495225 1555731 2596951 3655954 5479630 7050721
38474 7050721 6485305 4128197 2382476 2345116 2770112 2650831 2644060 3275444 3809093 3935114
38464C935114P89800J856909J306854n55922j136215K16042J045257M2028n46143
38455F953724J184679L060290J898017j369932k914534j606345j42286n47443
38447F516170j589667j407810k11782O94104P33898P2301o73338l93290J134498
38438D875084J892930N208k604809k091269J352888L202680J446803n03114J18637
38429G695038R49502n29455j844668m3642K220740Q09397k297602j888756J525860
38420F596414K512621Q1825r38077J120386J621484j950342m970568l010846J122561
38411B185458K286889Q05285M55417J668810J759555J78239j026171j099377j096022
38402F118083j057874m3681J284570J046920q24598k260461j867765l35102R08933
$$ plain form
38464 3935114 4724914 6581823 7888677 7332755 6196540 6412582 7457839 7499867 6953724
38455 6953724 8138403 11198693 13096710 11726778 8812244 7205899 7063613 6516170
38447 6516170 4926503 3518693 3306911 4001015 4734913 4807214 4133876 3740586 4875084
38438 4875084 6768014 6773222 4168413 2077144 3430032 6632712 8079515 7576401 7695038
38429 7695038 8644540 8115085 6270417 6226775 8447515 9256912 6959310 5070554 6596414
38420 6596414 9109035 9190860 8252783 9373169 10994653 9044311 4073743 1062897 2185458
38411 2185458 4472347 5277632 5733049 7401859 9161414 9339653 8313482 7214105 6118083
38402 6118083 5060209 5016528 6301098 7348018 6523420 4262959 2395194 2060092 2969025
38393B969025J091368L74731k85260J236Q04084Q70264J47571j58625K02503K42120
38383F259017o5115J79241K27732j530806l530622k002340K377072L645913o29335
38374D930757m559531k376296K658415L491469J14307j532198L41016J459604
38366D527543m38101k275535j645444m56127n84421n79334R45578K357854J849497
38357C701510M56852J77550J139287K098141K037787N25637j746032k620888q39894
38348D929950J421128J046487j201810j628440N25120J896253N11151j258386
38340F241453q13612Q27603J259037K46928q08542j068130m56791P43059J581581
38331G752586J226775L61545Q1770k59459j710326k847123j530730Q66511R88184
$$ plain form
38393 2969025 4060393 4435124 4149864 4151100 4955184 5825448 5973019 5814394 6016897 6259017
38383 6259017 6193902 6373143 6600875 5070069 1539447 -462893 1914179 5560092 4930757
38374 4930757 371226 -2005070 653345 4144814 4259121 2726923 3067939 4527543
38366 4527543 4089442 1813907 168463 -287664 -872085 -1451419 -505841 1852013 3701510
38357 3701510 4158362 4335912 5475199 7573340 9611127 10136764 8390732 5769844 4929950
38348 4929950 6351078 7397565 6195755 4567315 5092435 6988688 7499839 6241453
38340 6241453 5427841 6255444 7514481 7761409 6952867 5884737 5427946 6171005 7752586
38331 7752586 8979361 9340906 9422676 9163217 7452891 4605768 3075038 3941549 4929733
38322D929733p32732m37663K364877L462279R73492j441944q68200L32046n60196
38313H021692j820508j204837l94736j176150j102846J983193M425576J530744
38305A0262128m301698o165345k339828K174065L458709K661182J801858O91372
38297H242443o51498p41461M28170M59749j670208l544007k731902k27108J189788
38288G53966N71356o33062p78021K50608J221025J087911K59175j71675l48625
38279B212658j295427k282794r66092K469007M054599J483299j719870r95202
38271B960178K274277K961643K55852j486127j15081J182411k56392k071790j054480
38262D650491J473751J872132j23826j373380m38680L49719j284435l726436l221952
$$ plain form
38322 4929733 4197001 3759338 6124215 9586494 10559986 9118042 8249842 8581888 8021692
38313 8021692 6201184 4996347 4601611 3425461 2322615 4305808 8731384 10262128
38305 10262128 5960430 -204915 -2544743 -370678 3088031 5749213 7551071 8242443
38297 8242443 7590945 6849484 7277654 7737403 6067195 2523188 -208714 -435822 753966
38288 753966 1325322 692260 -85761 164847 1385872 2473783 2732958 2561283 2212658
38279 2212658 917231 -1365563 -2331655 137352 4191951 5675250 3955380 2960178
38271 2960178 5234455 8196098 8451950 6965823 6850742 8033153 7776761 5704971 4650491
38262 4650491 6124242 7996374 7872548 6499168 6060488 6410207 5125772 1399336 -1822616
38253a822616R44374M838658M542757J202099p65487m4580J73827k004996l664825
38244C399211j886602J154789J622026J42584Q3720J332880Q38964j264884j438367
38235C984321Q60183J773226m50906k368042j048070J338967J507155J24963k77806
38226E443991K81519J77405n10941o55147m78015n88477l7334K010514L832129
38217I475644L013446O3150k097785j770289K14844K218001L125189K494869Q60274
38208A7597343n09803j088974j551266k094014j755043l97664L54010m24578j260430
38199H869581o84683L43913K77299l87830m15244k68127r26327j555285q06433
38190D446864N92463R80950N68401O29057P94124j68197j519664j323164K27754
$$ plain form
38253 -1822616 -878242 3960416 8503173 9705272 8939785 8895205 9069032 7064036 3399211
38244 3399211 1512609 2667398 4289424 4432008 4515728 5848608 6687572 5422688 3984321
38235 3984321 4844504 6617730 6166824 3798782 2750712 4089679 5596834 5721797 5443991
38226 5443991 5725510 5902915 5391974 4736827 4258812 3670335 3633001 5643515 9475644
38217 9475644 12489090 12552240 10454455 8684166 8899010 11117011 14242200 16737069 17597343
38208 17597343 17087540 15998566 14447300 12353286 10598243 10200579 10554589 10130011 8869581
38199 8869581 8184898 8528811 8806110 8418280 8003036 7734909 6808582 5253297 4446864
38190 4446864 5039327 6020277 6588678 7217735 8011859 7843662 6323998 5000834 5228588
38181E228588R95885M18592J93044J131873J747568O10966j704575l518531l543836
38172A559574j577871R65346J757732L15417r05841j0967J235082M59452q81740
38163B916184M0584J807824N54644k827139k998308J045448L382589L10922l268618
38154I64130j193438M224944N429934N54843m450756m363133o46777K006587J646205
38145D172539J31937J20403J995759L222449J190898k749888l898507m15720L313349
38136G083219K327013j841005l510479j109176J331067Q78975o22351p42984l00852
38127C493427r08705j720077j057562O71511J781699J691307R53941R0785m33477
38118D562849j72425N52787R56226J102257J428400J090668r18452k993381k297037
$$ plain form
38181 5228588 6224473 6643065 6836109 7967982 9715550 10326516 8621941 5103410 1559574
38172 1559574 -18297 947049 2704781 3020198 2114357 2103390 3338472 3797924 2916184
38163 2916184 2956768 4764592 5319236 2492097 -506211 539237 3921826 4232748 964130
38154 964130 -229308 3995636 9425570 9980413 5529657 1166524 519747 2526334 4172539
38145 4172539 4304476 4424879 6420638 9643087 10833985 8084097 4185590 3769870 7083219
38136 7083219 9410232 7569227 4058748 2949572 4280639 5159614 4537263 3794279 3493427
38127 3493427 2584722 864645 -192917 478594 2260293 3951600 4905541 4996326 4562849
38118 4562849 4390424 4943211 5899437 7001694 8430094 9520762 8602310 5608929 3311892
38109C311892N25803J496437o32859k207175n15758J993892K094407P45088K45504
38100G057231k04116j960097k912889p96919J826839J106320j417168j312294
38092A386907Q84496O36027k179963k628931O57110K998743J780657M74475J558521
38083E568042J751814j395861l752450r28294L848972M134173k33136l730098
38075E263162l360430q91990J686775L643992L355646n4705l259426j972468K294624
38066F705180L701949O96972j999409j122813O14872j07800j987318k242416j292030
38057B967187r39507p55059K69133O77652j193193l360659k284008J695539M365389
38048A442474L339078Q42724l6849N62610N20888n66250j082149m15560j62032
$$ plain form
38109 3311892 3837695 5334132 4701273 2494098 1978340 3972232 6066639 6811727 7057231
38100 7057231 6853115 4893018 1980129 1183210 3010049 4116369 2699201 1386907
38092 1386907 2271403 2907430 727467 -1901464 -1244354 1754389 3535046 4009521 5568042
38083 5568042 7319856 5923995 2171545 1243251 5092223 9226396 8993260 5263162
38075 5263162 1902732 1010742 2697517 6341509 9697155 9642450 6383024 4410556 6705180
38066 6705180 10407129 11104101 9104692 7981879 8596751 8488951 6501633 4259217 2967187
38057 2967187 2027680 1272621 1541754 2219406 1026213 -2334446 -4618454 -2922915 1442474
38048 1442474 4781552 5624276 5587427 6150037 6670925 6104675 5022526 4606966 4444934
38039D444934j419252k468249j026223J874712K739153P02122r35435L04527K191047
38030F407336J400620j162307k086643j068853p47185j453415o23900J936288
38022B601941K705096J53022k173302r23798J907292K260864N4914j457846q57055
38013D271128K69553N82584L93632k9408r63181j798859j227616O44472J942999
38004D085304J378697q3023m47502R25158K515242K243559n8855k197019k267853
37995F093708j121255q01808j183951m31153J309316J567338l65840j993051j612944
37986A460360q16423j097612r48352J018892K674012J373842j544457k638427
37978e18165j293929M89962J926168L543093M460569L245668J003044J45685M65534
$$ plain form
38039 4444934 3025682 557433 -468790 1405922 4145075 4847197 3911762 4216289 6407336
38030 6407336 7807956 6645649 4559006 3490153 2742968 1289553 665653 2601941
38022 2601941 5307037 5460059 3286757 2362959 4270251 6531115 6586029 5128183 4271128
38013 4271128 4540681 5123265 5516897 5487489 4524308 2725449 1497833 2142305 4085304
38004 4085304 5464001 5380978 4933476 5858634 8373876 10617435 10558580 8361561 6093708
37995 6093708 4972453 4170645 2986694 2555541 3864857 5432195 5066355 3073304 1460360
37986 1460360 643937 -453675 -1402027 -383135 2290877 3664719 2120262 -518165
37978 -518165 -1812094 -1322132 604036 4147129 8607698 11853366 12856410 13002095 13467629
37969A3467629j56826j604388j870100j267350k059994l642056k656588J022754
37961A233081L003691R57089j761141j601163l5830o1938q34605K24009K235015
37952C358208K032695n02952k111298r75255J244271K367119K103181J159687
37944H675656J09599l40104L39718J386614J230659m80777k307291k723760j655411
37935D234903k24408M02866p3936q65583r11382j46741M85641M16350L4095k91876
37925C059929o32325o11941M28236J779931J612904j53502j132677k3002J184528
37916E512081N27487n16702K48327J385519j25506l373614m148785j260881J749222
37907b852K125869J286825J105588N63885j296555k255614j64195K842368L011384
$$ plain form
37969 13467629 13310803 11706415 9836315 8568965 6508971 2866915 210327 1233081
37961 1233081 4236772 5193861 3432720 1831557 1795727 1733789 899184 1123193 3358208
37952 3358208 5390903 4887951 2776653 1801398 3045669 5412788 7515969 8675656
37944 8675656 8785255 8445151 8784869 10171483 11402142 10921365 8614074 5890314 4234903
37935 4234903 4010495 4413361 4339425 3473842 2562460 2415719 2901360 3317710 3351805 3059929
37925 3059929 2427604 1815663 2243899 4023830 5636734 5483232 4350555 4327553 5512081
37916 5512081 6039568 5522866 5771193 7156712 7031206 3657592 -491193 -1752074 -2852
37907 -2852 2123017 3409842 4515430 5079315 3782760 1527146 1362951 4205319 7216703
37898G216703N15897j277186j219920j210025j802479j141250Q51010J219638
37890C152388j122609k686510m43845L064547L159923p9123k218090j190297L68515
37881B004899J28015l48313J059339K923375K259357q17956l125989k697421q17635
37872E67671L39758L21401J45617P18520K052115L204884K695741n6705l282501
37863F706501l947639j233909J859695J737890j237268l038714j283117J512137
37855A075576J551922o61093j080117J629577L832815K428669l80470p24089P79085
37846H451875N36911j446658j379800J459045K688902k16316l387869k376203
37838D329887J007800J881075j59648j412114o50726l70486j530823j754122J56775
$$ plain form
37898 7216703 7732600 6455414 5235494 4025469 2222990 1081740 1932750 3152388
37890 3152388 2029779 -656731 -1100576 1963971 5123894 5044771 2826681 1636384 2004899
37881 2004899 2132914 1784601 2843940 5767315 8026672 7208716 4082727 1385306 567671
37872 567671 907429 1228830 1374447 2092967 4145082 7349966 10045707 9989002 6706501
37863 6706501 2758862 1524953 3384648 5122538 3885270 846556 -436561 1075576
37855 1075576 2627498 1966405 886288 2515865 6348680 8777349 8396879 7672790 8451875
37846 8451875 8988786 7542128 6162328 7621373 10310275 10093959 6706090 4329887
37838 4329887 5337687 7218762 7059114 5647000 4996274 4625788 3094965 1340843 1497618
37829A497618J811759J060440p18106r55468O45371K520430L337166K430580j89913
37820A1439877l081051m022110k447604j09650J177795J133909J83537j150131
37812C124572j665145k85179J950613K599202J107758m93291o56366J9018O44118
37803F345300J179096J088678n46875k715138k954490j156637k7075o24243p16041
37794a27425Q14136J525175k10962j880205r85706O11996K02461o92968R02105
37785A58607L567914L187738m10874l034894k225421J62016J633754J774379R63857
37776E777076m35494j207596l73989O94499n3522j717554j476135Q39841K484141
37767D531267K272092J840495J886432P86914j797744l297223k013369J18906
$$ plain form
37829 1497618 3309377 4369817 3651711 2696243 3341614 5862044 9199210 11629790 11439877
37820 11439877 8358826 4336716 1889112 1779462 2957257 4091166 4274703 3124572
37812 3124572 1459427 1174248 3124861 5724063 6831821 6338530 5682164 5701182 6345300
37803 6345300 7524396 8613074 8066199 5351061 2396571 1239934 1212859 588616 -127425
37794 -127425 686711 2211886 2000924 120719 -864987 -252991 -50530 -743498 158607
37785 158607 3726521 6914259 6503385 3468491 1243070 1405086 3038840 4813219 5777076
37776 5777076 5341582 4133986 3759997 4454496 4400974 2683420 1207285 2047126 4531267
37767 4531267 6803359 8643854 10530286 11317200 9519456 6222233 4208864 4327770
37759D327770M06698j029506k166163j803490p0176K148787L224248J915286n49843
37750F403611j230688Q22906L348530M042666K987392J164909j190317l538676
37742A2810333m352003k953701o42469R90003J498914R22348m33519j138037J41141
37733F843010K016021J614601q35672j766621J38322J534605k87257k939864k697468
37724C619677j15218J443439J032671M52833N18375K95170l86146m59252L12273
37715F713822Q07172J05772j622456l271794l091549j96786L305305L721728O57438
37706G128652j911129j246228L05098l25383j728158r04698J135809J190460l90169
37697C254254o44735K50359o53197l047294l004260L72365K863263J562402q46217
$$ plain form
37759 4327770 4734468 3704962 1538799 -264691 -334867 1813920 5038168 6953454 6403611
37750 6403611 5172923 5995829 9344359 13387025 16374417 17539326 16349009 12810333
37742 12810333 8458330 5504629 4862160 5852163 7351077 8273425 7839906 6701869 6843010
37733 6843010 8859031 10473632 9637960 7871339 8009661 9544266 9257009 6317145 3619677
37724 3619677 3504459 4947898 5980569 6433402 6951777 7246947 6860801 6401549 6713822
37715 6713822 7520994 7626766 6004310 2732516 -359033 -555819 2749486 6471214 7128652
37706 7128652 5217523 3971295 4276393 3951010 2222852 1318154 2453963 3644423 3254254
37697 3254254 2609519 2859878 2206681 -840613 -3844873 -3472508 -609245 953157 106940
37688A06940o35861J605973K859746K336645J646730K004909L258818M377854
37680A7561754L697227K97629l917257n437518l342489k63335J463888K037459
37672A2097358J873724L15651j901219k256768n42437k0827k041607l037760k42424
37663D243691K999320K106491j203946j638606R09852J316285j941766l871221
37655B920100q19644L701862M201958P85272j974879j672572j20853M02997m2965
37646G381276k81858j7207J40738k34471q18319r17340l40575K81278L55576J69221
37636E718319K07517O5255q55202j840346j490367J28312J444033J656839J460320
37627F494680J223546L08090j179363j878736j381439j040702j380455p64853
$$ plain form
37688 106940 -528921 1077052 3936798 6273443 7920173 9925082 13183900 17561754
37680 17561754 21258981 21556610 17639353 12201835 8859346 8596011 10059899 12097358
37672 12097358 13971082 14286733 12385514 10128746 9586309 9565482 7523875 4486115 4243691
37663 4243691 7243011 9349502 8145556 6506950 7416802 8733087 6791321 2920100
37655 2920100 2100456 5802318 10004276 10789548 8814669 7142097 7021244 7424241 7381276
37646 7381276 7099418 7082211 7222949 6988478 6170159 5252819 4912244 5193522 5549098 5718319
37636 5718319 5925836 5991091 5135889 3295543 1805176 1933488 3377521 5034360 6494680
37627 6494680 7718226 8026316 6846953 4968217 3586778 2546076 1165621 400768
37619D00768J574596L186730J606776j487465k252168j25825J683809J064238
37611E651459n97109j336731j159051o70657L69340J760729K131363R80270j98223
37602F931390k16441J2597n57017j065737m98760J33945m35204j157877m18108
37593B728788P29827P0657j605838j290181J032582J602910j237358l647950j361206
37584b977769L980771O633540M089948k04995j693779n4304J296554r5910k772601
37575H201455l341510r37653J348237M21003k307051k542443O11844K878827R43884
37566E276593k316430j845860J971391L685261O92345l238346l679640j316907
37558g71593M05495P48325J451249K428792J481855j443540l037952j145409J861961
$$ plain form
37619 400768 1975364 5162094 6768870 5281405 3029237 2903412 4587221 5651459
37611 5651459 5054350 3717619 2558568 1887911 2257251 4017980 6149343 7129613 6931390
37602 6931390 6714949 6727546 6170529 5104792 4606032 4739977 4304773 3146896 2728788
37593 2728788 3458615 3529272 1923434 633253 1665835 3268745 2031387 -1616563 -2977769
37584 -2977769 1003002 7636542 11726490 11521495 9827716 9773412 11069966 10974056 8201455
37575 8201455 4859945 3922292 5270529 5691532 3384481 842038 1453882 4332709 5276593
37566 5276593 2960163 1114303 3085694 6770955 7463300 4224954 545314 -771593
37558 -771593 -366098 382227 1833476 4262268 5744123 4300583 1262631 117222 1979183
37549A979183K265306M6671j611799j158648l53339q02697j361576l79197J341979
37540c4117J843517J176354J043055J710910J597397J63812r66271n85513K13395
37531F162539j72304j592488k767569k955478j969065J89964K517725L060389
37523B473713J183127j195991j925785j130124j50050O48981J352676J183775
37515B440322j68482j087271k67134O84101l29240j780226k83620L705364N669908
37506H583722L250030p29462k680634k520415j868403r97150J37263K53417j283775
37497B144593k589056j769377J34621J007835J029456J631284K258304J105199
37489D952859j328033k266422o06173J427548J289307p95602k463043j927322
$$ plain form
37549 1979183 4244489 4291160 2679361 1520713 1167374 364677 -996899 -1376096 -34117
37540 -34117 1809400 2985754 4028809 5739719 7337116 7500928 6534657 5949144 6162539
37531 6162539 5990235 4397747 1630178 -1325300 -3294365 -3104401 -586676 2473713
37523 2473713 3656840 2460849 535064 -595060 -745110 -96129 1256547 2440322
37515 2440322 2271840 1184569 917435 1601536 1272296 -507930 -791550 2913814 8583722
37506 8583722 11833752 11104290 8423656 5903241 4034838 3037688 3174951 3428368 2144593
37497 2144593 -444463 -2213840 -2079219 -1071384 -41928 1589356 3847660 4952859
37489 4952859 3624826 1358404 752231 2179779 3469086 2673484 210441 -1716881
37481a716881L98445K357288K024376k24240j786128n67798K567587M573937L206157
37472A0832743q95314m474219m094978M12013M804424M457122k6707l330919k271039
37463E413126N41382J300875K32837l21999l10001j027791j774230j127414j01296
37454B825489l54815o98637N94814J531163o27398l223812j039259M641355O355817
37445A0004717J465906l646268l340876n29780l95885j785763o84498J711154
37437B798707J063765k050990k701871K99269K710006J802914l4013Q8159J385929
37428E361875J485817j55077k167975k638539l36691L304213M040185l07763n396089
37419C189956m748667J242320N186604K732088j838934k406294O82263K562968
$$ plain form
37481 -1716881 -1318436 1038852 3063228 2838988 1052860 485062 3052649 7626586 10832743
37472 10832743 9937429 5463210 1368232 1780245 6584669 11041791 11015084 7684165 5413126
37463 5413126 5954508 7255383 7488220 7166221 6856220 5828429 4054199 2926785 2825489
37454 2825489 2470674 1772037 2366851 3898014 3270616 46804 -992455 3648900 10004717
37445 10004717 11470623 7824355 4483479 3953699 3557814 1772051 1087553 2798707
37437 2798707 3862472 1811482 -890389 -591120 2118886 3921800 3887787 3975946 5361875
37428 5361875 6847692 6692615 4524640 1886101 1549410 4853623 8893808 8586045 3189956
37419 3189956 -1558711 -316391 4870213 7602301 5763367 3357073 4039336 6602304
37411F602304J186478j218846k428057k327880j323136L70925J784532J662362
37403D308682Q9284j580759k211226j523736n0814P91018j90219j889290j550529
37394c807589J318143L580097K708591M25753j26107R63904J300165L36224m49477
37385F249704n85908p35967n01437P40892J425941k95893k625494k025279Q33896
37376B480455J452852j242288k760612k78933K565892J532025j425832j678924
37368F44635M55427P60365j497289k532492n95457J298769N92539r24199o44834
37359b442536N91617M91693n88857m46129J176768K252440J574996M6237j094882
37350A561347j483946r62815N28074J946016J651974k67374j509335m43975J576766
$$ plain form
37411 6602304 7788782 6569936 4141879 1813999 490863 861788 2646320 4308682
37403 4308682 4397966 2817207 605981 -917755 -968569 -177551 -367770 -2257060 -3807589
37394 -3807589 -2489446 1090651 3799242 4224995 4098888 5062792 6362957 6699181 6249704
37385 6249704 5663796 4927829 4426392 5167284 6593225 6297332 3671838 1646559 2480455
37376 2480455 3933307 2691019 -69593 -348526 2217366 3749391 2323559 644635
37368 644635 1100062 1860427 363138 -2169354 -2764811 -1466042 -873503 -1797702 -2442536
37359 -2442536 -1850919 -1359226 -1948083 -2394212 -1217444 1034996 2609992 2656229 1561347
37350 1561347 77401 -885414 -357340 1588676 3240650 2973276 1463941 1019966 2596732
37341B596732K098609R28366k7100J08408J48171p88090j780613j826376j332261
37332A25846o89620R28284L542281M694669K390519j198581k026199L6897J075187
37323H879283o46918k035751n02009J556473O40307k072378k647569o97359K94102
37314B768181j240908k629161j287303J625488L256857K656457R93646l49165
37306E794092q13536p46174r82774j622981j525497k27264N04604q05682k121432
37297b546644l97039K927143K971236j127653m102590k059641J927563K908497
37289E00872J216209M23806Q94935K90747j038970l47793K152217L042599J196959
37280H331581q65867j745617k789464l872815k346042J655829L431486M74440
$$ plain form
37341 2596732 4695341 5623707 5596607 5705015 5853186 5065096 3284483 1458107 125846
37332 125846 -563774 364510 3906791 8601460 10991979 9793398 7767199 7804096 8879283
37323 8879283 8232365 6196614 5694605 7251078 7891385 5819007 3171438 2474079 2768181
37314 2768181 1527273 -1101888 -2389191 -763703 2493154 5149611 6143257 5794092
37306 5794092 4980556 4234382 3251608 1628627 103130 -124134 380470 -425212 -2546644
37297 -2546644 -2943683 -16540 2954696 1827043 -2275547 -4335188 -2407625 500872
37289 500872 1717081 2140887 3035822 3326569 2287599 1939806 4092023 7134622 8331581
37280 8331581 7465714 5720097 2930633 -942182 -3288224 -1632395 1799091 2273531
37272B273531k894607j691052K081334K736949k24451j960102l74926J104940
37264A051616j49055j728093o46335J582566J485449q89832k218981p77223J596419
37255f93469K353658J038881j085367k705880l114099k100020J3157K296521L485505
37246e11113K663648J72459k113114k183565j15775J698743J297417l92879r18843
37237d03022J58504O84349n77167j529433M13157L937524M798112J616581j818163
37228G280442j710285M45036N34898j599225k153718Q0567J552960l051j565390
37219B862234j7548K218756J199566j455163r71487K382668L742524K438130L493548
37210A5893228Q166963R743977L281259n785551q616533m865655j275779r38103
$$ plain form
37272 2273531 -621076 -2312128 -230794 2506155 2281704 321602 -53324 1051616
37264 1051616 902561 -825532 -1471867 110699 1596148 706316 -1512665 -2289888 -693469
37255 -693469 1660189 2699070 1613703 -1092177 -4206276 -6306296 -6293139 -3996618 -511113
37246 -511113 2152535 2324994 211880 -1971685 -2087460 -388717 908700 515821 -403022
37237 -403022 -244518 439831 -137336 -1666769 -1253612 2683912 7482024 9098605 7280442
37228 7280442 5570157 6015193 6550091 4950866 2797148 2877715 4430675 4427624 2862234
37219 2862234 2844686 5063442 6263008 4807845 3836358 6219026 9961550 12399680 15893228
37210 15893228 24060191 33804168 37085427 31299876 22683343 17817688 16541909 15603806
37202A5603806j040365l68532j529909m522583m871082q67081K822444K020047
37194G246745j041326k091485j058352j51844O46976J887764J484477j988203
$$ plain form
37202 15603806 14563441 14194909 12665000 8142417 3271335 2404254 5226698 7246745
37194 7246745 6205419 4113934 3055582 2903738 3550714 5438478 6922955 4934752
$$ [...]
##END NTUPLES=NMR SPECTRUM
##END=
