##TITLE=31Pdec_LR-736-RB-RM2
 , 24 sc
 5.04.2021
##JCAMPDX= 6.0         $$ Bruker NMR JCAMP-DX V2.0
##DATA TYPE= NMR SPECTRUM
##DATA CLASS= NTUPLES
##ORIGIN= UXNMR, Bruker Analytische Messtechnik GmbH
##OWNER= root
$$ XWIN-NMR		Version 3.5
$$ Mon Apr  5 12:28:37 2021 Russian Standard Time (UT+4h)  she@DPX200
##.OBSERVE FREQUENCY= 81.013821
##.OBSERVE NUCLEUS= ^31P
##.ACQUISITION MODE= SIMULTANEOUS
##.ACQUISITION SCHEME= undefined
##.AVERAGES= 24
##.DIGITISER RES= 16
##SPECTROMETER/DATA SYSTEM= spect
##.PULSE SEQUENCE= zgpg30
##.SOLVENT NAME= DMSO
##.SHIFT REFERENCE= (INTERNAL, DMSO, 0, 248.564)
##AUDIT TRAIL= $$ (NUMBER, WHEN, WHO, WHERE, WHAT)
$$ ##TITLE= Audit trail, XWIN-NMR		Version 3.5
$$ ##JCAMPDX= 5.01
$$ ##ORIGIN= Bruker BioSpin GmbH
$$ ##OWNER= she
$$ F:/spectra/data/she/nmr/P31/1/pdata/1/auditp.txt
$$ ##AUDIT TRAIL=  $$ (NUMBER, WHEN, WHO, WHERE, WHAT)
(   1,<2021-04-05 12:26:38.20 +0400>,<she>,<DPX200>,
      <created by zg, POWCHK disabled, PULCHK disabled
       configuration hash MD5:
       00 E9 B6 7A A2 85 ED C7 34 08 36 98 17 FE 4E 26
       data hash MD5: 32K
       30 B5 8F 77 6F 85 1D 63 49 E3 E3 8F 83 72 FB 4E>)
(   2,<2021-04-05 12:27:29.53 +0400>,<she>,<DPX200>,
      <Start of raw data processing
       efp BC_mod = 2 LB = 1 FT_mod = 6 PKNL = 1 PHC0 = -4509.842 PHC1 = 244.6011 SI = 64K 
       data hash MD5: 64K
       12 19 FD F1 1D 3E F4 FD B8 11 7D 24 E3 85 6A 2F>)
(   3,<2021-04-05 12:27:57.98 +0400>,<she>,<DPX200>,
      <pk PHC0 = 88.3213 PHC1 = -176.4 
       data hash MD5: 64K
       1D E7 16 19 28 6F 15 D4 1D 46 F4 F4 D1 4B BE 38>)
(   4,<2021-04-05 12:28:01.70 +0400>,<she>,<DPX200>,
      <abs ABSG = 5 
       data hash MD5: 64K
       FC 5E C9 C0 98 E8 60 8D 41 F7 26 53 07 B5 E4 AA>)
$$ ##END=
$$ 
$$ hash MD5
$$ BC B1 E0 8A 89 B1 7B EF FE B0 A6 7E 17 6F 68 BB
##$RELAX= 
##$RELAX= 
##$RELAX= 
##$RELAX= 
##$RELAX= 
##$RELAX= 
##$RELAX= 
##$RELAX= 
$$ Bruker specific parameters
$$ --------------------------
##$DU= <F:/spectra>
##$EXPNO= 1
##$NAME= <P31>
##$PROCNO= 1
##$TYPE= <nmr>
##$USER= <she>
##$AMP= (0..31)
100 100 100 100 100 100 100 100 100 100 100 100 100 100 100 100 100 100 
100 100 100 100 100 100 100 100 100 100 100 100 100 100 
##$AQSEQ= 0
##$AQ_mod= 1
##$AUNM= <au_zg>
##$AUTOPOS= <>
##$BF1= 81.014009
##$BF2= 200.13
##$BF3= 200.13
##$BF4= 200.13
##$BF5= 200.13
##$BF6= 200.13
##$BF7= 200.13
##$BF8= 200.13
##$BYTORDA= 1
##$CFDGTYP= 0
##$CFRGTYP= 5
##$CHEMSTR= <none>
##$CNST= (0..31)
1 1 145 1 1 1 1 1 1 1 1 1 1 1 1 1 1 1 1 1 1 1 1 1 1 1 1 1 1 1 1 1 
##$CPDPRG= <waltz16>
##$CPDPRG1= <>
##$CPDPRG2= <waltz16>
##$CPDPRG3= <>
##$CPDPRG4= <mlev>
##$CPDPRG5= <mlev>
##$CPDPRG6= <mlev>
##$CPDPRG7= <mlev>
##$CPDPRG8= <mlev>
##$CPDPRGB= <>
##$CPDPRGT= <>
##$D= (0..31)
0 1 0 0 0 0 0 0 0 0 0 0.03 2e-05 3e-06 0 0 0 0 0 0 0 0 0 0 0 0 0 0 0 0 
0 0 
##$DATE= 1617611197
##$DBL= (0..7)
120 120 120 11 120 120 24 19 
##$DBP= (0..7)
150 150 150 150 150 150 150 150 
##$DBP07= 0
##$DBPNAM0= <>
##$DBPNAM1= <>
##$DBPNAM2= <>
$$ [...]
##$SUBNAM3= <"">
##$SUBNAM4= <"">
##$SUBNAM5= <"">
##$SUBNAM6= <"">
##$SUBNAM7= <"">
##$SUBNAM8= <"">
##$SUBNAM9= <"">
##$SW= 501.771253377433
##$SWIBOX= (0..15)
0 1 3 0 0 0 0 0 0 0 0 0 0 0 0 0 
##$SW_h= 40650.406504065
##$TD= 32768
##$TD0= 1
##$TE= 0
##$TE2= 300
##$TE3= 300
##$TEG= 300
##$TL= (0..7)
0 120 53 12 22 120 120 120 
##$TP= (0..7)
150 150 150 150 150 150 150 150 
##$TP07= 0
##$TPNAME0= <>
##$TPNAME1= <>
##$TPNAME2= <>
##$TPNAME3= <>
##$TPNAME4= <>
##$TPNAME5= <>
##$TPNAME6= <>
##$TPNAME7= <>
##$TPOAL= (0..7)
0.5 0.5 0.5 0.5 0.5 0.5 0.5 0.5 
##$TPOFFS= (0..7)
0 0 0 0 0 0 0 0 
##$TUNHIN= 0
##$TUNHOUT= 0
##$TUNXOUT= 0
##$USERA1= <user>
##$USERA2= <user>
##$USERA3= <user>
##$USERA4= <user>
##$USERA5= <user>
##$V9= 5
##$VALIST= <valist>
##$VCLIST= <CCCCCCCCCCCCCCC>
##$VD= 0
##$VDLIST= <DDDDDDDDDDDDDDD>
##$VPLIST= <PPPPPPPPPPPPPPP>
##$VTLIST= <TTTTTTTTTTTTTTT>
##$WBST= 1024
##$WBSW= 4
##$XGAIN= (0..3)
0 0 0 0 
##$XL= 0
##$YL= 0
##$YMAX_a= 25317
##$YMIN_a= -25113
##$ZGOPTNS= <>
##$ZL1= 120
##$ZL2= 120
##$ZL3= 120
##$ZL4= 120
##$ABSF1= 248.5645
##$ABSF2= -253.2056
##$ABSG= 5
##$ABSL= 3
##$ALPHA= 0
##$AQORDER= 0
##$ASSFAC= 0
##$ASSFACI= 0
##$ASSFACX= 0
##$ASSWID= 0
##$AUNMP= <proc_1d>
##$AZFE= 0.1
##$AZFW= 0.5
##$BCFW= 0
##$BC_mod= 2
##$BYTORDP= 0
##$COROFFS= 0
##$CY= -3
##$DATMOD= 1
##$DC= 0
##$DFILT= <>
##$DTYPP= 0
##$F1P= 0
##$F2P= 0
##$FCOR= 1
##$FTSIZE= 65536
##$FT_mod= 6
##$GAMMA= 0
##$GB= 0
##$INTBC= 1
##$INTSCL= 5.30512e-09
##$ISEN= 30
##$LB= 1
##$LEV0= 0
##$LPBIN= 0
##$MAXI= 10000
##$MC2= 0
##$MEAN= 0
##$ME_mod= 0
##$MI= 50
##$NCOEF= 0
##$NC_proc= -7
##$NLEV= 6
##$NOISF1= 182.463
##$NOISF2= 159.3651
##$NSP= 0
##$NTH_PI= 0
##$NZP= 0
##$OFFSET= 248.5645
##$PC= 4
##$PHC0= -4421.521
##$PHC1= 68.20111
##$PH_mod= 1
##$PKNL= yes
##$PPARMOD= 0
##$PSCAL= 0
##$PSIGN= 0
##$REVERSE= no
##$SF= 81.014009
##$SI= 65536
##$SIGF1= 159.3651
##$SIGF2= -187.1042
##$SINO= 113.3802
##$SIOLD= 16384
##$SREGLST= <1H.CDCl3>
##$SSB= 0
##$STSI= 65536
##$STSR= 0
##$SW_p= 40650.406504065
##$SYMM= 0
##$S_DEV= 0
##$TDeff= 32768
##$TDoff= 0
##$TI= <>
##$TILT= no
##$TM1= 0
##$TM2= 0
##$TOPLEV= 0
##$USERP1= <user>
##$USERP2= <user>
##$USERP3= <user>
##$USERP4= <user>
##$USERP5= <user>
##$WDW= 1
##$XDIM= 65536
##$YMAX_p= 596451305
##$YMIN_p= -33203520
$$ End of Bruker specific parameters
$$ ---------------------------------
##NTUPLES= NMR SPECTRUM
##VAR_NAME=  FREQUENCY,     SPECTRUM/REAL,   SPECTRUM/IMAG
##SYMBOL=    X,             R,               I
##VAR_TYPE=  INDEPENDENT,   DEPENDENT,       DEPENDENT
##VAR_FORM=  AFFN,          ASDF,            ASDF
##VAR_DIM=   65536,         65536,           65536
##UNITS=     HZ,            ARBITRARY UNITS, ARBITRARY UNITS
##FACTOR=    0.620285442955139, 1,           1
##FIRST=     20137.2065510759, 0,            0
##LAST=      -20513.1999529892, 0,           0
##MIN=       -20513.1999529892, -33203520,   0
##MAX=       20137.2065510759, 596451305,    0
$$ Real data points
##PAGE= N=1
##DATA TABLE= (X++(R..R)), XYDATA
$$ [...]
13016d19751K71082o088279n944810J364066P144852O275054J802733k012899
13008B392048m001750l781298j257276J298971J234154n49559j223959n57406
13000f446075k28774j53984O27407R91513k57151r57785J460701M829356M541966
12991D407174L59244l310954l640789k027876n71412N48338J729775K601523K455352
12982B550375P21821k278019m169005k206357K406473M684643K467270l80750
12974C796451j86070P69439j227265m258619l427337J248939M669539L687822
12966E072899J80027k436432k421447j59370J925752J125879j791322k924493
12958a428507j391935j224269l919979m169939J604854P241222M811358k701246
$$ plain form
13016 -419751 -148669 -6236948 -12181758 -10817692 -3672840 2602214 4404947 2392048
13008 2392048 -1609702 -5391000 -6648276 -5349305 -4115151 -4664710 -5888669 -6446075
13000 -6446075 -6674849 -6828833 -6201426 -5209913 -5467064 -6424849 -4964148 -134792 4407174
12991 4407174 4766418 1455464 -2185325 -4213201 -4784613 -4236275 -2506500 95023 2550375
12982 2550375 3272196 994177 -3174828 -5381185 -2974712 1709931 4177201 3796451
12974 3796451 3610381 4379820 3152555 -1106064 -4533401 -3284462 1385077 5072899
12966 5072899 5252926 2816494 395047 235677 2161429 3287308 1495986 -1428507
12958 -1428507 -2820442 -4044711 -7964690 -12134629 -10529775 -3288553 1522805 -1178441
12950a178441n242471n98478L486895K201585k71637M37015K133110J660772O56633
12941C284983J369382J678402j213467n421090o661740l823298O19864L991664
12933f175300M941364L151813l62542l340265l797511j334864K604558M993803
12925F81056L187774j548743m166479j997970J174361O21892j869839q61132L667075
12916a112005N927656L416871N84147J370490K978210M59528n564557r460312
12908a399972p828441l311408n90303j84519J680453O345794Q718020M036903
12900G466527k960532k542499N105893P719385j660784j3108291j3282723l986543
12892a7249567K520438K161036J634187M390807N865770L546613J172937O00290
$$ plain form
12950 -1178441 -6420912 -7019390 -3532495 -1330910 -1602547 -1165532 967578 2628350 3284983
12941 3284983 4654365 6332767 5119300 -301790 -6963530 -10786828 -10166964 -6175300
12933 -6175300 -1233936 1917877 1555335 -1784930 -5582441 -6917305 -4312747 681056
12925 681056 3868830 2320087 -1846392 -3844362 -2670001 -2048109 -3917948 -4779080 -1112005
12916 -1112005 4815651 8232522 8816669 10187159 13165369 13624897 8060340 -1399972
12908 -1399972 -9228413 -12539821 -13130124 -13314643 -11634190 -5288396 3429624 7466527
12900 7466527 4505995 1963496 7069389 14788774 13127990 19699 -13263024 -17249567
12892 -17249567 -14729129 -12568093 -10933906 -6543099 -677329 2869284 4042221 4642511
12884D642511j286031m834430n212314p24592L928506N324311N072957L904432
12876A0815350j00024m990550m978100q3091K381622p36099l817036k821365j338639
12867e667932k009632j210223K346961L107230p57202j611631N040590J1129284
12859A0367445Q183452P14354k546512l048304o548864r527363m794606L567276
12851c633122M738073j193279l549054J083795M443828J757159j216964p142R56231
12842C379525k051798m239318o68623M634958M753049K25592k872669k047701
12834A113015k07809j26944j305103j742473l34693K137673L471724K309395r6118
12825E218667j637303j980193j655176l58322J073107m70769n304455p404761
$$ plain form
12884 4642511 3356480 -1477950 -6690264 -7414856 -3486350 1837961 6910918 10815350
12876 10815350 10715326 5724776 746676 663585 3045207 2309108 -1507928 -4329293 -5667932
12867 -5667932 -7677564 -8887787 -6540826 -3433596 -4190798 -5802429 -761839 10367445
12859 10367445 18550897 19265251 16718739 13670435 7121571 -2405792 -7200398 -3633122
12851 -3633122 1104951 -88328 -3637382 -2553587 1890241 3647400 2430436 2423294 3379525
12842 3379525 1327727 -2911591 -3580214 1054744 5807793 6033385 3160716 1113015
12834 1113015 905206 778262 -526841 -2269314 -2604007 -466334 3005390 5314785 5218667
12825 5218667 3581364 1601171 -54005 -412327 660780 190011 -5114444 -12519205
12817a2519205j818414O375240P709920J980739k031683p70078l10629l974310
12809e358420n463827o6704N809041M243169j287866j702064K908725M093199
12801C175253n32511l367217O76858N797575L925420l357279o970562k573777
12793c226240M132519N093130k03557m913712m076429o01419k53499k979999l275176
12784a0304382R46985M633423L037268j130633j931460J048537K982538J772961
12776A055237N96664J756570K649346K52716l612363m615358j834200J561116
12768b190272K827711K274174J438071R68092Q99732J182447J015125q34992l865044
12759C715044n233808k895752J370909L677328K433729m46693k468853k970965
$$ plain form
12817 -12519205 -14337619 -7962379 -252459 1728280 -303403 -1073481 -1384110 -5358420
12809 -5358420 -10822247 -10888951 -5079910 -836741 -2124607 -3826671 -917946 3175253
12801 3175253 2642742 -724475 -47617 5749958 9675378 6318099 -652463 -3226240
12793 -3226240 906279 5999409 5795852 882140 -3194289 -3795708 -4049207 -7029206 -10304382
12784 -10304382 -9357397 -4723974 -1686706 -2817339 -4748799 -3700262 -717724 1055237
12776 1055237 1651901 3408471 6057817 6310533 2698170 -1917188 -3751388 -2190272
12768 -2190272 637439 2911613 4349684 5317776 6217508 7399955 8415080 7580088 3715044
12759 3715044 -1518764 -4414516 -3043607 633721 3067450 2620757 151904 -2819061
12751b819061k576738j970754j631876j422789l03155K071926L655816K091846
12743b904785j356009k577243l3400L291641M355608L486490J894275q57730m422654
12734H76193n825793l332769K31543J401670J090766K030057L376104K310131
12726B157902n02601j861624j560218j950104k378065L38364N116947O061837
12718E422438J080974l861810k623563K548215M360778L74705m408659m450602
12710a557524o2916L885294L927567J310267n81831q34162j293851k400526j739689
12701F52629J426833L184368M5389n025432n976725j974689K200526L496216L346034
12692A375149K926992J046891j799658k194294J043395M281149L838309J40581
$$ plain form
12751 -2819061 -5395799 -7366553 -8998429 -10421218 -10724373 -8652447 -4996631 -2904785
12743 -2904785 -4260794 -6838037 -6871437 -3579796 775812 4262302 6156577 5298847 876193
12734 876193 -4949600 -8282369 -8050826 -6649156 -5558390 -3528333 -152229 2157902
12726 2157902 1655301 -206323 -1766541 -3716645 -6094710 -5756346 -639399 5422438
12718 5422438 6503412 2641602 18039 2566254 6927032 7301737 2893078 -1557524
12710 -1557524 -1620440 2264854 6192421 7502688 6920857 6086695 4792844 2392318 652629
12701 652629 2079462 5263830 5309219 283787 -5692938 -7667627 -5467101 -1970885 1375149
12692 1375149 4302141 5349032 3549374 1355080 2398475 6679624 10517933 10658514
12684A0658514m321486p582076p452152k494265M242639O701460L429367l36255
12676B845746n12500N45879l01715j012763J321446M098601K561205k702834o432535
12667D10530n557539j678301J909511K634027q6897l318202k701799J518746L937527
12658b932397K140377P15871L007533M339378n2256n154310k937788L899176M889086
12649G914670j888378o604165l010979K441428J538931l216391l662794J141594
12641e346084M201401J299446l515267m147375m04168K539016J363021j210431
12633e220441p14867K289623L123075O35172p20304J532459L354782J241452j151700
12624D369251P34626L771386K181658k152138l005112j091244k179595n011235
$$ plain form
12684 10658514 6337028 -1245048 -8697200 -11191465 -6948826 -247366 3182001 2845746
12676 2845746 2333246 2879125 2577410 1564647 2886093 6984694 9545899 6843065 410530
12667 410530 -5147009 -6825310 -4915799 -2281772 -2368669 -5686871 -8388670 -6869924 -2932397
12658 -2932397 -792020 -76149 2931384 7270762 7218506 2064196 -873592 3025584 7914670
12649 7914670 6026292 -577873 -3588852 -1147424 391507 -2824884 -6487678 -5346084
12641 -5346084 -1144683 154763 -3360504 -7507879 -7912047 -5373031 -4010010 -5220441
12633 -5220441 -5935308 -3645685 -522610 112562 -607742 924717 4279499 5520951 4369251
12624 4369251 5103877 8875263 11056921 8904783 5899671 4808427 2628832 -2382403
12616b382403k372463M701074N895420j436044o180073p38925O411682M211874
12608H110142l864588o618066k486026J110211J555666K762858M897303L175067
12600H642567k649018o659996n896925l483844j510623J872993O417929P631021
12592D364104L528940j693541l451441k064487j66617J255664K118565J857793
12584E748980P16409j62210r79498k903731m865893l958220L5240L540226L658729
12575H30032J133261j771506l674171l871929k402360p53961j84596M06406K302063
12566g986761L638132J931926q95380o14529K390820L363695Q23712j362225p91105
12557D98285L4875q74205j411561P962J115929K96303j88743R35936N67795k791804
$$ plain form
12616 -2382403 -4754866 -53792 5841628 4405584 -1774489 -2513414 3898268 8110142
12608 8110142 4245554 -2372512 -4858538 -3748327 -2192661 570197 5467500 8642567
12600 8642567 5993549 -666447 -6563372 -10047216 -11557839 -9684846 -3266917 4364104
12592 4364104 7893044 6199503 2748062 683575 516958 1772622 3891187 5748980
12584 5748980 6465389 6303179 5323681 2419950 -2445943 -6404163 -6368923 -2828697 830032
12575 830032 1963293 191787 -3482384 -7354313 -9756673 -10510634 -10695230 -10288824 -7986761
12566 -7986761 -4348629 -2416703 -3312083 -3926612 -1535792 1827903 2651615 1289390 498285
12557 498285 533160 -341045 -1752606 -1744644 -628715 -332412 -521155 414781 982576 -1809228
12547a809228m196549O13515O617765N280730k418864o282463j212333N659895
12539B252468N300293j128793n205952l131005P22850J427921l84202j507479
12531a653899j418011j624491j997094j175606K95666P03191P82538K803887N531956
12522B248137M426181j270501n797638m209845J039313M174277L478786R79009
12514E067719j776061l326519j309021L038243L207170l411638q613314l835200
12506a0958621N688093P428251O09792l147053R65611M104759K23602l453412
12498A461022Q8585M734193J841437m617936m883198K50028J665135k475143m780784
12489f716661j753892J460510Q90030l15250J456247M100923L535735l89852m078472
$$ plain form
12547 -1809228 -6005777 -5392262 1225503 6506233 4087369 -2195094 -3407427 2252468
12539 2252468 7552761 6423968 1218016 -1912989 -1190139 237782 -146420 -1653899
12531 -1653899 -3071910 -4696401 -6693495 -7869101 -7573435 -6870244 -6087706 -3283819 2248137
12522 2248137 6674318 5403817 -393821 -4603666 -3564353 609924 4088710 5067719
12514 5067719 3291658 -34861 -1343882 1694361 4901531 1489893 -7123421 -10958621
12506 -10958621 -5270528 2157723 2767515 -379538 586073 4690832 4914434 1461022
12498 1461022 1549607 6283800 8125237 3507301 -1375897 -1125869 539266 -1935877 -6716661
12489 -6716661 -8470553 -7010043 -6120013 -6435263 -4979016 -878093 2657642 2267790 -1810682
12480a810682m003094K43184M822829M584245n01342l896071q20203M526179M633814
12471G778859o36918m598143l679800q89147N40367J199845K137249K189781M26561
12462D468654j844447k704380j375060J473102L433787J776244k631240m878715
12454b282055k265462J514800J746776o13158j591352o05259K87573O96649Q33803
12445b277685o37141k872975j180289N046238P778782J623334n396904k495092
12437d11732O377193P840773j12659o097313m405562j967438l352122k911365
12429e040225K355144M960903m0509n014207j902616M407935M601379j99745k016472
12420B111587O57824K630389J659040m3107j326040k016985n7692M714750O870705
$$ plain form
12480 -1810682 -5813776 -5570592 -747763 3836482 3335140 -560931 -1381134 3145045 7778859
12471 7778859 7141941 2543798 -1136002 -2025149 -1484782 -284937 1852312 4042093 4468654
12462 4468654 2624207 -80173 -1455233 17869 3451656 5227900 2596660 -2282055
12454 -2282055 -4547517 -3032717 -1285941 -1899099 -3490451 -4095710 -3808137 -3111488 -2277685
12445 -2277685 -2914826 -5787801 -6968090 -1921852 5856930 7480264 2083360 -411732
12437 -411732 5965461 13806234 13693575 7596262 3190700 1223262 -2128860 -5040225
12429 -5040225 -2685081 2275822 2235313 -2778894 -4681510 -273575 4327804 4128059 2111587
12420 2111587 2769411 5399800 7058840 7015733 5689693 3672708 3615016 8329766 15200471
12411A5200471K011387n600920q257788n033828j009514P02618K78676k119711
12403c828609m771404l063797L664086P810152L491035l167466k541921L250409
12395H42485M168113q11408k617060J575842L438982j482744n385843j289438
12387a561071M850191L508903l349239n818521j336044K601728O86235l061341
12379c479159k703362O71429J477303j607867l875386j639202K670889M523835
12371c961520L751503L452542L838073K018210j704177k790575K6910J541042
12363F172008j742917n065577k472330L339038M675367J32427m326758m537274
12355c826016k191813j12154P93025m6513k135075j967824K699461P292339N398791
$$ plain form
12411 15200471 17211858 11610938 3353150 -1680678 -2690192 -1987574 -1708898 -3828609
12403 -3828609 -8600013 -11663810 -7999724 -189572 3301463 133997 -2407924 842485
12395 842485 5010598 4199190 1582130 3157972 6596954 5114210 -271633 -1561071
12387 -1561071 3289120 6798023 3448784 -2369737 -3705781 -1104053 -417818 -3479159
12379 -3479159 -6182521 -5511092 -4033789 -5641656 -9517042 -11156244 -8485355 -3961520
12371 -3961520 -210017 3242525 7080598 9098808 7394631 4604056 4630966 6172008
12363 6172008 4429091 -636486 -3108816 230222 4905589 5038016 711258 -3826016
12355 -3826016 -6017829 -6129983 -5336958 -5383471 -7518546 -9486370 -6786909 505430 5904221
12346E904221j061540l747403l35224K729471J313954q85027p55358j278379m053898
12337b169183m175879J233769O007625L682260j985672l024807L29816J585177
12329A483106m21330q44383J156453O71381l459727n351491j174555M683563O093216
12320B836233L158371K53129k98945P04815J803281J498796j230929m577188m452046
12311c04483J15478M586607M676400K016898O87458M32055k147222o752727q694130
12302e383666n492943j9103L922357N414829M829339K411965J03675O46784K629624
12293I062861R31812m626536o269328N13424P442621L677803o751305q376398
12285d395046L270835J3471005Q316910n972967j2531275o815127L82308O10717
$$ plain form
12346 5904221 4842681 1095278 760054 3489525 4803479 3918452 3163094 1884715 -2169183
12337 -2169183 -6345062 -5111293 896332 4578592 2592920 -431887 -102071 1483106
12329 1483106 1061776 217393 1373846 2045227 -1414500 -6765991 -7940546 -3256983 2836233
12320 2836233 5994604 6247733 5948788 6653603 8456884 9955680 8724751 4147563 -304483
12311 -304483 -189005 4397602 9074002 11090900 11778358 12210413 10063191 3310464 -5383666
12302 -5383666 -10876609 -10895712 -6973355 -1558526 3270813 5682778 5786453 6433237 9062861
12293 9062861 9994673 5368137 -901191 -387767 7054854 10732657 3981352 -4395046
12285 -4395046 -1124211 12346794 20663704 14690737 2159462 -4655665 -4273357 -3662640
12277c662640k435404k345729J64361J212502R11580J307083J432824n00998k744107
12268f660528k417387l67839N63394N04750J434855K288948J51352l683365m016182
12259a2202002M62305M457780L747159J237385J479691K825705O19244l829820
12251a202553m174287P62173M397917K362686j088485p06526J068091j074318
12243C44698n585053o170865j881799J997589K805710L236669M370017K985344
12235B102310j757366n127711l595064L12705L039193M723901N406631K136059
12227G240658n087043r363994n177226K755852N380622J721198j234490K66693
12219c497730K535316J718658q43573k073391j339810M47274K452523L388914
$$ plain form
12277 -3662640 -6098044 -8443773 -8279412 -7066910 -6155330 -4848247 -3415423 -3916421 -6660528
12268 -6660528 -9077915 -9445754 -8882360 -8377610 -6942755 -4653807 -4502455 -8185820 -12202002
12259 -12202002 -11739697 -7281917 -3534758 -2297373 -817682 2008023 2627267 -1202553
12251 -1202553 -5376840 -4614667 -216750 2145936 1057451 350925 1419016 344698
12243 344698 -5240355 -11411220 -13293019 -11295430 -8489720 -5253051 -883034 2102310
12235 2102310 344944 -4782767 -8377831 -8065126 -5025933 -302032 5104599 7240658
12227 7240658 2153615 -7210379 -12387605 -9631753 -4251131 -2529933 -3764423 -3497730
12219 -3497730 -962414 756244 -87329 -2160720 -3500530 -3053256 -600733 2788181
12211B788181K163836k38814j812939k254435k164754o56650K682842M535954
12203E043221J273219m502140n927756j333577L231666K695653n39628j549407
12195a608749k23657J48093j078137j390912L73622K404084K746326J441683k98954
12186B513399j369216j068364M61789J747325J074864j249374k547736p79760
12178a217073K422518L317169J103498n83540J157423L823715K967132j016008
12170A1974834l507662k686424j410954j593958j603017p08711j038280k774307
12162c348479k513819M99833J675217j428756l957403j077396M081544N418371
12154f50888K867404M74964r26933k747130l538423j598436J35615j357669k617238
$$ plain form
12211 2788181 4952017 4713203 2900264 645829 -1518925 -2175575 507267 5043221
12203 5043221 6316440 1814300 -4113456 -5447033 -2215367 480286 -59342 -1608749
12195 -1608749 -1832406 -1684313 -2762450 -4153362 -3779740 -1375656 1370670 2812353 2513399
12186 2513399 1144183 75819 537608 2284933 3359797 2110423 -437313 -1217073
12178 -1217073 1205445 4522614 5626112 5042572 6199995 10023710 12990842 11974834
12170 11974834 8467172 5780748 4369794 2775836 1172819 464108 -574172 -3348479
12162 -3348479 -5862298 -5362465 -3687248 -5116004 -9073407 -10150803 -6069259 -650888
12154 -650888 2216516 2691480 1764547 -982583 -4521006 -6119442 -5983827 -7341496 -9958734
12145i958734Q10748N160074L441891k275201l170768K258325O144564L972897
12137F383796o5227j937626k738677k568990J318391O936186O862977n63209p051172
12128F576449n927811r34488J160216J15513o41538n68365n92021n2443N89715
12119b74773j142052m160389k916622L723268Q573349O092116O62695p58590Q38096
12110A0637098j33605l853541n285914k385178J618116L217684J869784q45694
12102D838750k601295k112939q69195q91441p38529K152090N293191L433666k245276
12093F259022m588611j876258m12067k799641k979865K269809O381363M065841
12085F319593M06378J254070L043660Q11659j864052o90131m29373n620974q973132
$$ plain form
12145 -9958734 -9147986 -3987912 -546021 -2821222 -5991990 -3733665 2410899 6383796
12137 6383796 6318569 4380943 1642266 -926724 391667 7327853 14190830 13627621 6576449
12128 6576449 648638 -285850 874366 989879 348341 -220024 -812045 -864488 -274773
12119 -274773 -1416825 -5577214 -8493836 -4770568 3802781 9894897 10557592 9799002 10637098
12110 10637098 10503493 6649952 1364038 -1021140 596976 3814660 5684444 4838750
12102 4838750 2237455 124516 -744679 -1636120 -2374649 -222559 5070632 8504298 6259022
12093 6259022 1670411 -205847 -617914 -3417555 -6397420 -4127611 2253752 6319593
12085 6319593 6725971 7980041 11023701 11835360 9971308 9281177 8851804 3230830 -5742302
12076e742302k157431P784609P512110j127590m428061J52011J106688n496074
12068b396040q333155l31994Q658915P170101q49998l788706K96280L489101J092631
12059E007135l153093l827368n93978K183054Q88751k294260j255264N048140
12051B003117Q734170L161662o250746q763124l663260J93382o87715n38097L237352
12042b573259M679589M03721l577980j800881J786649J008929k804015m202478
12034g079725j811410J825988M270015L367191j713167o544288m367341L803131
12026h249606Q560393N219932J29723o32268n04782l905446o599024l210639K190909
12017g000808K536877k99473J23134K532257N85815m617519n413402m11452L604387
$$ plain form
12076 -5742302 -7899733 -115124 7396986 6269396 1841335 1993346 3100034 -2396040
12068 -2396040 -10729195 -11061189 -2402274 4767827 3917829 129123 425403 3914504 5007135
12059 5007135 1854042 -1973326 -2567304 -384250 504501 -1789759 -3045023 2003117
12051 2003117 10737287 13898949 7648203 -1114921 -4778181 -4584799 -5272514 -5810611 -2573259
12042 -2573259 2106330 2510051 -1067929 -2868810 -1082161 -73232 -2877247 -7079725
12034 -7079725 -8891135 -7065147 -2795132 572059 -1141108 -7685396 -12052737 -8249606
12026 -8249606 310787 5530719 5660442 5028174 4523392 617946 -5981078 -9191717 -7000808
12017 -7000808 -4463931 -4763404 -4640270 -2108013 -1522198 -6139717 -11553119 -11964571 -8360184
12008h360184L309551K953179M975275N187472O50923m548849n232130j896546
12000b961309J551813K955645K443072J034432L42781J095154J594507K53533
11992H309628j413987j842434l238333p054383q161513j280962Q030291Q434543
11984A782850j67712n107526J68045O420116M144294j333908K7598N448894M094706
11975A5477357m392615q791818l784724K837089L082099p29142k591228j999261
11967h92243j104850R54434M501578M753508j933127r704836q643486J344547
11959a0724475Q811993N165278m467708q448603l243329L877093N520063K588858
11951i20830O33642J607065K621111J387877p74568j715369j279973k52879J071186
$$ plain form
12008 -8360184 -5050633 -2097454 2877821 8065293 8716216 4167367 -1064763 -2961309
12000 -2961309 -1409496 1546149 3989221 5023653 5366434 6461588 8056095 8309628
11992 8309628 6895641 5053207 1814874 -5239509 -13401022 -14681984 -6651693 1782850
11984 1782850 1615138 -3492388 -3324343 3095773 7240067 5906159 5933757 11382651 15477357
11975 15477357 11084742 2292924 -1491800 1345289 4427388 3698246 1107018 -892243
11967 -892243 -1997093 -1042659 3458919 8212427 6279300 -3425536 -12069022 -10724475
11959 -10724475 -1912482 3252796 -1214912 -9663515 -12906844 -9029751 -3509688 -920830
11951 -920830 -287188 1319877 3940988 5328865 4554297 2838928 1558955 1306076 2377262
11942B377262J789193K94940k628816l036409Q49282M595390K876202k437928
11934D679116m387859j039991J913493J44107l031444k500343P95482J999838
11926a427601m36606l651806m599432k065229L473695Q682626Q459674K143897
11918A0579218l608883k623735K234696L474132K5484k515466j820115j614687
11910D130644l566877l774679j75637K996203K076549q4837M81895K049997P99325
11901D932583k214598k983867j223394j42435q14943j128765L46896K937960N476319
11892E185756O340639L305991l178389p826551n598246J448259N995545M215057
11884I888061m86377k723324j244437R80936Q04353j743276l395465j356739K484559
$$ plain form
11942 2377262 4166455 4461395 1832579 -1203830 -354548 4240842 7117044 4679116
11934 4679116 291257 -748734 1164759 1308866 -1722578 -4222921 -3427439 -1427601
11926 -1427601 -1864207 -5516013 -10115445 -12180674 -8706979 -24353 8435321 10579218
11918 10579218 6970335 4346600 6581296 10055428 10080912 7565446 5745331 4130644
11910 4130644 563767 -3210912 -3386549 -390346 1686203 1601366 2083261 4133258 4932583
11901 4932583 2717985 -265882 -1489276 -1631711 -2446654 -3575419 -3228523 -290563 5185756
11892 5185756 11526395 14832386 11653997 3827446 -1770800 -322541 5673004 9888061
11884 9888061 9401684 6678360 5433923 6414859 7219212 5475936 2080471 723732 3208291
11875C208291K893103j788868o450778n501176k61415L248586K446649L11333
11867a894275p2877P21873P34320k54890r03257m9236K128545L779851K735522
11858F925576q14228l991977m552266l011054n82225K477670M911400M058701
11850E421597Q4519k498544r01842J352335j07486l439315l847193j323076M82583
11841d776422J110708K685176L721006O53907m326168m279986J940122O853416
11833C581759M868060k92715k392465j792297k858847n617832n457094m39657
11825a0401088N255498O167857J881216k573441k363754J784368M826876L811113
11817H388645Q45743j119486k284646l470403l049487k45374J463572r22608m103054
$$ plain form
11875 3208291 6101394 4312526 -2138252 -7639428 -7900843 -4652257 -2205608 -1894275
11867 -1894275 -1967152 -1245279 -510959 -765849 -1669106 -1718342 410203 4190054 6925576
11858 6925576 6111348 2119371 -2432895 -5443949 -6026174 -3548504 1362896 5421597
11850 5421597 5506116 3007572 2105730 3458065 3350579 -88736 -3935929 -5259005 -4776422
11841 -4776422 -3665714 -980538 2740468 3394375 -931793 -5211779 -3271657 3581759
11833 3581759 8449819 8157104 5764639 3972342 1113495 -4504337 -9961431 -10401088
11825 -10401088 -5145590 1022267 2903483 330042 -2033712 -249344 4577532 8388645
11817 8388645 9234388 8114902 5830256 2359853 -689634 -935008 528564 -394044 -4497098
11808d497098k804406J864391M223653K757234P47621o38299k852329m140045
11800e339278j002779M045356M199721p24405l076510P40660N031092M312054
11792H185911M34359l000709n675563o487392k522182L623541L881231k649263
11784d210067n711826Q07880Q142619N654980k974691o451282k719498J461775
11776f000110L139951M302746L641028j492472o556233m249949L007182N433294
11768A225437Q07666l180213k081886K63866J291285L598931O495626M259849
11760A2680561k858957n901198j018440L301360k58125n623414l352004L735714
11752G05497N022711j451468o837703m818729J203772M838511M108399R57436
$$ plain form
11808 -4497098 -7301504 -5437113 -1213460 1543774 2291395 1653096 -1199233 -5339278
11800 -5339278 -6342057 -2296701 1903020 1178615 -1897895 -1157235 3873857 8185911
11792 8185911 8620270 5619561 -56002 -6543394 -9065576 -5442035 -1560804 -4210067
11784 -4210067 -9921893 -9114013 -971394 4683586 1708895 -4742387 -7461885 -6000110
11776 -6000110 -2860159 1442587 5083615 3591143 -2965090 -7215039 -4207857 1225437
11768 1225437 2033103 -1147110 -3228996 -2965130 -1673845 1925086 8420712 12680561
11760 12680561 9821604 3920406 2901966 6203326 5945201 321787 -3030217 705497
11752 705497 5728208 4276740 -2560963 -7379692 -6175920 -1337409 2770990 3728426
11744C728426j782783j860806M98924J961887K05816k303481k063855m87130j468835
11735c571837m059469l188502J887692N466136L534190p49545k278311p98401
11727c758047N42613M76179K01723N66179J409057K413942K578919M30816l231297
11718A630084m682732j842824K175624K919380O05853r10454j51306O87738J98584
11709F29947l05913O1780K03520k48895J21642J449329J600675j4806q57063L10702
11699B950918P99121j087539j926142J469291N173396K611582m896485q539309
11691c445167m213487J768269K186540j079343j214738K929020O068530M954427
11683G954051K074597M24152o60008k576229l984876l023749q47310r1213q59009
$$ plain form
11744 3728426 1945643 84837 583761 2545648 2751464 447983 -1615872 -2103002 -3571837
11735 -3571837 -7631306 -10819808 -8932116 -3465980 68210 -681335 -2959646 -3758047
11727 -3758047 -3215434 -2739255 -2537532 -1971353 -562296 1851646 4430565 4861381 1630084
11718 1630084 -3052648 -4895472 -2719848 199532 805385 -105069 -256375 431363 629947
11709 629947 324034 385814 589334 340439 462081 1911410 3512085 3497279 2640216 2950918
11699 2950918 3750039 2662500 736358 2205649 7379045 9990627 5094142 -3445167
11691 -3445167 -7658654 -5890385 -3703845 -4783188 -5997926 -3068906 2999624 7954051
11683 7954051 10028648 10452800 9792792 7216563 3231687 207938 -639372 -730585 -1589594
11674a589594r04029N52617J774574J605783J177270J512985J606290N09795n15546
11665E730145j48696J92128j468835l672530l186488m26409P51190o40228r72218
11656c841941J550814L145568N36028l012709k339134J579176L400180J687598
11648B705580k339K34208M36974k15106N28791L247907M656382K411650j372212
11639A2631835l529598l740956l122653j833478q3401J011202J286798J782312
11631D402061J970052l6512l139218l189404L74787K211686r23440l994858p02741
11622c027587O300152Q482191L513485k201893l538612k910082m202312n783080
11614c367738l640055J631160N249381M427470P83849k747463m417347l341251
$$ plain form
11674 -1589594 -2493623 -1941006 -166432 1439351 2616621 4129606 5735896 6245691 5730145
11665 5730145 5581449 5773577 4304742 632212 -2554276 -2980685 -2229495 -2869723 -3841941
11656 -3841941 -2291127 854441 1390469 -1622240 -3961374 -2382198 1017982 2705580
11648 2705580 2703241 2937449 3374423 3159317 3688108 6936015 11592397 14004047 12631835
11639 12631835 9102237 5361281 2238628 405150 321749 1332951 2619749 4402061
11631 4402061 6372113 6335601 3196383 6979 381766 2593452 1670012 -2324846 -3027587
11622 -3027587 3272565 11754756 15268241 13066348 9527736 6617654 2415342 -3367738
11614 -3367738 -7007793 -5376633 -127252 4300218 5084067 2336604 -2080743 -5421994
11606e421994K59548L860860M254213J548978m44773Q45125L273074L099198n8483
11597A1215746l468298n110958m862470l029707n46589K57469j644052l131581
11589a0320440n85279L982216N065220K254039J147001M031964N633093J589977
11581A2797791m177881n228881j527856K133999K977104R25096l554051p329819
11573b984498m796165L818125Q912279L587144n114348n805663K50544K375264
11565B42682j690505l479947M63742L234287P96864j357990M58665J109660k746918
11556b969460m771904N54969P460771P269686J238306l078642l405214k771708
11548d73196j816846J091160M319826M309517J150678k092643l833839l871946
$$ plain form
11606 -5421994 -5162446 -1301586 2952627 4501605 4056832 4901957 8175031 11274229 11215746
11597 11215746 7747448 2636490 -2225980 -5255687 -5802276 -5544807 -7188859 -10320440
11589 -10320440 -10905719 -6923503 -1858283 395756 1542757 5574721 11207814 12797791
11581 12797791 8619910 3391029 1863173 3997172 6974276 7899372 4345321 -2984498
11573 -2984498 -7780663 -3962538 4949741 8536885 3422537 -2383126 -2132582 242682
11565 242682 -1447823 -4927770 -4464028 -1229741 -432877 -1790867 -1332202 -222542 -2969460
11556 -2969460 -7741364 -7186395 274376 7544062 8782368 5703726 2298512 -473196
11548 -473196 -2290042 -1198882 3120944 7430461 8581139 6488496 2654657 -1217289
11540a217289j702765J240310J115374k574581m629345j667883K423221L085098
11532c927860K148499K897777L246158L93055k401449j051589J398425p4269k890506
11523b61759j063867L559908L445658k236202o209686m321442j53098K353644
11515d886844L409889L244926M30389l678404m730107j694312J478247K057325
11507d368891J781294K527231L193909K510633J157490l13198k392395m430452
11499c34379m517200k338343L13325K070078K773528K198988M38852j076387j125267
11490a596805k26710J030678K937520M078911J386515m270700o771431l160956
11482f592978J039784J78698k435749n09714M163166M733262Q70533j262674M44622
$$ plain form
11540 -1217289 -2920054 -1679744 -564370 -3138951 -7768296 -9436179 -7012958 -3927860
11532 -3927860 -1779361 1118416 4364574 4757629 2356180 1304591 2703016 2628747 -261759
11523 -261759 -1325626 2234282 5679940 3443738 -2765948 -7087390 -7240488 -4886844
11515 -4886844 -1476955 1767971 2198360 -1480044 -6210151 -7904463 -6426216 -4368891
11507 -4368891 -2587597 -60366 3133543 5644176 6801666 6488468 4096073 -334379
11499 -334379 -4851579 -7189922 -6876597 -4806519 -2032991 165997 604849 -471538 -1596805
11490 -1596805 -1823515 -792837 2144683 6223594 7610109 3339409 -3432022 -6592978
11482 -6592978 -5553194 -5374496 -7810245 -8319959 -4156793 576469 1447002 184328 628950
11473F28950J776629M26736j061169j168120j560226k718839l084125k559629
11465i319793j787847P43267N304784P076977K562115k882775k089573K057448
11457A664603J453665k825454k442215K715745L782964j028185k869664J705145
11449B156604M169389p62503n395379k191004L684943L718350m87403k192687
11441B700310j151197j215967j735028m2469J677821J8771k731360k570039j128452
11432f177610j865727k448915J315195O641285O920332K271177q23602l9932R9700
11423E891903k950630m985343j828855L801434N708325K309744j685799j574369
11415D686410J343022J779207j691212l864339n44115M002728K478600l871950
$$ plain form
11473 628950 2405579 2832315 1771146 603026 -957200 -3676039 -6760164 -9319793
11465 -9319793 -11107640 -10364373 -5059589 2017388 4579503 1696728 -392845 1664603
11457 1664603 3118268 292814 -2149401 566344 4349308 3321123 451459 2156604
11449 2156604 6325993 5563490 168111 -2022893 1662050 5380400 4892997 2700310
11441 2700310 1549113 333146 -1401882 -1444351 233470 252241 -2479119 -5049158 -6177610
11432 -6177610 -8043337 -10492252 -9177057 -2535772 4384560 6655737 5832135 5792203 5891903
11423 5891903 2941273 -2044070 -3872925 -71491 5636834 7946578 6260779 4686410
11415 4686410 6029432 7808639 6117427 2253088 1708973 5711701 8190301 4318351
11407D318351n968775k23365N828630M406396j993590n450890l489949q5830J378808
11398a280214J467331K065466L496060L987760J320461l699196o194539k818631
11390a655502K528164L205690n11051k038730J178740M502611M193769J851633
11382A3255324o49194l555151m890087j420569L825583L274640l084941o129465
11374F26140j811041K515899R16851j745984J94790L207049K414052Q96835K460777
11365I675368K947609j880648o882582n686494j713872j115057j364045K151240
11357c868481M643227l62955p016569m625616M139610O722073R20199k577807
11349b026319J485712N647938L357362j914826m667027m606678k818350N53928
$$ plain form
11407 4318351 -1650424 -1873789 3954841 8361237 6367647 916757 -2573192 -2659022 -1280214
11398 -1280214 187117 2252583 5748643 9736403 11056864 7357668 1163129 -1655502
11390 -1655502 872662 4078352 3567301 1528571 2707311 7209922 11403691 13255324
11382 13255324 12606130 9050979 4160892 2740323 6565906 9840546 6755605 626140
11374 626140 -1184901 1330998 2247849 501865 696655 3903704 6317756 7214591 9675368
11365 9675368 12622977 10742329 3859747 -1826747 -3540619 -4655676 -6019721 -3868481
11357 -3868481 774746 411791 -6604778 -11230394 -7090784 -368711 551488 -2026319
11349 -2026319 -540607 5107331 8464693 6549867 1882840 -2723838 -5542188 -4988260
11341d988260K516060l84718m343110k035764M542154N141890k422644p722835
11333i697227l597219L574572N023304K007964N61396J279165J284971P62568
11325A199494J183749J346774L19906K40048J843074J586155k467358o194598
11317i42756n268913j650510L1308p48803j204076m1380J803408K961284K168643
11308b891795l80715j518193J187117M109361J653896l802289l543783L697778
11300a488623P900147K160497o729041q204938k115403L714413M955488K991241
11292C183781j02612k147504j50123M666411N082496k037892q092445l588565
11284c186453O529614Q403360o49606q041173m245956M145212M942504k681935
$$ plain form
11341 -4988260 -2472200 -2856918 -7200028 -9235792 -4693638 448252 -1974392 -9697227
11333 -9697227 -13294446 -9719874 -4696570 -2688606 -2127210 -848045 436926 1199494
11325 1199494 2383243 3730017 4049923 4289971 6133045 7719200 5251842 -942756
11317 -942756 -6211669 -7862179 -7830871 -8579674 -9783750 -9825130 -8021722 -5060438 -2891795
11308 -2891795 -3272510 -4790703 -3603586 505775 2159671 -1642618 -5186401 -1488623
11300 -1488623 6411524 8572021 1842980 -6361958 -8477361 -4762948 192540 3183781
11292 3183781 3081169 933665 783542 5449953 10532449 8494557 402112 -3186453
11284 -3186453 3343161 11746521 11096915 3055742 -1190214 2954998 7897502 5215567
11276E215567q580743o022271Q50559M334171L121345K050154L850804N167766
11268I987352K300148k296545l265771p33356j11161k991046m203516n60779L261290
11259A386616K062155j500424j629719J064006J239610k056558m530494m017996
11251g982804k494123q72092K138284N344980N058716J345579p34653J721732
11243C525619N139846M524805k89196n284717o634323l350192J854282L814010
11235C300134M7164n002005m447941J816845O624832N303065J188368o51860l27883
11226G850719m21874o27710M96085J349335n24811l795938m985285l523755j497155
11217e680389M53104L116060N373803M795001J491686j916217l960933m724226
$$ plain form
11276 5215567 -3365176 -9387447 -8536888 -4202717 -1081372 968782 4819586 9987352
11268 9987352 12287500 9990955 6725184 5991828 5880667 2889621 -1313895 -1874674 1386616
11259 1386616 3448771 1948347 318628 1382634 2622244 565686 -3964808 -7982804
11251 -7982804 -10476927 -11349019 -9210735 -3865755 1192961 2538540 1803887 3525619
11243 3525619 8665465 13190270 12901074 7616357 982034 -2368158 -513876 3300134
11235 3300134 3347298 -1654707 -6102648 -4285803 2339029 7642094 8830462 8178602 7850719
11226 7850719 7428845 6801135 7297220 8646555 8121744 4325806 -659479 -4183234 -5680389
11217 -5680389 -5227285 -2111225 3262578 8057579 9549265 7633048 3672115 -1052111
11209a052111l212674J442196N979923M996782j363281n945861l561932J934593
11201g82365K990717j497181n254189l112108K935679O633656M354374j550341
11193D718242n382021l963745o077J355825n82141j154545K423171N921692L639311
11184F969712k810898n847522k105398L100114L073779j885051n812993m662139
11176i980396q1224L379452K941467j68767k189681r34596J520306J558661p56477
11167d711255j768053j48422P37442j385477k994127Q7342N037840M852194j350080
11158a642596o174334l847273K222430M757050K103644j346468k070444n77132
11150f575123J480280L237626L356072N10161l644143m942614j786787K513316
$$ plain form
11209 -1052111 -4264785 -2822589 3157334 8154116 6790835 844974 -2716958 -782365
11201 -782365 2208352 711171 -4543018 -7655126 -4719447 1914209 6268583 4718242
11193 4718242 -663779 -4627524 -4633601 -3277776 -3859917 -5014462 -2591291 3330401 6969712
11184 6969712 4158814 -1688708 -3794106 -693992 2379787 494736 -5318257 -9980396
11176 -9980396 -10061620 -6682168 -3740701 -3909468 -6099149 -7033745 -5513439 -3954778 -4711255
11167 -4711255 -6479308 -6627730 -5890288 -7275765 -10269892 -10182550 -5144710 -292516 -1642596
11158 -1642596 -7816930 -11664203 -9441773 -4684723 -2581079 -3927547 -5997991 -6575123
11150 -6575123 -5094843 -1857217 1498855 2009016 -1635127 -6577741 -8364528 -5851212
11142e851212M015732K622294O09307j022991k353011k537924q62160J284913
11134d095052K061626J812763J542192J36185l521011o668088n066632O21872
11126a3176145M850063M264555J110620j182858j964220j747081m69129J061265
11118g252930J356266J056943J937231K488862n96105n410601n394087O28035
11110a1186386N419484L968179N16374K96079J235762J20934M4378L681279N476640
11101I572723K55539n629049k920118M565145M883773l024520q070108m678920
11093e045535R44445L440063M545015M369101p40756p752249p032613J839262
11085e433267O640455J331754l953353J3653O281941M069652l564979o375035
$$ plain form
11142 -5851212 -1835480 786814 1396121 373130 -1979881 -4517805 -5379965 -4095052
11134 -4095052 -2033426 -220663 1321529 1457714 -2063297 -8731385 -13798017 -13176145
11126 -13176145 -8326082 -4061527 -2950907 -4133765 -6097985 -7845066 -8314195 -7252930
11118 -7252930 -5896664 -4839721 -2902490 -413628 -1009733 -6420334 -11814421 -11186386
11110 -11186386 -5766902 -1798723 -1282349 -986270 249492 370426 414804 4096083 9572723
11101 9572723 9828262 4199213 1279095 5844240 10728013 7703493 -366615 -5045535
11093 -5045535 -4101090 -661027 3883988 8253089 7512333 -239916 -7272529 -5433267
11085 -5433267 1207188 2538942 -1414411 -1400758 4881183 8950835 5385856 -989179
11077i89179l664206k118026k460822k98035L418448L801537J356244L42390M71918
11068a39731r86345k034208L18521K715152R25220j290385J404314M763521J314378
11059F990437n620153o393542j081840J711260N67450K189653O762387O492865
11051A1618517M49012k971800j260545j752527o390563o550537R89333O437315
11043E68205L076019j629448j76815J624346l318953q417635l873250N460995
11035f686536P037041Q17803j842493K394670M592433k94075n622120m913555
11027d516832j193158K10370J8455R27503J603328L19428j90616K781258N872290
11018E832026L859787j768344m033688k87161M050641L069427k023858n372487
$$ plain form
11077 -989179 -4653385 -6771411 -9232233 -9530268 -6111820 -2310283 -954039 -611649 -139731
11068 -139731 -1126076 -3160284 -2841763 -126611 798609 -491776 912538 5676059 6990437
11059 6990437 1370284 -5023258 -6105098 -4393838 -3826388 -1636735 5125652 11618517
11051 11618517 12067529 9095729 7835184 6082657 -307906 -6858443 -5869110 568205
11043 568205 3644224 2014776 1837961 3462307 143354 -8274281 -12147531 -6686536
11035 -6686536 350505 1168308 -674185 1720485 6312918 6018843 396723 -4516832
11027 -4516832 -5709990 -5499620 -5481165 -4553662 -2950334 -2630906 -2821522 -40264 5832026
11018 5832026 9691813 7923469 3889781 3602620 7653261 10722688 8698830 3326343
11010C326343m139594p41247J390049J224160m43285k123710j894822P47913K852926
11001A98733Q95257l529007m587056l87367L816859L252728K73355l94248R29618
10992D68872J099820L98815Q33437Q49490j939207m710251k886428J638512K809745
10983a437195K94416m02194K208280L414390J080039j037293n97896m898k57935
10974C259714J199241L958367L475508n33978k261937n532P6749m720514p180873
10965b733255j870745M551446L400166j995180k229882K601317L941568o17970
10957E047465m221227k575727L08995Q5064j839823k795818l296879m030324l175462
10948a6493736K72858L890714M952781L648343J544905p58853k933089l834974
$$ plain form
11010 3326343 -813251 -1554498 -164449 1059711 616426 -1507284 -3402106 -2654193 198733
11001 198733 1093990 -2435017 -7022073 -7409440 -3592581 -339853 -66498 -460746 468872
10992 468872 1568692 1967507 2800944 3650434 1711227 -2999024 -5885452 -4246940 -1437195
10983 -1437195 -1142779 -1544973 663307 4077697 5157736 4120443 3522547 3517649 3259714
10974 3259714 4458955 8417322 11892830 11358852 9096915 9091383 9168132 4447618 -2733255
10965 -2733255 -4604000 -52554 3347612 1352432 -877450 1723867 5665435 5047465
10957 5047465 826238 -1749489 -1440494 -1355430 -3195253 -5991071 -9287950 -13318274 -16493736
10948 -16493736 -16220878 -12330164 -7377383 -3729040 -2184135 -2942988 -5876077 -9711051
10940i711051k616411J4329K191145K129030k55746k178458k15658M687885O770488
10931H15553K701664l047976l814619J49546K748006J159016j257618j256954
10923a803382J91291J166264J482121N72087k704975n963237l755402M276227
10915f539006R846628N705709l679789o991622r17007N972212N532452L73138
10907I302715j861674l2467M95825k505654n000698m012212k142619k009774j236384
10898i002942K577211N744125L231334k529670m110154j81356K513906j20650
10890a878196l328418j656523K113393J654770k676308m554271j488040K142533
10882i671060K642838K214616M006630N998480L964103j221602l714880p09241
$$ plain form
10940 -9711051 -12327462 -12313133 -10121988 -7992958 -8248704 -10427162 -10642820 -5954935 815553
10931 815553 3517217 469241 -3345378 -3195832 -447826 711190 -546428 -1803382
10923 -1803382 -1612091 -445827 1036294 1608381 -1096594 -7059831 -10815233 -6539006
10915 -6539006 3307622 9013331 5333542 -1658080 -2575087 3397125 8929577 9302715
10907 9302715 7441041 7408574 7904399 5398745 398047 -3614165 -5756784 -7766558 -9002942
10898 -9002942 -6425731 -681606 2549728 20058 -4090096 -4271452 -1757546 -1878196
10890 -1878196 -5206614 -6863137 -4749744 -3094974 -5771282 -10325553 -11813593 -9671060
10882 -9671060 -7028222 -4813606 -806976 5191504 9155607 7934005 4219125 3509884
10874C509884L358378K826061j396744l397099p87088K167013R34054l073799
10866D140660m990066l029058J78074J666798J066939j41504m22092N83069J578223
10857F31043J080401j36836J27406J454658M51950l709645o556497m079436J495669
10848i241287N081369N236843L560262M86295l499426m926011j315790L437098
10840a180647L474907l43861k210830r14933p94670l084670l537567j59718L285550
10831e466439L657072K472694J467466j82759k015598j432399Q64851M70251k922538
10822c087399l564044Q49872M085754Q75731m046582k746107L973163Q059697
10814D400085N477886r9361l858742m684909l386807o15822K321678L385562J804669
$$ plain form
10874 3509884 6868262 9694323 8297579 4900480 4113392 6280405 7214459 4140660
10866 4140660 -849406 -3878464 -3700390 -2033592 -966653 -1108157 -1530249 -947180 631043
10857 631043 1711444 1574608 1702014 3156672 3608622 -101023 -6657520 -10736956 -9241287
10848 -9241287 -4159918 1076925 4637187 5123482 1624056 -3301955 -4617745 -1180647
10840 -1180647 2294260 1950399 -260431 -1175364 -1970034 -5054704 -8592271 -8751989 -5466439
10831 -5466439 -1809367 663327 2130793 1948034 -67564 -1499963 -635112 -164861 -3087399
10822 -3087399 -6651443 -5801571 -1715817 -840086 -4886668 -7632775 -3659612 4400085
10814 4400085 9877971 9778610 5919868 1234959 -2151848 -2767670 -445992 2939570 4744239
10805D744239q58722j990925j66357L241625M869986K977046m11362k719606m648484
10796E037440p515425q482079l787347L553499N624232O82720l845332k218537
10788a0950829J688720J456431j885053k359422J438492M707321L382068j201640
10780c723912m518377l522132O84065L909827L303645O25207l87980R34576K344589
10771c50492K712467K317190K67250l784703o295072l683807R57261J199488k683182
10762i343600l886462L3484L877032L984744L024178L123036J913796j177689
10754A548519k035093P54751K411945O183k563207j816788l56219q68038j018077
10745c936024R91016K184530Q51675L26430K086317K083822j069489j987876J571768
$$ plain form
10805 4744239 3885517 1894592 1728235 4969860 9839846 12816892 12405530 9685924 5037440
10796 5037440 -2477985 -10960064 -14747411 -11193912 -5569680 -4886960 -8732292 -10950829
10788 -10950829 -9262109 -7805678 -9690731 -12050153 -10611661 -5904340 -2522272 -3723912
10780 -3723912 -8242289 -11764421 -11080356 -7170529 -3866884 -3241677 -3629657 -2695081 -350492
10771 -350492 2361975 4679165 4946415 1161712 -5133360 -8817167 -7859906 -6660418 -9343600
10762 -9343600 -13230062 -13196578 -9319546 -5334802 -2310624 812412 2726208 1548519
10754 1548519 -486574 268177 2680122 2686305 123098 -1693690 -2049909 -2917947 -3936024
10745 -3936024 -2945008 -760478 91197 417627 2503944 4587766 3518277 1530401 3102169
10736C102169K937755k064062o160786k046351M678810M372806q81514j763549
10728B175278K300000L483567k85020k926011j576663n1239k01163R58488L823392
10719G700629L870873p87913n697793o337117l617428j339958j457470k891821
10711a0557998k915464J05809L980268M548073J662338q7542J311501J882482
10703g0533j089522l398171l08086N572828P934578M967411m13408m984704o061143
10694B149250k254980K836676K693880k710372n609523k360413J059779M18778
10686c776925P73501N350173O786142k46216o659592k013247P064387O008674
10678A3286897m613698j0353579n342907J448092K929451K693665M295235M216031
$$ plain form
10736 3102169 6039924 3975862 -2184924 -4231275 447535 4820341 3938827 2175278
10728 2175278 4475278 7958845 7673825 4747814 3171151 3119912 2918749 3877237 7700629
10719 7700629 11571502 10783589 5085796 -1251321 -4868749 -6208707 -7666177 -10557998
10711 -10557998 -13473462 -13367653 -9387385 -4839312 -3176974 -3264516 -1953015 -70533
10703 -70533 -1160055 -4558226 -4866312 706516 8641094 13608505 13195097 8210393 2149250
10694 2149250 -105730 2730946 5424826 2714454 -2895069 -5255482 -4195703 -3776925
10686 -3776925 -3003424 2346749 9132891 8886675 2227083 213836 7278223 13286897
10678 13286897 8673199 -1680380 -7023287 -5575195 -2645744 47921 4343156 8559187
10670H559187J28151l574624l197014j221134o76867m76542N78921P94407p72214
10661A42271k242804k237599j446942l55682J000144J484474O00684L00545J503189
10652a251720J506267j079718k634349p25672O79585j585565k720975K058218
10644e753929P286174M585569l373455o497419k525438J537614J731149P64012
10636b245723J15017j582405k395014J132689N735607M167544k973387o841353
10628d887025l106736K717138M269331J802242r16984j576733j07888J473646
10620c33009N22745j882495j077534L151209M045888j256765n021697p09343N390429
10611B829428M093248j304034j146177L760715L928573k855160r111603r611620
$$ plain form
10670 8559187 8687338 5112714 1915700 694566 17699 -458843 120078 914485 142271
10661 142271 -2100533 -4338132 -5785074 -6140756 -5140612 -3656138 -3055454 -2754909 -1251720
10652 -1251720 254547 -825171 -3459520 -4185192 -3505607 -5091172 -7812147 -5753929
10644 -5753929 1532245 6117814 2744359 -3753060 -6278498 -4740884 -3009735 -2245723
10636 -2245723 -2130706 -3713111 -6108125 -4975436 760171 4927715 1954328 -4887025
10628 -4887025 -7993761 -5276623 -1007292 794950 -122034 -1698767 -1806655 -333009
10620 -333009 189736 -1692759 -2770293 380916 4426804 3170039 -1851658 -2561001 2829428
10611 2829428 6922676 5618642 4472465 8233180 12161753 9306593 194990 -9416630
10603i416630n422827J680572Q852256R424874J120192o506664l907340L215474
10595i60093K676595m353408o184800l90666L965542K720222R06353P43407j063057
10586a939905l458142j220651M107521N059696N36735l249320l519766k484403
10578f168235q0418M362929O032190J032934m813734m552482k114403l706230
10570a0007449m328454K507440R111745M815844l953919l634627K658076J836115
10562i95229m120964k418907N108266M782449k609135k937198M077799L974353
10554D861434m641485o846871O54726L612777k571665m463053L604371Q859535
10546C069769L645266k013535l35202J461088k788387o956122n312119j112014
$$ plain form
10603 -9416630 -14839457 -13158885 -4306629 5118245 6238437 -268227 -4175567 -960093
10595 -960093 1716502 -2636906 -8821706 -9212372 -5246830 -2526608 -1620255 -876848 -1939905
10586 -1939905 -5398047 -6618698 -2511177 2548519 3085254 -164066 -3683832 -6168235
10578 -6168235 -6248653 -1885724 4146466 5179400 365666 -4186816 -6301219 -10007449
10570 -10007449 -14335903 -11828463 -2716718 2099126 -1854793 -5489420 -2831344 -995229
10562 -995229 -5116193 -7535100 -2426834 2355615 -253520 -3190718 887081 4861434
10554 4861434 219949 -6626922 -5972196 -2359419 -4931084 -9394137 -5789766 3069769
10546 3069769 6715035 4701500 4366298 5827386 3038999 -3917123 -9229242 -10341256
10538a0341256K572077N978340N030031l442008r816278l121564Q334253Q213317
10530C406912j68599r01169M666078K112197o226213n204441K641103J804726
10522B130594m390320k39246P959304J001614j3067886q590570R873070J3077369
10514G753929l83611m003028M284784P85069j1643141n727551J2443553Q292785
10506A1802789j3366059j1645517J1694327J0847315j5060998j4476493J6793731
10499c410905K0279262j3547585j9797834J6650117K3762455j8181458k4863461
10492a9109409L0188721M1919383k8028956k8076901J41356432K90261197J67940838
10485E96451305j39769868k91191933j60379419J9824071L3115811m2292451l8851147
$$ plain form
10538 -10341256 -7769179 -1790839 3239192 -202816 -10019094 -13140658 -4806405 3406912
10530 3406912 3238313 2337144 7003222 9115419 2889206 -2315235 325868 2130594
10522 2130594 -2259726 -2498972 5460332 6461946 -6605940 -15196510 -5323440 7753929
10514 7753929 7370318 3367290 7652074 8437143 -3205998 -8933549 3510004 11802789
10506 11802789 -1563270 -13208787 -1514460 9332855 -5728143 -20204636 -3410905
10499 -3410905 16868357 3320772 -16477062 173055 23935510 5754052 -19109409
10492 -19109409 11079312 52998695 24969739 -3107162 138249270 428510467 596451305
10485 596451305 456681437 165489504 5110085 24934156 58049967 15757516 -23093631
10478b3093631K3974161K8586124j8130131k3547072J3012028J7354417j3127173
10471E028723j5479351J4274687J9938261o600188j7277550m80144O372233o326779
10463e50108q341159N917412Q759548m054263p413888K310053L759755l851303
10455c463953j008568R283524N570666q734203j0157398J046829L854794k336247
10447e944556m91886O428264J483028q913903m353022Q874227P036846o617848
10439b498850p570026M408715O600244k682783k723170P712306P702761m905630
10431F043567q823434R43503N482046j448765m216064K068968K975848n121687
10423b096018p309654J212374P125921M779506L300266M588696N47869n734363
$$ plain form
10478 -23093631 880530 29466654 11336523 -12210549 801479 18155896 5028723
10471 5028723 -10450628 3824059 23762320 17162132 -115418 -595562 5776671 -550108
10463 -550108 -8891267 -2973855 5785693 1731430 -5682458 -3372405 387350 -3463953
10455 -3463953 -4472521 4811003 10381669 1647466 -8509932 -7463103 -3608309 -5944556
10447 -5944556 -6436442 -8178 1474850 -7439053 -11792075 -2917848 4118998 -2498850
10439 -2498850 -10068876 -5660161 940083 -1742700 -4465870 3246436 10949197 6043567
10431 6043567 -2779867 -1836364 3645682 2196917 -2019147 49821 3025669 -2096018
10423 -2096018 -9405672 -8193298 -1067377 3712129 7012395 11601091 12148960 6414597
10415F414597k708226M782832R26977j0369193r350579L966263Q513482q38469
10407A337684o003918J97631L635738j150082j065340P218052Q301929k754610
10399I717084r599234l389149L062914L37782k666122P49496K714844q42685j289040
10390a204110L832486M195899k523284m505097J665491L993954j681592l837697
10382f3950J318598J712611o296336q841557k4870O504397K496348j057678L116524
10373a135913M382671l709755q825686j963832N787922L430684j675345l40521
10365d049775J570214k488941n415298j008176L098300O36858j055775L163307
10357e549286M878572n07537k552091M296880P655654p23241p997391k225402
$$ plain form
10415 6414597 3706371 8489203 9416180 -953013 -10303592 -6337329 2176153 1337684
10407 1337684 -4666234 -4468603 -832865 -1982947 -3048287 4169765 12471694 9717084
10399 9717084 117850 -3271299 -208385 129397 -2536725 -1787229 927615 84930 -1204110
10390 -1204110 2628376 6824275 4300991 -204106 1461385 5455339 3773747 -63950
10382 -63950 1254648 2967259 -3329077 -12170634 -12195504 -5691107 -3194759 -4252437 -1135913
10373 -1135913 3246758 -462997 -9288683 -11252515 -5464593 -2033909 -3709254 -4049775
10365 -4049775 -2479561 -4968502 -10383800 -11391976 -8293676 -7656818 -8712593 -5549286
10357 -5549286 -670714 -1178251 -3730342 566538 8222192 7498951 -498440 -2723842
10349b723842O245859L807997k598244o23243L834815m21225o564589j948900
10341i91372P047359N210641m513729o563381L11100L009360k263202n805034
10333d558258k530531K314220M468428L934963n40007p816746r382918m27512
10325a4538361R338521Q486937J158751j736481j091249l956501o566112q19327
10317i723822P374752N043139n191230p954761M9239O024537K995594j292809
10309b675361k47100K150863J791690J158559J595206J73605k502760j719273
10301b74571J824334K029122j380096k000069J324918K441260l16381j176200
10293B472317J611083K213495j415791l104256K19373K571590m65361l964730
$$ plain form
10349 -2723842 3522017 7330014 4731770 4108527 7943342 7522117 957528 -991372
10341 -991372 6055987 11266628 6752899 189518 500618 3509978 1246776 -4558258
10333 -4558258 -7088789 -4774569 -306141 3628822 3088815 -4727931 -14110849 -14538361
10325 -14538361 -5199840 3287097 4445848 2709367 1618118 -2338383 -8904495 -9723822
10317 -9723822 -2349070 2694069 -2497161 -10451922 -10402683 -4378146 -1382552 -2675361
10309 -2675361 -2922461 -771598 1020092 2178651 3773857 3947462 1444702 -274571
10301 -274571 1549763 3578885 2198789 198720 1523638 3964898 3648517 2472317
10293 2472317 4083400 6296895 4881104 1776848 1996221 4567811 4102450 137720
10285A37720k442777J084853J147806j205793j858637j252977k226686l511170
10277a0127661j457973L215428N433817K582249j995073l124942J67439L813146
10269a493570L821685J128767l33464K65459j15967k460863l440612j313461N16482
10260c425544p06890k156632o49272J398840N38757q64520J548029O091584O988564
10251H762916K740494k801768o100485n873906j681171M313549O617308K801006
10243H777943j972327k235345o54874k592022n745640l671383K388816M407961
10235a296871J70834l756439k740122J90462J172578R49326J128906J090490Q81008
10226b209828J862998K745565L44064m075189m852547m55941L521030K520327
$$ plain form
10285 137720 -2305057 -1220204 -72398 -1278191 -3136828 -4389805 -6616491 -10127661
10277 -10127661 -11585634 -8370206 -2936389 -354140 -2349213 -5474155 -5306716 -1493570
10269 -1493570 2328115 3456882 3123418 3388877 3272910 812047 -2628565 -3942026 -3425544
10260 -3425544 -4132434 -6289066 -6938338 -5539498 -5000741 -5865261 -4317232 1774352 8762916
10251 8762916 11503410 8701642 2601157 -3272749 -4953920 -640371 5976937 8777943
10243 8777943 6805616 4570271 3915397 1323375 -4422265 -8093648 -5704832 -1296871
10235 -1296871 -1126037 -4882476 -7622598 -7432136 -6259558 -5310232 -4181326 -3090836 -2209828
10226 -2209828 -346830 2398735 2742799 -1332390 -6184937 -6640878 -3119848 -599521
10218e99521q02666j535657P40112L267392M392266L462028j71477m900431o483282
10209b631236l107481J386778K288803J48966q53307O97075J972373P89334p80587
10200h9282Q38896N330345P659480L746904l791118p680956m376258J739415M016438
10191G393864J395634j700359j841776j1571J108166O01346n87777j431407j764804
10182C161316j784051j116879P56692K643827J838808j824646l923872r80547
10174a229352L418570L019303j343038k839859R198Q86492k882118m805362k06278
10165e972444N010820L675593r99106j547553J003155R9823l874141m268906j18903
10156f991662K355509M98316j596746j714166k473836l688546o47404O413280
$$ plain form
10218 -599521 -1402187 -2937844 -2197732 1069660 5461926 8923954 8752477 3852046 -2631236
10209 -2631236 -5738717 -4351939 -2063136 -1914170 -2767477 -2070402 -98029 691305 -89282
10200 -89282 749614 6079959 13739439 17486343 13695225 6014269 1638011 3377426 7393864
10191 7393864 8789498 7089139 5247363 5235792 6343958 6945304 6357527 4926120 3161316
10182 3161316 1377265 260386 1017078 3660905 5499713 3675067 -248805 -1229352
10174 -1229352 2189218 5208521 3865483 1025624 1034822 1921314 -960804 -5766166 -5972444
10165 -5972444 -961624 2713969 1714863 167310 1170465 1270288 -2603853 -6872759 -6991662
10156 -6991662 -4636153 -4137837 -5734583 -7448749 -9922585 -13611131 -14258535 -7845255
10148g845255R361495L829660l076732k934031J648435K096774k385131m366620
10140c671405o49069K797126N55020l816121l463705J377497M159998K117037
10132e93622q8941J643388M220500K553524k051148l895084j603469P39984O80742
10123A605874k05584j327846m137553o744126m253184K647979O096408K152813
10115d165219k750812j546134L134456M455451K040230J87932l24543j273182
10107b41821j223713J720571M205487K240027j080110m22133J798608n76228n244886
10098A175802l751331L800503P225137J955067l927576k727963J755371J985755
10090G490765j732471m118612l976375l532530k375952J278821N198083M836946
$$ plain form
10148 -7845255 1516240 5345900 2269168 -664863 983572 3080346 695215 -3671405
10140 -3671405 -4320474 -1523348 -968328 -4784449 -8248154 -6870657 -2710659 -593622
10132 -593622 -682563 960825 5181325 7734849 5683701 1788617 185148 925132 1605874
10123 1605874 1400290 72444 -4065109 -10809235 -15062419 -12414440 -6318032 -4165219
10115 -4165219 -6916031 -8462165 -5327709 -872258 1167972 1355904 1031361 -241821
10107 -241821 -1465534 255037 4460524 6700551 5620441 5198308 6996916 6420688 1175802
10098 1175802 -2575529 1224974 8450111 10405178 6477602 3749639 5505010 7490765
10090 7490765 5758294 1639682 -2336693 -5869223 -8245175 -6966354 -1768271 3068675
10082C068675p7108m946651n998575l394987O94585M064005M844855K651542m39313
10073D67028j839055j268781k40150O25626J764407K348885K81626m243059o971299
10064i074772l907685K779331O039146K583825k395947k112134K357473M096027
10056C65264J025614j323087R14009L797798K196058k138402l599785q02421K598272
10047C033320L114579J91855m139765n879812k182288L788911M925051j93870
10039B657981m420534k338849J962594K325780K54457Q01295L395227L966816
10031H604767K516475J387772m99517m341000o036688k134256K320136O52226
10023B469915l971829l584994R13549J843210j418069k237924K69750M6936l383612
$$ plain form
10082 3068675 2991567 -1955084 -7953659 -11348646 -10654061 -6590056 -1745201 906341 467028
10073 467028 -1372027 -2640808 -2880958 -2255332 -490925 1857960 2139586 -2103473 -9074772
10064 -9074772 -12982457 -10203126 -4163980 -1580155 -3976102 -6088236 -3730763 365264
10056 365264 1390878 67791 981800 4779598 6975656 4837254 1237469 435048 3033320
10047 3033320 6147899 6339754 2199989 -3679823 -5862111 -2073200 2851851 2657981
10039 2657981 -1762553 -4101402 -2138808 186972 441429 1242724 4637951 8604767
10031 8604767 11121242 12509014 12009497 7668497 1631809 -502447 1817689 2469915
10023 2469915 -1501914 -5086908 -4173359 -2330149 -3748218 -5986142 -5716392 -5669456 -9053068
10014i053068l226123J741100M283368J611150n7207K612575M563090K834583
10006E309468J774988L084617J382818m827108q237422m887947j069517j581579
9998i051682j510610K729517M675013o02306n756347k566396M047819M522300
9990c512692K20027j054436P11814O1596j805448M18967M237847K132369m748495
9981c338451o910133q98677O289295P928702M403996j062332n812702o634892
9973f035194k372614K357462K507881M94568J753979M409054K118551l864726
9965A368961n340702m80322L268083J569999q55826Q2462R68738j641613m152219
9956e212439j985001K463945L429857J34714k867624j767238K897834P146576
$$ plain form
10014 -9053068 -12279191 -10538091 -6254723 -4643573 -4700780 -2088205 2474885 5309468
10006 5309468 7084456 10169073 11551891 6724783 -1512639 -6400586 -7470103 -9051682
9998 -9051682 -10562292 -7832775 -3157762 -3760068 -9516415 -12082811 -8034992 -3512692
9990 -3512692 -3292665 -4347101 -3635287 -3573691 -5379139 -4960172 -722325 1410044 -3338451
9981 -3338451 -10248584 -11147261 -4857966 3070736 7474732 6412400 599698 -6035194
9973 -6035194 -8407808 -6050346 -3542465 -3047897 -1293918 3115136 5233687 1368961
9965 1368961 -3971741 -4452063 -1183980 386019 -469807 -387345 581393 -1060220 -5212439
9956 -5212439 -7197440 -4733495 -1303638 -1168924 -4036548 -5803786 -2905952 4240624
9948D240624O805914J868916k245800p50348L486554L030543l875821j0711416
9940A849166j1045844n172462K302817P034086O423026J301967k893792j291818
9932a492854L334361L741208q79116l397561P9339M205347K983601j575000l890013
9923C109312l145960k170161j473700M13507K608641K414730m25094l051154k837495
9914d557374L4731K678232J921247j823043l720439l71185M460817M310284m13838
9905B519432l018211r53262J144105M45476N06239L418194M599198N16300m456797
9896D720674m703279j863501p57294j258875l84165J291076J350194M19668o1995
9887a247497j275227l150912k080111J614556M66670p518893j0166755K708371
$$ plain form
9948 4240624 11046538 12915454 10669654 9919306 13405860 16436403 12560582 1849166
9940 1849166 -9196678 -14369140 -12066323 -5032237 1390789 2692756 -201036 -1492854
9932 -1492854 1841507 5582715 4703599 1306038 1385377 5590724 8574325 6999325 3109312
9923 3109312 -36648 -2206809 -3680509 -3267002 -658361 1756369 1331275 -1719879 -4557374
9914 -4557374 -4522643 -1844411 76836 -1746207 -5466646 -5837831 -1377014 2933270 2519432
9905 2519432 -498779 -1452041 -307936 137540 643779 4061973 8661171 9177471 4720674
9896 4720674 17395 -1846106 -2603400 -3862275 -4246440 -2955364 -1605170 -1185502 -1247497
9887 -1247497 -2522724 -5673636 -7753747 -6139191 -5672521 -13191414 -23358169 -20649798
9879b0649798J9624533J9416117J655020j1595292p238464K405444J715329n208867
9871A24022n422135O78003K613027j282922k682820J389379M680787L277229N34002
9862C908572o69781j607433k141084K43863L770210K564211l456321o095376n19890
9853d003029O656614O256474p70943n348840k750341K420580L519744j51268l866953
9844A962038l554320K35870L745967M263576K413957M99405k43771r4080J71162
9835I399804m21137k478728m629091m085472n88322K250763J935862R51855K251606
9826D587140L634267J613906j352857j17971L561230K396589m356320q131856
9818A834128l556174L394220M351817j80327l749494l358952o07231K536466L906294
$$ plain form
9879 -20649798 -1025265 18390852 20045872 8450580 1212116 3617560 5332889 124022
9871 124022 -5298113 -4620110 -2007083 -3290005 -5972825 -4583446 97341 3374570 3908572
9862 3908572 3238791 1631358 -509726 -265863 3504347 6068558 2612237 -3483139 -4003029
9853 -4003029 2653585 8910059 8139116 2790276 39935 2460515 5980259 5828991 1962038
9844 1962038 -1592282 -1356412 2389555 6653131 9067088 9566493 9322722 9228642 9399804
9835 9399804 8978667 6499939 1870848 -2214624 -2802946 -552183 1383679 2335534 4587140
9826 4587140 8221407 9835313 8482456 8364485 11925715 14322304 9965984 1834128
9818 1834128 -1722046 1672174 6023991 5843664 2094170 -1264782 -1872013 664453 4570747
9809D570747R43858m495263n297169J161909O875351L902796l026869l500592
9801A134768K001578L168557k953629p071082k639697M270755N103657R32015
9793C946922j581588o71841K34829q42276k697430l628381k385422J224880M399521
9784b000786L363868n84309j532802J903886L402832r85822n365162k771897L343034
9775a227158M168886q39737l788062r04902K911701K984781R04862l84583j090751
9766B735037j338525Q42066M744595N216471N9735m850375l079183K472283L134162
9757I936266k898321p563995m131956L528038O385279K194478k375430j336423
9749C737936K904555L601912q31704m893314l779534J10894Q55154k426039m176710
$$ plain form
9809 4570747 5514605 1019342 -4277827 -3115918 3759433 7662229 4635360 1134768
9801 1134768 3136346 6304903 3351274 -3719808 -6359505 -2088750 3014907 3946922
9793 3946922 2365334 1693493 1928322 1086046 -1611384 -5239765 -7625187 -6400307 -2000786
9784 -2000786 1363082 778773 -754029 1149857 4552689 3566867 -1798295 -4570192 -1227158
9775 -1227158 2941728 2101991 -1686071 -2590973 320728 3305509 4210371 3825788 2735037
9766 2735037 1396512 2238578 6983173 12199644 12259379 7409004 4329821 6802104 9936266
9757 9936266 7037945 -526050 -4658006 -1129968 5255311 7449789 5074359 3737936
9749 3737936 6642491 10244403 9412699 4519385 739851 850745 1705899 -720140 -4896850
9740d896850l21157N390741N620240j052440p894325p930360j667138M593165
9732h158124O229992L809107L85461j706700j504737K97117J248023k46334k082329
9723a728524j169555J127671O33363j902117o73384M890064O480604q99567r174235
9714b415680p635100J210018N795218K889564k7838P76527M00705k886280k891697
9705d784563K424599N021111j5546m952949j794369M066664K809191l561373n233511
9696f020746p96576K100470M09389j022011L26223J177054K22600M65286K298259
9687h40052K195535j59894q95295M73754r1984l088597l742972m31628K455847
9678d125286K362360J930455J964068j120891p069561q680200k081269O223399
$$ plain form
9740 -4896850 -5218007 172734 5792974 4740534 -3153791 -11084151 -12751289 -8158124
9732 -8158124 -1928132 1880975 2266436 559736 -945001 -647884 600139 353805 -1728524
9723 -1728524 -2898079 -1770408 -1137045 -3039162 -3712546 1177518 7658122 6758555 -2415680
9714 -2415680 -10050780 -8840762 -3045544 -155980 -183818 592709 993414 -1892866 -4784563
9705 -4784563 -2359964 2661147 2645601 -2307348 -4101717 -35053 2774138 -787235 -6020746
9696 -6020746 -6817322 -4716852 -4307463 -5329474 -5003251 -3826197 -3603597 -3138311 -840052
9687 -840052 1355483 1195589 300294 774048 682064 -2406533 -6149505 -6581133 -4125286
9678 -4125286 -1762926 167529 2131597 1010706 -6058855 -14739055 -16820324 -10596925
9670a0596925Q045197L994383R1414j235494j408655j082042m64260j021086k701519
9661f378987k825837r16439j18795o88852J875709P869009R566791K794816m455807
9652F721608l328731J789531O03178n749707o341576J742401Q794372P239497
9644A1470573R86261k979833l844740l915923l279738j834988j453001k360558
9636g211947j686454J351292L062410J090561j416152o54284K219276L479128
9628B33830K092875k32464k005237k574959j701513k63123L70959O25433K081573
9619a372626L932274L161854n79497l444763k392676R31321K866644J980640n58636
9610D524535k667950k605981o49498L70916j382599l349940k045999J133275K163333
$$ plain form
9670 -10596925 -2551728 1442655 1534069 298575 -1110080 -2192122 -2656382 -3677468 -6378987
9661 -6378987 -9204824 -10121263 -10240058 -10928910 -9053201 -1184192 8382599 11177415 6721608
9652 6721608 3392877 5182408 5785586 35879 -6305697 -4563296 4231076 11470573
9644 11470573 12456834 9477001 5632261 1716338 -1563400 -3398388 -4851389 -7211947
9636 -7211947 -8898401 -7547109 -4484699 -3394138 -4810290 -5464574 -3245298 233830
9628 233830 2326705 2094241 89004 -2485955 -4187468 -4450591 -4079632 -3454199 -1372626
9619 -1372626 2559648 5721502 5142005 1697242 -695434 235887 3102531 5083171 4524535
9610 4524535 1856585 -749396 -1398894 -1027978 -2410577 -5760517 -7806516 -6673241 -4509908
9601d509908J497607K940950N587353M067718j832355n341634l116918l4139r7046
9592h38372k93984J761161J954670k128844m451200M6884N490454L722431k078877
9583C184323k679069J693115K192101l397026p225807m356877N55422K096591
9575g937227J387358J360705J464638L69446j178704k522170l656738k819718
9567a3532410J235489M398948J340313m796225m655066L313475R291563O128905
9559B724992r27705l381699j137144R05750J591525K135152J173649j810098k418600
9550a144178K100897N958603K322030n025494o012656Q72271O583575M902978
9542A0558026k19513k799994l070001l856130m279144j894805K042809L923668
$$ plain form
9601 -4509908 -3012301 -71351 5516002 9583720 7751365 2409731 -707187 -741326 -838372
9592 -838372 -1132356 628805 2583475 454631 -3996569 -3949685 1540769 5263200 3184323
9583 3184323 505254 2198369 4390470 993444 -6232363 -10589240 -10033818 -7937227
9575 -7937227 -6549869 -5189164 -3724526 -3355080 -4533784 -7055954 -10712692 -13532410
9567 -13532410 -12296921 -7897973 -6557660 -11353885 -16008951 -12695476 -3403913 2724992
9559 2724992 1797287 -1584412 -2721556 -1815806 -224281 1910871 3084520 1274422 -1144178
9550 -1144178 956719 6915322 9237352 4211858 -1800798 -928527 5655048 10558026
9542 10558026 10338513 7538519 4468518 612388 -3666756 -5561561 -3518752 404916
9534D04916K956408J533597J094917N48842j036537k497184k339004j115349n91429
9525a040823q84714j32649K308645M025792K652662m58689k140483k086122k438396
9516a94777l157397j871543J140918K386082J145494J263171M216260N179609
9508A0107817K71973o156840o803289j528221L205663L550730J559646j40545
9500D066934j622636l006124l026435j504549L5865J036585K239179K919513J105852
9491B244184k510530m122149j928673Q85410M99201j906090j575394K816588O172725
9482E75272L154399l554237m964885K212078R162739N719721m838438r310322
9474a843673l123259L567257J748479l495365k712793K688755M299647J004480
$$ plain form
9534 404916 3361324 4894921 5989838 6538680 5502143 3004959 665955 -449394 -1040823
9525 -1040823 -1925537 -2058186 250459 4276251 6928913 6470224 4329741 2243619 -194777
9516 -194777 -3352174 -5223717 -4082799 -1696717 -551223 711948 4928208 10107817
9508 10107817 10379790 4222950 -2580339 -4108560 -902897 2647833 4207479 4066934
9500 4066934 2444298 -561826 -3588261 -5092810 -5056945 -4020360 -1781181 1138332 2244184
9491 2244184 -266346 -4388495 -6317168 -5431758 -4932557 -6838647 -8414041 -5597453 575272
9482 575272 3729671 175434 -4789451 -2577373 6585366 12305087 7466649 -1843673
9474 -1843673 -4966932 -1399675 348804 -3146561 -5859354 -3170599 1129048 2133528
9466B133528q94376L99148L62339k005697k223422N67825J461781r86736j649997
9457b835607J818461M016155M76473m847390n582257j771068J838989K789455
9449d096789K084077J030820L71982O39734R60302o33621m056014o361216n226205
9440a5286930j231763L627754P178114P074875K917437j832464l493764k983505
9432d030246l107094k834113Q9642K606101M870m565452l140338L740450O522341
9423d713839J859232j993095O05366L528579P05542k588338O45266N972544M577305
9414H598562j814872m014858m02384J743597r49938l532683k057678P01012Q46231
9405h83011j225187k871515k538398j32308K750084L223521O92389j297335k6820
$$ plain form
9466 2133528 1239152 1638300 2000639 -5058 -2228480 -1660655 -198874 -1185610 -2835607
9457 -2835607 -1017146 2999009 3475482 -1371908 -6954165 -8725233 -6886244 -4096789
9449 -4096789 -2012712 -981892 -609910 29824 990126 356505 -3699509 -10060725 -15286930
9440 -15286930 -16518693 -12890939 -5712825 1362050 4279487 2447023 -1046741 -4030246
9432 -4030246 -7137340 -9971453 -9881811 -7275710 -7270840 -11836292 -14976630 -11236180 -4713839
9423 -4713839 -2854607 -4847702 -4242336 -713757 -8215 -2596553 -1951287 4021257 8598562
9414 8598562 6783690 2768832 2366448 4110045 3160107 -372576 -2430254 -1729242 -883011
9405 -883011 -2108198 -4979713 -7518111 -7650419 -4900335 -1676814 -984425 -2281760 -2308580
9396b308580J762316L36895k312708j448441K394535M087708K030018J18488J204231
9387E864462L140484K301951j994586o888971p859184k446405N729199Q902746
9379F749696L947094l308585n615769k982214m9965J499800K792381L051438Q42790
9370F926666j906054k381241j592634j894111k183356n26740J147921K97919j199652
9361c311282p96409o44209l005635m110119J5241N111793M377067m41194k426578
9352e231325j075902r02573j196816J927100N191119J940456m393614l506388
9344g247943M327829P464453J894077k808946p17260J253698k189032m437036
9336b460160O2968M331065P56817n127733l917316K190234M396523J909316N53066
$$ plain form
9396 -2308580 -546264 -209369 -2522077 -3970518 -1575983 2511725 4541743 4660231 5864462
9387 5864462 9004946 11306897 9312311 2423340 -5435844 -7882249 -2153050 6749696
9379 6749696 10696790 7388205 1772436 -1209778 -1259743 240057 3032438 6083876 6926666
9370 6926666 5020612 2639371 1046737 -847374 -3030730 -3557470 -2409549 -2111630 -3311282
9361 -3311282 -4107691 -4751900 -7757535 -11867654 -11852413 -6740620 -2363553 -2804747 -5231325
9352 -5231325 -6307227 -7209800 -8406616 -6479516 -1288397 652059 -3741555 -7247943
9344 -7247943 -2920114 4544339 6438416 3629470 2912210 4165908 1976876 -2460160
9336 -2460160 -2397192 1933873 2690690 -2437043 -6354359 -4164125 232398 2141714 2694780
9327B694780J190619J12399k084200j762971j30234r76636k591997m53919L780789
9318b21370M400379J495096L85602J810402R09878l491558o148814l530217J373227
9309c017375M093890L744310J655573r84012k829341k701878j047247P15200J799225
9300A428345J571667o46898l402780l327234J75885L462103M106162L842945L445266
9291A0655461J6470o423951r339848m512227K493495M195120J867647J225006
9283A77173K066759O02602j695735p26841J527717K58593k456170r84146K540566
9274A310518Q55740n026215o148809l05731M428790K971447l00038j168912j625611
9265e008821k724274j118681K955864L495232p58092k723125R28617L525526N42555
$$ plain form
9327 2694780 3885399 3997798 1913598 150627 20393 -956243 -3548240 -4002159 -221370
9318 -221370 4179009 5674105 6059707 7870109 8779987 5288429 -860385 -4390602 -3017375
9309 -3017375 1076515 4820825 6476398 5492386 2663045 -38833 -1086080 -370880 1428345
9300 1428345 3000012 2353114 -1049666 -4376900 -4201015 -738912 3367250 7210195 10655461
9291 10655461 10671931 4247980 -5091868 -9604095 -7110600 -2915480 -1047833 177173
9283 177173 2243932 2846534 1150799 423958 1951675 2210268 -245902 -1230048 1310518
9274 1310518 2166258 -2859957 -9008766 -9314497 -4885707 -1914260 -2214298 -3383210 -5008821
9265 -5008821 -7733095 -8851776 -5895912 -2400680 -3158772 -5881897 -4953280 -1427754 -885199
9256h85199j639822K617733O704893K294321n546913n529239J932513O010518
9248E958805K761358o22848O75663K189823l79517l594887k482377J717831M079651
9239A0303502K330439k132563o212405o215725o11783O313658P146932J86235
9231A1108290p417011q090174k893526J062810N09950p09740J401613M437086
9223e90702K861235l310188o806449j982335O947779J0129759M071029m502668
9215F817460p684716n129276j369333J535783M216157N348918K441108k784694
9207C391407m865260k041419P93306q80834m319904l291512K651301O817677M174381
9198B429143j878349m161498j226241J554011K96383k231471j752396R56308K285047
$$ plain form
9256 -885199 -2525021 92712 6797605 9091926 3545013 -1984226 -51713 5958805
9248 5958805 8720163 8097315 8772978 10962801 10583284 6988397 4506020 6223851 10303502
9239 10303502 12633941 10501378 4288973 -1926752 -2538535 3775123 10922055 11108290
9231 11108290 3691279 -4398895 -7292421 -6229611 -5719661 -6429401 -5027788 -590702
9223 -590702 2270533 -1039655 -7846104 -9828439 -2880660 7249099 11320128 6817460
9215 6817460 -867256 -5996532 -7365865 -5830082 -1613925 3734993 6176101 3391407
9207 3391407 -1473853 -3515272 -2721966 -3602800 -7922704 -11214216 -8562915 -1745238 2429143
9198 2429143 550794 -3610704 -4836945 -3282934 -2986551 -5218022 -6970418 -6014110 -3729063
9189c729063J898981J976171K003757k01708k801602j403788K863994L177272
9181C784014k514747o941024l583999L766557O624491L067388k042548m985643
9173b825511n488899l314485J265269M547944K819567j423643j978696K144478
9165d253976N422388M027332L48456j841025k087093j492119l26362P98725Q29210
9156A425536P17976K420944M371490K376503l130559n679769j905751K540192
9148C136562J083845l341201k363348M663540Q565094L081589o092324q944918
9140b11161m189911N92724P29467L09689L921332P674854M377698m219277p784338
9131A201077j941017M545378K199019n087994o093577P48894N785394L494662
$$ plain form
9189 -3729063 -1830082 146089 2149846 1948138 -853464 -2257252 606742 3784014
9181 3784014 1269267 -5671757 -9255756 -5489199 1135292 4202680 2160132 -2825511
9173 -2825511 -8314410 -11628895 -10363626 -5815682 -2996115 -4419758 -6398454 -4253976
9165 -4253976 1168412 5195744 5544200 3703175 1616082 123963 -202399 596326 1425536
9156 1425536 2143512 4564456 8935946 11312449 8181890 2502121 596370 3136562
9148 3136562 4220407 879206 -1484142 3179398 11744492 14826081 8733757 -211161
9140 -211161 -4401072 -3808348 -3078881 -2769192 1152140 8826994 13204692 8985415 1201077
9131 1201077 -739940 3805438 6004457 916463 -5177114 -4428220 1357174 4851836
9123D851836m40003m18488O7837l279348n991547j962406M898832N583884P2401
9114C382998l060954o49435J149627j287962k695838J162370N147920K838043
9106E986769k588323k998672K244632N848334L597250q17192k479879j229802
9098G563117M89084J466905J610820R52828Q0686n85991k027871m515940n063069
9089b9431j099853L744644L068023k317306m262897M35923M632284K260644j729547
9080D702484o3848L863739J358820o192574q307372k050731L145360N13193l937294
9071f968223j984328L902906N501150J518217k135979j896933K22477J383902
9063d56811N35974k465455n893025n921676j557728K328215J418289j071867P69830
$$ plain form
9123 4851836 4411833 3993345 4061182 781834 -5209713 -7172119 -2273287 3310597 3382998
9114 3382998 322044 -327391 822236 -465726 -3161564 -1999194 3148726 5986769
9106 5986769 3398446 399774 2644406 8492740 12089990 11272798 8792919 7563117
9098 7563117 8052201 9519106 11129926 12082754 12163440 11577449 9549578 5033638 -29431
9089 -29431 -1129284 2615360 5683383 3366077 -896820 -460897 4171387 6432031 4702484
9080 4702484 4638636 8502375 9861195 3668621 -4638751 -6689482 -3544122 -3030929 -6968223
9071 -6968223 -8952551 -5049645 451505 1969722 -166257 -2063190 -1840713 -456811
9063 -456811 79163 -2386292 -8279317 -14200993 -15758721 -13430506 -12012217 -13084084 -12314254
9054a2314254N921025P921290M727922N39116j664573k737660k628654j03699
9046c39487K126660n37221n745989n180468K618156Q136581M304589l019729m254620
9037a891528J7660K051696m1519q73557J730741K936687q36568n899797o372799
9028i178984j698779L474969M963280K686328m31574j891843j720635j204925
9020e002163l65667J622042L691820L326389O26635j009717Q2371J117110m96174
9011C592646k643534j758560J539809L350419J691443j942549m979514n462726
9003f612566k901735M91426J310405m60948j010862J233855K882518J761087J146600
8994b160220L342572L902966j154836o349652l354167N401347Q863614L145076
$$ plain form
9054 -12314254 -6393229 1528061 6255983 6795099 5130526 2392866 -235788 -339487
9046 -339487 1787173 1249952 -4496037 -9676505 -7058349 1078232 5382821 2363092 -1891528
9037 -1891528 -1873868 177828 136309 -737248 993493 3930180 3093612 -2806185 -9178984
9028 -9178984 -10877763 -7402794 -2439514 246814 -184760 -2076603 -3797238 -5002163
9020 -5002163 -5367830 -3745788 -53968 3272421 3899056 2889339 2971710 4088820 3592646
9011 3592646 949112 -809448 730361 4080780 5772223 3829674 -1149840 -6612566
9003 -6612566 -9514301 -9022875 -7712470 -8173418 -9184280 -7950425 -5067907 -3306820 -2160220
8994 -2160220 1182352 5085318 3930482 -2419170 -5773337 -371990 8491624 11636700
8986A1636700l748909m609511j891871p41690r54486n09490p57752k711028k981424
8977g269461J079899N672057N192828K53894l515699l026241k16501J742217J450072
8968A363065o13094k523905k284308k18872J325256J371329J091856P41732o92598
8959d39539j929858K812L842477L920211j076235m412322o79703N877340P618037
8950A2723220M025307J84162j725545k938225k854358l11210J585189j040796
8942I647744n448185n428540j316357N91074j178878j079278L273369O668813
8934E729762N024323J202636j590811m950743q915745p712237J105175R099017
8926a008623P133803p82411l284029Q99778J944489l991207p903966k717592M752592
$$ plain form
8986 11636700 7887791 3278280 1386409 644719 -309767 -819257 -1577009 -4288037 -7269461
8977 -7269461 -6189562 -517505 4675323 4929217 1413518 -1612723 -1829224 -87007 1363065
8968 1363065 749971 -1773934 -4058242 -4277114 -2951858 -1580529 -488673 253059 -439539
8959 -439539 -2369397 -2366585 1475892 5396103 4319868 -92454 -772157 5105183 12723220
8950 12723220 16748527 16932689 15207144 12268919 9414561 9103351 10688540 9647744
8942 9647744 4199559 -1228981 -2545338 -1954264 -3133142 -4212420 -939051 5729762
8934 5729762 10754085 11956721 10365910 5415167 -3500578 -11212815 -10107640 -1008623
8926 -1008623 6125180 5342769 2058740 2958518 4903007 911800 -6992166 -9709758 -4957166
8917d957166M426317j154216j330886N376022Q797810K699783o124476p803483
8909g0295j848116M649359O352522K699419m295487j0129650q897171n8604P818074
8900c779949O041249k393885o082088l95593O952395P161685J225242l661526
8892E067530l974538k062209j241483k468139m580903n286702k882202J453917
8884a5974729M333257M052928K153754N98050k58769l79873L91371Q10143n54222
8875d828090j953084r5270L960919M933983Q28925m172863n986557m897991j873512
8866a4083540L383087P971369O158289j475202n786013j371095N127710N240857
8858E165462R04332j060932p69360k469648m632236k804945R55701J495927N34415
$$ plain form
8917 -4957166 -530849 -1685065 -3015951 2360071 11157881 13857664 7733188 -70295
8909 -70295 -1918411 2730948 9083470 11782889 7487402 -2642248 -11539419 -11598023 -3779949
8900 -3779949 2261300 -132585 -6214673 -6610266 342129 7503814 8729056 5067530
8892 5067530 1092992 -969217 -2210700 -4678839 -9259742 -14546444 -17428646 -15974729
8884 -15974729 -11641472 -7588544 -5434790 -4836740 -5095509 -5475382 -5084011 -4273868 -4828090
8875 -4828090 -6781174 -6876444 -2915525 2018458 2847383 -1325480 -7312037 -12210028 -14083540
8866 -14083540 -10700453 -2729084 3429205 1954003 -3832010 -5203105 -75395 5165462
8858 5165462 6069794 5008862 4239502 1769854 -2862382 -5667327 -4711626 -3215699 -2681284
8849b681284K770696M753422l92326q561934q245176Q50256O364060L050378J36938
8840a954970M041636P318993K606530m219599m529037j176167j785687m973752
8832d672053l952673J042607L923884L023849J477473J16588k096474l066323
8824d203122m02992L045471L274892K077340L169752M450443J590443l327753
8816I674474m655944k546412j523260j674975K07927K254769l35252n183016m591069
8807h372758J571319M759979J755158k75675L251717O023185J861828m054073
8799F520680l252989K322207L592021j595626o261284n440513j858543M74201
8791e499846J677245K652573J781866j380321k935167L99669N176724M731962
$$ plain form
8849 -2681284 89412 4842834 4450508 -4111426 -12356602 -11506346 -5142286 -2091908 -1954970
8840 -1954970 2086666 9405659 12012189 7792590 3263553 2087386 301699 -4672053
8832 -4672053 -8624726 -7582119 -3658235 -634386 843087 959675 -1136799 -4203122
8824 -4203122 -4606114 -1560643 1714249 3791589 6961341 11411784 13002227 9674474
8816 9674474 5018530 2472118 948858 -726117 -518190 1736579 1401327 -3781689 -8372758
8807 -8372758 -6801439 -2041460 -286302 -561977 2689740 8712925 10574753 6520680
8799 6520680 3267691 5589898 9181919 7586293 1325009 -4115504 -5974047 -5499846
8791 -5499846 -3822601 -1170028 611838 -768483 -3703650 -3303981 1872743 6604705
8783F604705j512584o732312n779210j392402J116118J500841K691120M041252
8775E37528K215831j976986l709184j880718q04162k276141k056691K367163O206976
8766a376384M384065m66489k434538j096142j34005l25016J3376R7686j471769
8757b809216k025841J387908N338245M334614M19616L26334L605736K790633l439258
8748I928771o954401l309252J129328L67706j447680J417862N130370K689188
8740H951892l256948l886774J497594M331205L80487m292073l403457Q36108K921966
8731D080000K264005J493077O58977j613665l565553k270960O41051L75539l350928
8722a288457m871944q86344L949704L340254j528167l740116m65976L707999L783388
$$ plain form
8783 6604705 5092121 -1640191 -7419401 -8811803 -7695685 -6194844 -3503724 537528
8775 537528 2753359 776373 -2932811 -4813529 -5617691 -7893832 -9950523 -7583360 -1376384
8766 -1376384 3007681 2541192 106654 -989488 -1123493 -1448509 -1435133 -1337447 -2809216
8757 -2809216 -4835057 -3447149 1891096 6225710 6645326 6971660 10577396 13368029 9928771
8748 9928771 2974370 -334882 794446 1162152 -285528 1132334 6262704 8951892
8740 8951892 5694944 1808170 3305764 7636969 8017456 3725383 321926 1158034 4080000
8731 4080000 6344005 7837082 8496059 6882394 3316841 1045881 1686932 2062471 -1288457
8722 -1288457 -6160401 -7046745 -3097041 243213 -1284954 -5025070 -5491046 -1783047 2000341
8713B000341M39713k409607k573633j49670L606919N708317K983415k938048n407827
8704A259920j209852L788410K244713l698851n101653P48215O421890M929076
8696I381868j346797n184948l912311p53522P24213J93283l98383Q41412L837732
8687C382547N852660L690876k405731q015332q543216l430680L638202P753872
8679A923198O361179J342780k613602k955454j746729j748760k001571m29891
8671a868850J070558r15212m412586l502607K280359O095825L959489Q31026K262759
8662E800761N223700L330093k372424n006218k757902r07332k511056l952461
8654c152839k056584L64212j45642j494941j4891K644217K111025r39205j556317
$$ plain form
8713 2000341 2440054 30447 -2543186 -2692856 914063 6622380 9605795 6667747 1259920
8704 1259920 50068 3838478 6083191 2384340 -2717313 -1969098 4452792 9381868
8696 9381868 8035071 2850123 -1062188 -1815710 -1091497 -898214 -1296597 -455185 3382547
8687 3382547 9235207 12926083 10520352 2505020 -6038196 -9468876 -5830674 1923198
8679 1923198 8284377 9627157 7013555 4058101 2311372 562612 -1438959 -1868850
8671 -1868850 -798292 -1713504 -6126090 -9628697 -7348338 -1252513 2706976 3538002 5800761
8662 5800761 11024461 14354554 11982130 6975912 4218010 3310678 799622 -3152839
8654 -3152839 -5209423 -4845211 -4990853 -6485794 -6500685 -3856468 -1745443 -2684648 -4240965
8645d240965J042494J848166j488622m309581k382750J271277J765809O06383
8637e887789K407778N840256N069385k14106l493016j410813J679001J367874
8629E358570r83174k918061m928874o139701k669371M674957P755038K697550
8621B846934k267351J094174O860479L669144o168720r007119r45948O380731
8613B462324L981113k403662l739815r44029N96972J490668M688549P121945L918192
8604A7172257k435437n358865m404693m348049n389104k622473L983057P072058
8596C668751K544427l484539l003129K703142N547087K336956j769501j900794
8588F642400j40297o98942k544807j691000J246338J631845j085980k023916O77447
$$ plain form
8645 -4240965 -3198471 -1350305 -2838927 -7148508 -9531258 -8259981 -6494172 -5887789
8637 -5887789 -3480011 2360245 7429630 7215524 3722508 2311695 3990696 5358570
8629 5358570 4375396 1457335 -3471539 -9611240 -12280611 -7605654 149384 2846934
8621 2846934 579583 1673757 8534236 12203380 6034660 -2972459 -3918407 2462324
8613 2462324 6443437 4039775 299960 -644069 -47097 1443571 6132120 13254065 17172257
8604 17172257 14736820 9377955 4973262 625213 -4763891 -7386364 -3403307 3668751
8596 3668751 6213178 2728639 -274490 2428652 7975739 10312695 8543194 6642400
8588 6642400 6502103 5803161 3258354 1567354 2813692 4445537 3359557 1335641 2013088
8579B013088K320423n2207k080721K446J804844j678633n895979l257141L381270
8570c442610M250033j369588l936696L10645L450090j35027m345992k107665L071088
8561d255722L674147r9922k669578k321395j069989Q72788L734126M399831M81076
8552B745362m229352m320484o70612J790881J984799K355577K451327n55608n278809
8543c726919o261577j763713L420896M342371J430631j629130k532632j383738
8535h103811P74650K794087L557006K417966q8547k099737j997852q65175j705993
8526e317406m487783m435105J191640P096996O169767P1854l141522j237959M01789
8517c687729l70155P49911M429610M366112j225733m401856l54072L503866l01019
$$ plain form
8579 2013088 4333511 4281304 2200583 2203029 4007873 2329240 -3566739 -6823880 -3442610
8570 -3442610 807423 -562165 -4498861 -4188216 -738126 -873153 -5219145 -7326810 -4255722
8561 -4255722 -581575 -681497 -3351075 -5672470 -6742459 -5869671 -2135545 2264286 2745362
8552 2745362 -1483990 -5804474 -6475086 -4684205 -2699406 -343829 2107498 1551890 -3726919
8543 -3726919 -9988496 -11752209 -8331313 -3988942 -2558311 -4187441 -6720073 -8103811
8535 -8103811 -7329161 -4535074 -978068 1439898 1351351 -748386 -2746238 -3611413 -5317406
8526 -5317406 -9805189 -14240294 -13048654 -5951658 218109 289963 -2851559 -4089518 -3687729
8517 -3687729 -4057884 -3307973 1121637 5487749 4262016 -139840 -493912 3009954 2708935
8508B708935o027349l847731L758173O075049J113705k762062r48241J990250
8500B060729J618323l29613q35173N430R42102J298901L98738j257170j497945
8491B404322k96999r85349l955700l907854J387552N212375J956403k623824l25162
8482a134236N294774M546123k007850m786484j202951J789589J053477R15574
8474D468016K198015j56909n576946n719356J538082O498979J932942n907491
8466g24668p071959j627909K988155L008157N90146j372959j735033n73597P88938
8457e730729R41186L69885k2422j329423l789317l659992J474070O621224N644168
8448E18650J213316J10800J182014j521842n529429k721869M728066N477118j688773
$$ plain form
8508 2708935 -3318414 -7166145 -3407972 2667077 3780782 1018720 70479 2060729
8500 2060729 3679052 3349439 2514266 2519696 3461798 4760699 5159437 3902267 2404322
8491 2404322 2107323 1121974 -2833726 -6741580 -5354028 -141653 1814750 -809074 -1134236
8482 -1134236 4160538 8706661 6698811 1912327 709376 2498965 3552442 4468016
8474 4468016 6666031 6509122 932176 -4787180 -3249098 3249881 5182823 -724668
8466 -724668 -7796627 -9424536 -6436381 -3428224 -2838078 -4211037 -5946070 -6519667 -5730729
8457 -5730729 -4789543 -4419658 -4442080 -5771503 -9560820 -13220812 -11746742 -5125518 518650
8448 518650 1731966 1842766 3024780 1502938 -4026491 -6748360 -2020294 3456824 1768051
8439A768051m688330J195998M983320l72499n228490n87700N395545J341001p677031
8430c870135q717925j547988L565344L235676K534774K779625N76344k796854
8422d241139k394993R85599K030271L30701n9136J208326J308158Q79706K084823
8413B132316K567401m81806l227283q33853L073604K095396j128337M31446M402576
8404I031460K051948n798759q539585k592337L503701L271200M11610n64960j301624
8395e27346k874035j640096L114690N529187K201039k274511l307994k783427
8387b562493k990903j384015L151216N518354K176046j967082j012475K292590
8379C221238J386984l082626m346421q0261M598032M732947J182291k057823k726558
$$ plain form
8439 1768051 -2920279 -1724281 3259039 2886540 -2341950 -2929650 2465895 3806896 -3870135
8430 -3870135 -12588060 -14136048 -10570704 -7335028 -4800254 -2020629 -1444285 -4241139
8422 -4241139 -6636132 -5650533 -3620262 -3289561 -3348697 -2140371 -832213 47493 2132316
8413 2132316 4699717 4217911 990628 156775 3230379 5325775 4197438 4628884 9031460
8404 9031460 11083408 5284649 -3254936 -5847273 -2343572 927628 1339238 774278 -527346
8395 -527346 -3401381 -5041477 -1926787 3602400 5803439 3528928 220934 -2562493
8387 -2562493 -5553396 -6937411 -3786195 1732159 3908205 1941123 928648 3221238
8379 3221238 4608222 1525596 -2820825 -2901086 1696946 6429893 7612184 5554361 2827803
8370B827803j547217n84936j094180k410103k984577k169624j17842K953670N451198
8361C24192M104120j458525n401922k103999M774368N894960n19042o066070m802412
8352e254330r63636r5458J01126L653098O965019L858754l261201n796553j681091
8343b474272K102561O24210k360225j453785K220129L736626J845501l02635m35549
8334C502561L18664J61405o91089r48220l48369M27498J118703J607203O54417
8325E802773k811468o551684n984573l85571M529239L647919o7034O4175L856522
8316B100298M302246j023038n372067k901459K547699L802348J100108K56910
8308D813045K612677L531997O51874k440452k185392n1332O12735n36939j452301
$$ plain form
8370 2827803 1280586 695650 -398530 -2808633 -5793210 -7962834 -8080676 -5127006 324192
8361 324192 4428312 2969787 -2432135 -4536134 238234 6133194 5614152 -451918 -5254330
8352 -5254330 -6217966 -6313424 -6212298 -2559200 4405819 8264573 5003372 -793181 -2474272
8343 -2474272 -371711 252499 -2107726 -3561511 -1341382 2395244 4240745 3938110 3502561
8334 3502561 3821225 3982630 3291541 2343321 1994952 2422450 3541153 5148356 5802773
8325 5802773 2991305 -3560379 -9544952 -9930523 -5401284 -1753365 -1820399 -1756224 2100298
8316 2100298 6402544 5379506 7439 -2894020 -346321 3456027 4556135 4813045
8308 4813045 7425722 10957719 11609593 9169141 6983749 6932417 7545152 7008213 5555912
8299E555912j201706p65462j139941j894373j547070M71131J952364m70558o209724
8290e249427r094242m169334M829329R010651N558483P88118N06315K271159P14454
8281E165506l485795n033581k308734J054303K328458K541338K766667K102856
8273E131018N70993R4564J013605J112022l33195j177172q59387k094723n428810
8264a971085o394141k077602L190409L588304K69860j363449m26259l55536j491024
8255g030523p21968J708732J911175m38680j178145R10237K339814J949378K498091
8246A948111L264513p60435q655594j1006808l217650O263410P879641M038133
8238b46679K184741J649057k249533o110140k703983M872562N742366j678306
$$ plain form
8299 5555912 4354206 3588744 2448803 554430 -992640 -521509 1430855 960297 -5249427
8290 -5249427 -14343669 -18513003 -13683674 -4673023 885460 1673578 2179893 4451052 5165506
8281 5165506 1679711 -3353870 -5662604 -4608301 -2279843 261495 3028162 5131018
8273 5131018 5702011 5796575 6810180 7922202 7589007 6411835 5552448 3457725 -1971085
8264 -1971085 -8365226 -10442828 -7252419 -3664115 -3394255 -4757704 -5183963 -5539499 -7030523
8255 -7030523 -7752491 -6043759 -4132584 -4571264 -5749409 -4839172 -2499358 -549980 1948111
8246 1948111 5212624 4452189 -4203405 -15210213 -18427863 -12164453 -4284812 -246679
8238 -246679 1938062 3587119 1337586 -4772554 -7476537 -2603975 3138391 1460085
8230A460085o914014l824845J476080K779521K969707N243177N003525j275988
8222F917248o661767k929106N542697P094605J05045m831708j050747M581391
8214H767658K292515o281936j0369670m689312L800401N270294n34004m931905
8206f675959k408614K594332L061894m71557j820010R49369L403065K671324J508328
8197B812172K279099K196251j556141n716188m796482O78643M369546K522167
8189B789067j443310j874737J782881M350285J369437m909632p341098k354616
8181g631723M910374O289977P80753m280441k970796J844763L385487N42278j374224
8172A496448R70596L815739J693646m303080p159923l197902K681038L607312
$$ plain form
8230 1460085 -5453929 -9278774 -7802694 -5023173 -2053466 3189711 8193236 6917248
8222 6917248 255481 -2673625 2869072 9963677 10068722 5237014 4186267 8767658
8214 8767658 11060173 4778237 -5591433 -10280745 -6480344 -1210050 -1744054 -6675959
8206 -6675959 -9084573 -6490241 -3428347 -3899904 -5719914 -4770545 -1367480 1303844 2812172
8197 2812172 5091271 7287522 5731381 15193 -4781289 -4102646 266900 2789067
8189 2789067 1345757 -528980 1253901 5604186 6973623 2063991 -5277107 -7631723
8181 -7631723 -2721349 3568628 4349381 68940 -2901856 -1057093 2328394 2870672 1496448
8172 1496448 2467044 6282783 7976429 3673349 -3486574 -6684476 -4003438 -396126
8164c96126K32964q24852K595480M949036J948732k691609l343908q64287J71510
8155A776940o54729k70254J448032J846681R18935P57716M10857k653035o180961
8146b599818m663536J867967O544640M827938j52486l130988k890348j137603
8138a334234O55978J568600J562163K068940L277302K086927k839097o187146
8130H59433k713140L066362K444266l146588l796523J993939M031280k183165
8122E55864o955035k230208M952927M201525j741735k965533J361134L719760
8114H98699J380837j448897k392091k802959k423949K4220K348792J800142M29181
8105b186025J174116J780941l79982j468419K343464N577607J000781o523914
$$ plain form
8164 -396126 -163162 -988014 1607466 6556502 8505234 5813625 2469717 1605430 1776940
8155 1776940 1122211 851957 2299989 4146670 5065605 5823321 6234178 3581143 -2599818
8146 -2599818 -7263354 -5395387 1149253 5977191 5824705 2693717 -196631 -1334234
8138 -1334234 -678256 890344 2452507 4521447 7798749 9885676 7046579 859433
8130 859433 -1853707 1212655 3656921 510333 -3286190 -1292251 2739029 555864
8122 555864 -6399171 -8629379 -3676452 525073 -1216662 -4182195 -2821061 898699
8114 898699 2279536 830639 -1561452 -4364411 -6788360 -6764140 -4415348 -2615206 -2186025
8105 -2186025 -1011909 769032 389050 -1079369 1264095 6841702 7842483 1318569
8097A318569n688181K895097O899134K014197j872184J752069N009972n55920
8089A1772753r381846j0277010k739915M045107M444843Q50061k443516l099384
8081f828907q4164N217152Q136863N384443k50899l288062k391820o34059l68576
8072D891971j187370k001756k168437j174946N26718J242055M19226j01320Q36358
8063A282499J212739r88768l718091l188354M46958K933062J599238j461135k635797
8054d517649j225068M83473M67883p47437q32558J666096N232193O135992J997869
8045H660794n057229r411536p068534R0554N993238O688922L851000J214703n17264
8036D444648k696210m154860j882497L295830O118439L885646K58912m40452Q74979
$$ plain form
8097 1318569 -4369612 -1474515 5424619 7438816 5566632 7318701 12328673 11772753
8089 11772753 2390907 -7886103 -10626018 -6580911 -2136068 -1286007 -3729523 -6828907
8081 -6828907 -6913071 -1695919 6440944 11825387 11574488 8286426 5894606 5260547 4891971
8072 4891971 3704601 1702845 -465592 -1640538 -1113820 128235 547461 446141 1282499
8063 1282499 2495238 1506470 -2211621 -5399975 -4953017 -2019955 -420717 -1881852 -4517649
8054 -4517649 -5742717 -5259244 -4791361 -5538798 -6371356 -4705260 526933 6662925 8660794
8045 8660794 3603565 -5807971 -12876505 -12785951 -6792713 -103791 3747209 4961912 4444648
8036 4444648 1748438 -2406422 -4288919 -993089 5125350 9010996 9269908 8829456 9704435
8027I704435R99830j85375j214355k876564n864290o949815k892518L085062M249722
8018a943868k54566l977799j910951L525101O466962M438548M1334k125164J63494
8009D423091M099102M389988j66195m725848m934831k291760j05742J805496L823829
8000F317130K322012m580341j0429870p623056P97466M966816K607545M32506
7992e189792J429250J015066k423267l477241K24926L375271K826315K911725
7984F92253N603359M699708k872993q546869m256779L645728L374743l843895
7976a504745n955918Q28458O699824L775678k936077m433433m78755K140716K14048
7967a650204k496120j564175K317754M884774L796535Q98877r68490j584931k181473
$$ plain form
8027 9704435 10704265 10518890 9304535 6427971 563681 -6386134 -9278652 -6193590 -1943868
8018 -1943868 -2198434 -6176233 -8087184 -4562083 1904879 6343427 6384761 4259597 4423091
8009 4423091 8522193 12912181 12745986 8020138 3085307 793547 687805 2493301 6317130
8000 6317130 8639142 4058801 -6371069 -13994125 -13196659 -8229843 -5622298 -5189792
7992 -5189792 -3760542 -2745476 -5168743 -8645984 -8421058 -5045787 -2219472 692253
7984 692253 6295612 10995320 8122327 -424542 -4681321 -1035593 2339150 -1504745
7976 -1504745 -7460663 -6632205 67619 3843297 907220 -3526213 -4004968 -1864252 -1650204
7967 -1650204 -4146324 -5710499 -3392745 1492029 5288564 6187441 5218951 3634020 1452547
7958A452547k184405k16398K174704J697340j177890k017779P76218L067301J183464
7949D755102k695799m141890k319184N32659K588247K829690P98803j661508j451119
7940g64999Q73592R56627k238282l825763r58749J674466o14772l965902j542176
7931a0405958N208326Q046357L837021j659167k584295j58342P23572j556266
7923A451248l903739k702312J541633M084075J661544k387076k128938J909793
7915d73772L105735l64720j834306K716082O849838L487236l326438m614791k22687
7906E322177K587256J607367J281259K775611J872569k322991m949887l589926
7898D583435j826268k515666l698859l231982j917248k79551K495058M994874
$$ plain form
7958 1452547 -731858 -948256 1226448 2923788 1745898 -271881 504337 3571638 4755102
7949 4755102 2059303 -2082587 -4401771 -3869112 -1280865 1548825 2347628 686120 -764999
7940 -764999 108593 1065220 -1173062 -4998825 -5957574 -4283108 -4897880 -8863782 -10405958
7931 -10405958 -5197632 2848725 6685746 5026579 2442284 2283942 3007514 1451248
7923 1451248 -2452491 -5154803 -3613170 470905 2132449 -254627 -2383565 -473772
7915 -473772 2631963 2267243 432937 3149019 9998857 13486093 10159655 5544864 5322177
7906 5322177 7909433 9516800 10798059 13573670 15446239 13123248 8173361 4583435
7898 4583435 2757167 241501 -3457358 -6689340 -8606588 -8886139 -6391081 -1396207
$$ [...]
##END NTUPLES=NMR SPECTRUM
##END=
