##TITLE=31Pdec_LR-736-RB-RM1
 , 24 sc
 2.04.2021
##JCAMPDX= 6.0         $$ Bruker NMR JCAMP-DX V2.0
##DATA TYPE= NMR SPECTRUM
##DATA CLASS= NTUPLES
##ORIGIN= UXNMR, Bruker Analytische Messtechnik GmbH
##OWNER= root
$$ XWIN-NMR		Version 3.5
$$ Fri Apr  2 13:06:23 2021 Russian Standard Time (UT+4h)  she@DPX200
##.OBSERVE FREQUENCY= 81.013821
##.OBSERVE NUCLEUS= ^31P
##.ACQUISITION MODE= SIMULTANEOUS
##.ACQUISITION SCHEME= undefined
##.AVERAGES= 24
##.DIGITISER RES= 16
##SPECTROMETER/DATA SYSTEM= spect
##.PULSE SEQUENCE= zgpg30
##.SOLVENT NAME= CDCl3
##.SHIFT REFERENCE= (INTERNAL, CDCl3, 0, 248.564)
##AUDIT TRAIL= $$ (NUMBER, WHEN, WHO, WHERE, WHAT)
$$ ##TITLE= Audit trail, XWIN-NMR		Version 3.5
$$ ##JCAMPDX= 5.01
$$ ##ORIGIN= Bruker BioSpin GmbH
$$ ##OWNER= she
$$ F:/spectra/data/she/nmr/P31/1/pdata/1/auditp.txt
$$ ##AUDIT TRAIL=  $$ (NUMBER, WHEN, WHO, WHERE, WHAT)
(   1,<2021-04-02 13:04:51.76 +0400>,<she>,<DPX200>,
      <created by zg, POWCHK disabled, PULCHK disabled
       configuration hash MD5:
       00 E9 B6 7A A2 85 ED C7 34 08 36 98 17 FE 4E 26
       data hash MD5: 32K
       42 9E 02 06 57 EB 3A 6B 25 47 DA 58 A8 C3 F4 54>)
(   2,<2021-04-02 13:04:57.93 +0400>,<she>,<DPX200>,
      <Start of raw data processing
       efp BC_mod = 2 LB = 1 FT_mod = 6 PKNL = 1 PHC0 = -4609.804 PHC1 = 501.6011 SI = 64K 
       data hash MD5: 64K
       A6 00 59 99 A0 48 DD A0 81 01 81 EB 41 AF 05 E7>)
(   3,<2021-04-02 13:05:24.90 +0400>,<she>,<DPX200>,
      <pk PHC0 = 146.7097 PHC1 = -334.6 
       data hash MD5: 64K
       67 65 7C 74 1E AE 2F FD C5 17 CB 38 AF 7F EA D2>)
(   4,<2021-04-02 13:05:36.67 +0400>,<she>,<DPX200>,
      <abs ABSG = 5 
       data hash MD5: 64K
       7E AD 80 8E 8F BF F2 95 F3 54 53 A6 5F 41 B2 24>)
$$ ##END=
$$ 
$$ hash MD5
$$ 4D DC 1D 6D 33 36 04 9D 6C 4C AE 91 C8 59 21 2D
##$RELAX= 
##$RELAX= 
##$RELAX= 
##$RELAX= 
##$RELAX= 
##$RELAX= 
##$RELAX= 
##$RELAX= 
$$ Bruker specific parameters
$$ --------------------------
##$DU= <F:/spectra>
##$EXPNO= 1
##$NAME= <P31>
##$PROCNO= 1
##$TYPE= <nmr>
##$USER= <she>
##$AMP= (0..31)
100 100 100 100 100 100 100 100 100 100 100 100 100 100 100 100 100 100 
100 100 100 100 100 100 100 100 100 100 100 100 100 100 
##$AQSEQ= 0
##$AQ_mod= 1
##$AUNM= <au_zg>
##$AUTOPOS= <>
##$BF1= 81.014009
##$BF2= 200.13
##$BF3= 200.13
##$BF4= 200.13
##$BF5= 200.13
##$BF6= 200.13
##$BF7= 200.13
##$BF8= 200.13
##$BYTORDA= 1
##$CFDGTYP= 0
##$CFRGTYP= 5
##$CHEMSTR= <none>
##$CNST= (0..31)
1 1 145 1 1 1 1 1 1 1 1 1 1 1 1 1 1 1 1 1 1 1 1 1 1 1 1 1 1 1 1 1 
##$CPDPRG= <waltz16>
##$CPDPRG1= <>
##$CPDPRG2= <waltz16>
##$CPDPRG3= <>
##$CPDPRG4= <mlev>
##$CPDPRG5= <mlev>
##$CPDPRG6= <mlev>
##$CPDPRG7= <mlev>
##$CPDPRG8= <mlev>
##$CPDPRGB= <>
##$CPDPRGT= <>
##$D= (0..31)
0 1 0 0 0 0 0 0 0 0 0 0.03 2e-05 3e-06 0 0 0 0 0 0 0 0 0 0 0 0 0 0 0 0 
0 0 
##$DATE= 1617354291
##$DBL= (0..7)
120 120 120 11 120 120 24 19 
##$DBP= (0..7)
150 150 150 150 150 150 150 150 
##$DBP07= 0
##$DBPNAM0= <>
##$DBPNAM1= <>
##$DBPNAM2= <>
$$ [...]
##$SUBNAM3= <"">
##$SUBNAM4= <"">
##$SUBNAM5= <"">
##$SUBNAM6= <"">
##$SUBNAM7= <"">
##$SUBNAM8= <"">
##$SUBNAM9= <"">
##$SW= 501.771253377433
##$SWIBOX= (0..15)
0 1 3 0 0 0 0 0 0 0 0 0 0 0 0 0 
##$SW_h= 40650.406504065
##$TD= 32768
##$TD0= 1
##$TE= 0
##$TE2= 300
##$TE3= 300
##$TEG= 300
##$TL= (0..7)
0 120 53 12 22 120 120 120 
##$TP= (0..7)
150 150 150 150 150 150 150 150 
##$TP07= 0
##$TPNAME0= <>
##$TPNAME1= <>
##$TPNAME2= <>
##$TPNAME3= <>
##$TPNAME4= <>
##$TPNAME5= <>
##$TPNAME6= <>
##$TPNAME7= <>
##$TPOAL= (0..7)
0.5 0.5 0.5 0.5 0.5 0.5 0.5 0.5 
##$TPOFFS= (0..7)
0 0 0 0 0 0 0 0 
##$TUNHIN= 0
##$TUNHOUT= 0
##$TUNXOUT= 0
##$USERA1= <user>
##$USERA2= <user>
##$USERA3= <user>
##$USERA4= <user>
##$USERA5= <user>
##$V9= 5
##$VALIST= <valist>
##$VCLIST= <CCCCCCCCCCCCCCC>
##$VD= 0
##$VDLIST= <DDDDDDDDDDDDDDD>
##$VPLIST= <PPPPPPPPPPPPPPP>
##$VTLIST= <TTTTTTTTTTTTTTT>
##$WBST= 1024
##$WBSW= 4
##$XGAIN= (0..3)
0 0 0 0 
##$XL= 0
##$YL= 0
##$YMAX_a= 25521
##$YMIN_a= -25263
##$ZGOPTNS= <>
##$ZL1= 120
##$ZL2= 120
##$ZL3= 120
##$ZL4= 120
##$ABSF1= 248.5645
##$ABSF2= -253.2056
##$ABSG= 5
##$ABSL= 3
##$ALPHA= 0
##$AQORDER= 0
##$ASSFAC= 0
##$ASSFACI= 0
##$ASSFACX= 0
##$ASSWID= 0
##$AUNMP= <proc_1d>
##$AZFE= 0.1
##$AZFW= 0.5
##$BCFW= 0
##$BC_mod= 2
##$BYTORDP= 0
##$COROFFS= 0
##$CY= -3
##$DATMOD= 1
##$DC= 0
##$DFILT= <>
##$DTYPP= 0
##$F1P= 0
##$F2P= 0
##$FCOR= 1
##$FTSIZE= 65536
##$FT_mod= 6
##$GAMMA= 0
##$GB= 0
##$INTBC= 1
##$INTSCL= 5.30512e-09
##$ISEN= 30
##$LB= 1
##$LEV0= 0
##$LPBIN= 0
##$MAXI= 10000
##$MC2= 0
##$MEAN= 0
##$ME_mod= 0
##$MI= 50
##$NCOEF= 0
##$NC_proc= -6
##$NLEV= 6
##$NOISF1= 182.463
##$NOISF2= 159.3651
##$NSP= 0
##$NTH_PI= 0
##$NZP= 0
##$OFFSET= 248.5645
##$PC= 4
##$PHC0= -4463.095
##$PHC1= 167.0011
##$PH_mod= 1
##$PKNL= yes
##$PPARMOD= 0
##$PSCAL= 0
##$PSIGN= 0
##$REVERSE= no
##$SF= 81.014009
##$SI= 65536
##$SIGF1= 159.3651
##$SIGF2= -187.1042
##$SINO= 113.3802
##$SIOLD= 16384
##$SREGLST= <1H.CDCl3>
##$SSB= 0
##$STSI= 65536
##$STSR= 0
##$SW_p= 40650.406504065
##$SYMM= 0
##$S_DEV= 0
##$TDeff= 32768
##$TDoff= 0
##$TI= <>
##$TILT= no
##$TM1= 0
##$TM2= 0
##$TOPLEV= 0
##$USERP1= <user>
##$USERP2= <user>
##$USERP3= <user>
##$USERP4= <user>
##$USERP5= <user>
##$WDW= 1
##$XDIM= 65536
##$YMAX_p= 428703287
##$YMIN_p= -16836002
$$ End of Bruker specific parameters
$$ ---------------------------------
##NTUPLES= NMR SPECTRUM
##VAR_NAME=  FREQUENCY,     SPECTRUM/REAL,   SPECTRUM/IMAG
##SYMBOL=    X,             R,               I
##VAR_TYPE=  INDEPENDENT,   DEPENDENT,       DEPENDENT
##VAR_FORM=  AFFN,          ASDF,            ASDF
##VAR_DIM=   65536,         65536,           65536
##UNITS=     HZ,            ARBITRARY UNITS, ARBITRARY UNITS
##FACTOR=    0.620285442955139, 1,           1
##FIRST=     20137.2065510759, 0,            0
##LAST=      -20513.1999529892, 0,           0
##MIN=       -20513.1999529892, -16836002,   0
##MAX=       20137.2065510759, 428703287,    0
$$ Real data points
##PAGE= N=1
##DATA TABLE= (X++(R..R)), XYDATA
$$ [...]
42443a291029n96312q81862o72700p02478r04816m69532N68651J274351J226140
42434b449587R22663R66499J521936K129592J686166l96066k579029k290792M81173
42425g445K454243J345833q52785r51801N61628M83587j825689l070526o52336
42416b515291L443588M788878J720401k714365m133435j679438J206083J284730
42408A401151k89492r0536J874793J737620j973612n028505l122020J721860L961276
42399A92535K236428J85642O1255l0039j571758k452890o99843J567140R57527
42390D45997j994769l464514j688634R07231J314216k43688j049243M97073K951855
42381b324476L475138J073091k081800k924851r93612J142328J209539j04687
$$ plain form
42443 -1291029 -1887341 -2769203 -3441903 -4144381 -5049197 -5518729 -4950078 -3675727 -2449587
42434 -2449587 -1526924 -560425 961511 3091103 4777269 4381203 1802174 -488618 -7445
42425 -7445 2446798 3792631 2939846 1988045 2549673 3033260 1207571 -1862955 -2515291
42416 -2515291 928297 5717175 7437576 4723211 589776 -1089662 116421 1401151
42408 1401151 1111659 1021123 2895916 4633536 2659924 -2368581 -5490601 -3768741 192535
42399 192535 2428963 2614605 2675860 2645821 1074063 -1378827 -2078670 -511530 445997
42390 445997 -1548772 -5013286 -6701920 -5794689 -4480473 -4724161 -5773404 -5276331 -2324476
42381 -2324476 1150662 2223753 141953 -2782898 -3776510 -2634182 -1424643 -1529330
42373a529330p15287l05580k32617p15000l09584J284028K055568P50628o51118
42364c68292L04700K427102K265225n94470k578131j262909J261145J719684N1009
42355C225063j559020k145551k050676j029233R87224K243435J156682p19056
42347A08868p23365M90115Q6766j560488q84769K505924L974238P84488l055039
42338A726738k450486J204005K395737k52863k650101j813810M55459J267616
42330a17705N08932m48475j214858j738894j103740J034083K883673K287435l06445
42321A784006k178886j743663l43612o3705p25273l62662J444587K442177J000916
42312A253885r07156k52276K172207K390955o97929l129538j577864J589477J900513
$$ plain form
42373 -1529330 -2244617 -2550197 -2782814 -3497814 -3807398 -2523370 -467802 282826 -368292
42364 -368292 -63592 2363510 4628735 4034265 1456134 193225 1454370 3174054 3225063
42355 3225063 1666043 -479508 -2530184 -3559417 -2572193 -328758 827924 108868
42347 108868 -614497 -124382 -37616 -1598104 -2482873 23051 3997289 4781777 1726738
42338 1726738 -723748 480257 2875994 2623131 -26970 -1840780 -1385321 -117705
42330 -117705 391227 -57248 -1272106 -3011000 -4114740 -3080657 -196984 2090451 1784006
42321 1784006 -394880 -2138543 -2482155 -2545860 -3271133 -3633795 -2189208 252969 1253885
42312 1253885 346729 94453 2266660 4657615 3959686 830148 -747716 841761 2742274
42303B742274o07202k031333r05726J40572o85417j512395l44873J501590J562708
42294a39802o3607j200813o80073P41448J825123J853021P31989p76965j366697
42285I23624o12753L80435N39716L82271R70975J784892R95987j881242m638532
42276a154627m445845j068912K582232L379716J154941j483799k277522j386445
42268d700261j89367P45132J554791J912413J347789L17504l06831m84166n61564
42259c64560j61858R44658J445411M6990j800205j229402J637142L257374J646965
42250E422515p78399r54545N45685J174673N46073K80612P62411O70116n86733
42241G082408k110067l035590l068474j877072K39806J516403N62841j248436
$$ plain form
42303 2742274 2135072 103739 -801987 -661415 -1346832 -2859227 -3204100 -1702510 -139802
42294 -139802 -203409 -1404222 -2084295 -1342847 482276 2335297 3067286 2290321 923624
42285 923624 310871 691306 1231022 1613293 2584268 4369160 5365147 3483905 -1154627
42276 -1154627 -5600472 -6669384 -4087152 -707436 447505 -1036294 -3313816 -4700261
42268 -4700261 -4889628 -4144496 -2589705 -677292 670497 988001 681170 197004 -364560
42259 -364560 -526418 418240 1863651 1910641 110436 -1118966 518176 3775550 5422515
42250 5422515 4644116 3689571 4235256 5409929 5956002 6236614 6999025 7669141 7082408
42241 7082408 4972341 1936751 -1131723 -3008795 -2768989 -1252586 -689745 -1938181
42233a938181j354588K43879J148964M96118N1811Q25757J320533L92770n61363
42224F25700J459J088662P78549q49433k167976k342821j659352m73080P13188
42215d285104J043014N04839L47137J092101J451926O24013M0136R19341J723829
42206C461232N15854j565268k050024j190326r97069j148226K88238K390862J997075
42197A702348o88231j608713N86221J976507k45972l006447k305242N57577J730185
42188a301767J062944J139341J904736J020464j222012j909066m34832O59270
42180I19078J27135m94951m02671p76722j598127q99289J388708K324080N82468
42171A169709r72313K93886K505395K187899n55444k666827k604950j446062l12751
$$ plain form
42233 -1938181 -3292769 -3048890 -1899926 -1403808 -1351997 -526240 794293 1187063 625700
42224 625700 627159 1715821 2494370 1644937 -523039 -2865860 -4525212 -4998292 -4285104
42215 -4285104 -3242090 -2737251 -2390114 -1298013 153913 777926 818062 1737403 3461232
42206 3461232 3977086 2411818 361794 -828532 -1825601 -2973827 -2685589 -294727 1702348
42197 1702348 1014117 -594596 -8375 1968132 1722160 -1284287 -3589529 -3031952 -1301767
42188 -1301767 -238823 900518 2805254 3825718 2603706 694640 259808 919078
42180 919078 1046213 551262 148591 -628131 -2226258 -3125547 -1736839 587241 1169709
42171 1169709 197396 491282 2996677 5184576 4629132 1962305 -642645 -2088707 -2401458
42162b401458P40439J508429J398598N42274k37253n33774m99155k81305j58649
42153G8146n58073j101421n91168J041922J917594O56737j430458k127284j263189
42144c377194j78742P76556K121225L211828K587831L29479j812829k713753k655393
42135a710992j943629o07012M84225K05087p57040l76836J554061K658152J313369
42126H19385r56070j693862p15564L65838P56799R46141J054170L84449j172139
42117b10853k409409j985429Q4556K342743L159571K145008M05331p10520r99857
42108A821141j132258j215142o30524M53919O56141n89115j560858l12886K225210
42099b84372K985520Q86399j502511j391775N39334J453015M85175m62547k3608
$$ plain form
42162 -2401458 -1661019 -152590 1246008 1788282 1551029 1017255 518100 236795 78146
42153 78146 -479927 -1581348 -2172516 -1130594 787000 1443737 13279 -2114005 -3377194
42144 -3377194 -3555936 -2779380 -658155 2553673 5141504 5470983 3658154 944401 -1710992
42135 -1710992 -3654621 -4261633 -3777408 -3572321 -4329361 -4706197 -3152136 -493984 819385
42126 819385 -136685 -1830547 -2546111 -2180273 -1423474 -477333 576837 961286 -210853
42117 -210853 -2620262 -4605691 -4521135 -2178392 981179 3126187 3531518 2820998 1821141
42108 1821141 688883 -526259 -1156783 -702864 -46723 -635838 -2196696 -2509582 -284372
42099 -284372 2701148 3587547 2085036 693261 1232595 2685610 3170785 2708238 2684630
42090B684630O63855J64481q07137o77329L00141M07855q72006k175002k236775
42081b547287j178211L05648J719503K451741J920943N02451o53248j045323j136281
42072C39936j136870p02958o3674l5904m96450l26283O03095J051609O87153P64029
42062F83683J461229Q24734j791347l430569j395490K210272L045132P15780j149210
42053A174214p64877k36434r75900r90150J184035L013226J431238k165224l520207
42044a850079j232569J944178L203183K500423J074927m78612j821881k284938
42036A054632j727682r63549n79159k02419M90224R96099R04028P09893R30630
42027A612697J181599R78683P06309Q01914O93031k38668j236717j199728p32122
$$ plain form
42090 2684630 3348485 3512966 2705829 2028500 2328641 2736496 1864490 -310512 -2547287
42081 -2547287 -3725498 -3419850 -1700347 751394 2672337 3174788 2521540 1476217 339936
42072 339936 -796934 -1499892 -1563566 -1599470 -2095920 -2422203 -1819108 -767499 -80346 683683
42062 683683 2144912 2969646 1178299 -2252270 -3647760 -1437488 1607644 2323424 1174214
42053 1174214 409337 172903 -802997 -1793147 -609112 2404114 3835352 1670128 -1850079
42044 -1850079 -3082648 -1138470 2064713 4565136 5640063 5161451 3339570 1054632
42036 1054632 -673050 -1636599 -2215758 -2418177 -1927953 -931854 -27826 682067 1612697
42027 1612697 2794296 3772979 4479288 5281202 5974233 5735565 4498848 3299120 2566998
42018B566998j356018k686626k479281j06120K079808K040829Q44080N12584P75847
42009B192101J98106o73269j6978J827927K371004O56225j476565k301970k121067
42000F55514j654272q47151j76340p92499k118708j660943J140018L194567K066254
41991a93560j83956k39221J214119R92552q61442r55596J602456L197399J048935
41982E621686k588172l707732j777090O16970J685498J551009N21401j173912
41974G49658k264810j418340M98370J178279K59865q4492J310360K524681J429921
41965D183492j026071k288765j776702q77209k07694O47040J066309p8179j596651
41956a954430p91457J975506K820137K23247j975153l19429K601467K229283n77864
$$ plain form
42018 2566998 1210980 -1475646 -3954927 -4061047 -1981239 59590 903670 1416254 2192101
42009 2192101 2390207 1716938 1699960 3527887 5898891 6555116 5078551 2776581 655514
42000 655514 -998758 -1845909 -2022249 -2814748 -4933456 -6594399 -5454381 -2259814 -193560
41991 -193560 -377516 -616737 597382 1589934 728492 -227104 1375352 4572751 5621686
41982 5621686 3033514 -674218 -2451308 -1834338 -148840 1402169 1923570 749658
41974 749658 -1515152 -2933492 -2435122 -1256843 -996978 -1081470 228890 2753571 4183492
41965 4183492 3157421 868656 -908046 -1785255 -1992949 -1345909 -279600 -357779 -1954430
41956 -1954430 -2745887 -770381 2049756 2273003 297850 -21579 2579888 4809171 4231307
41947D231307j202510R02366J594745n88756k059123o32218Q61402p9780j267289
41938A760144n7783J854989J545102k57409j074847r84048j371318j589028n16374
41929f90572N00800j01239q46925N9620Q52477o96341k310919m14380L110672
41920e36807L047545p28767k837473q97671J360411Q62103m61800k58152L23851
41911a26760p010J83196J629466K082797M82264m73583P68716J076970j972413
41902C643643m806165k903096J637075L038505O16645j056808K2019J047177L19959
41893A558954j03772Q88415J013516r34612k298882r72360Q43214L77481j060213
41884f88259o77398P27721K67870j628791j508584J365595L461343K268053j15248
$$ plain form
41947 4231307 3028797 3931163 5525908 4937152 2878029 2245811 3107213 3027433 1760144
41938 1760144 1702361 3557350 5102452 4845043 3770196 2786148 1414830 -174198 -690572
41929 -690572 -189772 -291011 -1137936 -1078316 -225839 -922180 -3233099 -3647479 -536807
41920 -536807 2510738 1781971 -1055502 -1953173 -592762 269341 -192459 -450611 -126760
41911 -126760 -133770 49426 1678892 3761689 4243953 3770370 4539086 5616056 3643643
41902 3643643 -1162522 -4065618 -2428543 609962 1226607 169799 191818 1238995 1558954
41893 1558954 1455182 2343597 3357113 2422501 123619 -848741 -5527 371954 -688259
41884 -688259 -1365657 -637936 -370066 -1998857 -3507441 -2141846 1319497 3587550 3472302
41875C472302n09787P37401R99827m21909j803079j866821r30553L82671J550302
41866A610354J549926q1966j666090j018106J168586J913696L99697p92709J0482
41857C093870Q08094n23461k326848j653993R46576K296237J407361K59224L7548
41848D344608j61868n45916K14708J943715K027584o56251l227559k512333L74944
41839A801632J702561M30057r09820n66517j8144r85274k271894j689513J21598
41830b385314M52550j027061j464032N08340K144265R00550j080670k85300K070503
41821a66169J802687r36089j469142J371940K726584k43613l279163k022753Q23322
41812a392396O35553r62941M39276L367131K632922j215797k282504P88898K786232
$$ plain form
41875 3472302 2962515 3699916 4699743 4277834 2474755 607934 -322619 60052 1610354
41866 1610354 3160280 3078314 1412224 394118 1562704 3476400 3876097 3083388 3093870
41857 3093870 3901964 3378503 1051655 -602338 344238 2640475 4047836 4307060 4344608
41848 4344608 4182740 3636824 3851532 5795247 7822831 7166580 3939021 1426688 1801632
41839 1801632 3504193 3934250 3024430 2457913 2439769 1454495 -817399 -2506912 -2385314
41830 -2385314 -1932764 -2959825 -4423857 -3915517 -1771252 -870702 -1951372 -2236672 -166169
41821 -166169 1636518 700429 -768713 603227 3329811 3086198 -192965 -2215718 -1392396
41812 -1392396 -756843 -1719784 -1280508 2086623 4719545 3503748 1221244 2010142 4796374
41803D796374R79536r87435m30613j5833j664231k310207K87295K895080K253427
41794E803393L66714p1275q41652l718846n190160j708270L090214K971690j196945
41785d95137k953501l84491J838451P11482j047870n80623P76543R09927N78565
41776f46654J198988J910687J109864r87040k846602l218177j519290J644132
41768c354092L877199K925019k04102k023519j077759L90251N9435j290041j492361
41759b189970k49004Q53474O87112k86488q56067l31733Q29528J448999Q65160
41750G71011m11709j476622j846217j145254R01515L287832L811645J757955o15197
41741E034959r47149o0458l35148j716929j890884j39707J562652J614026O94321
$$ plain form
41803 4796374 5775910 4788475 4357862 4342029 2677798 367591 654886 3549966 5803393
41794 5803393 6170107 6098832 5257180 1538334 -3651826 -5360096 -2269882 701808 -495137
41785 -495137 -3448638 -3833129 -1994678 -1283196 -2331066 -2911689 -2135146 -1225219 -646654
41776 -646654 552334 2463021 3572885 2585845 -260757 -3478934 -4998224 -3354092
41768 -3354092 523107 3448126 3244024 1220505 142746 532997 592432 -697609 -2189970
41759 -2189970 -2438974 -1585500 -898388 -1184876 -2040943 -2372676 -1543148 -94149 771011
41750 771011 359302 -1117320 -2963537 -4108791 -3207276 80556 3892201 5650156 5034959
41741 5034959 4087810 4027352 3692204 1975275 84391 -55316 1507336 3121362 3815683
41732C815683N5971j78945l24806k86580o3100P4868K46521P33169J098463P61927
41722E933171K64240N04483R44864K81705j221883j931908j354854n12334J76040
41713C083524J168808J832261P62732j373567k062592r77014q36153k618937l064755
41704d085693K50617L980759L070737j639888m251572k165539P93849Q15765n28040
41695c759005l320J550822J098829q68666q95512J524774K874428J279220o40734
41686B160836l17241P98383K91457j047504j129173m05779n08208q26063L3530
41677i49762Q69939j60414j442716j44455K206769J394866k153091l090014N92111
41668b876767M237583L577466L77758j573507j772871j314357M2911J784084J328365
$$ plain form
41732 3815683 3871654 3692709 3367903 3081323 3018223 3093091 3339612 4072781 5171244 5933171
41722 5933171 6197411 6701894 7646758 7928463 6706580 4774672 3419818 2907484 3083524
41713 3083524 4252332 6084593 6847325 5473758 3411166 2434152 1597999 -1020938 -4085693
41704 -4085693 -3835076 145683 3216420 1576532 -2675040 -4840579 -4046730 -3230965 -3759005
41695 -3759005 -3762325 -2211503 -1112674 -1981340 -2876852 -1352078 1522350 2801570 2160836
41686 2160836 1843595 2641978 2933435 1885931 756758 350979 -157229 -983292 -949762
41677 -949762 -79823 -240237 -1682953 -1827408 379361 1774227 -378864 -3468878 -2876767
41668 -2876767 1360816 4938282 5316040 3742533 1969662 655305 698216 2482300 3810665
41659C810665j676579l259798r59939J808792J213061q24107n56682R60223O07951
41650A123587m40620P70713K405333M38949l513817l918093m77749J404522j63499
41641b370674r03646J450744L048457R16087j751060j109406J079207R12149j211607
41632F0251j826691j36227J225889M29830j266068j484349L49315K166799J432920
41623I51669j324175k303354N90656M080000L655863M0034k223162j632120o37033
41614A198378j25938J639851L935853L067385j149567l612118j318548K073950
41606E709246K143405j2008q33170o4430J92737o16369j789256l050454l333402
41597a653701r08295K680970K595620k002561m748780p82919N074950M708756
$$ plain form
41659 3810665 2134086 -1125712 -2085651 -276859 936202 112095 -444587 515636 1123587
41650 1123587 682967 1453680 3859013 4297962 784145 -3133948 -3611697 -2207175 -2370674
41641 -2370674 -3274320 -1823576 1224881 2140968 389908 -719498 359709 1271858 60251
41632 60251 -1766440 -1902667 -676778 -246948 -1513016 -2997365 -2648050 -481251 951669
41623 951669 -372506 -2675860 -2085204 1994796 5650659 5690693 3467531 1835411 1198378
41614 1198378 1072440 2712291 6648144 9715529 8565962 4953844 3635296 5709246
41606 5709246 7852651 7840643 7007473 6943043 7135780 6519411 4730155 1679701 -1653701
41597 -1653701 -2561996 118974 2714594 712033 -4036747 -4819666 255284 4964040
41589D964040j368705n101947k749562J146506K021945J044193P49327N00011
41581A205808o97761j060606Q18275K599750J432455j383021k266354o95657N83045
41572E35934K61085J18855J329485K041979M65162j686260j431192P56952J492785
41563C884785j33482r82384R42642K869046J487221j667743k643938j241485n72136
41554A942526j235969o21561J636660K268952n5521k052122r79515J174570J295418
41545C373438j85062j065205j211345j670102k013677j337646k31223N18337J343335
41536b479150K049350R97923j560224k208432N27546K688128M34132l376484k939072
41527e866283J691381M690014K954375m73695j950592j552688o29520Q02279K290781
$$ plain form
41589 4964040 3595335 -1506612 -4256174 -3109668 -1087723 -43530 705797 1205808
41581 1205808 508047 -552559 265716 2865466 4297921 2914900 648546 -47111 535934
41572 535934 797019 915874 2245359 4287338 4752500 3066240 1635048 2392000 3884785
41563 3884785 3751303 2768919 3711561 6580607 8067828 6400085 3756147 2514662 1942526
41554 1942526 706557 84996 1721656 3990608 3935087 1882965 903450 2078020 3373438
41545 3373438 3188376 2123171 911826 -758276 -2771953 -4109599 -4340822 -3822485 -2479150
41536 -2479150 -429800 568123 -992101 -3200533 -2672987 15141 449273 -2927211 -5866283
41527 -5866283 -4174902 515112 3469487 2995792 1045200 -507488 -1137008 -334729 1956052
41518A956052J951956m76619k133646q80195J304323J091868j392141k885428
41510a463830j522924J011573K002388Q96800n97453q46328K9693P98191Q45269
41501A153379O30577N10957K8413j113668k093747j851186o03241L36064K29191
41492b773261k34932K5075R47056J256661J50959j313905j341632R4484J121988
41483b067507P95995L99027Q90481J051516j326n43592Q35153J999926M72075
41474C831748j813695j286708R62128Q36619j381945j326436J319274J621388
41466B762373j813028l618984n35621K911283K054980m01272k70J429711j82206
41457B606966l013993k328943R65484J777242n58895j808935l98382P95219K95467
$$ plain form
41518 1956052 3908008 3431389 1297743 417548 1721871 2813739 1421598 -1463830
41510 -1463830 -2986754 -1975181 27207 924007 326554 -519774 -490081 308110 1153379
41501 1153379 1783956 2294913 2323326 1209658 -884089 -2735275 -3338516 -3002452 -2773261
41492 -2773261 -3008193 -2983118 -2036062 -779401 -628442 -1942347 -3283979 -3189495 -2067507
41483 -2067507 -1271512 -872485 17996 1069512 1068186 524594 1359747 3359673 3831748
41474 3831748 2018053 731345 1693473 2530092 1148147 -178289 1140985 2762373
41466 2762373 949345 -2669639 -3205260 -293977 1761003 1359731 1359461 2789172 2606966
41457 2606966 -407027 -2735970 -1770486 6756 -552139 -2361074 -2759456 -1964237 -1668770
41448a668770J6163Q63237J285756Q17143P40002R20160P7399q29382K70922K203083
41438D695713J779892o74344j689800o17252l29082j546289j530144O06661K148486
41429B843841J596437O51275J26374j432329l556757l118139K00238K306012R49254
41420E66206q33398k13235P98849m68811k331784j748294N45198J711906J496753
41411d76610J666240K330738K062749O55522q49459j958440k466626j599177N54976
41402h0087J975748J136955n72091q05572L41688Q49383n1906j084443r63606
41393G46069K16401J470561J816709Q67229q59122k366631k981920k378562l86700
41384c855966K165634L125290J274868j430494j838622L04588K216159J966415
$$ plain form
41448 -1668770 -1652607 -789370 496386 1313529 2053531 2973691 3051090 2221708 2492630 4695713
41438 4695713 6475605 5801261 4111461 3494209 3165127 1618838 88694 695355 2843841
41429 2843841 4440278 5091553 5217927 3785598 228841 -2889298 -2689060 -383048 566206
41420 566206 -267192 -480427 318422 -150389 -2482173 -4230467 -3685269 -1973363 -476610
41411 -476610 1189630 3520368 5583117 6238639 5389180 3430740 964114 -635063 -80087
41402 -80087 1895661 3032616 2460525 1654953 1996641 2846024 2794118 1709675 746069
41393 746069 962470 2433031 4249740 5116969 4257847 1891216 -1090704 -3469266 -3855966
41384 -3855966 -1690332 1434958 2709826 1279332 -559290 -254702 1961457 3927872
41376C927872M27939p15610q56711k40087L52491j01988j240982r71461J138128
41367A719591J878346r04195l566130j374795L368373L899295m52291l011979
41359A556215l93697K566369J376100j238284j285955m72779j823302l114185
41351b829518q29191K737356K641598o50062k397495j346603n12704r65959n39238
41342d691816J175783J779247O92594K11082J014710R24075o55255j123529P61181
41333H8072K320095J075679j518844k757045k607220k452197j884221L24801L082923
41324d327957L729549J914816K64062N18965J097164j26264k136173k042904M48902
41315f59840K324460J668291L90807Q53305J822198N39751k335265l199707q81590
$$ plain form
41376 3927872 4355811 3640201 2783490 2543403 2895894 2793906 1552924 581463 1719591
41367 1719591 3597937 2693742 -872388 -2247183 1121190 5020485 4568194 1556215
41359 1556215 1162518 3728887 5104987 3866703 2580748 2107969 284667 -2829518
41351 -2829518 -3658709 -921353 1720245 1070183 -1327312 -2673915 -3186619 -4152578 -4691816
41342 -4691816 -3516033 -1736786 -1044192 -833110 181600 1105675 450420 -673109 88072
41333 88072 2408167 3483846 1965002 -792043 -3399263 -5851460 -7735681 -7410880 -4327957
41324 -4327957 -598408 1316408 1580470 2099435 3196599 3070335 934162 -1108742 -659840
41315 -659840 1664620 3332911 3723718 4577023 6399221 6938972 4603707 1404000 522410
41306E22410J714535K085710J232836R25142N96120r55207k691337k474084j65098
41297G91027K150710K561840R35944j235874j938468l99116J777657K182735N25341
41288G351796j204519j524258q34014O3991R01019J058522k55499k318211l073148
41279A65679j535655J273837L603198L711870M66069m313925n529279o04779N404981
41270B641996N259316l32096l622500j272126J625588P67286j013484k37229P36742
41261D553493j200339l466862k202204P68873J167270n90949j088897j78122k485
41252b240222M6053J830275L715539K791375L44135k55351L27967j005254l288532
41243B265985k613353P19249K126777N5616k107963j908734n45143O84108J741620
$$ plain form
41306 522410 2236945 4322655 5555491 6480633 7076753 6121546 3430209 956125 791027
41297 791027 2941737 5503577 6439521 5203647 3265179 2866063 4643720 6826455 7351796
41288 7351796 6147277 4623019 3789005 3852996 4754015 5812537 5557038 3238827 165679
41279 165679 -1369976 -96139 3507059 7218929 7684998 3371073 -2158206 -2762985 2641996
41270 2641996 7901312 7569216 3946716 2674590 4300178 5067464 4053980 3816751 4553493
41261 4553493 3353154 -113708 -2315912 -1547039 -379769 -970718 -2059615 -2237737 -2240222
41252 -2240222 -2194169 -363894 3351645 6143020 6487155 6231804 6559771 5554517 2265985
41243 2265985 -347368 371881 2498658 2554274 446311 -1462423 -2007566 -1323458 418162
41234D18162J431918j267178l297790n91902M476163M956296j02032l578868j152995
41225A291774K446836J780245r43135r76363N84748k51874k457044j596821K208201
41216B086567M076859J950746q90094j507609r01219o51150L140J633382K266638
41207H067260K25742k590204k969554r19401O59456M17602p1148K05563k57140
41198B768176k300009l457767j309319K118539K786329P95082J21138J940449
41190C462618K641228O6362k586287j916514L09065N28603q38752j044534j61076
41181D60713k52937j018896o40021J74103n72096j658596l7932L459193M471884
41172D385415J669557j389348j907901j303306j628951k194716j595428k75473
$$ plain form
41234 418162 1850080 582902 -2714888 -3306790 1169373 6125669 6023637 2444769 1291774
41225 1291774 3738610 5518855 4575720 3599357 4184105 3932231 1475187 -121634 2086567
41216 2086567 6163426 8114172 7224078 5716469 4815250 4164100 4167240 5800622 8067260
41207 8067260 8293002 5702798 2733244 1813843 2473299 2890901 2819753 3025316 2768176
41198 2768176 468167 -2989600 -4298919 -2180380 605949 1401031 1522169 3462618
41190 3462618 6103846 6170208 3583921 1667407 1976472 2505075 1666323 621789 460713
41181 460713 207776 -811120 -1451141 -1277038 -1849134 -3507730 -3545662 -86469 4385415
41172 4385415 6054972 4665624 2757723 1454417 -174534 -2369250 -3964678 -4240151
41164d240151O91941J243985J459608R32259p4096n24198j44932N00296J287519
41155A132231K033283J467202p73294k048831P5694L227934K788189j126731l604338
41146C171339k316328l57009m37335p84551Q78691L010393K708876j4690k725706
41137C133680l488743j888007R28603K369807Q24558j568851j329444R86066J415697
41128A383366q84793k143267l81153J335647M50591p05265O19092K539806J859489
41119D073513m23612r89392L71704J028303Q425j095202j045264k05228N85552
41110B308799N67410o36819j930894j363691Q85607J990386M07998j736187j881049
41101a388440n07613N07782Q94327J216800J002878j89655j383042j646420j392376
$$ plain form
41164 -4240151 -3548210 -2304225 -844617 87642 13546 -510652 -655584 -155288 1132231
41155 1132231 3165514 4632716 3859422 1810591 1886285 5114219 7902408 6775677 3171339
41146 3171339 855011 498002 60667 -723884 154807 3165200 5874076 5859386 3133680
41137 3133680 -355063 -2243070 -1314467 1055340 1879898 311047 -1018397 -32331 1383366
41128 1383366 498573 -1644694 -2025847 -690200 -239609 -944874 -325782 2214024 4073513
41119 4073513 3649901 2660509 3032213 4060516 4068941 2973739 1928475 1723247 2308799
41110 2308799 2876209 2239390 308496 -1055195 -169588 1820798 2228796 492609 -1388440
41101 -1388440 -1896053 -1388271 -493944 722856 1725734 1536079 153037 -1493383 -2885759
41092b885759q94532M26784J994834J953396M93448K41070J555448J066077k512830
41083A437936m921200k369309K267590L592072J460088J688P70062J663268J585934
41074E488129J553520J524575K35811j838617k839248k661641k599341k345870
41066c482682o68493J378217J391309l65932j195709j90035R31128J187384J380160
41057C65347J619579Q74270o35877j288416n62817O54539J988262L185794K459607
41048H660288j412490n583629n511492j250249K293483K138273N62909M68753
41040C65846J146186P19861l02810m68643j24402k51122j86037J159168K904960
41031D963007L111157J458505n83417j798320k151862k067171j836061j546286
$$ plain form
41092 -2885759 -3780291 -3353507 -1358673 594723 1088171 1329241 2884689 3950766 1437936
41083 1437936 -3483264 -5852573 -3584983 7089 1467177 1468865 2238927 3902195 5488129
41074 5488129 7041649 8566224 8802035 6963418 4124170 1462529 -1136812 -3482682
41066 -3482682 -4151175 -2772958 -1381649 -1747581 -2943290 -3133325 -2202197 -1014813 365347
41057 365347 1984926 2859196 2223319 934903 372086 1026625 3014887 6200681 8660288
41048 8660288 7247798 1664169 -3847323 -5097572 -2804089 -665816 -102907 365846
41040 365846 1512032 2231893 1929083 1460440 1336038 1084916 898879 2058047 4963007
41031 4963007 8074164 9532669 8949252 7150932 4999070 2931899 1095838 -450448
41023d50448r43209L10174J773738K139658O30343j745131k861817j560144R94196
41014a712640K265553J074704q28969q16721J054181K014827N73547j336303j369348
41005I18831p8598N90636N27686Q96370J479133J043869l00293j404474k135297
40996A537863k862826k613324l72700K229979K449945O12090j71527J175790K119589
40987D104879O72231j554788j884472j84304J492333J545443P2486j505613j531962
40978A226233J44085J443614L98695j958555k778781j300330N06413J149079J066196
40969a03351O88247k66880j005373j0483J848129J504954j511591l402422j361346
40960c620116K063953K583693J40801j772539j436642l12209L18395R43494J727905
$$ plain form
41023 -450448 -1393657 -1083483 690255 2829913 3460256 1715125 -1146692 -2706836 -1712640
41014 -1712640 552913 1627617 798648 -18073 1036108 3050935 3624482 2288179 918831
41005 918831 840233 1430869 1958555 2854925 4334058 5377927 5077634 3673160 1537863
40996 1537863 -1324963 -3938287 -4310987 -2081008 368937 981027 809500 1985290 4104879
40987 4104879 4777110 3222322 1337850 1153546 2645879 4191322 4263808 2758195 1226233
40978 1226233 1370318 2813932 3212627 1254072 -1524709 -2825039 -2318626 -1169547 -103351
40969 -103351 584896 318016 -687357 -697840 1150289 2655243 1143652 -2258770 -3620116
40960 -3620116 -1556163 1027530 1168331 -604208 -2040850 -2353059 -2034664 -1091170 636735
40951F36735J491630k41171j970316k052791p35644M25402M84002r4502j53639
40942b210294Q20227J881356J508555k59412j359759l93545J058588N28589j388834
40933A85471j555981P89605K240562J6669l517584l754078k12872K970850K897426
40924F0068J217618O48821R72320M71464o78244r81518m47956k99565l93663N59104
40914A128449K229606K512625O39119j516452j945781q19846K69477J20407j311658
40905A305946k735296k183200O73350L195086K697146L01467o75516Q9623k52683
40896B415923k261343k581246M05817L046524J517877k265103l264427k14725
40888c200703L284865L722743J121490j931924k744010n86319K300958K724244
$$ plain form
40951 636735 2128365 1887194 -83122 -2135913 -2871557 -2446155 -1962153 -2056655 -2210294
40942 -2210294 -1390067 491289 1999844 1740432 380673 -12872 1045716 1574305 185471
40933 185471 -1370510 -580905 1659657 1676326 -1841258 -5595336 -5808208 -2837358 60068
40924 60068 1277686 1926507 2898827 3370291 2692047 1710529 1262573 963008 569345 1128449
40914 1128449 3358055 5870680 6509799 4993347 3047566 2227720 2497197 2617604 1305946
40905 1305946 -1429350 -3612550 -2939200 255886 2953032 3254499 2578983 2668606 2415923
40896 2415923 154580 -2426666 -2020849 1025675 2543552 278449 -2985978 -3200703
40888 -3200703 84162 3806905 4928395 2996471 252461 -333858 1967100 4691344
40880D691344N20226j175328o74616k01119j795037l577978k857439n45847P17575
40871d898219Q74170J489146K148404J365172j36169m86777m1987m38912j280913
40862a406085r83894N8253L64961L67974J252437J975996R34879n49997r7223
40853A917301J476468J545053J64191p81498j552267l229107l849530j053830
40845e363219K501752K186260p49809p45512K564419L403548l39657l464550k165677
40836b172445K43185j24351j331130r2120K186462K477313J511694J673370K418158
40827F790136J723343k43079k054838l259523l252774r52309K053539J778001
40819B582496j907599l460495K65647M378351K981751j892481l783846j373129
$$ plain form
40880 4691344 5211570 4036242 3361626 3160507 1365470 -2212508 -5069947 -5615794 -4898219
40871 -4898219 -4024049 -2534903 -386499 978673 842504 355727 313740 -125172 -1406085
40862 -1406085 -2389979 -2331726 -1966765 -1598791 -346354 1629642 2564521 2014524 1917301
40853 1917301 3393769 4938822 5103013 4321515 2769248 -459859 -4309389 -5363219
40845 -5363219 -2861467 -675207 -1425016 -2170528 393891 3797439 3457782 -6768 -2172445
40836 -2172445 -1929260 -2053611 -3384741 -3476861 -1290399 1186914 2698608 4371978 6790136
40827 6790136 8513479 8270400 6215562 2956039 -296735 -1249044 804495 2582496
40819 2582496 674897 -2785598 -2519951 1858400 4840151 2947670 -836176 -2209305
40811b209305J194958J657409J517671J482600M00392j302782j633169n79987
40803E27787Q8253L01660J358539K586713K020683O7033j010082q06385n64743
40794D569458n1830J540693K409363K26656l025630l032118k2845J276526p77666
40785C112607k410913j184409J22753r68029j950034Q3204K827034K196907r17780
40776I11340j937943L00761K063860O60052j791807j867861N26076K883300L787915
40767E535693L686138K672465J762l514185m781674k071254J724144K038460j265118
40758D026431l539942j899701Q59422Q57413j007087j000821J206187K086843
40750A588745m8209k439199k012277N25708K248275J906907P12776K25937P76628
$$ plain form
40811 -2209305 -1014347 643062 2160733 3643333 4043725 2740943 1107774 527787
40803 527787 616040 917700 2276239 4862952 6883635 6950668 5940586 5134201 4569458
40794 4569458 4517628 6058321 8467684 8694340 5668710 2636592 2613747 3890273 3112607
40785 3112607 701694 -482715 -359962 -1327991 -3278025 -3194821 -367787 1829120 911340
40776 911340 -1026603 -725842 1338018 1998070 206263 -1661598 -1135522 1747778 5535693
40767 5535693 9221831 11894296 11896058 8381873 3600199 1528945 3253089 5291549 4026431
40758 4026431 486489 -1413212 -553790 303623 -703464 -1704285 -498098 1588745
40750 1588745 1540536 -898663 -2910940 -2385232 -136957 1769950 2482726 2708663 3485291
40741C485291J577898J587574M29263j174340k037167j651833n50195K87473J84640
40732B138604p00722j368485r82295O593M89980M20841O11460P46581m26175k279904
40722a343522k081997R27355L552305K872804L73734p42617m14585o66560j285218
40713A191699m54956J082455P11615j171273j193824J250690K436442J43830k688950
40704A307728k541574l92163O59981L35246M21548Q23072j3205j466222j106707
40695a972296J086057K077946L53242j575611r16604J229056J759236M19862k3490
40686B437398J561731K647551R38883j889442k562907j075243m59811j870977
40678b72817k738609q04494K352827L554513K219947L93713m86050q35521j200785
$$ plain form
40741 3485291 5063189 6650763 7080026 5905686 3868519 2216686 1666491 1953964 2138604
40732 2138604 1437882 69397 -912898 -906305 -416325 4516 615976 1362557 936382 -1343522
40722 -1343522 -3425519 -2498164 1054141 3926945 4300679 3558062 3143477 2476917 1191699
40713 1191699 736743 1819198 2530813 1359540 165716 1416406 3852848 3996678 1307728
40704 1307728 -1233846 -1626009 -966028 -630782 -209234 613838 600633 -865589 -1972296
40695 -1972296 -886239 1191707 1544949 -30662 -947266 281790 2041026 2460888 2437398
40686 2437398 3999129 6646680 7585563 5696121 3133214 2057971 1598160 -272817
40678 -272817 -3011426 -3815920 -1463093 2091420 4311367 4705080 4219030 3383509 2182724
40669B182724j098673m2922J313548J683161N93657q75290j078552J49057R58661
40660C785371p5824j609844j322159K78159K71163k045701l670909k265088N48452
40651f106380K013853K081836K263847K598543K156571J081659p3250j596334
40643D420345l172982l006067p20023Q78529j99026j417272M51065L597520L607166
40634D439255N59504j069886M69914J974692J045340m23147k59625L65416k18525
40625F882938p06927R52126L612417L911637P09306l241065m293901k010554J78341
40616E994318q57358l305682k234123K872565N735373J650925m798752n482546
40608d25280l39914K994392R31466j597329r2832K708010K463066K00035p96880
$$ plain form
40669 2182724 1084051 1041129 2354677 4037838 4631495 3756205 2677653 2826710 3785371
40660 3785371 3709547 2099703 777544 1055703 1326866 -718835 -4389744 -6654832 -6106380
40651 -6106380 -4092527 -2010691 253156 2851699 5008270 6089929 6016679 4420345
40643 4420345 1247363 -1758704 -2478727 -1600198 -1799224 -3216496 -2765431 832089 4439255
40634 4439255 4998759 3928873 4398787 6373479 7418819 6995672 6736047 7101463 6882938
40625 6882938 6176011 7128137 10740554 14652191 15361497 12120432 7826531 5815977 5994318
40616 5994318 5136960 1831278 -402845 2469720 8205093 9856018 5057266 -425280
40608 -425280 -765194 2229198 3160664 1563335 1470503 4178513 6641579 6841614 6044734
40599F044734r09541k175221l392236k106785N16158J352745M89536N46482J826925
40590B192797K178779J161778N42892P40202K82454r39430j090509L16003J286482
40581F671448L79476j298863k005215j550347p77464j87118J62466K42627Q4103
40572A721113j50016j82077L62466J376036J648220Q1410k083738k037779N92644
40563A328279K433180P09421k769126l972095j663605J933722M192206L741815
40555E933797N18873l401800m335730j130110K315865J707076j448813j914880
40547a755722J415235L853678J867650k127845l640433j813584P68077J874151
40539D41207J265129m6114o00348M19402J933681J914827J70732j284101j158802
$$ plain form
40599 6044734 5135193 2959972 -432264 -2539049 -2022891 -670146 -180610 365872 2192797
40590 2192797 4371576 5533354 6076246 6816448 7098902 6159472 5068963 5384966 6671448
40581 6671448 7050924 5752061 3746846 2196499 1419035 1231917 1394383 1637010 1721113
40572 1721113 1571097 1389020 1751486 3127522 4775742 4857152 2773414 735635 1328279
40563 1328279 3761459 4470880 1701754 -2270341 -3933946 -2000224 2191982 5933797
40555 5933797 6452670 3050870 -1284860 -2414970 -99105 1607971 159158 -1755722
40547 -1755722 -340487 3513191 5380841 3252996 -387437 -2201021 -1432944 441207
40539 441207 1706336 1660222 1059874 1479276 3412957 5327784 5498516 4214415 3055613
40530C055613l65387J22410P62022J653928J397756o22193k569989k551184j223195
40521c40219l37270j16628J39741K58318n2606N1985J018183J404196J54137r92333
40511A187504j7807J676924J293588n07309n32319J335109J624546p82040k360966
40502B917230n02683K290118K400593L40224j017984j087116j188356j319987
40494B832039o72711r9466p95018j568787p30858L78813n25990j984388o52752
40485c819118K380395K297901j460982l294917L8875L950326K868050j381144
40477A579386k794073j94198K138040J685858N49943Q59648J538459Q13437r60283
40468E216217k154175j705133L27714K456293K303687n99044l138688k204747
$$ plain form
40530 3055613 2690226 2812636 3574658 5228586 6626342 6004149 3434160 882976 -340219
40521 -340219 -677489 -794117 -654376 -396058 -448664 -396679 621504 2025700 2179837 1187504
40511 1187504 1169697 2846621 4140209 3632900 3100581 4435690 6060236 5278196 2917230
40502 2917230 2414547 4704665 7105258 7445482 6427498 5340382 4152026 2832039
40494 2832039 2159328 2059862 1264844 -303943 -1034801 -655988 -1181978 -3166366 -3819118
40485 -3819118 -1438723 859178 -601804 -3896721 -3857846 92480 2960530 1579386
40477 1579386 -1214687 -1408885 729155 2415013 2964956 3824604 5363063 6176500 5216217
40468 5216217 3062042 1356909 1684623 4140916 6444603 5845559 2706871 502124
40460E02124O36331J136516j181332k270106K6354K596466J929462p88202j953436
40451F34177p27949O87148O43642m09910j279600j161963P7192J521147J702463
40442A686347M22659p32237n05340M39811R03617R01525R18660N84261n41166
40433D078137j670446j575556j93112J406583K096963J266418p10558k107464
40425B590965j286339Q84004J679181L85270n56366L81771R97659r87065l489781
40416E99299k662723J047749L138031J493931r20501r18610M79088M94210q32436
40407A918038j225324k50757L6882j257406j955689J33938L583746M618418J922892
40398G524738j491882k080038k32326O16267j054491k783779j763722J121032
$$ plain form
40460 502124 1138455 2274971 1093639 -1176467 -1150113 1446353 3375815 2587613 634177
40451 634177 -93772 593376 1237018 827108 -452492 -1614455 -1537263 -16116 1686347
40442 1686347 2109006 1376769 871429 1311240 2214857 3116382 4035042 4619303 4078137
40433 4078137 2407691 832135 639023 2045606 4142569 5408987 4698429 2590965
40425 2590965 1304626 2188630 3867811 4253081 3696715 4078486 5076145 4089080 599299
40416 599299 -2063424 -1015675 2122356 3616287 2695786 1777176 2256264 2750474 1918038
40407 1918038 692714 441957 478839 -778567 -2734256 -2600318 983428 5601846 7524738
40398 7524738 6032856 3952818 3720492 4336759 3282268 498489 -1265233 -144201
40390a44201K514017J078307j083612j591534o93836j64109m28685j96708J217353
40381E06992K502500J938476k82743k206219k443248j485049n11131K16007J118423
40372f45992K061699K256671J357826M8211o06434j83523O53212P28355l06293
40363E363732j318340j053942k2358J27133p96522j157303k79962K90278m92919
40354F59797j106771Q3017J951162K397274J598256J028053N36984p05676j425026
40345E017070K22344K889621L449954K045156J811829L131052K409767j920685
40337A9056108o139072o274285l227102l88003J038414J593486R39708j110057
40329E489197k566259j386802J255588K409907J344463j44683p28666o36080j94438
$$ plain form
40390 -144201 2369816 3448123 2364511 772977 79141 -84968 -513653 -710361 506992
40381 506992 3009492 4947968 4665225 2459006 15758 -1469291 -1980422 -1764415 -645992
40372 -645992 1415707 3672378 5030204 5078415 4471981 4288458 4941670 5670025 5363732
40363 5363732 4045392 2991450 2969092 3096225 2299703 1142400 862438 1152716 659797
40354 659797 -446974 -363957 1587205 3984479 5582735 6610788 7147772 6442096 5017070
40345 5017070 5239414 8129035 11578989 13624145 15435974 18567026 20976793 19056108
40337 19056108 12917036 6642751 3415649 3027646 4066060 5659546 6599254 5489197
40329 5489197 2922938 1536136 2791724 5201631 6546094 6401411 5672745 5036665 4842227
40320D842227O53874J446441J361237K90176j148241k255129k302775r25706P85685
40311B747789Q84744p53177j793305o42546J291196J924954J372083P22061l48743
40302E405056k411445l920694k612276J072642M016711L849003J008660k210776
40294D196881l517844k159920K80903J304373M42929l89806j13066J678p71445
40285g25317p37667J040329K150221M25715j881306j179775J585254K282544K98638
40276C258636n51091J536899L244221J377316k081651k889417n38474J483384
40268D839823P16896j414594k070974o23088J148415J712924J399075J146684
40260F855161P91976l42453j749319k060133j007562K68988R10069J010077P19744
$$ plain form
40320 4842227 5496101 6942542 8303779 8593955 7445714 5190585 2887810 1962104 2747789
40311 2747789 3632533 2879356 1086051 443505 1734701 3659655 5031738 5753799 5405056
40302 5405056 2993611 -927083 -3539359 -2466717 1549994 5398997 6407657 4196881
40294 4196881 679037 -1480883 -1199980 104393 547322 157516 44450 46128 -725317
40285 -725317 -1462984 -422655 1727566 2153281 271975 -907800 677454 2959998 3258636
40276 3258636 2707545 4244444 7488665 8865981 6784330 3894913 3356439 4839823
40268 4839823 5556719 4142125 2071151 1448063 2596478 4309402 5708477 6855161
40260 6855161 7647137 7304684 5555365 3495232 2487670 2756658 3666727 4676804 5396548
40251E396548K12820K99525J210825J240520q95464k882879j458196J899399K333701
40242G356799o34726j896161P85589K693784N7074l279206k097297J623565K354136
40233F963557M7479r20777K02962J54707j627654k204566r66481m77829j188718
40224a7320p09590J114845J598193L85350J88685J475040J429670n92666j500733
40215C371474J09494J605664J112756K37074J90864m35836j950173j817182R23296
40206C347431L262747K716124Q22961j26384n29671j312262j531998n71199J13013
40197F190762l98017p98541k40062J73835J9522L75948P46113p80171k781018
40188B508371r52481M175068N558508k07189o301455m844236J512793L788820
$$ plain form
40251 5396548 5609368 5908893 7119718 8360238 7464774 4581895 3123699 5023098 7356799
40242 7356799 6722073 4825912 5611501 8305285 8362359 5083153 2985856 4609421 6963557
40233 6963557 7011036 6090259 6293221 6447928 4820274 2615708 1649227 1171398 -17320
40224 -17320 -726910 387935 1986128 2371478 2560163 4035203 5464873 4872207 3371474
40215 3371474 3480968 5086632 6199388 6436462 6627326 6191490 4241317 2424135 3347431
40206 3347431 6610178 9326302 10149263 10022879 9493208 8180946 6648948 6077749 6190762
40197 6190762 5792745 4994204 4754142 4927977 4947499 5323447 6069560 5289389 2508371
40188 2508371 1555890 5730958 11289466 11082277 4780822 -63414 1449379 5238199
40180E238199j85259l918523k692492R00519K621368K149425J213594L51406m29104
40171E249133n31752J00025N69935M69627J53353m20248j309979j400827K36098
40162C115365K099795J786522l12144j309314n3558J325900P33479j034492j661549
40153D690004k61371J769054K232661L89136j908729k013585O6312J370675J58416
40144F492573j441991p99429R97623R83024q55103j747332o86478L80566J18924
40135C442377l43211J60364R97388J252827J135442J015021O92683L01783L68753
40126I023427M39445o21945k255893j997458J092441M257202L944424J52201l568394
40117A0465450m155886j865604Q69164K163866J794513N47794m98698l60074R98039
$$ plain form
40180 5238199 5052940 1134417 -1558075 -657556 1963812 4113237 5326831 5678237 5249133
40171 5249133 4717381 4817406 5387341 5856968 6010321 5590073 4280094 2879267 3115365
40162 3115365 5215160 7001682 6689538 5380224 5326666 6652566 7386045 6351553 4690004
40153 4690004 4428633 6197687 8430348 8819484 6910755 4897170 4963482 6334157 6492573
40144 6492573 5050582 4251153 5248776 6231800 5376697 3629365 2942887 3323453 3442377
40135 3442377 3099166 3259530 4256918 5509745 6645187 7660208 8352891 8654674 9023427
40126 9023427 9462872 8840927 6585034 4587576 5680017 9937219 13881643 14033844 10465450
40117 10465450 6309564 4443960 5313124 7476990 9271503 9819297 9320599 8960525 9958564
40108I958564J990538Q74379j535700k164879K2420J750185j43472l340485k642036
40099D769514K247046N582893L454186j003313k572576r54157L10045l51067j293580
40090A0188991j100163j31880R70132J942260K360900K242612K546846L493559
40082B2513257L424849J093687k110713m067257m637872m481618k981433m1666
40074H711234J798473M26729j935095j589997P41204R84993j569350k984939q28869
40065C754383K408439L421182K214467N76954n74547p26025O13670K206555J616519
40056A5511597r15407j840879M91601K751987J366385j988187k833952l64502
40048A2178643J900468J405469n76270j603521j082180Q9920J076457J404888
$$ plain form
40108 9958564 11949102 12823481 11287781 9122902 9145322 10895507 10752035 7411550 4769514
40099 4769514 7016560 12599453 16053639 15050326 12477750 11523593 11833638 11482571 10188991
40090 10188991 9088828 8956948 9927080 11869340 14230240 16472852 19019698 22513257
40082 22513257 25938106 27031793 24921080 20853823 16215951 11734333 8752900 8711234
40074 8711234 10509707 10936436 9001341 7411344 8152548 9137541 7568191 4583252 3754383
40065 3754383 6162822 9584004 11798471 12375425 11800878 11074853 11688523 13895078 15511597
40056 15511597 14596190 12755311 13246912 15998899 17365284 15377097 12543145 12178643
40048 12178643 14079111 15484580 14908310 13304789 12222609 12312529 13388986 14793874
40040A4793874Q00112n25420j842135k391824j749367j47910J141296O23318j275059
40031I426885j799280Q28898M298040M473367Q69230k392102j986515L92964J024909
40022A5136396k92772m39228J756440L524470K381617k46892j502865j258489
40014A9058677j294779j544285k42863K319997L331303J551899q30020j709943
40006B0639986j892190k649962k891419j276215P16706Q22050j69917J68340J434197
39997A4901576R94209r95320j149121J494927L219155J217634j789795j623610
39989A6269655J044052K182668R10763L70432K032930L128181J216958j802604
39981B5353035k519784p84261P88863Q33552L09155J53214J67278K27413O47784
$$ plain form
40040 14793874 15593986 15068566 13226431 10834607 9085240 8937330 10078626 10701944 9426885
40031 9426885 7627605 8456503 12754543 17227910 18097140 15705038 13718523 14111487 15136396
40022 15136396 14843624 14404396 16160836 19685306 22066923 21820031 20317166 19058677
40014 19058677 17763898 16219613 15976750 18296747 21628050 23179949 22349929 20639986
40006 20639986 18747796 16097834 13206415 11930200 12646906 13468956 13299039 13467379 14901576
39997 14901576 15895785 14900465 13751344 15246271 18465426 19683060 17893265 16269655
39989 16269655 17313707 19496375 20407138 20777570 22810500 25938681 27155639 25353035
39981 25353035 22833251 22048990 22837853 23671405 23980560 24133774 24301052 24528465 25176249
39972B5176249J085767P07115k85447p13629j47696Q41545K026825L391683M009786
39963C6092198L553947M673307J0044691J6006497J3792175O12962j3993512j7775552
39955E3006713r976337r30346J688415M94915J319675M249662N285228L388898
39947E8526823J470433J396395J626645K75911j838892k444688j139517j42951
39939E7730159j440776m116538n664168n470035n064453m761825k763287J071343
39931B9520420L425874J982399p47142j123317K13071K76452p41919j95643J868837
39922C4479032K745812J737981N66381l46530j660621j879262P79866L780373
39914D0203032K946624m39322j113600J459802K421561L52301m10521J843596
$$ plain form
39972 25176249 26262016 26969131 26683684 25970055 25822359 26663904 28690729 32082412 36092198
39963 36092198 39646145 44319452 54364143 70370640 84162815 84775777 70782265 53006713
39955 53006713 43030376 42100030 43788445 44283360 45603035 49852697 55137925 58526823
39947 58526823 59997256 61393651 63020296 63296207 61457315 59012627 57873110 57730159
39939 57730159 56289383 52172845 46508677 41038642 35974189 31212364 28449077 29520420
39931 29520420 32946294 34928693 34181551 33058234 33271305 33547757 32805838 32610195 34479032
39922 34479032 37224844 38962825 39529206 39182676 37522055 35642793 36422659 40203032
39914 40203032 43149656 42710334 41596734 43056536 45478097 45830398 45419877 47263473
39906D7263473K841863L36328j530673M21073L214287L843958M217284N751261
39898F6358854N519994K440086Q11161K908605N109424O470070J2392786K2345422
39890A24356402K3398084P210875j3766489k0251022j1667069l855906m068673
39883A01356202l757746K859237Q731178P774013N742332R376863J4240244J2326414
39875A58648737N658875L513130Q871066J4619564J2521811J519311j2480357
39868A92872137k2178417k4405603k1499407j7304496j2879392p828878l827753
39861H2948191k898499l330616j921062L04501l75312l336349l725417l65386
39853F7300051K037369K27987l031700l786484k046692q8440Q52280M96563q35465
$$ plain form
39906 47263473 50105336 50441664 48910991 49332064 52546351 56390309 60607593 66358854
39898 66358854 71878848 74318934 75130095 78038700 83148124 89618194 102010980 124356402
39890 124356402 147754486 154965361 141198872 120947850 109280781 105424875 101356202
39883 101356202 97598456 100457693 109188871 116962884 122705216 132082079 146322323 158648737
39875 158648737 164307612 167820742 176691808 191311372 203833183 205352494 192872137
39868 192872137 170693720 146288117 124788710 107484214 94604822 86775944 82948191
39861 82948191 80049692 76719076 74798014 75102515 74727203 71390854 67665437 67300051
39853 67300051 69337420 69565407 66533707 62747223 60700531 60612091 61464371 61960934 61125469
39844F1125469j456927J296J958427K053060J422800K965021O028261P348574
39836H1445981O696770O707438P615432P362199O354548O517979O325309L044153
39828A32069809o56430O23508N884173Q820346Q354899R898895J4957896J8115034
39820A98068130J6955017J7111924K4053206L5961381M6600200M8896045L5585321
39813D23231224N472063k9062744n0043584n2200413m5234629l7364160k7902483
39806A86895274j7752816j3150261j3742143j0369226j180297L522827l16404
39799A33906954k154187M085746R175098R124300J8051211M1439507N3205566
39792B66834195K6195870k3327276n0471081l9276193j7814224j2869437j7627159
$$ plain form
39844 61125469 59668542 59669838 61628265 63681325 65104125 68069146 74097407 81445981
39836 81445981 88142751 94850189 102465621 109827820 116182368 122700347 129025656 132069809
39828 132069809 131413379 132036887 137921060 146741406 155096305 164995200 179953096 198068130
39820 198068130 215023147 232135071 256188277 292149658 338749858 387645903 423231224
39813 423231224 428703287 399640543 349596959 297396546 252161917 214797757 186895274
39806 186895274 169142458 155992197 142250054 131880828 130700531 134223358 133906954
39799 133906954 131752767 135838513 145013611 154137911 172189122 213628629 266834195
39792 266834195 293030065 269702789 219231708 179955515 162141291 149271854 131644695
39785A31644695j4800731o980276o399125j1127696j0326123l915735p31642k596137
39777G4767230l913831l438661m473701n739820k775693K746495M537288K011380
39769F3720687N81779J721654J112978k210413l016952J001940M439310K957329
39761G0308312R78957M477409J0372258J1397198J0077780J7374844L3485170
39754A58471928L9958318K1038010j2220147l1632110k5544243j0467196o034348
39747A33570212j1221272j3196150q640497m275677k780709p14735K642525N341688
39739A00725385R147987J5150279J5501885J879550j8357073k7353824j9908308
39732G6785881r256580o738681q050596n084763J44375J471317k80211q07611
$$ plain form
39785 131644695 116843964 109863688 103464563 92336867 82010744 78095009 77363367 74767230
39777 74767230 70853399 67414738 62941037 57201217 54425524 57172019 61709307 63720687
39769 63720687 64302466 66024120 67137098 64926685 61909733 62911673 67350983 70308312
39761 70308312 71287269 75764678 86136936 97534134 107611914 124986758 158471928
39754 158471928 198430246 219468256 207248109 175615999 150071756 139604560 133570212
39747 133570212 122348940 109152790 100512293 96236616 93455907 92741172 95383697 100725385
39739 100725385 109873372 125023651 140525536 142405086 124048013 96694189 76785881
39732 76785881 67529301 60790620 52740024 47655261 47799636 49270953 48990742 48183131
39724D8183131p73885k667846l996898j246359K852483K987513k59422j721558
39716D3357159L38113K785587K932750J004256j672806l659249l724913k483646
39708C8877251k068020k681969k119314n1393Q29069l23170o88176R49351J688761
39699C4412390Q8509n27818K102657M674041L771240J534743J359603K026104
39691D9441469J106980M61212K811106O049345O835024P157549J0821434J5074772
39683I9758891J2721636K785634o997813r735331o798251m018210m043182m591921
39675G9081453k467835K200229N422044L439398k170469n175284j913835M045859
39667H2461560O466760L700233j136517n298925q309370r675715q334502m846290
$$ plain form
39724 48183131 47409246 44741400 40744502 39498143 42350626 45338139 45078717 43357159
39716 43357159 43695272 46480859 49413609 50417865 48745059 45085810 41360897 38877251
39708 38877251 36809231 34127262 32007948 31956555 32785624 32462454 31774278 32723629 34412390
39699 34412390 34500899 33973081 36075738 40749779 44521019 46055762 47415365 49441469
39691 49441469 50548449 51009661 53820767 59870112 66705136 73862685 84684119 99758891
39683 99758891 112480527 115266161 108268348 98533017 91734766 87716556 83673374 79081453
39675 79081453 76613618 78813847 84235891 87675289 85504820 80329536 78415701 82461560
39667 82461560 88928320 92628553 91492036 86193111 77883741 68208026 59873524 55027234
39659E5027234j736010q71014j674305k135752q69639J681905L732325M152319
39651E7307063L624100K880116Q78931l077385o444042n991989k864196j201196
39643D5111402j724850j195362J186044J984700k90360k317015j517522L28623
39635D1565660J413487K875842M829717M713055K644641K842153O308811Q339034
39627G5532400P292454Q436594J3466116J4801696R178698Q529904K3815891M2545655
39619B03599408L8682336O796773k7862519l8909173k7182988j2478351o484598
39612A36160888m282048J949816J1630179J9336603K3084592K6153298L2621835
39605B46655163M1752293M5889636L5329092P955755k5850613m9968399n5338152
$$ plain form
39659 55027234 53291224 52420210 50745905 48610153 47740514 49422419 53154744 57307063
39651 57307063 60931163 63811279 64690210 61612825 55168783 49176794 46312598 45111402
39643 45111402 43386552 42191190 43377234 45361934 45071574 42754559 41237037 41565660
39635 41565660 42979147 45854989 50684706 55397761 58042402 60884555 67193366 75532400
39627 75532400 82824854 91261448 104727564 119529260 128707958 137237862 161053753 203599408
39619 203599408 242281744 249078517 221215998 182306825 155123837 142645486 136160888
39612 136160888 131878840 133828656 145458835 164795438 187880030 214033328 246655163
39605 246655163 288407456 334297092 369626184 377581939 351731326 301762927 246424775
39598B46424775m6111185l3735624k6096235k2688677j9101982j3889009r539440
39591G5262623p943707p725633o675160m592086k660293j802391k518772m422255
39583C6922326n263229k914332Q57859J721324q91491k514937o77494J053144
39575B8293170p37725l199067j805932K112025L581925J735244K94870J359068
39567C1633578L152966L538888K471315J783527M691648J2791633K0697034J7990308
39559I8750897J798921j6169585k1686222j4547869o202158l300456k201114P78156
39551C7220570L086554K246820O92251Q12293R57725m30994j557497r16053Q3655
39542D2195324M38223J372560K902973K814072R37343J59403J322656J541453
$$ plain form
39598 246424775 200313590 166577966 140481731 117793054 98691072 84802063 75262623
39591 75262623 67318916 59593283 52918123 48326037 45665744 43863353 41344581 36922326
39583 36922326 31659097 28744765 29602624 31323948 30432457 27917520 27240026 28293170
39575 28293170 27555445 24356378 22550446 24662471 28244396 29979640 30274510 31633578
39567 31633578 34786544 38325432 40796747 42580274 47271922 60063555 80760589 98750897
39559 98750897 100549818 84380233 62694011 48146142 41943984 38643528 36442414 37220570
39551 37220570 40307124 42553944 43246195 44058488 45016213 44585219 43027722 42111669 42195324
39542 42195324 42633547 44006107 46909080 49723152 50660495 50819898 52142554 53684007
39534E3684007m75346j999136j318637n56287j047139o30356J593315K428693
39526E1679114j09397k853632k475011o41377m58006j256533r39447n28846k204483
39517D0212382n013867o327013n805671m704661l055296o30200J038212O08862
39509A6322748n74849n56201J70946M1317o95919p36853J8156Q20129J309922
39500A6119396J202208N63710J065438M241346P991816Q635267P188031Q374455
39492E5381667J1489858Q688495l302131j5676918j7997868j1753686o492154
39485B0337263n714018m657859p61629K045053O93027k153816k863897j535242
39477E388882J32148J621665K452566J705672K11595J33667J278599J008148j177162
$$ plain form
39534 53684007 53208661 51209525 49890888 49334601 48287462 47657106 49250421 51679114
39526 51679114 51569717 48716085 46241074 45599697 45141691 43885158 42945711 42416865 40212382
39517 40212382 35198515 28871502 23065831 18361170 15305874 14675674 15713886 16322748
39509 16322748 15747899 15191698 15362644 15403961 14708042 13971189 13989345 14809474 16119396
39500 16119396 17321604 17885314 18950752 23192098 31183914 39819181 47007212 55381667
39492 55381667 66871525 75560020 72257889 56580971 38583103 26829417 20337263
39485 20337263 14623245 9965386 9203757 11248810 11941837 9788021 6924124 5388882
39477 5388882 5521030 7142695 9595261 11300933 11512528 11646195 12924794 13932942 12755780
39468A2755780k407318j099559O12033Q19109Q83748K330691L697425L255237
39460B0847146K555114M137313P034982P520812L938526j404237m981363n072495
39452C4575798k412373O17959J670683O39921p5416J270050K940714J833907j871290
39443C9189953m542476m179154l178997m276445n837525m227950O880J987217
39435A4941503p26540m490704m566956j155806J971569K769991J947898L18758
39427A1009713j489716j629855J040692L926816L216856m32951k446406j091298
39419A2103851K59991j115052l222073l158054j532368m22167K42339J318914
39411D475381J755615L28746j533606j567659j82621M18476k68479p44560l1193
$$ plain form
39468 12755780 10348462 9248903 9860936 10680045 11563793 13894484 17591909 20847146
39460 20847146 23402260 27539573 34574555 42095367 46033893 44629656 39648293 34575798
39452 34575798 32163425 32781384 34452067 35091988 35016572 36286622 39227336 41061243 39189953
39443 39189953 34647477 30468323 27289326 23012881 17175356 12947406 12954286 14941503
39435 14941503 14214963 9724259 5157303 4001497 5973066 8743057 10690955 11009713
39427 11009713 9519997 7890142 8930834 12857650 16074506 15641555 13195149 12103851
39419 12103851 12363842 11248790 8026717 4868663 3336295 2914128 3156467 4475381
39411 4475381 6230996 6559742 5026136 3458477 3275856 3694332 3425853 2681293 2650100
39402B650100J407469K641062K741915J201696r18230j550410m79030R3144q87885
39393F899831j396596K65675K508936L210189L093635L525871L125256P7320l713468
39384A7596649m567296k356358l95959m86007j407936k065019k688748k774956
39376H54370j116991J502318K523720J244685k73178n49166m12990o36054m20546
39367B716168N35367P98502l40604j068225K93478K127638J381337j747570l379909
39358A316182j126334K142526J772730k069919m055920r14991L731108M277635
39350E073017Q71372j414558k16378J608492J431150M36913L20718L56444j35832
39341H331338J65058J724022K394083Q98676p25040l41279J440588L442548N582129
$$ plain form
39402 2650100 4057569 6698631 9440546 10642242 9724012 8173602 7694572 7787716 6899831
39393 6899831 5503235 5768910 8277846 11488035 14581670 18107541 21232797 21310117 17596649
39384 17596649 13029353 10672995 10277036 9791029 8383093 6318074 3629326 854370
39376 854370 -262621 1239697 3763417 5008102 4734924 4185758 3772768 3136714 2716168
39367 2716168 3251535 4050037 3709433 2641208 2934686 5062324 6443661 4696091 1316182
39358 1316182 189848 2332374 4105104 2035185 -2020735 -2935726 795382 5073017
39350 5073017 5944389 4529831 4313453 5921945 7353095 7790008 8110726 8467170 8331338
39341 8331338 8496396 10220418 12614501 13513177 12788137 12446858 13887446 17329994 22912123
39332B2912123O762030N552146M921524J0200044J8617697J7956215K366517j6330955
39324G2957341k1794673j3615579n266232m411419n969314m423904j998987j866252
39316A3610981k354694j801925j973026l070020j843883J894926L196857P546
39308G666762k847898j586969O90181M55279M5570K226355L889903J320226k551401
39299I308008k496289P34003K641885K653056L259859L755427J386627k470409
39291A8772167l575084j768339q31948j618429j160857R65075J250555j382125
39283A0651015l158816j587153N59587R9829j536907j327054K19942M38317q02351
39274C556409j209669j04762P10675J91903l97382Q9518O80143R436j229976j252869
$$ plain form
39332 22912123 29674153 35226299 40147823 50347867 68965564 86921779 89288296 72957341
39324 72957341 51162668 37547089 32280857 27869438 21900124 17476220 15477233 13610981
39316 13610981 11256287 9454362 7481336 4411316 2567433 4462359 7659216 7666762
39308 7666762 4818864 3231895 3922076 4377355 4422925 6649280 10539183 11859409 9308008
39299 9308008 6811719 7545722 10187607 12840663 16100522 19855949 21242576 18772167
39291 18772167 15197083 13428744 12596796 10978367 9817510 10782585 12033140 10651015
39283 10651015 7492199 5905046 6464633 6564462 5027555 3700501 3920443 4358760 3556409
39274 3556409 2346740 2241978 2952653 3144556 2747174 2836692 3516835 3526271 2296295 1043426
39264A043426n7427N66651N9785K0547J130631J316677r93850l552114l107809
39255c573483m56643P70168m3301J88740K528379L764764J667284j153028j170201
39246B522679J101584K721366K514299J027468j488865m223044m840891k359087
39238c024491N29746Q30827n01191n65401O75594Q80325l15893q25778K57162
39229b059100J504644J675223R79395j01741j155390j282201j63458Q49068O05428
39220H51868J88985R23242J584576L54988j541278j415258L39619P77460p30452
39211A333750j737073j065398l38593m71691q5539J410041K278490J466890M16982
39202C207859L33931J97056p98977j210766J71202J720664J138628j017094k103996
$$ plain form
39264 1043426 985999 1552650 1612435 1632982 2763613 4080290 3086440 -465674 -3573483
39255 -3573483 -4030126 -3259958 -3303259 -3114519 -586140 3178624 4845908 3692880 2522679
39246 2522679 3624263 6345629 8859928 9887396 8398531 4175487 -665404 -3024491
39238 -3024491 -2494745 -1663918 -2165109 -2730510 -2054916 -1174591 -1490484 -2316262 -2059100
39229 -2059100 -554456 1120767 2100162 1998421 843031 -439170 -602628 246440 851868
39220 851868 1040853 1964095 3548671 3903659 2362381 947123 1286742 2064202 1333750
39211 1333750 -403323 -1468721 -1807314 -2279005 -2364544 -954503 1323987 2790877 3207859
39202 3207859 3541790 3738846 2939869 1729103 1900305 3620969 4759597 3742503 1638507
39193A638507j040315O17932J045495K91427r1805R78237K608061K659006M76758
39184I183303j747213j584019K13636P41042q11723k191025j688737l35976L99022
39175B178310P94734J318528R15831j156879l162109k719798k01142J652234J369947
39166I89656L22539L15167J002642O99365p95319j496208K0559K070632J625214
39157D754247j378764l441915k143124N55816J338563J37308o38809j22851N95151
39148c44378J185615K093547K299825L88164k211646k480795n52573L85948n95786
39139A67921r10209N44169J392560M64993Q1895J265119J117756j694811l160685
39130g31292n8655L793043K807634j533712l095191p26537Q99553k75276r68381
$$ plain form
39193 1638507 598192 1216124 2261619 2553046 2461241 3439478 6047539 8706545 9183303
39184 9183303 7436090 5852071 6065707 6806749 5995026 3804001 2115264 1779288 2178310
39175 2178310 2973044 4291572 5207403 4050524 888415 -1831383 -2032525 -380291 989656
39166 989656 1312195 1627362 2630004 3329369 2534050 1037842 1058401 3129033 4754247
39157 4754247 3375483 -66432 -2209556 -1653740 -315177 -177869 -816678 -939529 -344378
39148 -344378 841237 2934784 5234609 5622773 3411127 930332 377759 763707 167921
39139 167921 -742288 -198119 1194441 1659434 1741329 3006448 4124204 2429393 -731292
39130 -731292 -789947 3003096 5810730 4277018 1181827 455290 1354843 1079567 111186
39121A11186N91752J183597j482082m279381l351051L32373L179215L808326K815065
39112B909000M66077k283050k832510k83889K147347J347957p89856l52379K067296
39103B395993K199597p95969k667710p29375J896954J169411j725820k400836
39095f57755Q5714K070296P94219j805250j991192Q29941L620892L495679O63318
39086G105862k308055l115337j407887J252236K622074J613571n27500j419904
39078C815060m80916J76579j178346k907719k119538O18412J517865o43437k044599
39069c246639N37678M169933L580383p46192k879501k80596K379078M98192l368551
39060F43785l542415K14269K798614J548533p25805j007769j08580K05652M99724
$$ plain form
39121 111186 702938 1886535 404453 -3874928 -7225979 -6893606 -3714391 93935 2909000
39112 2909000 3375077 1092027 -1740483 -2024372 122975 1470932 681076 328697 2395993
39103 2395993 4595590 3799621 1131911 402536 2299490 3468901 1743081 -657755
39095 -657755 -572041 1498255 2292474 487224 -1503968 -674027 2946865 6442544 7105862
39086 7105862 4797807 1682470 274583 1526819 4148893 5762464 5234964 3815060
39078 3815060 3334144 3510723 2332377 -575342 -2694880 -2076468 -558603 -1202040 -3246639
39069 -3246639 -2708961 1460972 5041355 4295163 1415662 1135066 3514144 4012336 643785
39060 643785 -2898630 -2684361 114253 1662786 936981 -70788 -179368 26284 526008
39051E26008J581102J904017O2184k052244j772731n6276K4660j487506j411188
39042b681974J079288K627656Q11244j982060k044201M08050K033638J198695
39034A450336m93207j043663k28415J161608K469111L122846K667704J320205
39026A0426525j96237j462184k377601k594298j872462r07590p50724j279176
39018a013747j234516o7282J137505J019791l81150j705957j659386j77068J421412
39009b660398J522219l4646j508968j272659M0374M72288l75112q96984j42464
39000d856350Q21376J011550J288432K552123L522733K305456m94349k293357
38992C857614k036675j162067q04244j48116J466262K613003J593645q31619k232348
$$ plain form
39051 526008 2107110 4011127 4073311 2021067 248336 192060 216720 -1270786 -2681974
39042 -2681974 -1602686 1024970 1836214 -145846 -2190047 -1781997 251641 1450336
39034 1450336 957129 -86534 -314949 846659 3315770 6438616 9106320 10426525
39026 10426525 10230288 8768104 6390503 3796205 1923743 1016153 265429 -1013747
39018 -1013747 -2248263 -2315545 -1178040 -158249 -539399 -2245356 -3904742 -4081810 -2660398
39009 -2660398 -1138179 -1172825 -2681793 -3954452 -3914078 -3441790 -3816902 -4713886 -4856350
39000 -4856350 -4034974 -3023424 -1734992 817131 4339864 6645320 6150971 3857614
38992 3857614 1820939 658872 -145372 -293488 1172774 3785777 5379422 4547803 2315455
38983B315455j652708m75136j72984n63447o74094l15052j37432o14410j455768
38974c745576j875990j307264j9231J058262J397032J454413J685457J449959
38966I7062q773j669073j363322J127413L066889K037326q33163k426816j741793
38957a714250o16875m94415n10712M57742J561405J199407m57850j634224j304724
38948c514496j57184P31889J093738J173082J124495J016200Q27016K48772r03964
38939A639548j955429j820198n33239M82775K71350l01507O1690R60320Q44719
38930c49971m68466j306480o13516M17985J40859j108243j629893q40377K70552
38921e487550R06039J172028R62918j76243j525395j228967J027814K854282K192033
$$ plain form
38983 2315455 662747 187611 14627 -548820 -1222914 -1537966 -1675398 -2289808 -3745576
38974 -3745576 -5621566 -6928830 -6948061 -5889799 -4492767 -3038354 -1352897 97062
38966 97062 88289 -1580784 -2944106 -1816693 1250196 3287522 2454359 27543 -1714250
38957 -1714250 -2331125 -2825540 -3336252 -2878510 -1317105 -117698 -575548 -2209772 -3514496
38948 -3514496 -3671680 -2939791 -1846053 -672971 451524 1467724 2294740 2543512 1639548
38939 1639548 -315881 -2136079 -2669318 -2186543 -1915193 -2216700 -2155010 -1194690 -349971
38930 -349971 -818437 -2124917 -2738433 -2320448 -2179589 -3287832 -4917725 -5758102 -5487550
38921 -5487550 -4581511 -3409483 -2446565 -2622808 -4148203 -5377170 -4349356 -1495074 696959
38912F96959K83711l27451K36034k08978j685465j534294J087508L138334J965509
38903C651867o67608j286180J87150Q92248k48323j322712r61126k13883k10452
38894a79019l84452o9595K02420J39408N01481J232076P68989j173019k148445
38885a110156n02424J455799O60458j636439j535996J143979K113139q35480m123349
38876d370469l343821P61608L889792L917362K253666N34816j062158k254026
38868C26770j966430n920K103021K651304J307342r48372k602801k498635r51512
38859b585233K47098l0395n99886J62706J405941Q09986j581808k884647j344770
38850f401008J330910K599367K149555J164135K66388l40194j45474P07289R37619
$$ plain form
38912 696959 980670 653219 889253 680275 -1005190 -2539484 -1451976 1686358 3651867
38903 3651867 2984259 1698079 1885229 2777477 2529154 1206442 245316 31433 -179019
38894 -179019 -563471 -633066 -430646 -291238 210243 1442319 2211308 1038289 -1110156
38885 -1110156 -1612580 -156781 503677 -1132762 -2668758 -1524779 588360 -247120 -4370469
38876 -4370469 -7714290 -6952682 -3062890 854472 3108138 3642954 2580796 326770
38868 326770 -1639660 -1645580 457441 3108745 4416087 3467715 864914 -1633721 -2585233
38859 -2585233 -2338135 -2368530 -2968416 -2805710 -1399769 -589783 -2171591 -5056238 -6401008
38850 -6401008 -5070098 -2470731 -321176 842959 1109347 769153 623679 1330968 2268587
38841B268587K6834o57537j05628M11502m94173j648980j109951M56466Q03073
38832d9807j78481n53145J11937J73027r12236j607522j082754m20780k84716
38823d804477J80236J211221J561896Q14805K76880N01474L12602n19881k92063
38814g57307J400078K277289J280122Q84921K716658L730688N96213m265115n504838
38805B358709k558679R7975M7295m78795L24706Q27528l30271j497695j175792
38796b385019o71563j238810j425418J00979J535791P18596r28099m34992J862752
38787b865783K715638R02157j106704q71740Q49702J559990K78285j600106k172648
38778b311209j132765J19647L95908J87227N55330J235404J266664R98651J390880
$$ plain form
38841 2268587 2295421 1637884 1532256 1943758 1449585 -199395 -1309346 -852880 -49807
38832 -49807 -228288 -781433 -669496 -496469 -1408705 -3016227 -4098981 -4519761 -4804477
38823 -4804477 -4624241 -3413020 -1851124 -1036319 -759439 -257965 54637 -465244 -757307
38814 -757307 642771 2920060 4200182 5085103 7801761 11532449 12128662 7863547 2358709
38805 2358709 -199970 -101995 -54700 -533495 -208789 618739 288468 -1209227 -2385019
38796 -2385019 -3056582 -4295392 -5720810 -5619831 -4084040 -3365444 -4293543 -4728535 -2865783
38787 -2865783 -150145 752012 -354692 -1226432 -376730 1183260 1461545 -138561 -2311209
38778 -2311209 -3443974 -3324327 -2928419 -2741192 -2185862 -950458 316206 1314857 2705737
38769B705737J540204l33136l098675l240507l44367J503413j52555k223899j258145
38760d901930R64493J005784q4169Q46958K730674K031923l46477o0816K780251
38751D966691L050326p88461l638406j860207J086401O52942j739170j942280
38743b12164N7806J108385M55184m9401M0261m86408j405845j139560L19051J318450
38733E759J232054R81097J094844J112675O49790l10994j590887k324746j556410
38724g06818k18540n18601k157629j890095J224706L336981J554124j025673j39762
38715e41307K517108K160500q65707j590027J289473L441482K002016o69942j806658
38706E936938k024063k355981j772409o003P65381n25547j687631r00549M12889
$$ plain form
38769 2705737 4245941 3912805 814130 -2426377 -2770744 -1267331 -1419886 -3643785 -4901930
38760 -4901930 -3937437 -2931653 -3015822 -2168864 561810 2593733 2247256 2186440 4966691
38751 4966691 8017017 7228556 3590150 1729943 2816344 3469286 1730116 -212164
38743 -212164 -154358 954027 1409211 1359810 1400071 913663 -492182 -1631742 -1312691 5759
38733 5759 1237813 2218910 3313754 4426429 5076219 4765225 3174338 849592 -706818
38724 -706818 -925358 -1443959 -3601588 -5491683 -4266977 -929996 624128 -401545 -541307
38715 -541307 1975801 4136301 3270594 1680567 2970040 6411522 8413538 7743596 5936938
38706 5936938 3912875 1556894 -215515 -221518 543863 18316 -1669315 -2569864 -2156975
38697b156975M74844L5598J48080j18686j322637j651130J24723K053679J954450
38688d58054P73728M15834L78124o54886j766263j261986L19598J282801J445302
38679D74198J374857O13378r09396j492470k57736Q07554J16375m58498R79688
38670A247950K270458O39549j860929j226481J573422J936747o35082j838289
38662B107345n0450J230658p2173j114711L22398J663805K29539j913746j521547
38653H81118N67591J564729J532324K048313K122545k01418l327574l577899r62392
38644F47337N98549o90796k040295r34397Q67516L93462j731589k168646L56536
38635d702323L412076L977643J661194j443835l004510k160695J62973K037451
$$ plain form
38697 -2156975 -1682131 -1646533 -1498453 -1617139 -2939776 -4590906 -4466183 -2412504 -458054
38688 -458054 315674 731508 1109632 454746 -1311517 -2573503 -2253905 -971104 474198
38679 474198 1849055 2462433 1553037 60567 -197169 610385 726760 268262 1247950
38670 1247950 3518408 4157957 2297028 1070547 2643969 4580716 3945634 2107345
38662 2107345 2056895 3287553 3215380 2100669 2423067 4086872 4316411 2402665 881118
38653 881118 1448709 3013438 4545762 6594075 8716620 8515202 5187628 1609729 647337
38644 647337 1245886 555090 -1485205 -2419602 -1552086 -1158624 -2890213 -5058859 -4702323
38635 -4702323 -1290247 2687396 4348590 2904755 -99755 -2260450 -2097477 -60026
38627f0026K044923N85907n19689j56292O89835L12743j252339k242832j682874
38618b280644n22932K36548J030922K209582K481933P34516j516442j687077J61362
38609H47768J362618N02397r12840j099623k65152N29552R27805P81418k18205
38600B455738j426494j364894L0342R09831L25046l09656O6057O1824j485380
38591g37586k654123j086207J769540K323808L03707q60356N34121K012898J172538
38582B778340o40171r97533l69796o76403j360270j36570K655354L648471J285679
38573F187101j520630j236831J575337L440605K745483R74630m25165j807650
38565I932880l335535l581180j666472P39579J362668L56798l48027j03922m6654
$$ plain form
38627 -60026 1984897 2570804 2051115 1894823 2584658 2897401 1645062 -597770 -2280644
38618 -2280644 -2803576 -2567028 -1536106 673476 3155409 3889925 2373483 686406 847768
38609 847768 2210386 2712783 1799943 700320 435168 964720 1892525 2673943 2455738
38600 2455738 1029244 -335650 -305308 604523 929569 619913 685970 747794 -737586
38591 -737586 -3391709 -4477916 -2708376 -384568 -80861 -941217 -407096 1605802 2778340
38582 2778340 2138169 1140636 770840 94437 -1265833 -1402403 1252951 4901422 6187101
38573 6187101 4666471 3429640 5004977 8445582 11191065 12165695 11740530 9932880
38565 9932880 6597345 3016165 1349693 2089272 3451940 3808738 3460711 3356789 3310135
38556C310135o86862q87466K87840K046145K738739J483093j161796l346567l094665
38547F88596n08652J575783P02857j765960k307568k21784J504266P89084p76353
38538c19731r96716l98004n63048j116562o56076N92277J225659R24420M00815
38529i06966j22015o69620n88941M30726J242840Q34175J00896K84471P41130
38520A346696L18448j92909N67840J684386J227209m02097j314282j568471k370535
38511g03715k473017L65380M188863M007808m81107l305788r16821K317553J198111
38502D197267j985249j609104J724189K264980j142587l024308j45057L420386
38494C700517K775660p84644k750610k099437j129292p19205J83185J267608Q87670
$$ plain form
38556 3310135 2623273 1735807 2023647 4069792 6808531 8291624 7129828 3783261 688596
38547 688596 179944 1755727 2458584 692624 -1614944 -1836728 -332462 456622 -319731
38538 -319731 -1316447 -1714451 -2277499 -3394061 -4050137 -3457860 -2232201 -1307781 -906966
38529 -906966 -1028981 -1698601 -2287542 -1856816 -613976 220199 321095 605566 1346696
38520 1346696 1665144 1472235 2040075 3724461 4951670 4549573 3235291 1666820 -703715
38511 -703715 -3176732 -2811352 1377511 5385319 4904212 1598424 681603 2999156 4197267
38502 4197267 2212018 602914 2327103 4592083 3449496 425188 280131 3700517
38494 3700517 6476177 5691533 2940923 841486 -287806 -1007011 -823826 443782 1331452
38485A331452n74659p27209P83023J245582p78717k707273j596707J280050K147164
38476D02706K39352j177834L24102K900532L257124J223853n30131o51023o69420
38467E319261j970080l179796k055422J026674L230026K871947J389016J061983
38459G693609J779065J214900j827492n243420n594053k129312K050991L451993
38451A396281K091022P70522Q78513R00694l48250j319789l93900Q59033j34123
38442D700003k417839k482698J33833J737473J50599j848930r90680J392188J830654
38433B204603L40955q7635J226628J679492l9530j780555j460106p7848K76634
38424B282638n46473j228479j038301j15498J117731J765152Q64580j027397j912922
$$ plain form
38485 1331452 756793 29584 812607 2058189 1279472 -1427801 -3024508 -1744458 402706
38476 402706 642058 -535776 -211674 2688858 5945982 7169835 6639704 5988681 5319261
38467 5319261 3349181 169385 -1886037 -859363 2370663 5242610 6631626 7693609
38459 7693609 9472674 10687574 8860082 3616662 -1977391 -4106703 -2055712 1396281
38451 1396281 3487303 4257825 5136338 6037032 5688782 4368993 3975093 4834126 4700003
38442 4700003 2282164 -200534 -66701 1670772 1821371 -27559 -1018239 373949 2204603
38433 2204603 2545558 2457923 3684551 5364043 5324513 3543958 2083852 2006004 2282638
38424 2282638 1736165 507686 -530615 -646113 471618 2236770 3101350 2073953 161031
38415A61031j028287n0120l95697q37947L92409K336358K420661L45250j459630
38406A884028j415296o89194p71323j016720l7319J596805J894891N24558m51113
38397A519317L09263J067877m76910l046282k715964J391023M968274L961022
38389F977620R931k251552j695082r09369q14902M63334K819032K877172n06406
38380F969778l404246k354037M29187P28443j260813j930250r8376J867942K068446
38371C016074J027960l7664l84835L89334J560298J256026p45957j641845N52220
38362D991611L504749L896600K439428J968107K242009J017090r74948j132399
38354A7952247m48598k362309n882055n677496n19729L848645K721469j414187
$$ plain form
38415 161031 -867256 -917376 -1313073 -2151020 -1758611 577747 2998408 3343658 1884028
38406 1884028 468732 -220462 -991785 -2008505 -2045824 -449019 1445872 1970430 1519317
38397 1519317 1828580 2896457 2419547 -626735 -3342699 -1951676 3016598 6977620
38389 6977620 6987551 4735999 3040917 2131548 1316646 1779980 4599012 7476184 6969778
38380 6969778 3565532 1211495 1640682 2369125 1108312 -821938 -920314 947628 3016074
38371 3016074 4044034 4006370 3621535 4010869 5571167 6827193 6081236 4439391 4991611
38362 4991611 8496360 12392960 14832388 16800495 19042504 20059594 19084646 17952247
38354 17952247 17503649 15141340 9259285 3581789 3062060 6910705 9632174 8217987
38346H217987l544314k765641j136387M37895J746513J604887r8589j025999J85613
38337C621965J467131P89159m80921l38276L44919q3040q87208p87467o40374
38328C005888j407014j797563q32249k29646j174076j461393N91103K209289L44755
38319g50906k720787k708359k56728O61643k17751M19650K847732L445685R39641
38310A659820j592703j959207j536279j483643n75305J485067K334876N81793
38302a085581j736641k129302p30564R58641K162192K492102J625195L11054j86111
38293A680985j98586j129289k527977k218181R4972J930478J583443K17847m33846
38284a000154k64249J20460M80738M34489l11429r08341l91659L59960j22550
$$ plain form
38346 8217987 4673673 1908032 771645 1209540 2956053 4560940 4462351 3436352 3621965
38337 3621965 5089096 5878255 5397334 5059058 5403977 5320937 4433729 3646262 3005888
38328 3005888 1598874 -198689 -1030938 -1260584 -2434660 -3896053 -3304950 -1095661 -750906
38319 -750906 -3471693 -6180052 -6436780 -5775137 -5992888 -5573238 -2725506 720179 1659820
38310 1659820 67117 -1892090 -3428369 -4912012 -5487317 -4002250 -1667374 -1085581
38302 -1085581 -2822222 -4951524 -5682088 -4723447 -2561255 -69153 1556042 1867096 1680985
38293 1680985 1482399 353110 -2174867 -4393048 -4298076 -2367598 -784155 -566308 -1000154
38284 -1000154 -1264403 -1143943 -663205 -228716 -540145 -1448486 -1840145 -1480185 -1602735
38275a602735j046302m21162J348623J964420J096342M51674K28098p51321j515390
38266b47753N2695K422697J586614k000285k971718N57847L534511J805936j631027
38257C109517k033985j72067K86771q51985j278855r45792j285007j573923l28277
38248e073603J215229R60449q6202M68189J955256J720386k66915j522345j130034
38239a759590l57328K54103J189986J756158O23604j538972k527111j534096L56601
38230c536645J937348K306192P54589j733296k360719q5157K459198K873820K454016
38221E069346K887979K398886p58984l568433k122364J539000K051458p94274
38213F702614k102581k45937R52129o50261k099904j039524L75845j79536j301387
$$ plain form
38275 -1602735 -2649037 -3070199 -1721576 242844 1339186 1790860 2018958 1267637 -247753
38266 -247753 -195058 2227639 3814253 1813968 -1157750 -599903 2934608 4740544 3109517
38257 3109517 1075532 903465 1190236 338251 -940604 -1886396 -3171403 -4745326 -5073603
38248 -5073603 -3858374 -2897925 -2984127 -2515938 -560682 1159704 892789 -629556 -1759590
38239 -1759590 -2116918 -1862815 -672829 1083329 1706933 167961 -2359150 -3893246 -3536645
38230 -3536645 -1599297 706895 1461484 -271812 -2632531 -2717688 -258490 2615330 5069346
38221 5069346 7957325 10356211 9597227 6028794 3906430 5445430 7496888 6702614
38213 6702614 4600033 4354096 5306225 4655964 2556060 1516536 1892381 1712845 411458
38204D11458j048070l87883p62707j294707q67964k32619M5093R01054K140393
38195a095952J638537o69949j361029J196278L373885J518706k079609k488146
38187C2721L68529J776702o65413l780525l315622P78433M522498M197466L4008
38178C948797l969351m173465j240687J079327R46474J79774O10808J303421P89141
38169e25761k65749n07037j71416p2256P9793N96950O07434l95771j316004j265129
38159c234946r19480o72894M29446K254367K561894O17203p24795O95928K395420
38150C402143R32355k455222l656444j739803N89293J596511J807815J366904
38142A843552j01523j284648m55169J187802R22934r52423j610870n54092j1716
$$ plain form
38204 411458 -636612 -1024495 -1787202 -3081909 -3949873 -4182492 -4137399 -3236345 -1095952
38195 -1095952 542585 -127364 -1488393 -292115 3081770 4600476 2520867 32721
38187 32721 401250 2177952 1512539 -2267986 -5583608 -4805175 -282677 3914789 3948797
38178 3948797 -20554 -4194019 -5434706 -4355379 -3408905 -3229131 -2618323 -1314902 -525761
38169 -525761 -791510 -1298547 -1469963 -1542219 -1462426 -865476 -258042 -653813 -1969817 -3234946
38159 -3234946 -4154426 -4827320 -4397874 -2143507 418387 1035590 310795 1006723 3402143
38150 3402143 4334498 1879276 -1777168 -3516971 -2927678 -1331167 476648 1843552
38142 1843552 1742029 457381 2212 1190014 2112948 1160525 -450345 -1004437 -1016153
38133a016153l77968L90189K116050J693278j459186l525454j982978O99224J444842
38124b018156J018213J330878J686804R18037L13227R48683P46776j960391m232549
38115a248478k316170J870640K804346n84278l574494k773122j80784J071109
38107d931231J071345J156797Q26563o32914j570073N8370L111473M214046K108868
38098E413244q87728j976662r36184L87804O09634M9833k22670M7202J9141r71212
38088A532402k197646k095858j76511J982443K100904l04239k976015k915342
38080e049862L42502L768587L859889N76087k624797k873905r05028O21475O04375
38071a680677P4460P7607N33753J005834J240012Q97284r2403q62673m48031O25039
$$ plain form
38133 -1016153 -1394121 -1003932 1112118 2805396 1346210 -2179244 -4162222 -3462998 -2018156
38124 -2018156 -999943 330935 2017739 2935776 3249003 4197686 4944462 2984071 -1248478
38115 -1248478 -3564648 -1694008 1110338 526060 -3048434 -5821556 -6002340 -4931231
38107 -4931231 -3859886 -2703089 -1876526 -2509440 -4079513 -4021143 -909670 3304376 5413244
38098 5413244 4525516 2548854 1612670 2000474 2610108 2659941 2437271 2484473 2503614 1532402
38088 1532402 -665244 -2761102 -2937613 -955170 1145734 841495 -2134520 -5049862
38080 -5049862 -4707360 -938773 2921116 3497203 872406 -2001499 -2906527 -2285052 -1680677
38071 -1680677 -1606217 -1528610 -994857 10977 1250989 2148273 2055870 1193197 745166 1370205
38061A370205P97475k69157j191914j033402o24642r42233j353507o50768Q81124
38052c016819J692051J073854J9312j78613M61035P03113l76006k133495k818693
38043d574261j461857R57181K639811K907733K281913J075848p13585k116278
38035I96505j572048O32253J953220R07389o29867j99771J324506R77202j584301
38026B805088l298970k167704j7175N02936l52944o12622p4707k19525j148093
38017d583716j060147P73706K502252K140139J57556j452744j667196q55593M15659
38008c630084J617276J805839M63206j269371j586469m03169N77075M38058K21846
37999a765793R17233J766852J621541P05386k34520j338495k606814k583474k08003
$$ plain form
38061 1370205 2167680 1898523 706609 -326793 -951435 -1893668 -3247175 -3897943 -3016819
38052 -3016819 -1324768 -250914 -231602 -410215 50820 753933 377927 -1755568 -4574261
38043 -4574261 -6036118 -5078937 -2439126 468607 2750520 3826368 3112783 996505
38035 996505 -575543 56710 2009930 2917319 2287452 2087681 3412187 4389389 2805088
38026 2805088 -493882 -2661586 -2678761 -2175825 -2528769 -3141391 -3216098 -3435623 -4583716
38017 -4583716 -5643863 -4870157 -2367905 -227766 -70210 -1522954 -3190150 -4045743 -3630084
38008 -3630084 -2012808 -206969 256237 -1013134 -2599603 -3002772 -2425697 -1987639 -1765793
37999 -1765793 -848560 918292 2539833 3245219 3010699 1672204 -934610 -3518084 -3726087
37990c726087K684015L206194J643012J102237K500399K921425M27627k363771
37982H395051k046095L49281J108692l38213r37055O92389K023824P70647j710395
37973H308126k918268k745878k352566j414738P64113K567438J607078j241390
37965B573915k389606o85207Q97901l4936j688341j281426M89474J072479M42234
37956f03513L99761N20724j117952l273661k209648J820303L530586N67941k100994
37947b466453K43800M223562L652783k89230j170037J609733J752588k779643
37939D777103n472810j705334L366003K769952j657733l081284n33214J095354
37931d41963J05775j99423J287482J288715j342593k818134p27512J660529O99686
$$ plain form
37990 -3726087 -1042072 2164122 3807134 4909371 7409770 10331195 10758822 8395051
37982 8395051 6348956 6698237 7806929 7468716 6531661 7224050 9247874 10018521 8308126
37973 8308126 5389858 2643980 291414 -1123324 -359211 2208227 3815305 2573915
37965 2573915 184309 -500898 397003 362067 -1326274 -2607700 -2118226 -1045747 -603513
37956 -603513 -203752 316972 -800980 -4074641 -6284289 -4463986 -933400 -365459 -2466453
37947 -2466453 -2222653 2000909 5653692 5364462 4194425 5804158 7556746 4777103
37939 4777103 -695707 -2401041 964962 3734914 2077181 -1004103 -1537317 -441963
37931 -441963 -336188 -535611 751871 2040586 697993 -2120141 -2847653 -1187124 -487438
37922d87438j756127j552356J168899K497776P85673j363119j211610O11076J533576
37913B26350M52575j300800j943876j333209o30440l10501K94070J175674J053030
37904b317127k41558n44501J463227L458641K574179M807q44832N0692l43842
37895C259686k325954k526757J91549K323334J172471j157500j653030q19265
37887a535466m67959j86361Q76158J310561j98348j928977j649538j77945N51279
37878c406596R28704J977017K317190N28051j269668k91178J827064J235925j678374
37869B168135k728309o95017J000725O0193j585987j679287q51411m00541p1150
37860d782649M32467N28704N69117J740109L172661K378856k83645j283306L01586
$$ plain form
37922 -487438 -2243565 -3795921 -2627022 -129246 656427 -706692 -1918302 -1307226 226350
37913 226350 678925 -621875 -2565751 -3898960 -4529400 -4839901 -4545831 -3370157 -2317127
37904 -2317127 -2558685 -3103186 -1639959 1818682 4392861 4397668 3552836 3603528 3259686
37895 3259686 933732 -1593025 -1401476 921858 2094329 936829 -716201 -1535466
37887 -1535466 -2003425 -2189786 -1313628 -3067 -201415 -2130392 -3779930 -3957875 -3406596
37878 -3406596 -2477892 -500875 1816315 2344366 1074698 783520 2610584 3846509 2168135
37869 2168135 -560174 -1255191 -254466 -194273 -1780260 -3459547 -4310958 -4711499 -4782649
37860 -4782649 -4350182 -3821478 -3252361 -1512252 1660409 4039265 3755620 2472314 2773900
37851B773900Q07647j621685l010292M6786L724987K187522k922696m517202r11251
37842c442284J940123K31006j948746K17985M441024N185992K049379p12253j212435
37833F749791j456569k349075k063257j80024P69673n08996j780284j014439N71862
37824a261318J183102J282029J520140P15705j386599k191053l75529R02575r90866
37815f01814k736694L9871M584821M337499m01231k568398J71754J989695n06421
37806D309082k286880P32170L632416N99693m573004m204847P43011K574966m47069
37797A079538k171378M29269K697722Q86929j878244j647778M4691m7167j097005
37788a703423m90448J014296O35519j449691k160763k13066J952890J407796j522134
$$ plain form
37851 2773900 3581547 1959862 -1050430 -1003644 2721343 4908865 1986169 -2531033 -3442284
37842 -3442284 -1502161 -1271155 -3219901 -3001916 1439108 6625100 8674479 7962226 6749791
37833 6749791 5293222 2944147 880890 700866 1470539 961543 -818741 -1833180 -1261318
37824 -1261318 -78216 1203813 2723953 3439658 2053059 -137994 -513523 389052 -601814
37815 -601814 -3338508 -3298637 1286184 5623683 5222452 2654054 2825808 4815503 4309082
37806 4309082 2022202 2754372 6386788 6986481 2413477 -1791370 -1048359 1526607 1079538
37797 1079538 -1091840 -662571 2035151 2922080 1043836 -603942 -559251 -606418 -1703423
37788 -1703423 -2193871 -1179575 -544056 -1993747 -4154510 -4367576 -2414686 -1006890 -2529024
37779b529024l446693j768480J990991L720912J953520k27791J15557J452936
37771A261928Q62973o66594m866K272448K451226q2230j914100j486862j175656
37762A518267k258515k522960q82470Q0737j089459j381839J796206N538146N088952
37753E887065O22213l146112l008676j02774K494036K679111M34397k156359k458893
37744A244008m8557K678505L270680J582860r20431k691603k624584q59007O59019
37735B290890L77072j43284J727730M944570N396700J836677k274509l814872
37727A0340974l374318k426748r19571O44218M11546j516818k372659j173321
37719c86697l43114j046958r15562J248955K652119J267178n31550k06397Q92352
$$ plain form
37779 -2529024 -5975717 -7744197 -5753206 -2032294 -78774 -306565 -191008 1261928
37771 1261928 2124901 1458307 1453441 3725889 6177115 6094885 4180785 2693923 1518267
37762 1518267 -740248 -3263208 -4145678 -4064941 -5154400 -6536239 -4740033 798113 5887065
37753 5887065 6509278 3363166 354490 251716 2745752 5424863 5859260 3702901 1244008
37744 1244008 1195451 3873956 7144636 8727496 7807065 5115462 2490878 1631871 2290890
37735 2290890 2667962 2524678 4252408 9196978 14593678 16430355 14155846 10340974
37727 10340974 6966656 4539908 3620337 4264555 4676101 3159283 786624 -386697
37719 -386697 -729811 -1776769 -2692331 -1443376 1208743 2475921 1944371 1737974 2630326
37710B630326R12147J018137K106312K035413j12852j114821J009957K952833
37702A1437452J885275P86135L002881O227997P689646J0188431J5493952J6502338
37694G3214107N642265j1382800k0321276j6432171q565778m965272m485728l659002
37686I044345l207439l807399k838825M49621K367496R59665n50392K73786R41529
37677C632387o86848j997006l73530J958494J795859P7989n51650k12238l94017
37668C249440p52211l08560M28796Q72351J490156J799412J75586k647870l307002
37659A000098r92845P03749o04720k345765j493268O91419J407458P23484L17540
37650e92850N18693J078934K091779K147977q80156n088824m993266K57244L904694
$$ plain form
37710 2630326 3542473 4560610 6666922 8702335 8589483 7474662 8484619 11437452
37702 11437452 13322727 14108862 17111743 23339740 31029386 41217817 56711769 73214107
37694 73214107 78856372 67473572 47152296 30720125 22154347 17189075 12703347 9044345
37686 9044345 5836906 2029507 -809318 -359697 2007799 2967464 2417072 2690858 3632387
37677 3632387 2945539 948533 575003 2533497 4329356 4407345 3855695 3643457 3249440
37668 3249440 2497229 2188669 2617465 3489816 4979972 6779384 6954970 4307100 1000098
37659 1000098 7253 711002 106282 -2239483 -3732751 -3041332 -1633874 -910390 -592850
37650 -592850 -74157 1004777 3096556 5244533 4364377 -724447 -5717713 -5460469 -1555775
37641a555775J044495l554886k633140K374324M073900Q11590j644783P1377K215052
37632A202154P39831k496960l137195n63432K124913K698034J999936J864137
37624D431418K292185J548311r63564l161095l014704j727598j653853j864546
37616d113446M09630L952447M040532L6888k699539r95208J292740K08400j721804
37607D10640p45419R62442m22022k557300m67563M295340N391099J887300m26276
37598H328241J473384L582554J884452j793056l412164k286530o48862l04191
37590F823828j349226k423786j735415N02667J310454j101911l864469l059109
37582d896967M38495K413039J508852q4757j128692k011660j772751O03576K475682
$$ plain form
37641 -1555775 -511280 -4066166 -6699306 -4324982 -251082 560508 -1084275 -1012898 1202154
37632 1202154 1941985 -554975 -3692170 -4255602 -2130689 567345 2567281 4431418
37624 4431418 6723603 8271914 7308350 4147255 1132551 -595047 -2248900 -4113446
37616 -4113446 -3703816 248631 4289163 4326051 1626512 631304 1924044 2132444 410640
37607 410640 -334779 627663 205641 -2351659 -2819222 1476118 6867217 8754517 8328241
37598 8328241 9801625 13384179 15268631 13475575 10063411 7776881 7128019 6823828
37590 6823828 5474602 3050816 1315401 1818068 3128522 2026611 -1837858 -4896967
37582 -4896967 -4458472 -2045433 -536581 -621338 -1750030 -3761690 -5534441 -4930865 -2455183
37573b455183M99746k946806k209995K441527M499304J387182j668609l83449
37565h36283K267840J954020k94588j328976j263924j484827j167044K31763N14471
37556a407548j389745k454123k54565K608122K652422R14332K31340L00019k95613
37547I04641k23818J721421K703872q6838l812541l774341q38502N29132j0707
37538b887681R18613L155548K749276o58491k486395o10608J523743J045054k63967
37529B485092l41653n43586k094703k940178j349998O53272O45971k46034J41273
37520c590544J088494Q05773j0678K23105N93497o43650k290950j611104J162669
37511d273388K990628K450089R94301j62357j431854k710349k629862r10323P00428
$$ plain form
37573 -2455183 -1955437 -4902243 -7112238 -4670711 -171407 1215775 -452834 -836283
37565 -836283 1431557 3385577 3090989 1762013 498089 -986738 -2153782 -1922019 -1407548
37556 -1407548 -2797293 -5251416 -5505981 -2897859 -245437 668895 900235 1200254 904641
37547 904641 680823 2402244 5106116 5019278 1206737 -2567604 -3406106 -2876974 -2887681
37538 -2887681 -1969068 1186480 3935756 3277265 790870 180262 1704005 2749059 2485092
37529 2485092 2143439 1599853 -494850 -3435028 -4785026 -4131754 -3485783 -3731817 -3590544
37520 -3590544 -2502050 -1696277 -1706955 -1483850 -890353 -1534003 -3824953 -5436057 -4273388
37511 -4273388 -1282760 1167329 2161630 1999273 567419 -2142930 -4772792 -5683115 -4982687
37502d982687Q61953L17657K63844N84068O00874K89327o6786l66296l44617J42753
37492b699910L16924n15845j052270P11727L715500M087989O25627k727497k205455
37483B56790M71525J261864J65274K79740J669285J075395j925523l350730j074380
37474a170760J610531J237586o68449q92827m023o14365k149524j593001J296748
37465b948084L379225K780750R10040m63715j251282j639568j227033l19411j7052
37456g96130l89312l62870K09298K29085n45842r24855k19730Q63135J458005
37447d79216J154362l39229k311341k468838K68723L046045K342695m65770q39152
37438i1721J499529J808455j580824l770161j056364K669061J980418j320514
$$ plain form
37502 -4982687 -4120734 -3803077 -3539233 -2955165 -2354291 -2064964 -2131750 -2498046 -2842663 -2699910
37492 -2699910 -2382986 -2898831 -3951101 -3239374 476126 4564115 5189742 2462245 256790
37483 256790 728315 1990179 2155453 2435193 4104478 5179873 3254350 -96380 -1170760
37474 -1170760 439771 1677357 1008908 116081 112058 -502307 -2651831 -4244832 -2948084
37465 -2948084 431141 3211891 4121931 3658216 2406934 767366 -459667 -779078 -796130
37456 -796130 -1185442 -1548312 -1339014 -1109929 -1655771 -2580626 -2800356 -1937221 -479216
37447 -479216 675146 335917 -1975424 -4444262 -4175539 -1129494 1213201 747431 -91721
37438 -91721 1407808 3216263 1635439 -2134722 -3191086 -522025 1458393 137879
37430A37879j298097K350737L925316R28924k317819j776681N70515Q10875o94457
37421B637192o86994J324374K309931M48051k128438k346599m27730N66554p54487
37412I41854j900626j39532K931139L047737m91871l336258k150064P24806J122309
37403G49494p82193j484169P9661J502138J302396P50119P93181L64054j107639
37394B167042k062563j130695P67728J916213J919280J259412J28845j142651
37386C822611j575704o25337P97995J191801O5100j603832k261384j316819q1623
37377a587192l88227j703925j175714J963734L963309J390845l017474l357726
37369c912370Q74147L787824J713980j823257k180240m52272m96386k194257k313930
$$ plain form
37430 137879 -1160218 1190519 5115835 6044759 3726940 1950259 2520774 3331649 2637192
37421 2637192 1950198 3274572 5584503 6032554 3904116 1557517 1129787 1696341 941854
37412 941854 -958772 -1098304 1832835 4880572 4388701 1052443 -1097621 -372815 749494
37403 749494 -32699 -1516868 -1437207 64931 1367327 2117446 2910627 3274681 2167042
37394 2167042 104479 -1026216 -258488 1657725 3577005 4836417 4965262 3822611
37386 3822611 2246907 1621570 2419565 3611366 3676466 2072634 -188750 -1505569 -1587192
37377 -1587192 -1975419 -3679344 -4855058 -2891324 1071985 2462830 -554644 -3912370
37369 -3912370 -3038223 749601 2463581 640324 -1539916 -1992188 -2488574 -4682831 -6996761
37360f996761m93050L85641m65322m29841J644549L063338J510422j171465j613544
37351d566033M59721K391676K340334Q99746n65852j435577j555466q41233K58574
37342b614110P20563Q3978p17154l74662R25298J389405j14086k155644k039983
37333d896395Q81412M014154M174194J044859k500390l360946j164472J649353
37325a58231K454366J010767p36811j253078r50421p14348j54985J180510J781108
37316B458877k26140l421023l760924J965L982481L999127P66072j895487k306685
37307d01737j666165p44061Q55693K298843J621251j031778k913362k450611j215700
37298e647627r69577j005515p5375J002053P68610j57522K5650J429260K435765
$$ plain form
37360 -6996761 -7489811 -7104170 -7569492 -7999333 -6354784 -3291446 -1781024 -2952489 -4566033
37351 -4566033 -4106312 -1714636 625698 1525444 959592 -475985 -2031451 -2872684 -2614110
37342 -2614110 -1893547 -1809569 -2526723 -2901385 -1976087 -586682 -700768 -2856412 -4896395
37333 -4896395 -4014983 -829 4173365 5218224 2717834 -643112 -1807584 -158231
37325 -158231 2296135 3306902 2570091 1317013 366592 -347756 -502741 677769 2458877
37316 2458877 2232737 -1188286 -4949210 -4947245 -964764 3034363 3800435 1904948 -401737
37307 -401737 -2067902 -2811963 -1956270 342573 1963824 932046 -1981316 -4431927 -5647627
37298 -5647627 -6617204 -7622719 -7698094 -6696041 -5927431 -6084953 -6059303 -4630043 -2194278
37289b194278K081868P99962p37241j828077j336581R51560K865641J926819j030229
37280A499444k547480j243200N45198O62121J99184J023631K331685J963549p5570
37271D358562j707377j786615j038204l78664m0246m0038k2097P98818K046117
37262B190256J606978j251641l441664j803809J502762J306157k735264n032201
37254g658426k179201K221459L352975J784472P99659N63463o40091j787811o33028
37245d176529J483803J171164j225661k010775k13965J293597J057193Q05006
37237a816167J231041O82053p41890n24434J117666L48039l526959n356674j743685
37228a0331010L163869L850144J473077O29356J373901M43922j671356j311364
$$ plain form
37289 -2194278 -112410 687552 -49689 -1877766 -3214347 -2262787 602854 2529673 1499444
37280 1499444 -1048036 -2291236 -1746038 -1083917 -884733 138898 2470583 4434132 4358562
37271 4358562 2651185 864570 -173634 -552298 -592544 -632582 -654679 144139 2190256
37262 2190256 3797234 2545593 -896071 -2699880 -1197118 109039 -2626225 -7658426
37254 -7658426 -9837627 -7616168 -4263193 -2478721 -1679062 -1115599 -1755690 -3543501 -4176529
37245 -4176529 -2692726 -1521562 -2747223 -4757998 -4971963 -3678366 -2621173 -1816167
37237 -1816167 -585126 96927 -644963 -1169397 -51731 296308 -3230651 -8587325 -10331010
37228 -10331010 -7167141 -3316997 -1843920 -1214564 159337 603259 -1068097 -2379461
37220b379461J410875K395088N65541o21969M23286J012772k68267q17909Q12214
$$ plain form
37220 -2379461 -968586 1426502 1992043 1370074 1793360 2806132 2537865 1719956 2532170
$$ [...]
##END NTUPLES=NMR SPECTRUM
##END=
