##TITLE=31Pdec_LR-736-RA-RM2
 , 24 sc
 5.04.2021
##JCAMPDX= 6.0         $$ Bruker NMR JCAMP-DX V2.0
##DATA TYPE= NMR SPECTRUM
##DATA CLASS= NTUPLES
##ORIGIN= UXNMR, Bruker Analytische Messtechnik GmbH
##OWNER= root
$$ XWIN-NMR		Version 3.5
$$ Mon Apr  5 12:59:46 2021 Russian Standard Time (UT+4h)  she@DPX200
##.OBSERVE FREQUENCY= 81.013821
##.OBSERVE NUCLEUS= ^31P
##.ACQUISITION MODE= SIMULTANEOUS
##.ACQUISITION SCHEME= undefined
##.AVERAGES= 24
##.DIGITISER RES= 16
##SPECTROMETER/DATA SYSTEM= spect
##.PULSE SEQUENCE= zgpg30
##.SOLVENT NAME= DMSO
##.SHIFT REFERENCE= (INTERNAL, DMSO, 0, 248.564)
##AUDIT TRAIL= $$ (NUMBER, WHEN, WHO, WHERE, WHAT)
$$ ##TITLE= Audit trail, XWIN-NMR		Version 3.5
$$ ##JCAMPDX= 5.01
$$ ##ORIGIN= Bruker BioSpin GmbH
$$ ##OWNER= she
$$ F:/spectra/data/she/nmr/P31/1/pdata/1/auditp.txt
$$ ##AUDIT TRAIL=  $$ (NUMBER, WHEN, WHO, WHERE, WHAT)
(   1,<2021-04-05 12:58:09.87 +0400>,<she>,<DPX200>,
      <created by zg, POWCHK disabled, PULCHK disabled
       configuration hash MD5:
       00 E9 B6 7A A2 85 ED C7 34 08 36 98 17 FE 4E 26
       data hash MD5: 32K
       70 55 CE DA 89 11 D9 39 D9 5C 13 83 F4 C0 A7 49>)
(   2,<2021-04-05 12:58:13.85 +0400>,<she>,<DPX200>,
      <Start of raw data processing
       efp BC_mod = 2 LB = 1 FT_mod = 6 PKNL = 1 PHC0 = -4574.191 PHC1 = 429.2014 SI = 64K 
       data hash MD5: 64K
       3B ED 5F C1 23 75 E4 FB 65 CD C2 1E 5A 87 58 BE>)
(   3,<2021-04-05 12:58:34.93 +0400>,<she>,<DPX200>,
      <pk PHC0 = -9.28241 PHC1 = 37.40001 
       data hash MD5: 64K
       7C 52 CB 07 91 88 8B 32 F0 53 4B 9E 3F A5 33 06>)
(   4,<2021-04-05 12:59:15.32 +0400>,<she>,<DPX200>,
      <pk PHC0 = -18.14392 PHC1 = 21.6 
       data hash MD5: 64K
       44 17 06 25 DA FC 6C 19 3D 37 38 75 F1 66 0F 70>)
$$ ##END=
$$ 
$$ hash MD5
$$ 34 79 D7 3E 75 D9 FD 03 8F 98 74 47 B1 61 CA 4A
##$RELAX= 
##$RELAX= 
##$RELAX= 
##$RELAX= 
##$RELAX= 
##$RELAX= 
##$RELAX= 
##$RELAX= 
$$ Bruker specific parameters
$$ --------------------------
##$DU= <F:/spectra>
##$EXPNO= 1
##$NAME= <P31>
##$PROCNO= 1
##$TYPE= <nmr>
##$USER= <she>
##$AMP= (0..31)
100 100 100 100 100 100 100 100 100 100 100 100 100 100 100 100 100 100 
100 100 100 100 100 100 100 100 100 100 100 100 100 100 
##$AQSEQ= 0
##$AQ_mod= 1
##$AUNM= <au_zg>
##$AUTOPOS= <>
##$BF1= 81.014009
##$BF2= 200.13
##$BF3= 200.13
##$BF4= 200.13
##$BF5= 200.13
##$BF6= 200.13
##$BF7= 200.13
##$BF8= 200.13
##$BYTORDA= 1
##$CFDGTYP= 0
##$CFRGTYP= 5
##$CHEMSTR= <none>
##$CNST= (0..31)
1 1 145 1 1 1 1 1 1 1 1 1 1 1 1 1 1 1 1 1 1 1 1 1 1 1 1 1 1 1 1 1 
##$CPDPRG= <waltz16>
##$CPDPRG1= <>
##$CPDPRG2= <waltz16>
##$CPDPRG3= <>
##$CPDPRG4= <mlev>
##$CPDPRG5= <mlev>
##$CPDPRG6= <mlev>
##$CPDPRG7= <mlev>
##$CPDPRG8= <mlev>
##$CPDPRGB= <>
##$CPDPRGT= <>
##$D= (0..31)
0 1 0 0 0 0 0 0 0 0 0 0.03 2e-05 3e-06 0 0 0 0 0 0 0 0 0 0 0 0 0 0 0 0 
0 0 
##$DATE= 1617613089
##$DBL= (0..7)
120 120 120 11 120 120 24 19 
##$DBP= (0..7)
150 150 150 150 150 150 150 150 
##$DBP07= 0
##$DBPNAM0= <>
$$ [...]
##$SUBNAM2= <"">
##$SUBNAM3= <"">
##$SUBNAM4= <"">
##$SUBNAM5= <"">
##$SUBNAM6= <"">
##$SUBNAM7= <"">
##$SUBNAM8= <"">
##$SUBNAM9= <"">
##$SW= 501.771253377433
##$SWIBOX= (0..15)
0 1 3 0 0 0 0 0 0 0 0 0 0 0 0 0 
##$SW_h= 40650.406504065
##$TD= 32768
##$TD0= 1
##$TE= 0
##$TE2= 300
##$TE3= 300
##$TEG= 300
##$TL= (0..7)
0 120 53 12 22 120 120 120 
##$TP= (0..7)
150 150 150 150 150 150 150 150 
##$TP07= 0
##$TPNAME0= <>
##$TPNAME1= <>
##$TPNAME2= <>
##$TPNAME3= <>
##$TPNAME4= <>
##$TPNAME5= <>
##$TPNAME6= <>
##$TPNAME7= <>
##$TPOAL= (0..7)
0.5 0.5 0.5 0.5 0.5 0.5 0.5 0.5 
##$TPOFFS= (0..7)
0 0 0 0 0 0 0 0 
##$TUNHIN= 0
##$TUNHOUT= 0
##$TUNXOUT= 0
##$USERA1= <user>
##$USERA2= <user>
##$USERA3= <user>
##$USERA4= <user>
##$USERA5= <user>
##$V9= 5
##$VALIST= <valist>
##$VCLIST= <CCCCCCCCCCCCCCC>
##$VD= 0
##$VDLIST= <DDDDDDDDDDDDDDD>
##$VPLIST= <PPPPPPPPPPPPPPP>
##$VTLIST= <TTTTTTTTTTTTTTT>
##$WBST= 1024
##$WBSW= 4
##$XGAIN= (0..3)
0 0 0 0 
##$XL= 0
##$YL= 0
##$YMAX_a= 22142
##$YMIN_a= -23404
##$ZGOPTNS= <>
##$ZL1= 120
##$ZL2= 120
##$ZL3= 120
##$ZL4= 120
##$ABSF1= 0
##$ABSF2= 0
##$ABSG= 0
##$ABSL= 0
##$ALPHA= 0
##$AQORDER= 0
##$ASSFAC= 0
##$ASSFACI= 0
##$ASSFACX= 0
##$ASSWID= 0
##$AUNMP= <proc_1d>
##$AZFE= 0.1
##$AZFW= 0.5
##$BCFW= 0
##$BC_mod= 2
##$BYTORDP= 0
##$COROFFS= 0
##$CY= -3
##$DATMOD= 1
##$DC= 0
##$DFILT= <>
##$DTYPP= 0
##$F1P= 0
##$F2P= 0
##$FCOR= 1
##$FTSIZE= 65536
##$FT_mod= 6
##$GAMMA= 0
##$GB= 0
##$INTBC= 1
##$INTSCL= 5.30512e-09
##$ISEN= 30
##$LB= 1
##$LEV0= 0
##$LPBIN= 0
##$MAXI= 10000
##$MC2= 0
##$MEAN= 0
##$ME_mod= 0
##$MI= 50
##$NCOEF= 0
##$NC_proc= -6
##$NLEV= 6
##$NOISF1= 182.463
##$NOISF2= 159.3651
##$NSP= 0
##$NTH_PI= 0
##$NZP= 0
##$OFFSET= 248.5645
##$PC= 4
##$PHC0= -4601.617
##$PHC1= 488.2014
##$PH_mod= 1
##$PKNL= yes
##$PPARMOD= 0
##$PSCAL= 0
##$PSIGN= 0
##$REVERSE= no
##$SF= 81.014009
##$SI= 65536
##$SIGF1= 159.3651
##$SIGF2= -187.1042
##$SINO= 113.3802
##$SIOLD= 16384
##$SREGLST= <1H.CDCl3>
##$SSB= 0
##$STSI= 65536
##$STSR= 0
##$SW_p= 40650.406504065
##$SYMM= 0
##$S_DEV= 0
##$TDeff= 32768
##$TDoff= 0
##$TI= <>
##$TILT= no
##$TM1= 0
##$TM2= 0
##$TOPLEV= 0
##$USERP1= <user>
##$USERP2= <user>
##$USERP3= <user>
##$USERP4= <user>
##$USERP5= <user>
##$WDW= 1
##$XDIM= 65536
##$YMAX_p= 300847305
##$YMIN_p= -31109435
$$ End of Bruker specific parameters
$$ ---------------------------------
##NTUPLES= NMR SPECTRUM
##VAR_NAME=  FREQUENCY,     SPECTRUM/REAL,   SPECTRUM/IMAG
##SYMBOL=    X,             R,               I
##VAR_TYPE=  INDEPENDENT,   DEPENDENT,       DEPENDENT
##VAR_FORM=  AFFN,          ASDF,            ASDF
##VAR_DIM=   65536,         65536,           65536
##UNITS=     HZ,            ARBITRARY UNITS, ARBITRARY UNITS
##FACTOR=    0.620285442955139, 1,           1
##FIRST=     20137.2065510759, 0,            0
##LAST=      -20513.1999529892, 0,           0
##MIN=       -20513.1999529892, -31109435,   0
##MAX=       20137.2065510759, 300847305,    0
$$ Real data points
##PAGE= N=1
##DATA TABLE= (X++(R..R)), XYDATA
$$ [...]
15289 -2016532 -1527894 -591767 -790423 -1696094 -1844435 -1166028 -391267 763551 2554059
15280 2554059 3376965 1589279 -1333116 -2121653 -227954 1536726 1272382 353041 536600
15271 536600 1061716 353360 -987436 -921284 1063121 3492797 5059810 5607941 5059709
15262 5059709 3045080 164534 -1653326 -1042501 1111284 2641283 2432198 1157501
15254 1157501 -2486 -605869 -922308 -1346067 -2063694 -2886716 -3234148 -2607084 -1193838
15245 -1193838 298738 1403818 2017913 1777367 93638 -2749287 -5143507 -5510594 -3915978
15236 -3915978 -1829918 -447175 243312 772866 1148964 850786 -250298 -1377158 -1672392
15227 -1672392 -1421234 -1661873 -2279700 -1636196 848151 2890139 2061999 -331438 -642146
15218 -642146 1802343 3681410 2807562 1153807 1018837 1236771 -1320 -1118960 353868
15209 353868 2876330 2588278 -664370 -2981903 -2233389 -452175 265652 642166 1682739
15200 1682739 2409706 1868562 929014 411760 -486350 -2360546 -4086311 -4531938 -4003457
15191 -4003457 -2829080 -524188 2333174 3501388 1940315 -535421 -1877460 -2169058
15183 -2169058 -2038171 -1001060 811285 1490179 59251 -1546175 -1294428 36846 847426
15174 847426 1492703 2675528 3238825 2393956 2101292 4022954 5979131 5040136 2519634
15165 2519634 1856985 2778783 2077441 -367671 -1109613 1027674 3155350 3248332 2666286
15156 2666286 2544100 1771010 296193 592974 3523705 6003613 5285917 2837174 1502746
15147 1502746 1368222 1034571 668962 917666 695024 -978982 -2442425 -1642352 297091
15138 297091 759924 -59922 231889 1759715 1950148 47976 -1080625 964426 4522260
15129 4522260 6126916 4942821 3148393 2569025 2689508 2216215 1275261 1097780 1974617
15120 1974617 2655732 2136278 1149684 1069516 1933522 2630957 2670550 2521353 2436863 2370208
15110 2370208 2917501 4579668 5940119 4681456 1143784 -1252364 -437734 1328711
15102 1328711 655231 -2290803 -4316857 -3501044 -973002 1065987 1315555 -284481 -2533056
15093 -2533056 -3452117 -2194366 -256101 437968 112733 250528 730168 47296 -1603317
15084 -1603317 -1900395 48282 1785639 692126 -2291665 -3959029 -3129001 -1669554
15076 -1669554 -1204577 -761665 1256502 4076597 5258504 4127082 2760792 2971886 3775867
15067 3775867 3149713 1346238 678090 2147652 4020998 4267574 3092601 2214130 2452028
15058 2452028 2903310 2246557 407911 -1080181 -612691 1317405 2171727 424772 -2232708
15049 -2232708 -3097527 -2061713 -1098719 -788542 31368 1209496 926823 -842147 -1529550
15040 -1529550 -14220 1360195 593062 -860057 -1000973 -710357 -1471261 -1960328 -262142
15031 -262142 2168366 2330643 414302 -813370 -592789 -422920 -61812 2642563 7214896
15022 7214896 9559133 7109966 2340374 -414012 355670 2988394 5126003 5366964
15014 5366964 3960518 2726303 3015746 3531985 1953863 -1159295 -2493283 -622655
15006 -622655 1989699 2681263 1820933 967592 197908 -851944 -1292068 -476879 319926
14997 319926 -160190 -798972 175997 2061298 2496167 958305 -559594 -324163 1210028
14988 1210028 2277709 1527991 -969728 -3566923 -4233553 -2707174 -937502 -677392 -1426164
14979 -1426164 -1614681 -799313 530985 2305590 4412853 5577321 4478444 1797751
14971 1797751 -345255 -896608 -513419 45181 694511 1223892 1189837 834745 872866 1136559
14961 1136559 622774 -833669 -2117668 -2515194 -2763704 -3765956 -5047588 -5230288 -3623293
14952 -3623293 -815356 2010851 3908274 4480557 3788213 2170895 272426 -918945
14944 -918945 -635779 739472 1816532 1776739 1372462 1756976 2785463 3291341 2732786
14935 2732786 1663068 744347 222534 262136 727003 544058 -1490638 -4698327 -6282764
14926 -6282764 -4074256 814912 4846035 5591883 3993124 3013722 4337367 6640958
14918 6640958 7186209 4894746 1441914 -725098 -842530 79951 954058 1479569 1566476
14909 1566476 1015986 149106 -5423 1277234 3536752 5607333 6729832 6978679 6914877
14900 6914877 7064025 7395226 7023165 4854589 1119440 -1961489 -1900401 1259831 4410696
14891 4410696 4358613 1272038 -1544302 -1515965 342479 1114241 -124696 -1431761 -1119741
14882 -1119741 -263787 -1016097 -3285258 -4635979 -3525303 -1298492 -356357 -1258552 -2554206
14873 -2554206 -3015841 -2963584 -3219616 -3560301 -2786416 -169556 3442171 5947979 5593509
14864 5593509 2745631 84301 222635 2703190 4203843 2537337 -446384 -1351383
14856 -1351383 48096 733890 -787125 -2167854 -957040 1522593 2206880 849287
14848 849287 53912 1293439 3256589 4125192 3392901 1294288 -1511348 -3355341 -2702542
14839 -2702542 -468803 688822 10163 -467253 495110 1074327 -709877 -3652749 -4897317
14830 -4897317 -3607137 -1190418 1251778 3692636 5787153 6594343 5902300 4628507
14822 4628507 3703099 3268726 2911805 2144474 894138 -156558 -232939 333350 461519
14813 461519 83066 232528 993254 1089192 307342 289607 1581457 2064277 330877 -1406879
14803 -1406879 -422564 2118365 2882191 1351947 -141712 -574605 -945337 -1290457 -761325
14794 -761325 -678972 -3326061 -6914454 -6198525 -42613 5700588 5740166 2352303 1301544
14785 1301544 3490168 4953157 3647507 1706347 1053251 838793 148594 19249 1287601
14776 1287601 2740013 2911860 2100067 1307374 588053 -257250 -516287 442124 1731496
14767 1731496 1936556 1275629 1524491 3630263 6283679 7259693 5795356 3354915 2117009
14758 2117009 2746103 3659052 2672916 -524186 -3818622 -4860149 -3591836 -2164595 -2361721
14749 -2361721 -3612608 -3816671 -1769233 1642260 4451213 5333686 4401710 2882706 2201725
14740 2201725 2881246 4012263 4128464 2839002 1240730 535845 773553 1231687 1327422
14731 1327422 646152 -1086841 -3171521 -3830934 -2208636 -10367 277875 -1377683 -2614268
14722 -2614268 -1943204 -259874 1205667 2513245 3690315 3621529 1797597 -161287 -542764
14713 -542764 -239033 -1481308 -4345436 -6551078 -6733324 -5846929 -4814824 -2834592 703244
14704 703244 4128775 5077221 3491143 1456399 327837 -441235 -1510463 -2201271 -1489456
14695 -1489456 531207 2835150 4403675 4516343 3013091 958639 149677 1062472 2144459
14686 2144459 2160175 2136993 3361677 4481858 3071744 -214829 -1899401 -616406 1065822
14677 1065822 987686 702431 2314399 4475563 4488621 2820071 2288984 3518240 4329501
14668 4329501 3482526 2082409 1069820 48775 -897925 -728847 554737 1626177 2078315
14659 2078315 2726322 3242473 2038287 -793162 -3094035 -4109653 -5421317 -7158920
14651 -7158920 -6633448 -2996753 -108838 -1508952 -4873142 -5201502 -2002585 642841
14643 642841 475043 -516382 -313734 217416 -142863 -460574 566933 2156813 2398993
14634 2398993 682793 -1854273 -3597879 -3705074 -2848705 -2846521 -4618920 -6627975 -6578322
14625 -6578322 -4493136 -2517820 -1743880 -1220157 -446769 -588433 -2148073 -3408399 -2707443
14616 -2707443 -771038 802617 2038363 3686047 4898128 4144804 2145757 1541076
14608 1541076 3201742 4909315 4647470 3442419 3417459 4318741 4077306 2399131 1468814
14599 1468814 2477256 3504854 2316185 -198555 -1355407 -682558 -363773 -1739956
14591 -1739956 -3596079 -4475847 -4635638 -4697923 -4212092 -2924930 -1933737 -2001653 -2016701 -790514
14581 -790514 796261 1286111 1178846 1815090 2569481 1643208 -657842 -1941299 -1204332
14572 -1204332 -62475 -131515 -1164690 -2144469 -2294002 -744670 2622510 5557621 5054858
14563 5054858 1442514 -1450562 -1291223 -48681 -429645 -1974491 -2705004 -2451179 -2010631
14554 -2010631 -766787 1919521 4136018 3422147 847931 -80176 1329448 1951327 -141712
14545 -141712 -2643411 -2584750 -567269 717216 605972 653172 1401781 1476595 248287
14536 248287 -641137 416490 2352261 2584106 529008 -1485654 -1273498 365529 849849
14527 849849 -785102 -3033316 -4320635 -4672334 -4425095 -2829302 629518 4299074 5394790
14518 5394790 3028996 -865962 -3682864 -4265812 -2947206 -720630 1091442 1254622
14510 1254622 -442294 -2853635 -4431604 -4348094 -2646501 129467 3000091 4590241
14502 4590241 3836007 1054485 -1827821 -2657958 -1162956 522967 127173 -1994225 -3322458
14493 -3322458 -2612286 -1470089 -1632788 -2185156 -1253729 623739 1301218 875920 1872066
14484 1872066 4886439 6842270 5295023 2292951 1620701 3603998 5186760 4412701
14476 4412701 2218232 -86637 -2517830 -4991450 -6326765 -5694339 -3648963 -1034823
14468 -1034823 1713147 3619151 3366933 1585044 1177729 3668906 6527227 6133964 2563053
14459 2563053 -754996 -1692920 -1364784 -1197065 -511853 1724195 4422713 5359982 4007193
14450 4007193 2023523 1101634 1333852 1779711 1880713 1939530 2438904 3184145 3318343
14441 3318343 2272956 455520 -1328942 -2881772 -4432797 -5551519 -5093034 -2665263
14433 -2665263 388532 2107170 1958367 1337345 1778330 2817092 2211656 -1155478 -5029816
14424 -5029816 -5712089 -2513546 1142027 1913443 336232 -1022162 -1625572 -2688075 -3697337
14415 -3697337 -2442644 1043694 3523361 2823252 761913 255998 1427349 2397242 2459255
14406 2459255 2437397 2683255 2461188 1072365 -1363548 -3779256 -4393962 -2215895 1152177
14397 1152177 2707349 1728500 457565 333232 1880 -1476805 -2257633 -986109 124392
14388 124392 -1273096 -3213506 -2224067 841494 1965282 290768 -1042105 -439900 78787
14379 78787 -820488 -1435456 -419551 909250 1326593 1772985 2921719 3390942 2244442
14370 2244442 900462 725026 888294 366766 -28328 568362 1257781 1198035 1410904
14361 1410904 2904091 4667437 5331901 5209280 4967059 3941297 1536386 -1297006 -3609398
14352 -3609398 -5663375 -6976339 -5476026 -919309 3073309 3307938 1553623 1625998 3458047
14343 3458047 3779845 1973713 1327963 3992386 7879308 9645999 8567350 6472752
14335 6472752 5303461 5369723 5158517 2950403 -625157 -2517552 -925229 2171759 3753194
14326 3753194 3553117 2956153 1777253 -727362 -2790611 -1853218 928800 1736089 -27517
14317 -27517 -819457 1059874 2523708 774513 -2052437 -2121878 656154 3449747 5094867
14308 5094867 6563494 7527393 5815719 1089725 -3307666 -3751737 -603753 2306782
14300 2306782 2240992 379897 -259962 1400627 3940947 5867526 6759361 6132618 3543913
14291 3543913 587037 290319 2917956 4652402 2588920 -1122288 -2731519 -2269179
14283 -2269179 -2009822 -1508092 1264737 4708334 4614301 877754 -1591097 12081 2688303
14274 2688303 2893471 1480362 985152 1448621 1685212 1870817 2142118 1145272 -1266776
14265 -1266776 -2227164 291367 3754346 4232384 1788342 -244822 -186594 687670 1017130
14256 1017130 874923 700614 690448 938921 892305 -433416 -2548734 -3320043 -2042075
14247 -2042075 -698091 -446528 692933 4117098 7035740 5963599 1958489 -1295827
14239 -1295827 -3062358 -5040199 -6409192 -4278918 728229 3978830 3069138 677274
14231 677274 -202902 -213381 -883413 -1142541 776229 3936351 5608732 4537707 1763066
14222 1763066 -801279 -1517916 86943 2589799 3825339 3332331 2391084 1382403 -885275
14213 -885275 -4400322 -6645719 -5615729 -2586818 -273418 620191 1441602 3011489 4496577
14204 4496577 4587992 2972770 907860 482912 2426097 4590204 4081605 1176817 -781636
14195 -781636 -107312 853755 -449453 -2727952 -2991109 -1238543 -164420 -762699 -1167199
14186 -1167199 -242249 316850 -1245120 -3698119 -4286982 -2402697 -162272 550261 201533
14177 201533 267425 805292 427140 -1567412 -4065125 -5370262 -4781891 -2690893 -20413
14168 -20413 1949379 2235624 1469391 1585986 3180673 4277537 3171889 1361405 1560516
14159 1560516 3537207 4419634 2931060 689188 -861817 -1959218 -2348713 -729639
14151 -729639 2166791 2900538 8649 -2996435 -2060600 1724968 3907589 3025964 1870490
14142 1870490 2601507 3831767 3421682 1705188 512440 463648 629471 203359 -520864
14133 -520864 -678692 143960 1409331 2136118 2002529 1667237 1784779 2206996 2567904
14124 2567904 3027372 3744055 4133939 3482303 1990858 534535 -293231 -298987 621822
14115 621822 2093965 2973958 2421589 1186992 1047655 2784716 5039244 5293118 2192320
14106 2192320 -2700918 -5783428 -4886022 -1630625 742085 1337352 1539374 1477831 -382278
14097 -382278 -3508645 -4633550 -2661343 -1018516 -2442175 -4424177 -3391161 -866338
14089 -866338 -1023872 -3780363 -5247640 -4285533 -3438239 -3332759 -1604300 1504797 1892095
14080 1892095 -1796092 -5111197 -4318928 -1708706 -900244 -760562 1587055 4656903 4509849
14071 4509849 1176380 -1510924 -1712831 -987560 -423309 440571 896064 -569515 -2662853
14062 -2662853 -1944306 1871669 4810293 4189355 2089779 1682563 2998628 4204381 4484220
14053 4484220 3598627 895636 -2936194 -5025589 -3589906 -579396 1052593 1154465
14045 1154465 1184357 881703 -949031 -3404775 -4370002 -3978670 -4157622 -4861169 -3919240
14036 -3919240 -990915 1515024 2371328 3265001 5078718 5410139 2214854 -2266593 -4035266
14027 -4035266 -2473325 -273833 857812 1625937 2615248 3201388 3436317 4580682 6806085
14018 6806085 8214371 7227294 4621283 2288732 1154938 1118701 1828578 2512690 2046381
14009 2046381 260890 -1519421 -2076925 -1703331 -1312045 -1128306 -1137864 -1727448 -2640140
14000 -2640140 -2309795 155226 2999128 3583705 1802590 11719 -260474 374799 1252702
13991 1252702 2858440 5026824 5802688 3688982 50752 -2200123 -1832529 -16575
13983 -16575 1766673 3193015 4380353 4859517 3938312 1774675 -357236 -1014873 113724
13974 113724 1867518 2758229 2440111 1732986 1276940 823837 74392 -535703 -453818 182737
13964 182737 1105058 2763660 5520954 8138792 8459757 6216482 4046263 4494896 6550486
13955 6550486 6684595 3503139 -199216 -900612 1441473 4086122 5403830 5943526 5929499
13946 5929499 4377881 1588790 50592 1053477 2302836 1230651 -758182 -263322
13938 -263322 2568819 3770843 1207819 -2570181 -4324252 -4333861 -4780889 -5921142 -6079726
13929 -6079726 -4361747 -1428980 1696793 3923289 3880962 1286436 -1725993 -2328324 -200600
13920 -200600 2226958 2786499 1669759 408048 -102388 -154113 -558565 -1798269 -3454034
13911 -3454034 -4386245 -3827149 -2224025 -688483 152717 382703 211775 -283714 -963529
13902 -963529 -1505688 -1419578 -297633 1414919 2154152 878351 -1049019 -1242424 92180
13893 92180 62888 -2324757 -3934085 -1989948 1368366 2161977 734166 944561 3600807
13884 3600807 4957717 2716392 -426948 -1206246 -424853 -468232 -866029 229174 1790519
13875 1790519 946887 -2146093 -4018076 -3004127 -1550446 -2148534 -3610232 -3452797 -2167285
13866 -2167285 -2421167 -4572084 -5664711 -3599274 -267620 941950 -436263 -1876863
13858 -1876863 -1824566 -1694254 -3340138 -6214782 -8282588 -8668362 -7972249 -6663529 -4737232
13849 -4737232 -2657714 -1114731 61742 1276551 1617935 -208400 -3169125 -4267757
13841 -4267757 -2551582 -786040 -1634316 -3805813 -4009814 -1655586 722816 1369437 1272204
13832 1272204 1798530 2397651 1797123 252426 -664962 -18708 1650595 3104861 3324493
13823 3324493 2002438 -9335 -855833 733525 3670423 5158991 3831342 1630414
13815 1630414 1529296 3681092 5262836 4418627 2722014 2612851 3764909 3850953 2235061
13806 2235061 748349 708584 1207314 987665 254663 -342467 -1027683 -2000415 -2428730
13797 -2428730 -1699230 -836990 -1353853 -3213348 -5031561 -5764849 -5207227 -3511409 -1440328
13788 -1440328 -504338 -1423146 -2717209 -2166686 410416 2981751 3744667 2601063 471743
13779 471743 -1381127 -1360421 1420347 5477615 7682865 6507586 3680278 1955212 2080080
13770 2080080 2662545 2201672 367762 -2104666 -3829852 -3456964 -900716 2201860 3952687
13761 3952687 3959243 3034589 1574323 -586735 -2702278 -2998761 -922320 1518763 1958485
13752 1958485 739017 328136 1732986 3166116 2948374 2180994 3034064 5190771 5783417
13743 5783417 2993868 -1562223 -4453430 -3706367 -328368 2749703 3187810 1313623
13735 1313623 -367003 -195300 734815 671158 291864 1704052 4583158 5781251 3604423
13726 3604423 370804 -688875 478177 1343648 451328 -1079666 -1219534 877204 4059343
13717 4059343 5899178 4919816 2453813 1217585 1798062 2195896 1309577 607007 1170214
13708 1170214 1538636 447122 -580859 18309 496407 -1516133 -4297289 -3801579 140620
13699 140620 3031634 1685128 -2066498 -4561354 -4599779 -3380920 -2234669 -1686528 -1389240
13690 -1389240 -147296 2836529 6349748 8038723 7065664 4659866 2181283 147550
13682 147550 -1102572 -1578169 -2222557 -3487800 -3833858 -1839896 911753 1882443 1835256
13673 1835256 3465938 6053447 5849206 2454073 81973 781358 1146745 -1462370 -3922953
13664 -3922953 -2499000 616220 580674 -2689052 -5149385 -5144457 -4574299 -4278928 -2862266
13655 -2862266 -343514 1037771 507284 93779 1399825 3551403 5025547 5322999 4410702
13646 4410702 2610549 1312872 1720845 2735986 2217534 370221 -493629 295832 865649
13637 865649 156986 -390858 618254 2597387 4503172 6142227 6992275 5924372 3368322
13628 3368322 1781732 2529983 3963509 3957016 2738669 1722110 1063959 127492 -758895
13619 -758895 -737818 135375 1307926 2816734 4590223 5460965 4402751 2172407 214355
13610 214355 -1532660 -3994654 -6392297 -6400955 -3507025 -487047 -243369 -2131159 -2942534
13601 -2942534 -1262177 744171 402181 -1920438 -3529343 -2942069 -1195647 173443
13593 173443 717003 300760 -1387009 -3503356 -3842947 -1496393 1447894 2451932 1767577
13584 1767577 1456433 2190915 2983821 3220901 2807623 1143015 -1556430 -2710360 -234574
13575 -234574 3457991 3896829 1164600 28764 2450795 4345131 2133634 -1557753
13567 -1557753 -2343639 -1018380 -1550553 -4059480 -4702508 -2161360 312168 53659 -1602970
13558 -1602970 -2372948 -2352639 -2610283 -2910215 -2755343 -2890816 -3857172 -4368295 -3035415
13549 -3035415 -859852 -187868 -1571067 -3277877 -3865770 -3782994 -4061458 -4548854 -4191324
13540 -4191324 -2614446 -755380 141703 -107547 -431670 317485 2099327 3710980 3995406
13531 3995406 2850888 1141817 -77370 -255320 316167 648857 -100318 -1575262 -2237359
13522 -2237359 -927867 1580527 3080282 2197903 -201070 -2149049 -2690241 -2330241 -1727749
13513 -1727749 -829103 574905 2215528 3634275 4591698 4981710 4894595 4817682 4946280
13504 4946280 4283120 1737505 -1571886 -2855569 -1367553 353736 398880 427467 2231264
13495 2231264 3434552 447745 -5196397 -7846662 -5448736 -1969892 -897065 -658930
13487 -658930 1131023 2937482 2402169 1090558 1854121 3437756 2303748 -1090371 -2460860
13478 -2460860 -268610 2200918 2315837 1765428 2949527 4888709 5195677 4032647 3587240
13469 3587240 4692241 6027399 6159392 4887833 2936507 1388126 1061024 1664852 2025268
13460 2025268 1711356 1748312 3062256 4960391 5951377 5492801 4191093 2809599 1808956
13451 1808956 1413244 1420299 1240209 618535 -11564 -234786 -222011 -254091 -242066 -77516
13441 -77516 130967 471790 1178480 1906151 1980418 1701556 2211300 3483773 3891299 2829632
13431 2829632 2288292 4123339 6928989 7769537 6374404 5214241 5502321 5658289 4340730
13422 4340730 2624895 1951481 1861934 1296125 552950 242960 -366833 -1954198 -3082374
13413 -3082374 -1844094 848208 1935566 295028 -1940655 -2489177 -1333442 491568
13405 491568 2399249 3552783 2677167 35499 -1990322 -1819814 -740978 -493048 -414930
13396 -414930 831958 2104351 1179354 -1306595 -2273839 -630597 1458428 2188926 2348404
13387 2348404 3041029 3627132 3250676 2450463 1901129 1252679 482859 688695 2144181
13378 2144181 3219807 2770366 2090277 2916928 4920850 6708779 7700972 7311550 4231687
13369 4231687 -992519 -4338952 -2383820 2856299 6156000 5589360 3751002 2842970
13361 2842970 2042084 311688 -1357912 -1742195 -1080882 -24032 1064434 1211384 -356147
13352 -356147 -1926478 -613217 3108300 5177983 3660076 1515819 1698209 2768085
13344 2768085 2287754 1538285 2927894 4930443 4253477 1922853 2223513 5492047 6925273
13335 6925273 3906103 13708 -650893 664327 414294 -1193249 -1173678 710342 1472140
13326 1472140 -194221 -2061235 -2136469 -1420012 -1659121 -2571148 -2894315 -2682684 -2862384
13317 -2862384 -3356890 -3181377 -2053087 -730471 136848 656089 1214909 1844007 1988988
13308 1988988 917617 -1043647 -1810930 486386 4367537 5687961 2796194 -807729
13300 -807729 -1069587 984369 1222395 -992007 -2044952 -114283 2141348 2390678 2299652
13291 2299652 3888726 5471300 4574948 2529098 2375019 3771739 3881244 2352863 1368742
13282 1368742 1157709 -186679 -2069459 -1130137 2929968 5509384 3565429 305739
13274 305739 187032 2091394 1546396 -1844491 -3627388 -1251933 2201981 2417180 -603657
13265 -603657 -3213338 -3006770 -1244361 -663034 -2148937 -4081695 -4558496 -3552420 -2430410
13256 -2430410 -1769712 -697511 1369200 3398339 3952697 3088212 2181108 2178213 2767471
13247 2767471 3139429 2899067 2090209 692539 -1516591 -4259063 -5975855 -4681422 -445268
13238 -445268 3673134 4503938 2301059 31730 -569182 -471328 -906057 -1578958 -1896458
13229 -1896458 -2004019 -1782481 -659799 735471 745302 -485829 -625625 990010 1625533
13220 1625533 -582803 -2995618 -2068930 1137977 2420366 405358 -2374561 -3974647
13212 -3974647 -5067969 -6134639 -5946244 -4005335 -1954234 -1241017 -1258221 -837192 124125
13203 124125 1446008 3363061 5389375 6048420 4913451 3626484 3681435 4219737 3231962
13194 3231962 284174 -2934548 -4355784 -3199638 -384959 2189514 3117342 2586681
13186 2586681 1927169 2304278 4107050 6785757 8477037 6942382 2493706 -1031929
13178 -1031929 -496932 2018264 1803534 -1535240 -3292103 -816131 2247041 1348232 -2116322
13169 -2116322 -2733392 1457471 6673021 8376455 5962629 2118975 -463566 -973467
13161 -973467 -333607 -66363 -996197 -2726520 -4209324 -4426314 -2661939 912061 4706760
13152 4706760 6866785 7277944 7194608 6626798 3985936 -773945 -4674181 -4974506 -2364993
13143 -2364993 717498 3275344 5200313 5273709 2724297 -22374 614553 4358326 6836599
13134 6836599 5040376 822444 -1836334 -1169602 1599214 4157137 4816470 3605261
13126 3605261 2442024 3160298 4896617 4769977 1742178 -1668221 -2476925 -808635 741942
13117 741942 391448 -1374020 -2996914 -3298933 -1923207 666440 3343410 4863603 4595253
13108 4595253 3017269 1645340 1947233 3717922 4948129 4083166 1938128 362058
13100 362058 -406638 -1546400 -3206457 -4178495 -4078153 -3807124 -3435381 -1833146 729903
13091 729903 1914272 699486 -641503 106820 1585852 1115784 -901022 -1690475 -571203
13082 -571203 287439 -325994 -961784 -393072 317194 -53437 -722338 -506787 -21274 -333859
13072 -333859 -442912 1694602 5730913 8479636 7542701 4119686 1331189 487783 61554
13063 61554 -1730870 -4268116 -5099666 -2991828 307605 1789108 356622 -2282039 -3787141
13054 -3787141 -3512453 -2430789 -1491465 -775403 -29128 664186 895385 328377 -898747
13045 -898747 -1989131 -1963870 -749014 424842 310434 -739947 -1157937 -242744 981520
13036 981520 1340965 1032294 843827 683421 24642 -702193 -603622 -86838 -500875 -1646964
13026 -1646964 -1384169 1212520 3773797 3404172 678438 -1087375 -382979 673255 -365041
13017 -365041 -2790846 -3756768 -1903567 1271924 3468679 3978267 3710956 3421112 2696169
13008 2696169 1042142 -626179 -771767 233750 -220891 -3592111 -7497445 -8219957 -5444937
12999 -5444937 -2449478 -1481860 -1196730 472712 2965890 4189909 3570233 2264987 1165328
12990 1165328 366650 191473 1122568 2691325 3661555 3498488 2806092 2233419 1690752
12981 1690752 797150 -385507 -1217110 -1015390 55400 770737 248829 -486532 441070
12972 441070 2858299 4224280 2983335 615617 -853089 -1677802 -2924738 -3725651 -2532663
12963 -2532663 -304181 256153 -1485466 -3475508 -4268664 -4536287 -4890019 -4592068 -3307175
12954 -3307175 -2111969 -1696887 -1211275 96889 1555504 2315372 2536834 2419375 1399463
12945 1399463 -665783 -2617709 -3177536 -2135247 -35912 1997664 1971800 -1376481 -5928328
12936 -5928328 -7347733 -4187079 201864 2254948 2368856 2499431 2066894 -536704 -3857766
12927 -3857766 -4490900 -2040768 249124 152618 -1072690 -1495753 -1162833 -849871 -383337
12918 -383337 318776 139482 -1689792 -3870767 -4320639 -2813283 -1295016 -1581529 -3295082
12909 -3295082 -4232394 -2799913 -62738 1189751 -142289 -1804629 -974914 1995727
12901 1995727 4187129 4145276 3457761 4042270 5679585 7010001 7459588 7132168 6005267
12892 6005267 4455432 3668353 4158934 4454284 2762645 -126401 -1173730 1039443 4015826
12883 4015826 4237203 1778005 209729 1534568 3284849 2346674 -31244 -66430 2266122
12874 2266122 2588870 -1149836 -5040668 -4799128 -1857936 -393850 -677597 232915 2495278
12865 2495278 3070016 1274883 6656 492618 276117 -1905968 -3419109 -2322466 -967053
12856 -967053 -1934730 -3416671 -2209685 857386 2228194 1055058 -175062 200450 1358051
12847 1358051 2261558 2948647 3550172 4077200 4946556 5994904 5735342 3561372 1660618
12838 1660618 2297478 4141596 4146441 2346925 1509065 2281960 2297280 527814 -1015276
12829 -1015276 -1011370 -990951 -2245273 -3466511 -3271487 -2538818 -2293940 -1615999 181114
12820 181114 1430866 657894 -560195 92 1344809 790060 -1475929 -2439375 -738659
12811 -738659 1757254 3210970 4034879 4949734 5037478 3167698 25341 -2606809 -3826770
12802 -3826770 -3919472 -3333980 -2294947 -1136835 -289956 92593 225353 450737 921336
12793 921336 1363328 1292062 725393 412854 912000 1719973 1920567 1492731 1332022 2091205
12783 2091205 3543420 4837172 4816506 2656146 -780291 -2673731 -846391 3275400
12775 3275400 5722046 4403527 1207715 -781343 -784879 -220334 -321432 -1077450 -1843462
12766 -1843462 -1908033 -849757 863775 2034733 2095796 1725828 1543982 1083284 -65985
12757 -65985 -1047641 -910102 -211829 -24541 42598 1124656 2702824 2763237 539256 -2483404
12747 -2483404 -4562234 -5181777 -4295298 -1889934 942491 2176304 1278035 221822 860762
12738 860762 2346386 2557166 1296712 449718 1171906 2391668 2417147 1044267 -477336
12729 -477336 -1128799 -1209116 -1611499 -2366687 -2621675 -2258509 -2428539 -3491233 -3602062 -1303789
12719 -1303789 1219739 244782 -3963801 -6729280 -5065486 -1231162 1411814 2984424
12711 2984424 4968129 6315486 5280643 3296740 3133824 4247032 3862730 2078966
12703 2078966 1754264 3321508 3966864 2704515 2144015 3819577 5576773 5442630 4553516
12694 4553516 4039025 2405776 -1180333 -3983077 -3326896 -810932 420852 570730 1719795
12685 1719795 3136108 2186881 -786873 -2551140 -1912769 -828404 -264835 1236719 3826874
12676 3826874 4803801 2709576 105489 -20683 1541210 1992705 836405 -142495 -133182
12667 -133182 106796 490554 1830213 3548923 3524020 1173719 -1121461 -1002636 798656
12658 798656 1922690 1918255 2333551 3582448 3935377 2280609 41684 -876596 -686257
12649 -686257 -793560 -1311674 -1215885 -414215 44823 -400447 -1458965 -2898922 -4260537
12640 -4260537 -4149876 -1832917 718274 693115 -1566865 -2960194 -2359132 -2057292 -3473587
12631 -3473587 -4417189 -2576191 703965 2475644 2232223 1590597 1368418 1227585 1104775
12622 1104775 984181 337548 -444234 450814 3268688 4882785 2623299 -1473466 -3219689
12613 -3219689 -2017372 -817267 -1068084 -1308641 -807726 -1010191 -2496341 -3490788 -2605662
12604 -2605662 -782174 518133 1080775 1144182 841234 1141485 3241207 6083673 6516044
12595 6516044 3165888 -1409496 -3604174 -2561352 -251963 978553 132240 -2019407
12587 -2019407 -3467755 -2797961 -889889 79166 -646945 -1778636 -1889284 -616258 1671644
12578 1671644 3730177 3446278 152135 -3388774 -3795802 -1671902 -533300 -1259858 -1241331
12569 -1241331 352854 631697 -1872632 -4047685 -2974838 -541284 79710 -245711 1177307
12560 1177307 3338786 2784284 -279526 -1562538 1153734 5148830 7080036 7004073 6553736
12551 6553736 5680698 3365242 164121 -1944560 -1818571 -32117 2145494 3720522
12543 3720522 4216033 3819894 3309958 3280123 3400851 2856809 1560495 490079 567338
12534 567338 1521431 2250536 2045791 904013 -1054721 -3422590 -4773005 -3639534 -929729
12525 -929729 218246 -1673644 -4088010 -3913440 -1968627 -1639296 -3611761 -4851935 -3138412
12516 -3138412 9363 1789219 1383986 -166655 -1515650 -1461924 475270 2888633 3267269
12507 3267269 907792 -2026845 -2936497 -1228125 1790795 4057442 3808042 1229509
12499 1229509 -973367 -624241 586194 -575537 -3439985 -3881513 -820003 1758269
12491 1758269 985382 -607000 333798 2577239 2960814 1815276 1845025 3246880 3821756
12482 3821756 3186648 3363470 5223485 7149040 7476114 6240920 4414144 2933733 2363990
12473 2363990 2409810 2233455 1898295 2271664 2824954 1557965 -1611932 -3656884 -2418025
12464 -2418025 479348 2690217 4567885 6890809 7771853 5357678 1737646 445283
12456 445283 1356760 1630594 574447 -66795 246771 610366 1386967 3479449 5388031
12447 5388031 4674775 2090550 685045 1063906 1127988 265847 -54270 132606 -889634
12438 -889634 -2753263 -2972212 -1262226 -106260 -355639 -150956 945132 820902 -907676
12429 -907676 -1525299 162702 1644426 1146051 638644 2044646 3787533 3837162 3284090
12420 3284090 3947543 4833694 3990684 2026671 908280 711892 217918 -478170 -467359
12411 -467359 -183226 -666354 -1285659 -350726 2253035 4795285 6061740 6714098 8080212
12402 8080212 10126008 10808090 7928331 2316982 -1736124 -1001672 2311240 3091030 64637
12393 64637 -2875377 -2483377 -146914 1110905 697784 -155512 -643588 -295804 1281649
12384 1281649 3033762 2859204 739583 -757630 -408409 -108226 -1016073 -834666 2545017
12375 2545017 7103349 9198413 8131935 5596779 2496114 -725358 -2211362 -519336
12367 -519336 2441759 3249713 1400672 -479466 -423206 1081200 2689785 3579507 3511478
12358 3511478 3155352 3879344 5837027 7104143 6141873 4012200 2567054 1744459 549015
12349 549015 -582361 -589063 69721 252257 204480 704801 1116393 471411 -462648 -445816
12339 -445816 -75486 -385375 -168443 2393861 5992896 7111139 4700429 1276538 -800008
12330 -800008 -1596688 -1845435 -1347941 114715 2040675 3841008 4808128 3643485 -32311
12321 -32311 -3730670 -3971331 -756433 1779144 200058 -4106913 -6699317 -5213695 -1793114
12312 -1793114 -371744 -1956773 -3417942 -1771671 1323597 1727127 -723075 -1500967
12304 -1500967 1500461 4103258 2117332 -1996572 -3057813 -1151066 -438715 -1532331
12296 -1532331 -1006595 1514573 1837680 -1667201 -4678275 -3251780 624049 2691567
12288 2691567 2278216 1459579 1053672 589039 405216 933217 1186750 338109 -376894
12279 -376894 559695 2384702 3289668 3208960 3386114 3952466 3845927 2650719 918694
12270 918694 -922949 -2625788 -3535729 -3249535 -2580071 -2859448 -4493409 -6757084 -8451826
12261 -8451826 -8339987 -5936672 -2582037 -677549 -992811 -1767963 -1418290 -942677 -2293993
12252 -2293993 -5237270 -7403419 -7176195 -5269920 -3476115 -2728046 -2458845 -1428119 707561
12243 707561 2554196 2234522 -407105 -3602837 -5754387 -6670644 -6514468 -5002608 -2517057
12234 -2517057 -780866 -1183221 -3031475 -4365349 -4006122 -2205362 8713 1462860
12226 1462860 1557474 1030573 1295010 2444395 2805706 1181170 -1388197 -2979434 -3117453
12217 -3117453 -2804813 -2825176 -2904718 -2210036 -208109 2406162 3442022 1029695 -3707899
12208 -3707899 -7079753 -6839016 -4549137 -2900004 -2124643 -786489 1048670 1762791 1015291
12199 1015291 389268 831745 1288767 621499 -606113 -1249875 -1377609 -1714261 -1955726
12190 -1955726 -1028906 1000978 2556818 2564925 1808163 1379422 657524 -1626729 -4598996
12181 -4598996 -5578908 -3879130 -2193899 -2617521 -3113118 -516268 4005264 5743888 2878379
12172 2878379 -1017066 -1979004 -397515 1072644 2018745 3959961 6652277 7636236 5794789
12163 5794789 3231635 2554516 3463908 3382377 1255068 -678861 125757 2583756 2974125
12154 2974125 190168 -2302332 -1283633 1592130 2553848 1360109 674370 835826 -387230
12145 -387230 -2715734 -2724949 389094 2913412 2685707 2726551 5659493 8449919 6891972
12136 6891972 2324414 -782710 -1699078 -2856620 -3894994 -1865985 2692559 5176731
12128 5176731 3443683 406590 -1292533 -2899649 -5658422 -7116585 -4533350 386119
12120 386119 3383435 3119997 2078401 2500467 3739722 3965393 2972891 2419578 3536309
12111 3536309 5242528 5239751 3037665 728374 13477 -124830 -1318450 -2810734 -2810776 -1817200
12101 -1817200 -1880433 -3138576 -4004825 -4423533 -5603360 -6524854 -4590911 -562123 1164381
12092 1164381 -1142104 -3761971 -3313070 -1651881 -1892905 -2821000 -1400292 1323964 1452212
12083 1452212 -1384703 -3160360 -1372907 1640556 2332552 362118 -1822513 -2195288
12075 -2195288 -901018 402907 443780 -190257 169129 1818724 3202637 3456382 3653638
12066 3653638 4348031 4020119 1924324 324061 1218108 2785170 2331311 1023643 1722990
12057 1722990 3419431 2584279 -331591 -921897 1962350 4143015 2882532 832420
12049 832420 774823 1031836 -494382 -1692398 140705 3005716 3034655 685504 -278546
12040 -278546 1238020 2941334 3700928 4654553 5741335 4976080 1939149 -1010371 -1864923
12031 -1864923 -1072637 -113854 -91569 -1879272 -5430684 -8683888 -9188632 -6977002 -4051664
12022 -4051664 -1499265 629469 1272446 -715154 -3666191 -4323301 -2300256 -337415
12014 -337415 132422 366758 878840 373382 -950418 -887734 612436 737263 -937641
12005 -937641 -682645 3274122 6876990 5846978 1671247 -1608079 -3183773 -3931110 -2439704
11996 -2439704 2163033 5874932 4113011 -988846 -3293814 -1862775 -1420125 -3662923
11988 -3662923 -4532374 -1585230 1815818 2150602 625405 -373523 -1286555 -2674749 -2390617
11979 -2390617 944749 4624186 5445473 4121007 2986920 1931509 96895 -721461
11971 -721461 1633435 5500526 7263070 6295594 4633960 2911179 353402 -2058020
11963 -2058020 -2443197 -1768352 -2766745 -4935896 -4610446 -865998 2438762 2004257 -802380
11954 -802380 -2973173 -4027484 -4861425 -4843669 -2901181 -265676 426135 -1525477 -4088431
11945 -4088431 -4818220 -2953253 287280 2656644 2818982 2031192 2895810 5662123 7153475
11936 7153475 4753277 249895 -2151052 -966302 1382095 2285497 1784027 1244833 1039776
11927 1039776 736218 613613 1582083 3575943 4968337 4223057 1987048 831169 2348486
11918 2348486 4933181 5454305 3111764 352647 -430938 395393 1262644 2056533 3426353
11909 3426353 4579356 4145690 2843271 2745898 3695673 3069226 -21838 -2863001 -3041919
11900 -3041919 -1987206 -2418019 -3979627 -4111360 -2309790 -702714 -598400 -1095437 -1343239
11891 -1343239 -1709864 -2126067 -1599689 -293977 61016 -963385 -1200304 962960 3757543
11882 3757543 4149213 1643591 -1684797 -3955048 -4568575 -3429375 -994593 1288635
11874 1288635 2208446 2173911 2141652 1865232 756587 -277265 157850 1498878 1837653
11865 1837653 825524 -107147 -461689 -1389039 -3252263 -4537641 -3988748 -2178560 -272901
11856 -272901 1235327 1999344 1674902 950496 1094540 1867090 1670881 437225 206625
11847 206625 1715066 2667961 1178486 -1040221 -1125632 803763 2418261 3017238 3922582
11838 3922582 5427540 5981287 4766760 2970064 1786819 798504 -764305 -2264791
11830 -2264791 -2216334 -252989 2143896 3084625 2353098 1642137 2201147 2805036 1491184
11821 1491184 -832435 -788496 2522732 5337771 3992852 15583 -2198468 -1580564 -1164838
11812 -1164838 -3035210 -5631093 -6604422 -5689531 -3792754 -1437855 748428 1777849
11804 1777849 1640907 1458183 1448052 360893 -2051669 -3701672 -2754269 -245198 1426652
11795 1426652 1567182 1130634 470195 -906470 -2523963 -2706731 -728279 1826743 2453993
11786 2453993 155474 -3622351 -6187409 -5895838 -3661402 -2046278 -2506136 -3770754
11778 -3770754 -3356757 -441868 3242239 5266782 4863151 3453615 3040549 4056103 4924216
11769 4924216 4052885 1956938 538012 281785 -535005 -3212930 -6425722 -7831111 -7050368
11760 -7050368 -5583007 -4209437 -2193017 753884 3285910 3935386 2788837 994615
11752 994615 -521448 -1187819 -582295 917050 1963626 1831151 1662996 2880331 4684116
11743 4684116 4713151 2345593 -275713 -1159721 -875853 -912924 -992515 179674 2178056
11734 2178056 2980782 1999456 1126914 2016813 3751757 4260164 3031067 1229789 -242983
11725 -242983 -1495151 -2560860 -2746132 -1528223 415621 1590998 1149028 -196532 -935940
11716 -935940 -483017 278730 418264 226666 303433 137412 -974041 -2045326 -1398093
11707 -1398093 390736 813455 -630270 -1322003 253959 1768546 874846 -521956 844295
11698 844295 3959857 4803363 2790884 1629857 3093136 4275126 2895876 1395307
11690 1395307 2776118 5439662 5808181 3978283 2779136 2477324 757643 -2196959
11682 -2196959 -2963529 -270924 2609353 2692799 1472023 1984262 4029258 4915924 3459612
11673 3459612 797980 -1700257 -3151976 -2819485 -1281534 -946152 -2978068 -4696172
11665 -4696172 -2893696 1012577 2576591 826337 -716418 21492 1031724 997017 2104310
11656 2104310 5211257 6450883 2955864 -1281304 -498244 3952242 5573533 2678713
11648 2678713 146339 684470 716227 -2632069 -6029946 -5213176 -1553070 895732 1730422
11639 1730422 3013392 4091444 2670901 78260 446762 4248782 6855920 4767967
11631 4767967 10604 -3157451 -3335590 -2108731 -1005452 -165422 850474 2174262
11623 2174262 3214996 2848422 757461 -1463799 -1785296 -464606 126817 -1210463 -2882370
11614 -2882370 -2906346 -1596271 -753186 -1092186 -1685433 -1573282 -888376 -331466 -170020
11605 -170020 -38212 374487 654715 91017 -1038099 -1215218 543581 3068736 4230384
11596 4230384 3703345 3391298 4709693 6495221 6497944 4392300 2211836 1702718 2199854
11587 2199854 1805314 113054 -1360543 -1506689 -1101378 -1291265 -1815374 -1879444 -1669057
11578 -1669057 -1367711 267474 4041430 7677351 7854978 4859235 2226195 1505930 818701
11569 818701 -617268 -612312 1426195 2163064 -346588 -2637033 -1027634 2240630 2658842
11560 2658842 791274 687897 2511402 2523799 93310 -1021528 858021 2831945 2781249
11551 2781249 2365408 2729667 1723408 -1978728 -5694440 -6481866 -5077419 -3512122 -1630808
11542 -1630808 1253033 3689087 3991714 3025525 2612147 2786712 2783387 2951433 3512083
11533 3512083 3263796 1820951 1245945 2857529 4172447 2059810 -2208889 -4132939
11525 -4132939 -1752164 2337499 4529217 3636814 987393 -1076066 -950781 568735
11517 568735 852736 -1186475 -3269577 -2728934 -119151 1931528 2337595 1948398 1257999
11508 1257999 29820 -1259167 -1731191 -1683922 -2122889 -3004021 -3479310 -3426688 -3246209
11499 -3246209 -2788372 -2029790 -1975550 -3148842 -4076998 -3213721 -1479200 -796004 -1033402
11490 -1033402 -781229 -252011 -616218 -1068987 323417 2995671 4256847 3482637 2760281
11481 2760281 2919004 2333467 649687 155115 1668733 2356064 147036 -2425219 -1883447
11472 -1883447 747000 1662436 299771 -88059 2183324 4762090 5146272 4178063 3951173
11463 3951173 4277888 3445634 1453118 196573 484393 844815 -39096 -1247840 -1160992
11454 -1160992 -86434 173690 -940964 -2016399 -1878072 -1036842 -232221 1094784 3577507
11445 3577507 6005365 6236865 3999929 1485913 767716 1524954 1910433 1126626 326448
11436 326448 796335 1829310 1263913 -1601397 -4533652 -4854041 -2953797 -1867048 -3226384
11427 -3226384 -5234123 -5356856 -3611647 -1986861 -1567906 -1612843 -1094013 -28668 723199
11418 723199 424172 -685213 -1394169 -870264 101615 208712 -142624 783646 3107545
11409 3107545 4639756 3955180 2254752 935555 -735557 -3693007 -6449151 -6660833
11401 -6660833 -4369878 -1639542 304771 1694204 2692327 3128102 3180446 2662825 392368
11392 392368 -3916450 -7871783 -8441142 -5271787 -498031 3705913 5691736 4111722
11384 4111722 -175014 -3167626 -1774886 1912382 3438391 2284738 1763778 3014984
11376 3014984 3310974 1042421 -1559292 -2127363 -1274294 -390322 713812 2191679 2791764
11367 2791764 1950643 1057023 991407 560629 -981056 -1964030 -642193 2266456 4926507
11358 4926507 6582727 7147910 6523573 5622798 6037438 7420038 7424932 5497373 4034682
11349 4034682 4200415 3712766 1149159 -729375 728901 3057572 1936796 -2157403
11341 -2157403 -4585579 -3048436 179545 2193422 2375757 1384938 25412 -715921 -615714
11332 -615714 -932709 -2412122 -3590998 -3194965 -2719917 -3846253 -4860441 -3173994 -140239
11323 -140239 734766 -368068 18548 2607102 4395700 4146224 4006978 4626904 3520649
11314 3520649 112068 -2240792 -1694245 -1086884 -2773235 -4366024 -3143130 -1048798
11306 -1048798 -1144121 -2006013 -283275 3120418 4082737 1523373 -1537844 -2759342 -2682875
11297 -2682875 -2370238 -2052821 -2063410 -2437110 -2000771 -373261 112484 -2463318 -5585346
11288 -5585346 -5102459 -1510874 532689 -1010887 -3280942 -3461339 -1979911 137526
11280 137526 3055725 5690734 5207301 1133489 -2979711 -4113710 -3413899 -3340531 -3803906
11271 -3803906 -3387248 -2251278 -1545775 -1507831 -1848373 -2470743 -2654883 -1525911 -243004
11262 -243004 -1086901 -3365594 -3569629 -1093913 110555 -2120540 -4375895 -3424631 -1498677
11253 -1498677 -1571786 -1421525 2098242 6080568 5251932 644180 -1960913 -1067116 -228708
11244 -228708 -331697 1663086 5562281 6697152 3767906 1368068 2095912 2371231 -565237
11235 -565237 -3333549 -2316398 114803 4031 -1624922 -1490859 -47184 153633 -506127
11226 -506127 -51455 816023 354137 -99386 1847952 4899188 5715524 4207866 3002852
11217 3002852 2615343 1393314 -415526 -778358 243624 683641 498399 1319081 2576962
11208 2576962 1965527 -69296 -421362 1508811 2729269 1701242 660809 1523032 2910969
11199 2910969 2930884 1935118 845919 -548401 -1864549 -1218386 1896992 4754867 4427014
11190 4427014 1398473 -1343759 -1727275 37384 2443502 4061167 4598832 4888880 5180809
11181 5180809 4238155 1749855 462759 2957600 6890251 7222814 3499006 737169
11173 737169 1846180 3508139 2040490 -668332 -686531 1541821 2579430 1996154 2581017
11164 2581017 5097348 6824239 5842159 3681361 2718543 3069980 3070453 1577999 -751693
11155 -751693 -1762056 375509 4680822 7410189 6054768 2673196 1403830 3048289
11147 3048289 4301976 2495171 -1161199 -3821352 -4488716 -3951893 -2772521 -1106830
11139 -1106830 196211 162063 -524992 203821 3009756 5599282 5154007 2072261 -58657
11130 -58657 1123973 3386163 2352397 -2777906 -7513091 -6985787 -1745477 2679996 2061169
11121 2061169 -1833070 -3611435 -771947 3517314 4627789 2151351 -250988 -150487
11113 -150487 876745 560472 -304741 521950 2795749 4113523 3733975 3463292 4457533
11104 4457533 5560645 5651280 5490321 5900350 5837724 4053043 1654377 1153579 3185656
11095 3185656 5629139 6140998 4524498 2311249 897965 752706 1936051 4289458
11087 4289458 6704183 7113288 4397287 145280 -2673168 -2926746 -2003976 -1177159 -76691
11078 -76691 1473239 2066370 699040 -1320248 -2084257 -1496396 -528602 379098 541588
11069 541588 -1317691 -4251770 -4080016 1375067 7609902 8095180 2881473 -1699690 -1748089
11060 -1748089 351105 1359704 1671692 2489666 2624459 870539 -1204091 -1383434 186320
11051 186320 1904510 2815113 2493443 846515 -842832 -758494 728845 1535922 1548701
11042 1548701 2730074 4854259 4930240 2287484 294398 1068693 2428509 2373163 2406924
11033 2406924 3577144 3548566 1185094 -214889 1509242 2740619 65977 -3005177
11025 -3005177 -1353072 2928563 3936655 1965667 2470585 5842373 6167626 1189429
11017 1189429 -3718525 -3717081 -558028 2029131 3575110 4639673 4137269 2067224 1016006
11008 1016006 2061834 2705427 1381418 301777 1156156 1860250 681611 -217259 1020358
10999 1020358 1826151 -436473 -3113713 -2118515 1189098 2142683 248589 -792864 245333
10990 245333 933434 820277 2656008 6527191 7903945 4268477 -356650 -929693 1467754
10981 1467754 1808478 -1305304 -4234776 -4132269 -2566841 -2357738 -3395475 -3385742 -1479730
10972 -1479730 670456 1381425 1095513 1332470 2075777 1435171 -1532941 -4615869 -4525436
10963 -4525436 -1181570 1705189 1168979 -1241796 -1677681 906967 3763047 4293575 2989221
10954 2989221 1859903 1702959 2048949 2502934 2758262 2165017 688338 -354621 78705
10945 78705 967242 625044 -587658 -833919 65760 214810 -1241058 -2719512 -2843342
10936 -2843342 -2487857 -2802542 -2903949 -1384207 1067565 2549452 2753871 2934875 3447038
10927 3447038 3309049 2277572 1472740 1452671 1249707 79147 -1215718 -1282076 48734
10918 48734 1925242 3544174 4292547 3596389 1628846 -345909 -1395822 -2281039 -4086949
10909 -4086949 -5706449 -4537419 -366264 3296132 3384150 1412292 1114995 2734608 2784108
10900 2784108 -99139 -2506598 -1382013 1061165 574397 -2745803 -4786263 -3442529
10892 -3442529 -948394 -91717 -1122038 -2928007 -4556443 -4801057 -2781594 134693
10884 134693 1247229 276580 -8927 2103047 4780500 5416555 3732533 896119 -2237710
10875 -2237710 -4515805 -4241491 -1366103 1661773 2742142 2294115 1467828 234821 -1291957
10866 -1291957 -1757614 -534426 1087847 2178326 3385560 4302483 2510599 -2249871
10858 -2249871 -5728722 -4245059 46240 2388005 2007626 1736259 2634955 3179640 2989253
10849 2989253 3270708 3786431 3116189 1849592 1932846 2897454 2429218 786466 708509
10840 708509 2380879 2587895 148336 -1675523 -152584 2820563 3945087 3216813 2843442
10831 2843442 3356462 3373032 2242773 878721 365703 946199 1924155 1980947 430665
10822 430665 -1437153 -1434478 657230 2595358 2565090 1209432 192526 92980 449041
10813 449041 784208 987009 1523199 3294759 6081944 7438096 5101950 568135 -2078734
10804 -2078734 -1424618 -361736 -1488462 -3448952 -3569740 -1900706 -334859 654904 1775959
10795 1775959 2362921 861607 -2118502 -3647805 -2101941 760261 2268100 2092108
10787 2092108 1780017 1819422 854421 -1815993 -4340141 -4234188 -1777603 28577 -731706
10778 -731706 -2483956 -2491916 -529591 1147083 980986 -222169 -901014 -788980 -794946 -1441191
10768 -1441191 -2100459 -1967183 -1484346 -1968035 -3298507 -3099817 182202 4170989 5031182
10759 5031182 2991978 2314490 4877572 7181626 5765132 2487329 1427102 2941380
10751 2941380 4283326 4387378 4328985 4159331 3088806 2268375 3637485 6022036 5909797
10742 5909797 2495100 -1230070 -2922971 -3404348 -4038883 -4483106 -4107146 -3331475 -2530809
10733 -2530809 -1447978 -327077 87169 -34172 61383 1624 -1082076 -2393478 -2226968
10724 -2226968 -774093 253238 669057 1770953 3236265 3047319 976356 -678350
10716 -678350 -454260 791055 2217634 4049117 5703189 5715386 4302503 3331885 3109492
10707 3109492 2033781 62089 -653246 443891 1098436 85010 -872121 -498245 -213925
10698 -213925 -1243827 -2337704 -2202185 -1523256 -819886 892883 3356304 3902664 1411409
10689 1411409 -1204379 -1002544 925614 2028962 2536418 4082568 6085315 6750401 6249528
10680 6249528 5804827 4887495 2515111 275888 597849 2533527 2844965 1406161 1890485
10671 1890485 5953170 9911577 9364806 5074030 1734576 1824545 3226043 3136804 1996674
10662 1996674 2101797 3780588 5107398 5052310 4581206 4095562 2140059 -1829734 -5279599
10653 -5279599 -5334230 -2586710 -154402 227727 -758932 -2018378 -2927516 -2823264 -1680454
10644 -1680454 -828336 -1164761 -1458285 -411901 682617 -144185 -1915835 -1832628 550784
10635 550784 3023257 4084865 3920836 2659948 538056 -857644 -495368 -256329 -2177297
10626 -2177297 -4402974 -3794269 -1676101 -2296443 -5686053 -7027424 -3906999 491813
10618 491813 2690807 3025082 2845758 1712916 -537893 -2252996 -2444027 -2125924 -1852147
10609 -1852147 -700126 1154267 1711643 173815 -1837435 -2835663 -2749634 -1458714 1010565
10600 1010565 2740084 1626525 -1021195 -1855253 -374287 995577 1289864 1578956 1641478
10591 1641478 401817 -728139 419509 2147616 1016430 -1885403 -2296809 -66186
10583 -66186 885620 -277336 -608495 73555 -1151755 -3583345 -3062992 210639 1455895
10574 1455895 76467 846265 4697062 6460799 4107719 2144834 3110902 3724710 2362609
10565 2362609 2145138 3485797 2081204 -2210741 -3216337 1049658 4651220 4421002
10557 4421002 4783270 7409849 6526073 457008 -2703674 1664730 5783993 2146991
10549 2146991 -4161000 -4878952 -1793463 -960792 -1386680 638088 2612721 916011 -1228663
10540 -1228663 38399 1154900 -1814377 -4462559 -1642939 2426274 1185432 -2933886
10532 -2933886 -3627281 -1646655 -1435915 -2219789 -1224125 -397595 -1834594 -2445974 -617081
10523 -617081 -971941 -5142402 -6479871 -1910258 923583 -2835968 -5798871 -2279374
10515 -2279374 593840 -2912053 -5004040 570797 5178217 1554805 -1224485 4673232
10507 4673232 8894679 2123256 -4094331 2072545 9231541 3788383 -3174335 2610133
10499 2610133 8671856 -859160 -10843123 -1117333 12089669 4389271 -6235915 9515799
10491 9515799 28690744 13031204 1418015 77106638 223079527 300847305 223689485
10484 223689485 76959835 1003148 14511825 31952167 11601099 -6726088 3605478
10477 3605478 13464241 1888375 -8130833 533266 7927827 -1455479 -10105481 -3120872
10469 -3120872 4604083 -1146619 -7993566 -2957182 3140561 -1744963 -7653151 -2426343
10461 -2426343 5488503 3587942 -2480652 -1495674 3262296 3366280 1845829 4810398
10453 4810398 7649592 3969841 -1390244 -1091218 1874299 1548865 611067 3845925 7935396
10444 7935396 7650946 5043599 4004230 3006776 695913 762585 4208411 5152176 1195195
10435 1195195 -1014837 2362414 4471982 -340677 -6067390 -5193748 -776222 560808
10427 560808 -227471 533489 648679 -2555223 -4996107 -2895063 -688730 -3186491 -6179662
10418 -6179662 -3895866 202663 -471381 -4021723 -4202499 -1723265 -1834794 -4140164 -4085325
10409 -4085325 -1912728 -1398748 -1836831 413771 3969537 3797738 -350529 -3653893 -3645516
10400 -3645516 -2125387 -630177 752442 1124110 -38175 -748911 518775 1721089
10392 1721089 707767 -927328 -1123776 -1145304 -2183511 -2053228 303187 1235528 -1583019
10383 -1583019 -3825863 -1089044 3196232 2966482 -812474 -2698772 -2161170 -2942352 -4900495
10374 -4900495 -4115381 -553713 1405454 338291 -532616 409886 825520 -698062 -2184944
10365 -2184944 -1914185 -809568 -293588 -654404 -1799413 -3102679 -2880228 -519182 1634195
10356 1634195 1007828 -1611542 -3638577 -4399925 -4713480 -4381222 -2849264 -857860 993521
10347 993521 3434570 6016510 6046814 2766440 -333818 -538335 -109105 -1833088 -3745853
10338 -3745853 -2780693 -616463 -733831 -2036900 -798249 2747215 4956740 4585049 3170829
10329 3170829 1057063 -2029388 -3840855 -2239999 189257 -613115 -3415533 -3668513
10321 -3668513 -1351112 -835384 -3047882 -3897853 -1357884 1532471 2128083 1591522 1191477
10312 1191477 -217691 -2998661 -4849949 -4175064 -2373308 -1297242 -1104180 -1604350 -2974055
10303 -2974055 -4258217 -3786872 -1727908 212723 1698855 3531690 4665406 2941320
10295 2941320 -855537 -3201727 -2823226 -2190543 -3207357 -4578764 -4493551 -3083713 -1240555
10286 -1240555 489956 1165886 97184 -1339724 -1025022 687454 1777167 2262132 3699252
10277 3699252 5185823 3980003 569597 -1240118 -381585 -229385 -2536156 -4129735
10269 -4129735 -2323166 345592 223957 -1658287 -1703802 369982 1577788 636625 -523807
10260 -523807 -213039 665594 342900 -1253727 -2494857 -2306261 -1958392 -3775028 -7528122
10251 -7528122 -9498797 -6939482 -2333957 -505576 -2120069 -3383237 -2139690 -419106
10243 -419106 -97230 -18364 810458 859819 -661396 -1416174 336045 2362079 1888574
10234 1888574 49288 -426047 65512 -694360 -2162469 -1747749 515076 1898973 1669341
10225 1669341 2167385 4450465 6098819 4776056 1520402 -1053086 -1990237 -1946766 -1328290
10216 -1328290 -33150 1686601 3182872 3751974 2613481 -422852 -3692597 -4402377
10208 -4402377 -1780389 1504428 2476660 1655968 1974593 4188776 5561411 3938156 1243932
10199 1243932 1030231 3395393 4648273 2353434 -1415093 -3176874 -2797753 -2964026 -4551082
10190 -4551082 -5193902 -3211284 -596178 -192080 -1301635 -598678 2849153 5957834 5767605
10181 5767605 3136285 876743 -152771 -962670 -1353716 268640 3496955 4893700
10173 4893700 2142443 -2263515 -3704476 -1318939 1036817 91471 -2668683 -3502746
10165 -3502746 -1694754 -178201 -989127 -2254842 -957306 2598060 4960527 3902330
10157 3902330 714198 -2185127 -3903777 -4325783 -2833082 217667 2431333 2401453 2435933
10148 2435933 4976950 7388805 4777671 -1936434 -5924756 -3975869 -941224 -1850057
10140 -1850057 -4693939 -5339252 -4966756 -6753053 -8585262 -6034727 -787664 1117874
10132 1117874 -974382 -1570014 1342902 3098861 815187 -1706415 -806240 1121627
10124 1121627 591760 -841996 142211 2803766 4025626 3123408 1325020 -1031680 -3433306
10115 -3433306 -3804779 -1434344 1056585 1592213 1832773 3516153 4733988 3515769 2118738
10106 2118738 3433809 5589447 4745657 1385633 -770145 -651499 -148004 205980 1310751
10097 1310751 2170314 938469 -1267558 -1713344 -551731 57702 393576 2208954 4075082
10088 4075082 2748893 -856868 -2146898 205795 2666003 2961921 2851876 3543747 3375350
10079 3375350 2051793 2463788 5554581 7461949 4981781 618826 -1116824 99534
10071 99534 1150808 454170 -920686 -1804271 -1872486 -901071 714939 1427139 350215
10062 350215 -1113881 -1075965 159884 763191 88397 -821626 -1125809 -1192151 -1562372 -1775697
10052 -1775697 -710102 1883529 4460382 5052195 3809667 2937901 3250245 2488040 -1067213
10043 -1067213 -4960279 -5467287 -3167173 -2089878 -3454669 -4084717 -1856592 1006784
10035 1006784 1766617 1071818 838624 873561 115058 -790989 -736345 -453896 -1084040 -1663282
10025 -1663282 -620678 1070540 991180 -669647 -886716 1698867 4296038 3408586 -573597
10016 -573597 -3919105 -4233409 -2892013 -2409446 -2897864 -2459491 -286677 2358619 4113278
10007 4113278 4687494 3904979 1564834 -1168100 -2391429 -2414900 -3710034 -6584489 -7687814
9998 -7687814 -5053910 -1882217 -2112064 -4454846 -4614538 -1847833 800263 1770326 2192112
9989 2192112 2318108 1176022 -134219 860243 3455456 4035758 1657932 -630450 -922123
9980 -922123 -768111 -1210175 -758987 1007235 1951383 1486399 2169043 4871408 6323152
9971 6323152 4300324 1596792 1593812 3157790 3456386 2903420 3415536 4105933 2785520
9962 2785520 170689 -1176722 -967750 -881715 -1188174 -858247 -138228 4872 187010
9953 187010 1524476 3116561 3390741 3024419 3638425 4501999 3661211 1679162 1027439
9944 1027439 2079220 2815769 2360919 1770607 1378789 470303 -279332 748787 2764609
9935 2764609 2852444 453077 -1475660 -910321 589477 1189370 1815572 3660904 5064979
9926 5064979 3717814 553249 -1365179 -1139490 -584699 -681221 -91605 2167655 4699540
9917 4699540 5531574 4540872 2888533 1113480 -841057 -2372035 -2458585 -1009780 1130890
9908 1130890 3239101 4597490 3906586 731726 -2592703 -2920144 -699121 169927 -2018066
9899 -2018066 -4182067 -3488162 -1938751 -2738697 -4614100 -3979268 -1172346 240376 -287675
9890 -287675 209583 2272502 2857757 1251789 800776 2525354 2187224 -2780227 -7773263
9881 -7773263 -6849002 -990818 3871543 4818159 3542011 1779599 -229865 -1507305 -831615
9872 -831615 588707 447527 -803232 -777851 337360 -263194 -3101551 -4943620 -3359954
9863 -3359954 49780 2295405 2566292 1826752 779920 -238490 -625098 -158364 385269
9854 385269 134110 -839798 -1830341 -2326815 -2257352 -1876637 -1592289 -1649502 -2090977 -3100538
9844 -3100538 -4759479 -6209354 -6039423 -4095790 -1870676 -415118 868640 2459428
9836 2459428 3272704 2372850 730586 -353474 -1219654 -2369428 -2435432 -116759 2800039
9827 2800039 3144049 784207 -1333042 -1650648 -1814631 -3342407 -4905922 -4328827 -1762718
9818 -1762718 585127 1212008 746720 786932 1900499 3019303 2922427 1989708 1596355
9809 1596355 1741674 712731 -2196468 -5074512 -5657288 -3996079 -1627779 657110 2654978
9800 2654978 3431048 2032146 -870485 -3366395 -4004473 -2488647 270351 2128687 1308490
9791 1308490 -1035558 -1715768 -67598 782531 -1195705 -3516887 -2966470 -112631 2729698
9782 2729698 5208335 7233851 6589974 2656971 -149061 2053031 5778590 5035914 1363128
9773 1363128 1648941 6248946 7637338 2781267 -1464587 591481 4412573 3156179
9765 3156179 -1112181 -1451012 2251021 3427960 -351276 -3917574 -2834764 604990
9757 604990 1955149 996771 687277 2208674 3898355 4234199 3751101 3800609 4536613
9748 4536613 4791179 3740134 1938050 208148 -1724942 -4293197 -6326624 -6022544 -3586036
9739 -3586036 -946925 1189094 3612116 5631182 4853926 1155496 -2089301 -2561511 -2005025
9730 -2005025 -2487610 -2577869 -373691 2132163 1691294 -630846 -679700 2490703 5519131
9721 5519131 6120754 5792055 6209854 6240202 4156161 510007 -2767057 -4516130 -4527608
9712 -4527608 -3129077 -1555936 -1262123 -1982088 -1896160 -478962 460627 -398355 -1707777
9703 -1707777 -1568819 -463764 -208468 -740802 22661 2989159 6074998 6295872 3069272
9694 3069272 -1063051 -2889321 -1573821 741689 1401107 67695 -1333168 -1332031 -701361
9685 -701361 -1127794 -2807985 -4164672 -3829613 -2290432 -1318112 -1929292 -3204802 -3409264
9676 -3409264 -2214424 -1175334 -1588182 -2558040 -2105385 220475 2964447 4769959 5383711
9667 5383711 4675578 2444726 -164843 -875736 778004 2184086 1015090 -1341079 -1803574
9658 -1803574 -195564 759125 -165602 -1172725 -974420 -1023572 -2636458 -4219461 -3589387
9649 -3589387 -1477902 -357171 -838486 -1597646 -2040047 -2466465 -2154411 -217400 1644335
9640 1644335 455672 -3235710 -5067432 -2877965 -8858 -269047 -2204158 -1658218 1587139
9631 1587139 3604018 2499406 1051936 2080650 4187345 4180882 1929478 373768 1213345
9622 1213345 2674563 2055055 -853331 -3789574 -4789250 -3845539 -1979477 11568 1273635
9613 1273635 650231 -1786653 -3589103 -2187699 1622792 4232437 3693282 1918857 1688204
9604 1688204 3180537 4618511 4899102 4266081 3437822 3148951 3548044 3359435 1145548
9595 1145548 -1888705 -2499492 -49058 1966312 996887 -599321 460537 2869746 3023194
9586 3023194 1117998 495132 1579877 1164650 -1860354 -4451158 -4317105 -3107474 -3033977
9577 -3033977 -3473944 -2785051 -983268 1009093 2593489 2774701 608013 -2471607 -3360677
9568 -3360677 -1613449 -323684 -1273457 -2267957 -1217590 334125 379497 140177 1335152
9559 1335152 2349192 975978 -982238 -170152 2421074 2611591 -52208 -1166569 1662341
9550 1662341 4928032 4407041 1218346 -131145 1886687 4227481 3710144 865477 -1187077
9541 -1187077 -506854 1800268 3124666 2163731 37030 -1091524 -121246 2165388 3944062
9532 3944062 3997653 2948347 2743213 4348758 6198453 5846051 3019774 -118224 -1712926
9523 -1712926 -1832098 -1264524 -396142 281666 283493 389032 1984248 4379839 4856117 2544027
9513 2544027 86227 -196387 376109 -467930 -1900753 -1418961 975482 2937800 3421725
9504 3421725 3419704 3500619 3258472 2987638 3316512 3266664 1332650 -1384118 -1894541 305501
9494 305501 2303500 2117337 1312481 1816258 2509474 1176978 -1628692 -3020856 -1622489
9485 -1622489 857955 1986460 1296637 272715 295996 1044052 977209 -649124 -2655262
9476 -2655262 -3243723 -2062450 -244323 1308939 2641937 3711731 3744620 2157971 -439973
9467 -439973 -2566499 -2957567 -1422370 931802 2405652 2156539 966568 292410 773071
9458 773071 1922472 2810083 2673712 1478453 298678 340028 1074829 455160 -2203937
9449 -2203937 -4800770 -5075975 -3466414 -1967297 -1412866 -1563463 -2604380 -4436474 -5515734
9440 -5515734 -4713564 -3454890 -3601646 -4220482 -3340594 -1975194 -2792108 -5210407 -5926341
9431 -5926341 -4568240 -4303535 -5636859 -4382835 1578090 7634735 8098189 3550274 -1081505
9422 -1081505 -3315348 -4032102 -3539083 -1266251 1201101 981567 -1793156 -3749532 -2805639
9413 -2805639 -173841 2428843 4634714 5859708 4842466 2085477 369489 1187204
9405 1187204 2452382 1460482 -1231078 -2719544 -1792243 -213099 44304 -605076 -287682
9396 -287682 1393687 2440515 1014415 -1784875 -3041608 -1940726 -803640 -1421129 -2329602
9387 -2329602 -1524220 -167930 -900743 -3410240 -4799036 -4160486 -3519950 -3789412 -3252089
9378 -3252089 -1370800 -673485 -2499048 -3785193 -1374166 2467039 2729925 -847035 -2982620
9369 -2982620 -258171 4094091 4658582 857912 -2782608 -2416731 1138666 4145143 4118739
9360 4118739 1686670 -905391 -2239621 -2532409 -2522387 -2329764 -1755662 -1163644 -1280682
9351 -1280682 -2128441 -2757541 -2227644 -534579 1440746 2556272 2087579 394607 -896254
9342 -896254 51717 3447550 7119815 8119364 5565676 1906208 801275 3334051 6721759
9333 6721759 7378143 4779115 1349243 -897727 -1857745 -1619160 250053 2691515 2907140
9324 2907140 117623 -2447316 -1880657 -172529 -1113547 -3858371 -3892721 -466640 1627695
9315 1627695 -691228 -4002253 -3689939 -754521 295993 -1715634 -3639739 -2882301 -69379
9306 -69379 2675586 3434386 1079574 -3123781 -5046913 -1785465 3894079 6057734 2722965
9297 2722965 -2203614 -4293464 -3084625 -743216 878433 892598 -435819 -1185970 333336
9288 333336 2597123 2317603 -534550 -2290607 -1223402 -86410 -1126814 -2141602 -396089
9279 -396089 2570140 3570076 2830876 2605407 2530619 536081 -2624230 -3928868 -2930352
9270 -2930352 -2209232 -2854031 -3058058 -1629253 445350 2450475 4651025 5918930 4147041
9261 4147041 162595 -2164012 -1275409 -191038 -1534462 -3446770 -2999836 -991864 -253634
9252 -253634 -1058139 -1387614 -600848 165728 596193 1439809 2422030 2349284 1305034 659558
9242 659558 821069 859765 494943 635353 1556988 2106505 1349342 -46854 -663819 -21420
9232 -21420 877035 565543 -1050411 -1945376 -124395 3205405 4284347 1597594 -1781595
9223 -1781595 -2206899 -14720 1998018 2770655 2789364 1346463 -2187320 -5135482 -3908155
9214 -3908155 104136 1423575 -1578811 -4020539 -1921015 1853573 2338048 -149859
9206 -149859 -1481850 -464098 290232 -558806 -1159166 141069 2586394 4591734 5076698
9197 5076698 3166508 -909394 -4499052 -4735207 -2416621 -1087445 -1800421 -1726091 988404
9188 988404 4006088 4427762 3226651 3506625 5834972 7913671 8128232 6975820 5180071
9179 5180071 2676095 -108724 -1818087 -1920418 -1736833 -2707847 -4217649 -4119997 -1404488
9170 -1404488 2400209 4868086 5289133 4932345 4776400 4096568 2060444 -194005 -497373
9161 -497373 1553477 4080403 5236658 4726027 2940397 226499 -2355404 -3086414 -1606135
9152 -1606135 39335 -455085 -2887875 -4771274 -4050582 -1101938 1726657 2389210 1293114
9143 1293114 938219 2727097 4768987 4305986 1754565 77543 186762 -186044 -2261988
9134 -2261988 -3898116 -3165577 -1435852 -557222 551578 3492047 6481892 6291310 3035356
9125 3035356 -180915 -1690358 -2262590 -2351657 -1686899 -1315925 -2612661 -4176453 -3240956
9116 -3240956 -601634 -399501 -3828109 -6634088 -4834577 -8539 3337895 3314021 1205577
9107 1205577 -1543996 -4249658 -5941136 -5788635 -4323579 -2799260 -1694382 -786266 -44479
9098 -44479 422108 680963 677260 380281 433867 1464646 2571342 2077220 86641 -1490199
9088 -1490199 -1768753 -1612445 -1145047 722442 3283211 3514851 352872 -3095001 -3617068
9079 -3617068 -1803753 105059 1564447 2352899 656916 -3979145 -7935129 -7641069 -4944874
9070 -4944874 -4414267 -6414105 -7127230 -4941408 -2367401 -1300283 -605060 603661 1069771
9061 1069771 211087 -358053 391697 1348669 1775806 2603394 3813681 3396876 740289
9052 740289 -1545549 -1282220 97517 282706 -134471 715917 2207414 2084434 371202
9043 371202 -370722 1298763 3928754 5326125 4882595 3474052 2205271 1510498 843973
9034 843973 -596713 -2364568 -2636461 -409375 2843034 4686984 4311522 2640386 636836
9025 636836 -1174461 -2056677 -1540734 -534869 -583190 -1792909 -2572712 -1674101 407045
9016 407045 2254469 2880338 2020190 2911 -2126345 -2982011 -2068420 -532167 -169445
9007 -169445 -1461319 -2818917 -2229735 209143 2026701 1319215 -648776 -1139012 -6149
8998 -6149 -25064 -2439702 -4436307 -3002558 353016 1520442 -263243 -1502557 174446
8989 174446 2780512 3437554 2426650 1631656 909891 -1241732 -4381690 -6274154 -6175410
8980 -6175410 -5483597 -4918526 -3523782 -1190040 187925 -580194 -1989659 -2150899 -1541512
8971 -1541512 -1630207 -2059321 -1436655 -199924 -287969 -2035351 -3627797 -4008130 -4289580
8962 -4289580 -5533232 -6842205 -6689176 -4889015 -2331860 169102 1916791 2278849 1563427
8953 1563427 1102991 1590681 2141268 1841344 1310235 1600141 2229995 1585773 -919079
8944 -919079 -4000318 -5720281 -4998621 -2247357 903213 2750413 2766007 1462899 -797675
8935 -797675 -3806108 -6200392 -5830545 -2491026 952120 1492861 -790616 -3570412 -5275444
8926 -5275444 -5758527 -4906397 -2651842 -221712 516336 -645696 -1977175 -2277270 -2455313
8917 -2455313 -3951430 -6333983 -7385939 -5670389 -2537069 -943703 -2016339 -3550398
8909 -3550398 -2913209 -727361 135318 -1010952 -1688165 -300729 1486366 1818117 1545409
8900 1545409 1924157 1685115 -787303 -3984254 -5096691 -4312058 -4164624 -5157729 -5207652
8891 -5207652 -3460880 -1728388 -1630906 -2641555 -3365369 -2868615 -835035 1588332 1638478
8882 1638478 -1727777 -4777195 -2575326 4132642 9017786 8001059 3745531 1046023
8874 1046023 896407 1114632 301896 -1205743 -2753702 -3732335 -3516709 -2352868 -1399332
8865 -1399332 -1231630 -1503127 -2240143 -3588825 -4153151 -2172941 1086499 2034293 -174750
8856 -174750 -2340295 -2269893 -1695439 -2230812 -2106369 136293 2056417 1177801 -306641
8847 -306641 995692 3622885 3553488 1316101 1458642 4845980 6760086 4147303 211080
8838 211080 -707203 686401 701440 -1361303 -2674415 -1495800 592402 1320625 563781
8829 563781 -319691 -831189 -1816010 -3665976 -5036476 -4245168 -1703384 224229 149606
8820 149606 -714855 -556969 678631 2077172 3605943 5396619 6085385 4132839 621928
8811 621928 -1469959 -1121634 -408962 -1211237 -2675825 -2950141 -1812846 -298292 1032795
8802 1032795 2022702 2101969 1146409 523252 1542208 3078308 2604839 -81703 -2052040
8793 -2052040 -1130483 1114201 1931925 1605466 2602372 4936913 5361711 2111144 -2120043
8784 -2120043 -3682541 -2523470 -1214641 -1084379 -1737344 -3110435 -5125276 -6036549 -4200327
8775 -4200327 -1284072 -654312 -2469219 -3573357 -2713055 -2354566 -4119581 -5810609 -4959655
8766 -4959655 -2573328 -1131570 -1065685 -1312498 -1365707 -767048 1487543 4978914 7138250
8757 7138250 6457610 4567398 3286681 1897005 -424348 -1952453 -1077530 532619 533205
8748 533205 -296883 -101903 222744 -982540 -2097968 -491018 2320732 2294139 -879814
8739 -879814 -3559278 -3977500 -3815900 -3836654 -2574427 -147802 982929 164036 -545259
8730 -545259 -566370 -1659842 -3464352 -2882929 182860 1236701 -1914884 -5054220 -3789670
8721 -3789670 -70769 1460970 396859 -487217 -682299 -1788237 -3518079 -4142920 -3860309
8712 -3860309 -3868459 -3148756 -115235 3390321 3909961 1794731 690385 1630963 1883924
8703 1883924 201549 -1068410 -422793 190292 -838000 -1755841 -657619 914608 220256
8694 220256 -2580594 -4902209 -5062095 -3302886 -700488 1324768 1599375 733811 781608
8685 781608 2138199 2563226 834900 -822423 -297256 567590 -1061179 -3783451 -3710638
8676 -3710638 -866529 461857 -1646155 -3878684 -3020468 -519152 615712 501024 1014225
8667 1014225 1834454 1114102 -891940 -1789568 -364824 2256246 4465608 5285401 4086836
8658 4086836 1229393 -1280290 -1693472 -889357 -1029016 -2180894 -2351104 -704690 1474251
8649 1474251 3162134 4704931 6143891 6537971 5593887 4184655 2747951 923090 -868418
8640 -868418 -1438561 -868760 -518477 -592576 68199 1332332 1569582 895868 1671162 4377276
8630 4377276 5998175 4502130 2118771 1645909 2062997 885328 -1192972 -1519377 -48066
8621 -48066 836516 464991 596930 2074054 3571093 3863340 3070052 1641274 197487
8612 197487 174464 2401912 5114419 5557049 3598432 1685550 1220540 1143073 310851
8603 310851 -810372 -1332006 -1121988 -299792 1182320 3184684 5447672 7641423 8538769
8594 8538769 6362370 1532977 -2292214 -2191120 91281 703747 -849892 -1812627 -1013088
8585 -1013088 -156580 -332960 -614932 -541903 -869038 -1288484 -412475 1340427 1797362 611613
8575 611613 -246690 -273738 -1381615 -3959187 -5357638 -3961090 -1778847 -1186505 -1779108
8566 -1779108 -2179541 -2278254 -1898470 135 2788632 3559494 1265919 -1094369 -708430
8557 -708430 1240197 2429220 3288441 5025572 6335647 5611404 4328553 4425481 4093147
8548 4093147 490214 -4404281 -5310767 -1142224 3213021 3443063 563361 -2074709 -3288268
8539 -3288268 -3743020 -3553170 -2412839 -932595 -129726 -97796 -221098 -347967 -1039452
8530 -1039452 -2739744 -4949581 -6309753 -5849780 -4184717 -2692154 -1370345 1090722
8522 1090722 4491220 6219226 4648589 1779654 436372 206217 -1276497 -3944726
8514 -3944726 -5208370 -4123634 -2698275 -2439371 -2199479 -615881 1305690 1512681 -299287
8505 -299287 -2334396 -2581543 -577792 2167472 3448823 2640568 1290073 656534 -308087
8496 -308087 -2861504 -5385839 -5026868 -2140551 -147993 -540291 -1101841 -170685 527293
8487 527293 -670935 -1885226 -556900 2132411 2933665 1494757 339921 402236 88206
8478 88206 -888597 -336558 2300823 3773994 1425565 -2383163 -3204651 -734347 1052083
8469 1052083 -109250 -1749632 -701426 2293483 3843502 2347798 -720658 -3246424
8461 -3246424 -4407432 -4362605 -3509155 -2288359 -825715 1241121 3816683 5535416 4971646
8452 4971646 2553243 219353 -731109 -374076 1009316 3314640 5646415 6524545 5664318
8443 5664318 4350845 3529360 2766229 1678055 1002755 1312760 1820579 1512746 534906
8434 534906 -521878 -1717307 -2984091 -3167783 -1322081 1461530 2908229 2231786 935144
8425 935144 839585 1997424 2676510 1124210 -2522159 -6006473 -7089304 -5912933 -4435944
8416 -4435944 -3559186 -2250492 12909 1721364 1568302 737482 1085722 1969090 1061395
8407 1061395 -1876238 -4183492 -3771505 -1737978 -585650 -917206 -1058828 358968 2442081
8398 2442081 3052033 1466639 -586237 -907796 584322 2003452 2054588 1404182 1295703
8389 1295703 1904879 2611544 2939296 2542269 1127956 -795104 -1784393 -901907 1162684
8380 1162684 2928178 3503563 2785397 1208758 -103657 83586 1598174 2735810 2389252
8371 2389252 1431475 1224554 1713242 1916953 1454050 636988 -202530 -690252 -502095 -87144
8361 -87144 -268834 -623530 232172 1974657 2125145 -332771 -2777849 -2324627 221323
8352 221323 1950541 1951911 1344810 437621 -1243623 -2770413 -2647610 -1629722 -1797875
8343 -1797875 -2769365 -1879872 1231699 3195447 1411138 -2362258 -4479186 -3691551 -1468676
8334 -1468676 415593 934361 -452830 -3288086 -5630918 -5419798 -2524047 1002830 2593635
8325 2593635 1049940 -2530930 -5322053 -4930405 -1602806 2004999 3517024 2892826 1647433
8316 1647433 736851 -93345 -1106496 -1566712 -502135 1672432 3033373 2174654 -92873
8307 -92873 -1797070 -2131594 -1670282 -658496 1276020 3593368 4779322 4320712 3141586
8298 3141586 1684325 -450630 -2396840 -2112033 171146 1242239 -463600 -2143414
8290 -2143414 -962097 1421426 1794014 644565 668724 1619240 996330 -799476 -474400
8281 -474400 2685533 5371075 5164770 3462578 2461026 2316074 2431740 2795169 2873455
8272 2873455 1671842 -105581 -350903 1151377 2195790 1683103 980831 896788 277334
8263 277334 -1095030 -1249083 508894 1604936 -195347 -3482664 -5616043 -6279159 -6366712
8254 -6366712 -5329008 -2287924 1514847 3866217 4356059 4040923 3257785 1718519 27833
8245 27833 -760199 -649669 -339774 74248 801749 1458435 1635816 1637541 1654342 1173339
8235 1173339 253911 218370 1741472 3312991 3081541 1389190 25467 -333533 -498222
8226 -498222 -1053164 -1567648 -1341722 -155401 1448665 2310846 1799120 964316 1345410
8217 1345410 2421380 2021420 -108513 -1276042 288620 2495618 2220517 -400519 -2585609
8208 -2585609 -2831507 -2127860 -1729267 -1595337 -1071343 138359 1743830 2958823 3084013
8199 3084013 2365413 1673472 1174953 337366 -697204 -1306761 -2163203 -4690895 -7980286
8190 -7980286 -8548401 -4694600 685840 3202047 1523312 -2206126 -4778826 -3754873
8182 -3754873 951096 5960058 7079390 4407906 2313518 2961950 3221235 345423 -2909962
8173 -2909962 -2554381 187716 1113645 -298564 -1093963 -407457 -192976 -1036861 -1627103
8164 -1627103 -2077552 -3598427 -5090004 -4299903 -2260119 -2122723 -3457667 -2553504 873121
8155 873121 2352052 -311587 -3499616 -3684752 -2553578 -3232143 -5082540 -5678315 -5053998
8146 -5053998 -4505258 -3485163 -1181273 665030 51122 -1462234 -692470 2092907 3338047
8137 3338047 1361018 -1524040 -2468854 -1386730 -108484 82015 -707699 -1615086 -1931196
8128 -1931196 -1745676 -1697073 -1907157 -1726121 -898284 -117247 227745 928198 2653519 4522155
8118 4522155 4984234 3677405 1683458 431002 809025 2578109 4146766 3894818 2293336
8109 2293336 1563835 2556727 3413179 2413731 624814 48292 389745 -158843 -1532933
8100 -1532933 -1581350 487337 2485425 2074365 -53237 -1115121 14029 1212566 -157737
8091 -157737 -3518734 -5281871 -3214622 595285 2383042 1377464 -83963 -555740 -946834
8082 -946834 -1663934 -1283791 476967 1156174 -795902 -2848803 -1737583 1395734 2408156
8073 2408156 209473 -1818168 -897724 1496889 2323238 1204641 234073 582119 1018104
8064 1018104 -98743 -2333607 -3395814 -1943185 468575 1193201 23093 -676986 231396
8055 231396 768346 -885526 -3162911 -3426717 -2112795 -1744837 -2532182 -2105622 152474
8046 152474 1511285 -312980 -3942134 -6048445 -4753052 -688834 3694511 5420282
8038 5420282 3447743 411304 -18767 2053105 2937059 947251 -1226896 -1131195 -227378
8029 -227378 -470466 -215106 2884053 6949448 7897394 5286000 2199615 15433 -2370804
8020 -2370804 -4146647 -2316136 2728093 5802400 3631541 -578878 -2137655 -1265131
8012 -1265131 -953863 -1097380 691704 3666324 4134857 1295219 -1270885 -905670 936515
8003 936515 2172995 3286780 4891597 5141770 2575471 -520033 -902626 635551 453490
7994 453490 -2189168 -4053221 -3136182 -1685776 -2381061 -4026752 -3419141 -115046 3114870
7985 3114870 4157747 3654613 2899764 1536446 -1411920 -5029635 -6480998 -3990539 687907
7976 687907 3624418 2878281 707422 771216 3460861 5430441 4169631 1449583 851305
7967 851305 2939348 4875081 4603433 3307315 3046038 3779360 4122861 3891672 4131722
7958 4131722 4961524 5038663 3497284 1216594 -357707 -743172 -230485 885410 1987640
7949 1987640 1875819 239861 -943258 693500 4165978 5248545 1831494 -2348385
7941 -2348385 -1791420 3480786 7614780 6450775 2397437 151911 388472 710071 843285
7932 843285 2631726 5216575 4760200 382913 -3453868 -2956226 -411632 -507586 -3444607
7923 -3444607 -5386872 -4597355 -3230532 -3097817 -3329339 -3076524 -3346946 -4660439 -5390622
7914 -5390622 -4222144 -2382153 -1627952 -1490824 -387946 1556230 2644002 2053051 664530
7905 664530 -313187 -496963 -338276 -602807 -1340342 -1080394 1746740 5948950 7760643
7896 7760643 5254647 1108733 -833543 -486920 -703081 -2387079 -3261861 -1625836 1263109
7887 1263109 3347713 4202413 4232384 3202969 995668 -1278707 -2291589 -2033440 -1328736
7878 -1328736 -342841 1400501 3711789 5329099 5060078 3068783 895483 63648 521680
7869 521680 771821 -79648 -909740 -91864 1863974 2418977 62785 -3695689 -5896884
7860 -5896884 -5072627 -2272056 250146 980711 255085 -185269 1046237 3522925 5442551
7851 5442551 5363558 3308314 628936 -731543 490437 3413269 5304259 4428341 2205027
7842 2205027 1340281 2291806 3166506 2842044 2222018 2140051 2009594 1346435 988211 1807706
7832 1807706 3454849 5169012 6596938 7104116 5759219 3015868 1014479 1014906 1810434
7823 1810434 1992050 2424239 4634325 7630515 8456012 5917146 2175257 313250 1265536
7814 1265536 3270079 3669909 1341337 -2095450 -3732731 -2511334 -391914 137722 -1063761
7805 -1063761 -2265164 -2399747 -1885247 -1359526 -872450 -241429 743468 2288764 3909837
7796 3909837 4134402 1993445 -1343725 -3501378 -3480227 -2409045 -1761358 -1763195 -1663241 -770694
7786 -770694 922226 2586717 3124276 2463704 1942774 2571151 3364643 2668283 918698
7777 918698 432561 2022149 3434873 2263567 -685795 -2332976 -1114033 1593923 3808532
7768 3808532 5258198 6676619 7775953 7147326 4170459 229965 -2268395 -1839415 997656
7759 997656 4043612 4915394 3028608 325522 -707903 15154 191182 -1479681 -3213669
7750 -3213669 -2588917 21482 2114180 2563413 2634658 3579449 4964460 5694468 5238064
7741 5238064 3483698 747136 -1624998 -1936733 -63088 2192059 3035971 2234561 722790
7732 722790 -366009 -425275 -256471 -1839986 -5672092 -8779818 -7611928 -2958455 486806
7723 486806 45322 -1952376 -2110288 -467364 597994 117380 -671965 -253639 1744922
7714 1744922 4300974 5620686 5075976 4498746 5779254 7428329 6299155 2833845 917242
7705 917242 1561665 1031008 -2560788 -5172169 -2963569 1179304 1852130 -763551 -2073914
7696 -2073914 -766311 -441 -1219128 -1788060 281771 3223604 4466485 3843761 2755660
7687 2755660 2245033 2478990 2432414 321709 -3664591 -5873850 -3228200 1796258 3518626
7678 3518626 397320 -3301102 -3627782 -1466025 57132 -255050 -1483009 -2390185 -2161331
7669 -2161331 -958820 -432511 -2101008 -4930804 -6274887 -5349384 -3898351 -3405624 -3685980
7660 -3685980 -4167457 -4372827 -3259904 -455757 2024201 1836453 -153197 -1163000 -904863
7651 -904863 -1315066 -2105525 -713891 2673492 4302498 2502355 231840 131920 805955
7642 805955 395791 355318 2605456 5587268 6316385 4560996 2265453 377102 -1247568
7633 -1247568 -2082437 -1397359 418729 2648123 5209740 7499926 7879813 5936501 3733770
7624 3733770 3185112 3639818 3584311 3094244 2878148 2444640 1125778 -263151 -485845
7615 -485845 359546 1414039 2276011 2642004 2091377 1135776 953070 1373490 1035878 124437
7605 124437 385557 1532893 771919 -2481559 -4657578 -3132344 -303721 176770 -1421102
7596 -1421102 -2521270 -2643781 -2918044 -3167561 -2734501 -2498467 -2992858 -2378582 424231
7587 424231 2565156 1010938 -2247281 -2894951 -861219 295468 -336429 -231735 1212916
7578 1212916 1519465 161487 116552 2751400 5109470 4361832 1728199 -164719 -1003093
7569 -1003093 -1545228 -1075256 1209337 3800618 4456007 3405400 2808866 3359470 3388756
7560 3388756 1603066 -831240 -1769633 -859553 264814 474889 547641 1302758 1668394
7551 1668394 493385 -575155 1035175 3949038 3468745 -1420051 -5313988 -3499763
7543 -3499763 1328320 3297436 1886887 1453204 3437787 4333037 1884673 -1407972 -2566521
7534 -2566521 -2200858 -2359831 -3157740 -3499727 -3013042 -1580177 1172432 4428012 6010816
7525 6010816 5156226 3790698 3535436 3136018 867877 -1804776 -1565226 1848849 4430946
7516 4430946 2754768 -1289172 -2452800 1150141 5220345 4587948 -88412 -3530121
7508 -3530121 -3198661 -1903250 -2225843 -2355705 -156634 1991071 459897 -3521878 -5383535
7499 -5383535 -3883515 -2066200 -1871379 -1909495 -939941 223259 991177 1814870 1998972
7490 1998972 -34211 -3448457 -5092478 -3791089 -1525914 364431 2716596 5242767
7482 5242767 5474562 2854889 501867 682773 1548407 729453 -730313 -829764 -497754
7473 -497754 -1860464 -4352893 -5580222 -4895308 -3507445 -2063821 -576885 138092 -643265
7464 -643265 -1799738 -1570150 -15095 1465124 2364060 3016318 3005562 1589766 -592224
7455 -592224 -1942972 -1903148 -1214399 -483518 266578 889766 1127463 1210710 1636909 2502636
7445 2502636 3465537 3927798 3154397 1133103 -633790 -589560 492166 446599 -630649
7436 -630649 -158026 2482326 4021187 1829234 -1928524 -3185996 -1344204 868340 1651333
7427 1651333 1595490 1647765 1991948 2495024 2464514 814952 -1828438 -2656046 -549355 1259907
7417 1259907 -506617 -3616955 -3022930 1415362 4303422 2508843 -614041 -567713 2271444
7408 2271444 4492852 4785610 4242480 3287400 1480916 -277564 -287655 974534 832525
7399 832525 -1733253 -4040710 -3064942 121034 1236061 -1620714 -5065721 -4518424 -139210
7390 -139210 3409923 2993122 393661 -1077910 -910202 -569071 -420878 -24901 -148602
7381 -148602 -1591319 -2690390 -1058935 2266369 3471632 1226960 -1614624 -2415121 -1944176
7372 -1944176 -1841749 -1731706 -931706 -703308 -2227689 -3942308 -3571781 -1825229 -1452335
7363 -1452335 -3102684 -4628937 -4513468 -3729056 -3751096 -4520702 -4993683 -4405209 -2569223
7354 -2569223 -79743 1521470 1015359 -695924 -1254370 227497 2014549 2079261 570226
7345 570226 -748670 -752376 84316 553643 83311 -503161 362956 2992030 5331364 4981247
7335 4981247 2305425 152127 233427 1388132 2012578 2336915 3030228 3271899 2129011
7326 2129011 730733 967139 2594269 3606943 3150509 2119261 1054859 -452473 -2065556
7317 -2065556 -2436558 -1256256 79718 473242 324933 213320 -57441 -404777 -8463
7308 -8463 1194785 1879104 1091689 -498395 -1810552 -2540865 -2522032 -1465734 -176555
7299 -176555 -282317 -1623211 -1738786 558866 2967563 2993102 1695468 1629107 2483419
7290 2483419 1942154 263959 516469 3695498 6676111 6444416 4134618 3065168 4171916
7281 4171916 5325399 4735803 3406729 3731206 6292596 8693397 7880311 3564071 -1217496
7272 -1217496 -3254006 -2344280 -847797 -633786 -1265088 -1021500 878074 3143124 3555511
7263 3555511 1625375 -334078 21473 1544260 882841 -2395704 -4584487 -3082563 -283232
7254 -283232 98419 -1474745 -1514861 1061059 3786612 4532430 3756803 2836529 2431964
7245 2431964 2597643 2660754 1217106 -1934512 -4390069 -3771603 -1236915 -50278 -1045258
7236 -1045258 -1946323 -993696 1199035 3327578 4596859 4319449 2558658 986752 964509
7227 964509 1352413 616553 62335 1761558 4179641 3873161 1236502 163874 1672086
7218 1672086 2495893 1038944 -13187 1169792 2345554 1682990 1427150 3897122 7008976
7209 7008976 7115799 4001335 208056 -2512217 -3561902 -2500150 -290568 365248 -1627784
7200 -1627784 -3826062 -3718451 -2119290 -1058131 -565494 101585 235283 -839310 -2067509
7191 -2067509 -2725649 -3917583 -5669268 -5193360 -1006995 3761363 5560409 5557784 6787146
7182 6787146 8250126 6367178 1231779 -3026400 -3944068 -2996421 -2145289 -1612796 -1438138
7173 -1438138 -2138020 -3123750 -2842303 -1065102 735611 1398334 878635 -689624 -3091738
7164 -3091738 -5387219 -6432314 -5717618 -3175210 489820 2776533 1169133 -2805536
7156 -2805536 -4206845 -1224402 2131233 2264480 1170780 1989527 3307422 2551194 1573546
7147 1573546 3181051 4854651 2366357 -2214866 -3061609 -199296 649985 -2084758 -3497195
7138 -3497195 -1005192 1546524 903728 -732852 -666187 62174 361057 1766521 4238756
7129 4238756 4313023 1030895 -1005888 1486188 4864022 4250275 1020192 -223483 1011889
7120 1011889 1961746 2438388 4401233 6895663 6566698 3177021 377587 507212 1965353
7111 1965353 2353516 1535780 827384 1015076 1765739 1923102 425887 -2283016 -4289006
7102 -4289006 -4290596 -2746243 -532230 1939533 3642771 3105807 779477 -898507 -964332
7093 -964332 -1005636 -1547775 -541436 2488880 4194042 2327150 -153787 454715 2806256
7084 2806256 3371383 2629475 3401494 4765643 3338475 25879 -424723 2729593 4483433
7075 4483433 1940057 -1174544 -559785 2285514 3048618 846992 -1970541 -4066494 -5718924
7066 -5718924 -6459152 -5232976 -2526787 -94208 1147453 1365377 638143 -828857 -1958982
7057 -1958982 -1882428 -1220625 -889606 -415989 892584 1926628 1070006 -871189 -1371972
7048 -1371972 60972 1203578 781405 449900 1835078 3688960 3908297 2859235 2403943
7039 2403943 2588126 1922531 719396 1351902 4457915 7260823 7009594 4355629 1918112
7030 1918112 987907 1160500 1856672 2421543 1808626 54188 -846432 515210 2457919
7021 2457919 2508651 1362350 1748639 3714379 4264043 2169420 -22994 31307 1253655
7012 1253655 1457711 533593 -400758 -984080 -990989 365141 2676114 3740827 2706866
7003 2706866 1949351 3504005 5408044 4424960 1083424 -1115783 -714450 652811 1766210
6994 1766210 2980391 3721164 2302711 -742001 -2195399 -563291 1564686 1359414 -213021
6985 -213021 -413220 827092 1094645 -502983 -1989114 -1464982 384476 1445892 757887
6976 757887 -830341 -2005932 -2204197 -1500355 11011 2052961 3493675 2884460 412776
6967 412776 -1524641 -1025605 538604 253090 -1845505 -2300706 788388 4559047 5065376
6958 5065376 2528848 458202 522921 1127702 834731 209313 -284859 -1354993 -2665256
6949 -2665256 -2213143 381400 2419746 2151423 1921025 4348676 7319591 6605388 2483330
6940 2483330 -455478 -35783 1268463 1533641 2279712 4269332 4708841 1801651 -1258510
6931 -1258510 -657870 2021947 2189757 -836417 -3354929 -3054306 -1412009 -313005 290980
6922 290980 848772 1155073 1394620 1983650 2168604 968774 -582589 -564093 594045
6913 594045 659500 -622175 -1159806 -136429 971584 1414084 2143780 3103140 2655317
6904 2655317 714326 -583186 -485534 -848126 -2331391 -2457828 597983 4884371 7321707
6895 7321707 7274547 5830445 3856776 2439682 2844232 4313030 4312460 2504318 1596537
6886 1596537 2539159 2437921 -162044 -1689577 967580 4615046 4106514 346695 -1192811
6877 -1192811 1112515 3239932 2212173 -34459 -495475 812296 1965025 1789083 337294
6868 337294 -1475151 -2245975 -1617251 -1234783 -2534088 -4249220 -4163375 -2508186 -1262153
6859 -1262153 -1001925 -1204028 -2684067 -6273301 -9530127 -8627193 -3930202 -165888 -211922
6850 -211922 -1895846 -1937445 -60295 2056499 3265266 3042095 1262767 -999686 -2247676
6841 -2247676 -2620045 -3211011 -3421467 -1779243 554158 611600 -1387641 -1700904 966556
6832 966556 3108279 2079914 206579 328857 778311 -1427644 -5010960 -6211558 -4507416
6823 -4507416 -2547213 -1386441 271736 2467181 3404268 2797394 2485821 2997881 2415922
6814 2415922 -225455 -2818570 -2885908 -740082 1365647 2065906 1734632 1352083 1513738
6805 1513738 2121386 2417005 1629111 -45194 -1384428 -1323422 -61382 1051793 742614
6796 742614 -781271 -1646557 -169662 2927953 5043572 4814065 3583472 3052907 2858417
6787 2858417 1872761 706327 845434 1801575 1369192 -1000445 -3062478 -2835085 -1303261
6778 -1303261 -933689 -2353687 -3681000 -2992691 -662172 1087468 835303 -254040 102069
6769 102069 2203096 3969163 4118486 4095757 5401837 6560960 5177537 2097110 450851
6760 450851 653419 -172591 -2895875 -4149089 -1555393 1999532 2488850 745237 501876
6751 501876 2017731 2158665 432106 112306 2305954 3408389 783470 -2735945 -3134569
6742 -3134569 -1193963 -612881 -2072484 -3033963 -2495007 -2108748 -2612140 -2605548 -1451868
6733 -1451868 -446485 -320486 -188765 164798 -505568 -2312045 -3231261 -2081501 -417919
6724 -417919 -21041 -481363 -832290 -1530349 -2795016 -2802785 -86701 3387425 4157192 1797742
6714 1797742 -850712 -1838260 -2125976 -2960680 -3297793 -1246220 2692154 5153116 3224262
6705 3224262 -1933113 -5555677 -4192795 329147 3187263 2483109 867979 1058214 2306098
6696 2306098 2514443 1423742 -154366 -2201471 -4413223 -5053713 -3296822 -1192950 -843357
6687 -843357 -1152691 -150459 1013599 -205063 -3088191 -4452506 -3629343 -2867770 -2876090
6678 -2876090 -1967897 -121602 233937 -1288172 -1656735 613277 2644845 1699004 -559416
6669 -559416 -1024215 152089 834812 935383 1916749 3423993 3531614 1941668 314119
6660 314119 -459753 -1032127 -1633774 -1483432 -534936 12947 -375985 -548028 622001 2407358
6650 2407358 3053894 2073132 912211 1185103 2751118 4078022 4305370 4035220 3806059
6641 3806059 2987166 1179285 -379505 -372867 397165 254433 -426891 235934 2303487
6632 2303487 3668875 3375439 2841667 3105114 3263844 2663184 2315244 2873063 3330159
6623 3330159 3086281 3187446 4043791 4144453 2855039 2282731 4051809 6067239 5084507
6614 5084507 1211821 -2600475 -4507531 -4881199 -4426629 -3513703 -2739574 -2245091 -1306006
6605 -1306006 -204126 -908474 -3733767 -5264894 -2697013 1393304 2369035 472390 87620
6596 87620 2446947 3859300 1977725 -793018 -1853527 -2186900 -3135882 -3010146 -44106
6587 -44106 3853708 5502747 4845568 4137040 4249913 4480220 4720143 5094176 4430969 1754702
6577 1754702 -1436062 -2843719 -2599604 -2382835 -2179250 -780768 1053709 1165304 -221468
6568 -221468 -449364 1346113 3003793 3077873 2691152 2476061 900534 -2400130 -4525642
6559 -4525642 -3140387 -143716 1251965 1179837 1791560 2897600 2533957 992020 457821
6550 457821 764834 -588001 -3491958 -4137578 -592712 3685962 4294457 1592457 -536059
6541 -536059 -108683 1300491 1594754 634651 -278535 -28936 1217272 1974193 1039218
6532 1039218 -591379 -648015 1098934 2201838 1148034 -400311 -479849 105973 -305791
6523 -305791 -1102210 -789893 -72481 -529596 -1198026 236756 3175824 4349349 2621801
6514 2621801 529608 355060 1405684 2099905 2221136 1917880 697071 -1156051 -1886690
6505 -1886690 -411461 2039263 3411503 2921359 1084137 -1125373 -2609800 -2788235 -2201489
6496 -2201489 -1432728 217278 3286033 5923346 5656662 3301061 2119742 2670150 1857676
6487 1857676 -1700739 -4822081 -4359002 -1732212 -289779 -479087 -475699 108518 48720
6478 48720 -952286 -1990705 -2594385 -2834251 -2629384 -2351875 -2850732 -3488061 -1941068
6469 -1941068 2234731 5810128 5897902 3815768 2336947 1163606 -1443511 -4179684 -3989748
6460 -3989748 -1201497 738283 654777 752446 1866852 1813083 -82216 -729216 1897105
6451 1897105 4619659 2928204 -2610695 -6888828 -6742029 -4333515 -3650144 -5431538 -6654990
6442 -6654990 -4436079 558920 4916427 6179656 4892709 2969920 1387942 345803
6434 345803 383325 1631660 2616079 1685094 -508201 -1667756 -1014844 -97741 -292632
6425 -292632 -1266453 -2358218 -3687642 -4997853 -4927136 -2733429 131797 1344651 167409
6416 167409 -2197862 -4197710 -4978731 -4192222 -1900068 896391 2351986 1335345 -1041217
6407 -1041217 -2289946 -1403795 27181 359281 352979 1350218 2096986 349379 -2534460
6398 -2534460 -2370469 1339332 3618379 1234622 -1969332 -755787 3420476 4822373
6390 4822373 2153647 -474472 -701996 -475835 -827720 392302 3589705 5055838 2451476
6381 2451476 -1145278 -1916713 -927603 -1546663 -3692922 -4515944 -3341068 -2191856 -2050149
6372 -2050149 -1961638 -1684376 -2132388 -2850037 -1763439 1698388 5251089 6473361 5474181
6363 5474181 4074938 3442479 3272544 2593380 830389 -1496489 -2949028 -2497385 -699704
6354 -699704 914936 1554775 1725673 2212720 3110461 3838671 3636938 2172832 174577
6345 174577 -739284 450220 2838020 4369243 4031707 2753678 1988262 1954313 1694043
6336 1694043 630769 -458031 -301726 1160894 2364448 1737846 -398622 -1976554 -1325922
6327 -1325922 1083968 3165297 3294151 1770946 318034 284423 1518762 3033679 4252418
6318 4252418 4931244 4276555 1554934 -2069999 -3826774 -2543174 -429792 -314345 -1990745
6309 -1990745 -2885155 -1681098 508360 2236022 3124263 3224130 2804143 2941843 4534893
6300 4534893 6436997 6455496 4709860 3964445 5596748 7140377 5493504 1311083 -1673077
6291 -1673077 -1229491 1052508 2061996 589709 -1941231 -3492835 -3492774 -2792985 -2097649
6282 -2097649 -1356426 -801099 -1206578 -2238797 -2003501 116392 1507407 -372757 -3658623
6273 -3658623 -4152201 -1517048 209716 -988586 -2073235 -279818 2037112 1073277 -2356302
6264 -2356302 -4138635 -2970138 -1404222 -1106797 -667965 1070020 2460353 1496301 -943076
6255 -943076 -2111653 -1050608 231293 -507330 -2644239 -3287211 -1202198 979547 -52381
6246 -52381 -3459767 -4926482 -2538091 653042 1317406 506236 1254049 3626232 5247741
6237 5247741 5433300 5406627 5121323 3480380 1649555 2336025 4998999 5506695 2168470
6228 2168470 -1269079 -963716 1546002 2130070 193852 -1325659 -835340 459404 1530142
6219 1530142 2674572 3438170 2409392 -5237 -1132454 350541 2351901 2338619 735120
6210 735120 -188365 473829 1765449 2615321 2543850 1413890 -7418 56274 2302732
6201 2302732 4678749 4512155 2043953 154440 696925 2759874 4504625 4971242 3973685
6192 3973685 2023821 640179 1002525 2088742 2000024 1183049 1890515 4056468 4689032
6183 4689032 2528531 281607 396613 1528751 1568110 1342321 2279931 2996742 1937494
6174 1937494 1235514 3514801 6366574 5083340 409487 -1772815 860395 3895583
6166 3895583 3346718 1094632 428544 370403 -1755544 -4904395 -5548829 -3084915 -605922
6157 -605922 -632812 -2500719 -3876864 -3215067 -837295 1448906 2189959 2030451 2509256
6148 2509256 3125837 1819026 -1045316 -2005699 577657 3613416 3559473 1308149 108034
6139 108034 577232 964082 1037600 2228616 4260876 4812240 2931350 427675 -647720
6130 -647720 -156546 816804 1371519 1224661 710917 372153 102810 -558176 -884876 635586
6120 635586 3329766 3901763 936521 -2195318 -1682640 1094849 1628025 -986308 -3086402
6111 -3086402 -2174816 -2567 871553 546879 481672 969558 1280318 917924 -59971 -917255
6101 -917255 -422006 1479830 2664391 1528508 114986 1709023 5428093 6662520 3694197
6092 3694197 288869 -43337 1007359 63888 -2207630 -2509486 -623197 164553 -1608273
6083 -1608273 -3148177 -1467472 2407269 4968059 4784765 3781048 4093638 5127100 4617491
6074 4617491 2037796 -428148 -871688 -509365 -2054501 -5454604 -7027968 -3787233 2427373
6065 2427373 6484778 5485064 1639441 -756856 -346249 438105 -564459 -2020630 -1357175
6056 -1357175 861137 1348352 -877972 -2629707 -1140894 1872077 3062084 2505181 2842417
6047 2842417 4348896 4310082 1508882 -1732823 -2884116 -2141827 -1011840 -88922 500035
6038 500035 196784 -1034522 -2045566 -1928806 -1180019 -698380 -665006 -1011708 -1781102 -2355883
6028 -2355883 -1649858 100467 1002860 -76900 -1910741 -2706963 -2428407 -2202111 -2325828
6019 -2325828 -2082641 -1027261 479692 1634078 1543206 -87771 -2042214 -2229188 -70346
6010 -70346 2431016 2859313 1117322 -740208 -923277 521200 2103369 2161881 48201
6001 48201 -3293234 -5916722 -6342860 -4566577 -1881725 60141 477259 254603 972004
5992 972004 2565576 2950832 1053701 -1071143 -1070412 -130276 -1259337 -4258249 -5654713
5983 -5654713 -3910503 -1250172 647386 3160934 7037774 9585012 8427413 5536933
5975 5536933 4330280 4637176 3861995 1705942 180306 -252868 -934984 -1635961 -522825
5966 -522825 2012035 2802830 339744 -2903261 -3879563 -2524983 -623715 812551 1471969
5957 1471969 815336 -892015 -1774108 -419666 1884014 2620910 1391004 317893 1190203
5948 1190203 3441884 5129735 4982195 3298331 1549893 1223741 2396940 3368349 2395382
5939 2395382 -119944 -2036290 -2286530 -2139666 -2915328 -3693891 -2913780 -1467896 -1821374
5930 -1821374 -3785394 -3818875 -104485 3811277 2962407 -2562766 -7767282 -8920350 -6848183
5921 -6848183 -4011642 -1305368 1198785 2871608 3500187 3875479 4097889 3087662 1072548
5912 1072548 390843 1876935 2562019 -262323 -4196002 -4264253 225919 4659483 5220618
5903 5220618 2980207 991544 144812 -327317 -324666 742441 1921846 1302726 -1192288
5894 -1192288 -3117848 -2258179 705473 2960592 2663157 536574 -1663393 -3322210 -4776547
5885 -4776547 -5641756 -4910831 -2899654 -1501072 -1730031 -2354075 -1911400 -716687 401253
5876 401253 1927264 4404799 6481412 6419200 4882177 3880721 3376093 1636891 -953640
5867 -953640 -1507494 888837 3080999 2150799 -251471 -278690 2627386 5194661 4972364
5858 4972364 3138842 2079252 2011314 1359086 -357181 -1552668 -810613 920683 1337132
5849 1337132 -242863 -2002827 -2065211 -745645 395542 771464 833591 668699 65384
5840 65384 -414274 -64928 437318 -127845 -1198382 -919184 740886 1508606 235458
5831 235458 -1277236 -1127572 -125781 -138344 -1102546 -1511449 -862778 91298 808535 1190976
5821 1190976 1059726 709563 1150586 2509588 3258213 2493043 1689588 2342328 3278723
5812 3278723 2759109 1939929 3070690 5020793 4365498 1027021 -1116985 -236734 721076
5803 721076 -853065 -3006999 -2857746 -1474016 -1722688 -3315034 -3684834 -2602015 -2223525
5794 -2223525 -2982408 -2945433 -1515822 -608761 -1353718 -2296450 -1975021 -1126063 -1117269 -1863784
5784 -1863784 -2462090 -2611668 -2439671 -1948030 -1361436 -1136400 -1213826 -1160175 -1078049 -1162337
5774 -1162337 -548940 1595222 3808231 3406442 382829 -2069295 -1906951 -846187 -1268584
5765 -1268584 -2716260 -3326678 -2978655 -2917726 -3468710 -3934988 -3697869 -1992778 1843396
5756 1843396 6207008 7217404 3300278 -1810886 -3439279 -1971820 -1319354 -2494172
5748 -2494172 -2696028 -751795 656498 -583233 -2753398 -3310070 -2553398 -2199410 -2154469
5739 -2154469 -993970 1205946 2411262 1020072 -2119673 -4133327 -2642513 1645284
5731 1645284 5262464 5746627 4380532 3857108 4248815 3606426 1953357 1654724 3455454
5722 3455454 5044039 4472134 2495600 578265 -934286 -1631507 -667830 1141618 1507784
5713 1507784 415966 860235 3967400 6344656 4831465 1197486 -930374 -1404403 -2230978
5704 -2230978 -2871453 -1124970 2133642 3281806 1173888 -1455076 -2252722 -1860213 -1667249
5695 -1667249 -1700705 -1545444 -1174237 -367307 656445 6040 -3899810 -8848312 -10259850
5686 -10259850 -6987413 -2941071 -1711290 -2233608 -1474991 967932 3128529 3793989 3178700
5677 3178700 1685812 16051 -379352 1207738 3455577 4733066 5261965 5956874 6109136
5668 6109136 4392325 1670716 438084 1351000 2550435 2873563 3377019 4515095 4083825
5659 4083825 205760 -4999269 -7448915 -6456613 -5232204 -5530932 -4893712 -1201268 2601194
5650 2601194 1820756 -2920534 -5856096 -3907841 -722487 -1057502 -4171196 -5684465 -4049378
5641 -4049378 -1768614 -934084 -828961 -212045 670476 1027545 506608 -1229218 -4036607
5632 -4036607 -6046816 -5020780 -1723682 97417 -1719763 -4907002 -5779146 -3625402
5624 -3625402 -684533 990273 1021326 -76307 -1524085 -2424651 -2407325 -1870058 -959460
5615 -959460 859438 3352086 4708990 3552954 944218 -1093276 -2312960 -3798665
5607 -3798665 -5397488 -5751171 -4780112 -3820163 -2892935 -342356 3626631 5477020 2703400
5598 2703400 -1820587 -2669851 1256367 5302259 5032167 1397509 -1271887 -746803 1370748
5589 1370748 2581720 2344002 1819452 1911062 2140716 1303711 -885369 -3038765 -3566502
$$ [...]
##END NTUPLES=NMR SPECTRUM
##END=
