##TITLE=31Pdec_LR-736-RA-RM1
 , 24 sc
 2.04.2021
##JCAMPDX= 6.0         $$ Bruker NMR JCAMP-DX V2.0
##DATA TYPE= NMR SPECTRUM
##DATA CLASS= NTUPLES
##ORIGIN= UXNMR, Bruker Analytische Messtechnik GmbH
##OWNER= root
$$ XWIN-NMR		Version 3.5
$$ Fri Apr  2 13:00:14 2021 Russian Standard Time (UT+4h)  she@DPX200
##.OBSERVE FREQUENCY= 81.013821
##.OBSERVE NUCLEUS= ^31P
##.ACQUISITION MODE= SIMULTANEOUS
##.ACQUISITION SCHEME= undefined
##.AVERAGES= 24
##.DIGITISER RES= 16
##SPECTROMETER/DATA SYSTEM= spect
##.PULSE SEQUENCE= zgpg30
##.SOLVENT NAME= CDCl3
##.SHIFT REFERENCE= (INTERNAL, CDCl3, 0, 248.564)
##AUDIT TRAIL= $$ (NUMBER, WHEN, WHO, WHERE, WHAT)
$$ ##TITLE= Audit trail, XWIN-NMR		Version 3.5
$$ ##JCAMPDX= 5.01
$$ ##ORIGIN= Bruker BioSpin GmbH
$$ ##OWNER= she
$$ F:/spectra/data/she/nmr/P31/1/pdata/1/auditp.txt
$$ ##AUDIT TRAIL=  $$ (NUMBER, WHEN, WHO, WHERE, WHAT)
(   1,<2021-04-02 12:56:41.89 +0400>,<she>,<DPX200>,
      <created by zg, POWCHK disabled, PULCHK disabled
       configuration hash MD5:
       00 E9 B6 7A A2 85 ED C7 34 08 36 98 17 FE 4E 26
       data hash MD5: 32K
       19 D3 79 DE C4 D2 E2 A3 07 F2 E8 1F 66 74 AB CA>)
(   2,<2021-04-02 12:56:47.45 +0400>,<she>,<DPX200>,
      <Start of raw data processing
       efp BC_mod = 2 LB = 1 FT_mod = 6 PKNL = 1 PHC0 = -4618.981 PHC1 = 557.0011 SI = 64K 
       data hash MD5: 64K
       FA 8B 65 DE 99 4D 5A 90 87 C9 B3 A4 6F 4B 75 DE>)
(   3,<2021-04-02 12:57:07.85 +0400>,<she>,<DPX200>,
      <pk PHC0 = 9.177296 PHC1 = -55.4 
       data hash MD5: 64K
       26 76 E0 91 67 95 87 BA 4B 0B 67 B2 6E F7 AF EB>)
(   4,<2021-04-02 12:57:13.31 +0400>,<she>,<DPX200>,
      <abs ABSG = 5 
       data hash MD5: 64K
       DC DA 59 22 F2 FD AF 38 B1 2A EF F2 0C E1 10 01>)
$$ ##END=
$$ 
$$ hash MD5
$$ 4A EA D5 E4 FD 64 0D A4 AE 4C D9 62 60 B0 28 AE
##$RELAX= 
##$RELAX= 
##$RELAX= 
##$RELAX= 
##$RELAX= 
##$RELAX= 
##$RELAX= 
##$RELAX= 
$$ Bruker specific parameters
$$ --------------------------
##$DU= <F:/spectra>
##$EXPNO= 1
##$NAME= <P31>
##$PROCNO= 1
##$TYPE= <nmr>
##$USER= <she>
##$AMP= (0..31)
100 100 100 100 100 100 100 100 100 100 100 100 100 100 100 100 100 100 
100 100 100 100 100 100 100 100 100 100 100 100 100 100 
##$AQSEQ= 0
##$AQ_mod= 1
##$AUNM= <au_zg>
##$AUTOPOS= <>
##$BF1= 81.014009
##$BF2= 200.13
##$BF3= 200.13
##$BF4= 200.13
##$BF5= 200.13
##$BF6= 200.13
##$BF7= 200.13
##$BF8= 200.13
##$BYTORDA= 1
##$CFDGTYP= 0
##$CFRGTYP= 5
##$CHEMSTR= <none>
##$CNST= (0..31)
1 1 145 1 1 1 1 1 1 1 1 1 1 1 1 1 1 1 1 1 1 1 1 1 1 1 1 1 1 1 1 1 
##$CPDPRG= <waltz16>
##$CPDPRG1= <>
##$CPDPRG2= <waltz16>
##$CPDPRG3= <>
##$CPDPRG4= <mlev>
##$CPDPRG5= <mlev>
##$CPDPRG6= <mlev>
##$CPDPRG7= <mlev>
##$CPDPRG8= <mlev>
##$CPDPRGB= <>
##$CPDPRGT= <>
##$D= (0..31)
0 1 0 0 0 0 0 0 0 0 0 0.03 2e-05 3e-06 0 0 0 0 0 0 0 0 0 0 0 0 0 0 0 0 
0 0 
##$DATE= 1617353801
##$DBL= (0..7)
120 120 120 11 120 120 24 19 
##$DBP= (0..7)
150 150 150 150 150 150 150 150 
##$DBP07= 0
##$DBPNAM0= <>
##$DBPNAM1= <>
##$DBPNAM2= <>
$$ [...]
##$SUBNAM3= <"">
##$SUBNAM4= <"">
##$SUBNAM5= <"">
##$SUBNAM6= <"">
##$SUBNAM7= <"">
##$SUBNAM8= <"">
##$SUBNAM9= <"">
##$SW= 501.771253377433
##$SWIBOX= (0..15)
0 1 3 0 0 0 0 0 0 0 0 0 0 0 0 0 
##$SW_h= 40650.406504065
##$TD= 32768
##$TD0= 1
##$TE= 0
##$TE2= 300
##$TE3= 300
##$TEG= 300
##$TL= (0..7)
0 120 53 12 22 120 120 120 
##$TP= (0..7)
150 150 150 150 150 150 150 150 
##$TP07= 0
##$TPNAME0= <>
##$TPNAME1= <>
##$TPNAME2= <>
##$TPNAME3= <>
##$TPNAME4= <>
##$TPNAME5= <>
##$TPNAME6= <>
##$TPNAME7= <>
##$TPOAL= (0..7)
0.5 0.5 0.5 0.5 0.5 0.5 0.5 0.5 
##$TPOFFS= (0..7)
0 0 0 0 0 0 0 0 
##$TUNHIN= 0
##$TUNHOUT= 0
##$TUNXOUT= 0
##$USERA1= <user>
##$USERA2= <user>
##$USERA3= <user>
##$USERA4= <user>
##$USERA5= <user>
##$V9= 5
##$VALIST= <valist>
##$VCLIST= <CCCCCCCCCCCCCCC>
##$VD= 0
##$VDLIST= <DDDDDDDDDDDDDDD>
##$VPLIST= <PPPPPPPPPPPPPPP>
##$VTLIST= <TTTTTTTTTTTTTTT>
##$WBST= 1024
##$WBSW= 4
##$XGAIN= (0..3)
0 0 0 0 
##$XL= 0
##$YL= 0
##$YMAX_a= 16949
##$YMIN_a= -17858
##$ZGOPTNS= <>
##$ZL1= 120
##$ZL2= 120
##$ZL3= 120
##$ZL4= 120
##$ABSF1= 248.5645
##$ABSF2= -253.2056
##$ABSG= 5
##$ABSL= 3
##$ALPHA= 0
##$AQORDER= 0
##$ASSFAC= 0
##$ASSFACI= 0
##$ASSFACX= 0
##$ASSWID= 0
##$AUNMP= <proc_1d>
##$AZFE= 0.1
##$AZFW= 0.5
##$BCFW= 0
##$BC_mod= 2
##$BYTORDP= 0
##$COROFFS= 0
##$CY= -3
##$DATMOD= 1
##$DC= 0
##$DFILT= <>
##$DTYPP= 0
##$F1P= 0
##$F2P= 0
##$FCOR= 1
##$FTSIZE= 65536
##$FT_mod= 6
##$GAMMA= 0
##$GB= 0
##$INTBC= 1
##$INTSCL= 5.30512e-09
##$ISEN= 30
##$LB= 1
##$LEV0= 0
##$LPBIN= 0
##$MAXI= 10000
##$MC2= 0
##$MEAN= 0
##$ME_mod= 0
##$MI= 50
##$NCOEF= 0
##$NC_proc= -6
##$NLEV= 6
##$NOISF1= 182.463
##$NOISF2= 159.3651
##$NSP= 0
##$NTH_PI= 0
##$NZP= 0
##$OFFSET= 248.5645
##$PC= 4
##$PHC0= -4609.804
##$PHC1= 501.6011
##$PH_mod= 1
##$PKNL= yes
##$PPARMOD= 0
##$PSCAL= 0
##$PSIGN= 0
##$REVERSE= no
##$SF= 81.014009
##$SI= 65536
##$SIGF1= 159.3651
##$SIGF2= -187.1042
##$SINO= 113.3802
##$SIOLD= 16384
##$SREGLST= <1H.CDCl3>
##$SSB= 0
##$STSI= 65536
##$STSR= 0
##$SW_p= 40650.406504065
##$SYMM= 0
##$S_DEV= 0
##$TDeff= 32768
##$TDoff= 0
##$TI= <>
##$TILT= no
##$TM1= 0
##$TM2= 0
##$TOPLEV= 0
##$USERP1= <user>
##$USERP2= <user>
##$USERP3= <user>
##$USERP4= <user>
##$USERP5= <user>
##$WDW= 1
##$XDIM= 65536
##$YMAX_p= 314423243
##$YMIN_p= -23847598
$$ End of Bruker specific parameters
$$ ---------------------------------
##NTUPLES= NMR SPECTRUM
##VAR_NAME=  FREQUENCY,     SPECTRUM/REAL,   SPECTRUM/IMAG
##SYMBOL=    X,             R,               I
##VAR_TYPE=  INDEPENDENT,   DEPENDENT,       DEPENDENT
##VAR_FORM=  AFFN,          ASDF,            ASDF
##VAR_DIM=   65536,         65536,           65536
##UNITS=     HZ,            ARBITRARY UNITS, ARBITRARY UNITS
##FACTOR=    0.620285442955139, 1,           1
##FIRST=     20137.2065510759, 0,            0
##LAST=      -20513.1999529892, 0,           0
##MIN=       -20513.1999529892, -23847598,   0
##MAX=       20137.2065510759, 314423243,    0
$$ Real data points
##PAGE= N=1
##DATA TABLE= (X++(R..R)), XYDATA
$$ [...]
15265 821663 3443353 3426435 768325 -529283 1003967 2399577 1780797 1354936 2770570
15256 2770570 3426104 640531 -3273232 -3788807 -542600 2487771 2590773 1111683 526959
15247 526959 1145461 1444920 289860 -1849369 -3322515 -2820204 -764059 1087731 1570292
15238 1570292 1026752 219483 -601755 -1206022 -1181363 -830642 -1120644 -2066869 -2244563 -555986
15228 -555986 2507395 5759691 8237621 8905256 7065701 3726163 1063463 -15164
15220 -15164 -228250 282455 2092089 3878756 2717375 -1481942 -4687218 -3956965 -1339930
15211 -1339930 -290675 -877416 -1370469 -1961289 -3336037 -3715941 -1405675 1261376 861875
15202 861875 -1300119 -941975 2157041 3870613 2771278 2193687 3809864 4258534 983323
15193 983323 -2776826 -2523063 874052 2907061 1949544 345958 -12144 308883 607154
15184 607154 1418353 2948692 4140512 4018947 2808067 1438073 857497 1707940 3590371
15175 3590371 4774438 3836457 1631313 451740 1046533 1741295 1075030 90080 798529
15166 798529 2972868 3989261 2159023 -1052378 -3003743 -3157379 -3068359 -3608691 -3943190
15157 -3943190 -3451352 -2900083 -2952794 -3043892 -2682723 -2375830 -2158538 -943983 1096131
15148 1096131 1374366 -1520000 -4568127 -3653577 649620 3795812 3532567 2174016 2300097
15139 2300097 3467588 4187790 4243536 3661272 1877225 -576798 -1694633 -705254 785921
15130 785921 1506510 2157038 3094007 2888841 970102 -655090 -389487 400407 -13375
15121 -13375 -793889 -778150 -1437859 -4329741 -7185132 -6208915 -1605584 2518359 3459346
15112 3459346 2101638 140857 -1617574 -2068782 -167571 2798125 4016379 2992330
15104 2992330 2103617 2663233 3081842 1969563 489892 171838 562565 654913 771089
15095 771089 1325619 1318443 -100771 -1747152 -1846005 -544900 566513 803740 855716 1381313
15085 1381313 2344430 3374275 3797746 2750675 247980 -2184415 -2863360 -1789650 -501948
15076 -501948 -283615 -1012473 -1629081 -1436797 -1018854 -1695131 -3678316 -5304042 -5075990
15067 -5075990 -3901823 -3698935 -4174684 -3263059 -932951 152077 -1243009 -2887048 -2866977
15058 -2866977 -2756659 -4482400 -6255050 -4938022 -1172709 1342745 1175800 398139 518719
15049 518719 519934 -416651 -1278380 -1434704 -1888275 -3027949 -3450111 -2477294 -1766206 -2748571
15039 -2748571 -4247598 -4401492 -3464964 -2884158 -2809108 -2354443 -1427241 -660008 -311331
15030 -311331 -595754 -2062234 -4180055 -4810212 -2919199 -596286 -211091 -769000 190736
15021 190736 2001221 1596960 -1213847 -2839172 -1226380 1203843 1551318 408446 -309884
15012 -309884 -862209 -2131262 -2542910 -9106 3892432 5144068 2844107 497570 998560
15003 998560 2988906 3542508 2266296 811741 -263506 -1878320 -4014509 -4899338 -3217061
14994 -3217061 -108925 1778896 978669 -1423748 -2976015 -2184306 334327 2743156
14986 2743156 3669492 2972362 1366220 -163100 -704420 224309 2401449 5046428 7163170
14977 7163170 7792052 6546074 4368716 3168698 3879921 5245489 5391374 4187822 2894483
14968 2894483 1853193 248144 -1677038 -2108519 -279082 2061936 3109497 3504913
14960 3504913 4641534 5595636 4073032 174366 -3080382 -3501836 -2127406 -1021389
14952 -1021389 -329822 1108797 3277257 4707027 4431327 2996853 1493589 463064
14944 463064 -128333 -572476 -1300660 -2542793 -3851754 -4337844 -3623654 -2362074 -1658207
14935 -1658207 -2101960 -3382540 -4671800 -5394670 -5809583 -6711954 -8197634 -8835006 -6804271
14926 -6804271 -2275798 1924223 2839915 526913 -2009987 -2136784 -202730 1429254
14918 1429254 1248452 -167649 -1335127 -1397698 -511363 499509 626940 -566719 -2316790
14909 -2316790 -3172382 -2434955 -763842 794559 1862801 2537529 2764672 2521560 2268173
14900 2268173 2605773 3654246 5150458 6757054 7756953 7056675 4497067 1803507 947304
14891 947304 1523812 1137599 -1153523 -3149789 -2255817 1051925 3752612 3804970 1967014
14882 1967014 271317 -223498 -22926 -325000 -1749876 -3504841 -3943087 -2404197 -89695
14873 -89695 1540321 2534413 3428633 3238359 605399 -3018895 -3879491 -767421 2787624
14864 2787624 2992482 766114 -79031 1526540 2890061 1931885 -147875 -1112742 -380821
14855 -380821 1245141 2560047 1925648 -1608343 -5982604 -7030011 -3439080 924995
14847 924995 1757342 -47946 -72871 3096925 5978291 5180046 1755761 -617565 -179148
14838 -179148 1595641 2429416 1755822 788920 669688 935121 185333 -1759206 -3247204
14829 -3247204 -2915215 -1487530 -461490 106880 1069675 2127868 2115857 1118686 466133
14820 466133 503257 116759 -1192732 -2400508 -2573779 -1929758 -881172 481712 1546083
14811 1546083 1389987 369759 -35433 544217 930364 669576 826278 1759285 2139552
14802 2139552 1234640 179470 -208852 -756802 -1659248 -1234713 1068820 2743496 1882463
14793 1882463 691800 2125524 4623314 4105900 579655 -1432559 324667 2413860
14785 2413860 815941 -3253617 -4931473 -1785051 3599061 6713075 5661640 2562741
14777 2562741 845347 1477905 2514530 2377620 1972034 2466230 2727133 1046905 -1766262
14768 -1766262 -3363648 -3033946 -1548090 1053466 4495815 6021014 2964543 -2414115
14760 -2414115 -4602870 -1996903 1378498 2172386 1642377 1767967 1699526 596805 165169
14751 165169 1220805 1112090 -1824190 -4227346 -2310993 1846564 3158866 1038258
14743 1038258 -731389 -653849 -934078 -2117948 -1340058 2684475 6975005 8430750 7510944
14734 7510944 6084709 4491777 2612128 1342437 988313 251851 -1276324 -1579498 761406
14725 761406 3749007 4515055 3416740 3162949 4597433 5716308 4708461 2005266 -731387
14716 -731387 -2023204 -1000191 1869236 4207413 3555251 463681 -1567585 -142800
14708 -142800 3046971 4324059 2344572 -923197 -3109231 -3794526 -3705145 -3045538 -1673180
14699 -1673180 -89583 948100 1448414 1808531 1829822 1296624 1074690 1972710 2738789
14690 2738789 1363726 -1352218 -2165145 -389158 325828 -2615233 -6162386 -5659472 -1714075
14681 -1714075 871120 284787 -386222 1182637 3062039 2718072 814639 -595784 -1062671
14672 -1062671 -917758 278944 2383404 3645620 3051986 1982959 1690225 1056150 -992401
14663 -992401 -2824409 -2467787 -918084 -264853 -131170 826452 1398082 -311527 -2498574
14654 -2498574 -1603952 1538470 2253677 -577355 -2599400 -1162994 536286 -522390
14646 -522390 -1582211 1087438 5173306 5366615 1539067 -1537730 -1940463 -2594040 -4975474
14637 -4975474 -6112206 -3906463 -1135332 -1191194 -2917142 -2866280 -594881 1455947 2016130
14628 2016130 1913279 1664953 940090 274469 884219 2469778 3111962 1804193 -289022
14619 -289022 -1368511 -716506 1032217 2183296 877869 -2795575 -5776693 -4891969 -921042
14610 -921042 1921936 992215 -1961238 -3568303 -2730484 -739990 998577 1926014 1874357
14601 1874357 1067087 299486 171921 292701 -168544 -1359465 -2592106 -3065000 -2531597
14592 -2531597 -1577213 -1211154 -1648292 -1693841 -241121 1794961 2332847 1012103 -249559
14583 -249559 3037 968125 1188825 486548 -533541 -1492765 -1829432 -856074 647396
14574 647396 413940 -2288664 -4991159 -5062518 -3208440 -2019329 -2032170 -1505698 307851
14565 307851 1935485 1966664 836378 -126735 -290885 -46309 -234305 -1205868 -2049010
14556 -2049010 -1406199 417938 1337489 401639 -626454 -45291 998621 581352 -472608
14547 -472608 240500 2752428 4635486 4555816 3376224 1919591 224903 -996234 -797013
14538 -797013 -82234 -735066 -2466039 -3105439 -2179036 -1318825 -833746 814707 3326857
14529 3326857 3913292 1872278 442244 1915339 3924841 3302211 1111061 668298 2262663
14520 2262663 3116717 1810696 -96208 -624468 616527 2801456 4531684 4318410 1891600
14511 1891600 -1103641 -2655250 -2197925 -360903 1921532 3225660 2093077 -982139
14503 -982139 -3315914 -3135225 -1623194 -607333 86472 1208487 1728077 304199 -1962865
14494 -1962865 -2661784 -1388809 112324 639314 503865 271572 238976 800561 1962192
14485 1962192 2998436 3590200 4248300 4634002 3208386 52085 -2015251 -1234785 206399
14476 206399 -379549 -1922178 -1889423 -928983 -1476862 -3149552 -3571530 -2818935 -2822676 -3058253
14466 -3058253 -1386561 1121775 1096921 -1189135 -1968105 -847707 -1923851 -6147514 -8248469
14457 -8248469 -4588013 771705 2043883 -64112 -779895 873024 1622368 -65015
14449 -65015 -2087007 -2454707 -1437889 -100532 640696 -76282 -1802966 -2257933 -321472
14440 -321472 1666775 1213698 -125080 868474 3533964 4030987 1357746 -1232490 -1391871
14431 -1391871 -594541 -693006 -845201 270657 1702051 1762246 602437 -564063 -1431239
14422 -1431239 -2176650 -2318804 -1660641 -1363069 -2367869 -3501214 -2952314 -1239202 -765626
14413 -765626 -2240047 -3420615 -2364881 -447866 -472595 -2444053 -3358603 -1647891 311306
14404 311306 -229581 -1959805 -1430217 1128876 1358423 -2798568 -7348270 -7213506 -2700243
14395 -2700243 1741659 3534666 3536812 2652097 634495 -1628800 -2196779 -1339616 -1613920
14386 -1613920 -3429733 -3588869 -175699 3786895 4166355 1219444 -1591177 -2791971
14378 -2791971 -3644067 -4443836 -3734767 -1738105 -1261940 -3556068 -5641796 -3923052 924156
14369 924156 4813695 5305988 3743604 2466447 1955183 1472006 971099 962292 1084506
14360 1084506 243550 -1608711 -2841298 -1993830 134658 1028495 -744705 -3775195 -5248617
14351 -5248617 -3931566 -1308634 182565 -421095 -2014607 -2747180 -1704867 239912
14343 239912 968991 -853402 -3786815 -4510378 -1787639 1263588 689026 -2781255 -4186840
14334 -4186840 -1056792 2958693 3164671 353205 -831244 1094854 2823091 1860986
14326 1860986 46626 -81705 674198 206487 -1042301 -1177142 -506912 -1033475 -2713825
14317 -2713825 -3183288 -1539410 199786 262206 -461157 -342357 530404 1331912 2352997
14308 2352997 3956947 4784395 3325161 952764 917916 3706697 5617207 3436358 -1061158
14299 -1061158 -3356484 -2128345 -511765 -1220388 -2876250 -2578057 -335125 1183269
14291 1183269 579910 -736940 -1004510 -255336 483079 648541 78654 -1296292 -2802612
14282 -2802612 -3017002 -1448631 336017 244786 -1884852 -4031119 -4098927 -1926114 651958
14273 651958 1555799 488304 -857026 -956384 -351842 -444772 -907700 -49453 2147979
14264 2147979 3485518 2884857 2154060 2910765 3713981 2530576 595071 891438 3318115
14255 3318115 4464993 2714873 790008 1833311 4988898 6741568 5514665 3041302
14247 3041302 1537664 1277627 1411794 1877084 3224340 4726625 4041818 -102356 -5354921
14238 -5354921 -7470026 -5113332 -1555078 -511636 -1554210 -1399365 940896 2568545
14230 2568545 682933 -3616063 -6524079 -5607270 -1873743 1621290 2567640 1147731
14222 1147731 -497641 -588419 506241 986824 -177853 -2331048 -4154921 -4833380 -4231702
14213 -4231702 -2716632 -1007360 268451 938944 966081 155832 -1286226 -2429327 -2633173
14204 -2633173 -2423974 -2521471 -2631783 -2327473 -2385945 -3614063 -4811807 -3931354 -1320043
14195 -1320043 264543 -597815 -2130128 -2075789 -591213 622153 665308 -192634 -1313629
14186 -1313629 -1757358 -567878 1941293 4016472 4413228 3637167 2633455 1532028 538696
14177 538696 533316 1464281 1578922 -118668 -1929113 -1862144 -802928 -994056 -2258092
14168 -2258092 -2487825 -1585417 -1826296 -3718287 -4497055 -2264353 792653 1410491 -233697
14159 -233697 -1409301 -1210283 -1416651 -3093770 -4778736 -4777602 -3424065 -1977657 -628943
14150 -628943 1103257 2866653 3759804 3732529 3453069 2914299 1358911 -1269272 -3795279
14141 -3795279 -4968942 -4367916 -2154933 955793 3313093 3291543 1340114 -71526 626082
14132 626082 2289076 3018723 2696698 2331640 2035873 1257177 153975 -952909 -2668252
14123 -2668252 -5110971 -6208974 -3933078 -16807 1313261 -1172951 -4008046 -3708000
14115 -3708000 -879160 1509687 1907241 827676 -576293 -1147767 -322003 691743 -264479
14106 -264479 -3183068 -5233326 -4498322 -2623147 -2160634 -2999043 -3329565 -2627296 -1545626
14097 -1545626 -149701 1508545 2167058 1014686 -386389 -224841 368584 -1156991 -4609034
14088 -4609034 -7034116 -6621641 -4177709 -966829 2304762 4385175 4052090 2172402
14080 2172402 868281 381275 -915834 -3267605 -4916145 -5052115 -4639341 -3801673 -1388652
14071 -1388652 1910246 3069696 871617 -2075549 -3050644 -2499876 -2021620 -1667072 -1208825
14062 -1208825 -1654257 -3234740 -4029038 -2855558 -1437029 -1375016 -1300253 186066 1114687
14053 1114687 -787703 -3591961 -3788412 -2054240 -1932795 -3431126 -2821610 748553 3280146
14044 3280146 2146945 151435 992783 3871770 5244997 3699391 679408 -1929577
14036 -1929577 -2899403 -1865369 -223624 -335333 -2249045 -2940113 -557953 2487192 2904038
14027 2904038 1223582 421926 1178301 1577859 902265 624657 1557483 2693076 3246890
14018 3246890 3538415 3465257 2338899 729462 295306 1153153 1535945 739215 138480
14009 138480 372811 12940 -1525794 -2281019 -1111442 -491608 -2988997 -6513751 -6567577
14000 -6567577 -2665435 996924 1522242 542120 487567 908099 474129 42713 1091779
13991 1091779 2721616 2914421 1868354 1509763 2168954 2272761 1282911 462386 363126
13982 363126 -60243 -1047221 -969066 1076486 3426196 4092717 3444340 3154430 3651108
13973 3651108 4133566 4124936 3474646 1756175 -656161 -1713045 223488 3838902 6117711
13964 6117711 5769466 3817625 1409742 -901536 -2096631 -1321381 263977 517603 -477490
13955 -477490 -450228 1431214 3369748 4006762 4085073 4010053 2475949 -782100 -3307119
13946 -3307119 -3109891 -1532879 -737418 -224818 1636796 4210292 5439072 4950383 3754684
13937 3754684 2011622 -204734 -1123536 531366 2368018 846886 -3248888 -5350956
13929 -5350956 -3329505 178915 2115447 2268488 1401161 -454551 -2469004 -2823276 -1577992
13920 -1577992 -1022948 -1818845 -1740918 164797 1390166 90982 -1716070 -1794589 -1635482
13911 -1635482 -3463777 -5729774 -5420437 -3230974 -2459118 -3612828 -3929873 -1989629 715525
13902 715525 2941308 5209162 7652816 9069889 8803317 7485193 5609451 3326161
13894 3326161 1634815 1621580 2491935 2498627 1718050 1651590 2326460 2415077 2086375 2744279
13884 2744279 3759003 2725935 -359023 -2493341 -2326587 -2122990 -3488695 -4368443 -2581602
13875 -2581602 345864 1568253 1171758 1369854 2786714 3917128 3394073 1019182 -2411678
13866 -2411678 -4827907 -3887147 44432 3414487 3761552 2804891 3242344 4355491 3582586
13857 3582586 1055838 -613327 -398959 306459 592930 869391 895636 -123400 -1234793
13848 -1234793 -364889 2141210 3301086 1799303 23611 384069 1710598 1207829 -1343483
13839 -1343483 -3314642 -2704500 -353880 1455642 1739382 1687132 2851787 4832771 5571206
13830 5571206 4247336 2733319 3093290 4639542 5070286 3873091 2729340 2824891 3666065
13821 3666065 4487424 4876733 3932922 937700 -2674566 -4024996 -2170662 921181 3254360
13812 3254360 4710442 5467998 4783424 2600657 482276 -469949 -1025754 -1887497 -2076812
13803 -2076812 -806364 640582 665494 -330445 -1074574 -1531579 -2096225 -2062748 -1004576
13794 -1004576 -463803 -1875667 -3722410 -3314877 -834982 1013628 1058304 603717 326219
13785 326219 -794191 -2707094 -3203703 -1004748 2050018 3325820 2455940 964181 227321
13776 227321 873597 2810013 4663054 4442212 2011292 -137730 273093 2667608 4853228
13767 4853228 5745182 5579013 4519933 2694492 934114 -84090 -1029016 -2839076 -4786135
13758 -4786135 -5009920 -2895062 199047 2433574 2763993 1102462 -1621276 -3749580
13750 -3749580 -4279397 -3773273 -3136547 -2185676 -561821 832494 1030430 973020 2178395
13741 2178395 3759685 3221051 478368 -1453514 -646245 1216938 1764973 1187032 796100
13732 796100 263512 -1328161 -2824006 -2013762 865089 2877439 2101264 -24013 -770114
13723 -770114 479614 1692218 700306 -2273936 -4805661 -4979953 -3439175 -2064461 -1162331
13714 -1162331 457631 2531001 2607689 -519594 -4330663 -5224447 -2648432 868872 2820247
13705 2820247 2425567 368449 -1479181 -1077011 1306139 2706595 1354699 -480648
13697 -480648 134318 2189775 2704963 1950172 2485533 3506815 1193338 -4282231 -7072859
13688 -7072859 -3516863 2311116 4062576 1013172 -2846485 -4987611 -5806397 -5646957
13680 -5646957 -4202939 -2155889 -376636 1705681 4241248 4822385 1603777 -2539233
13672 -2539233 -3010400 -301793 488928 -2592011 -5479159 -4425743 -1117747 980682
13664 980682 1939667 3771460 5972076 6356552 5154669 4750355 5587605 5481786 3472865
13655 3472865 1631764 1840726 2785653 1819398 -1222148 -3700392 -3472578 -1300252 350423
13646 350423 260178 -314179 638591 3199880 5006761 3856217 622784 -1347079 -229020
13637 -229020 1824695 1421003 -1451313 -3392844 -2381053 -347689 227635 24444 804262
13628 804262 1434078 -482687 -3672151 -3969012 -620630 2268760 2164849 1899109 4339471
13619 4339471 7045792 6206523 3065541 1705248 2246527 1449026 -676855 -379691 3112137
13610 3112137 5550379 4024758 925492 -617417 -1276674 -2787465 -4047838 -3166141
13602 -3166141 -973451 516763 1190703 1662303 1048506 -1113969 -2533872 -1013078 1727221
13593 1727221 2414623 1384261 1773584 3999738 4759718 2054246 -1922252 -3893363 -3140756
13584 -3140756 -1148130 452761 830058 422113 823903 2682440 3867621 1870912 -2033815
13575 -2033815 -3734346 -1898133 272559 77468 -856843 122642 2080919 2120207 187397
13566 187397 -861791 344766 1971883 1976294 576587 -1060056 -2796501 -4907747 -6514622
13557 -6514622 -6108859 -3617633 -984176 -221602 -1219850 -1993427 -1117381 637963 1403476
13548 1403476 339634 -1939611 -4406633 -6011356 -5594210 -3065097 -644895 -1067360
13540 -1067360 -4039375 -6272625 -5709947 -3687536 -1878733 335138 3284767 4250182
13532 4250182 824960 -4185812 -5289317 -1783888 1198026 35288 -2825991 -3543275
13524 -3543275 -2562236 -2599743 -3543287 -3116061 -1338061 -599273 -1565365 -2341135 -1982337
13515 -1982337 -1779177 -2311576 -2085022 -397012 859803 -55586 -2061489 -3110421 -3149960
13506 -3149960 -3248003 -3021590 -1329775 962054 1319490 -976467 -3530073 -3797141 -2054441
13497 -2054441 -475645 -147678 -214512 222660 584820 -87221 -1096572 -448206 2237268
13488 2237268 4249703 2613663 -1932054 -5342546 -4926403 -2147742 -221959 -411634
13480 -411634 -1711286 -2852460 -3141970 -2183792 -356105 856845 397149 -794933 -1019558
13471 -1019558 -323107 -318996 -1521138 -2336194 -1204839 1280194 3037954 2810762 1401043
13462 1401043 714427 1644007 3065743 3389965 2868896 3154319 4363464 4336281 1854974
13453 1854974 -1094361 -1973467 -1237425 -1155193 -2129039 -2579872 -1920043 -1190809 -970864
13444 -970864 -1021122 -1864968 -4167628 -6408392 -5873575 -2593743 182603 259328 -1049242
13435 -1049242 -1544770 -865693 458366 2321051 4041596 4123818 2444517 881035 578145
13426 578145 568670 224446 637097 1987893 2147039 83425 -1722188 -875264 1070494
13417 1070494 1321076 502208 1118823 2730482 2601694 706119 184150 2392513 4896465
13408 4896465 5258793 3902979 2120978 -107053 -2775569 -4381636 -3549808 -1059653
13400 -1059653 922198 929723 -920752 -3083043 -3310881 -561197 3345856 5230938 4212372
13391 4212372 2615059 2761658 4251808 5173397 4718994 3554712 2495052 1903769 1948463
13382 1948463 2517895 2907117 2095894 -365253 -3517500 -5156455 -3692430 -319275 1681004
13373 1681004 706405 -1133158 -995839 836936 1924779 1583749 1524965 2905318 4989579
13364 4989579 6682280 7291114 5970539 2773811 112974 464435 2552377 2803183 818517
13355 818517 -154173 1063466 1567911 -106223 -751698 2041079 4854750 3131346 -1667128
13346 -1667128 -4228940 -3142485 -1662535 -1445839 -537802 1866198 3253346 1914704
13338 1914704 -452297 -2028688 -3549030 -5655069 -6471980 -4440665 -1455271 -371297
13330 -371297 -747715 123069 2618186 3993542 2440517 -299933 -1341854 -353447 341885
13321 341885 -994970 -3186437 -3585039 -1515363 785446 1245976 877391 2059935 4482344
13312 4482344 5024875 2145088 -1743864 -3446465 -2859326 -2198864 -2647282 -3446067 -3550704
13303 -3550704 -2649398 -988473 645323 1300901 1167141 1642176 3066542 3592042 1786787
13294 1786787 -872335 -2014027 -1739465 -1670046 -1653781 -361512 1302802 767408 -1845460
13285 -1845460 -3229429 -1820337 -166959 -847057 -2746980 -3285601 -1965308 269922
13277 269922 2929733 5044061 4622814 1687359 -205321 1539667 4354306 4174062 1643236
13268 1643236 559797 1195790 53230 -3504011 -5396544 -3253350 -315470 -310614 -1951825
13259 -1951825 -1825833 -233714 -404994 -3032077 -5033823 -3813007 -293893 2694156
13251 2694156 3455166 2456732 1308809 1016730 1002308 139664 -1349606 -2114536 -1864768
13242 -1864768 -1720455 -1930827 -1264679 347468 805091 -869244 -2367236 -1508466 14964
13233 14964 -840296 -3470509 -4368720 -2365079 68587 867104 702678 637934 227311
13224 227311 -867799 -1605952 -1289582 -860458 -1187162 -1550864 -1190951 -1076536 -2565936
13215 -2565936 -5074067 -6579684 -6163657 -4829502 -3827591 -3152656 -2006045 -177153
13207 -177153 1512668 2103086 1484251 224502 -1287868 -2831520 -3585164 -2572779 -380888
13198 -380888 812521 -96486 -1556075 -1660834 -862552 -691433 -819070 326418 2513224
13189 2513224 3753984 3401228 2674824 1716410 -1169145 -6169197 -10247433 -10525843 -7685929
13180 -7685929 -4262599 -1083632 2444747 5509378 5892595 3029353 -691952 -2286661
13172 -2286661 -911199 1970389 4211108 4406558 2522124 -156705 -1861486 -1669564
13164 -1669564 -254151 794592 604291 -64779 143680 1250762 1712998 506989 -1254149
13155 -1254149 -1552704 147043 2554161 4157731 4270565 2962385 1185546 713517 2561360
13146 2561360 5358858 6511984 5165509 2930946 1621317 1512050 1985982 2490299 2428641
13137 2428641 1435323 376498 919730 3399683 6048812 6968503 6017646 4265447 2551664
13128 2551664 1214643 346283 -416983 -1698793 -3390107 -4433150 -4058634 -2703026 -1391707
13119 -1391707 -781507 -973765 -1572878 -1769934 -1083153 -115519 116008 -482504 -1192617
13110 -1192617 -1590751 -1473142 -166334 2503082 4796911 4494033 1855387 -640095 -1642454
13101 -1642454 -1979142 -2098876 -915815 1810859 4087921 4036534 2126725 139897 -560474
13092 -560474 819243 3942473 6154065 4436141 -87999 -2276129 496579 4539324
13084 4539324 5042035 2550382 987421 1189370 482008 -2012791 -3727864 -2868757 -1020131
13075 -1020131 -392645 -861903 -1045734 -635963 -330634 -363655 -121470 1022324 2809858
13066 2809858 4013466 3662386 2544968 2511483 3691113 3741366 1097214 -2261447 -2996209
13057 -2996209 -606706 2215192 2897282 1173726 -1481639 -3137629 -2591487 -568396
13049 -568396 745311 243013 -1108034 -2681642 -5595513 -9888892 -12499234 -10964288
13041 -10964288 -7523636 -6126039 -6486658 -5004342 -1135106 1384017 261842 -2256924
13033 -2256924 -3228290 -2597186 -1538250 -279773 705443 30387 -2188210 -3481698 -2392026
13024 -2392026 -625983 -124786 -93237 1006016 2355352 2038626 158440 -1482151 -1967643
13015 -1967643 -1692899 -995792 -145501 -65636 -1361509 -2978917 -3269855 -2171061 -1174013
13006 -1174013 -1327174 -2166229 -2455826 -1464177 147451 511217 -1574317 -4757934 -6234885
12997 -6234885 -5006872 -2694932 -843911 675379 1845277 1340615 -1180937 -3417676
12989 -3417676 -3073096 -1004209 125793 -633889 -2121652 -3287523 -3981417 -4133913 -3768644
12980 -3768644 -3306440 -2633186 -863958 1599662 2241850 -283817 -3365771 -3531641 -1424457
12971 -1424457 -757643 -2745133 -4758118 -4725217 -3652370 -2891219 -1925087 -409789 142858
12962 142858 -1222074 -2611081 -1560125 1468910 3714351 3486195 1336359 -1444224
12954 -1444224 -3840849 -4954982 -4373658 -2849297 -1675198 -1389042 -1753852 -2654292 -4062562
12945 -4062562 -5320890 -5495664 -4560716 -3445133 -2779707 -2304686 -1701465 -1290077 -1446866
12936 -1446866 -1820151 -1792541 -1634280 -2449771 -4493420 -6050728 -5051171 -1956405 158627
12927 158627 -737408 -2930672 -3363780 -2019527 -1824145 -4144215 -6734723 -7149923 -6096866
12918 -6096866 -5678307 -5858900 -4889865 -2477712 -311635 437115 254002 -161881 -751865
12909 -751865 -1233595 -946907 4816 751436 1071813 1489543 1810474 1233690 317047 929160
12899 929160 3344300 5150148 4267893 1538271 -950911 -2490588 -3151808 -2271419 249668
12890 249668 2379185 2226273 1164047 2061342 4759628 6134552 4842138 3095889 2834877
12881 2834877 2825925 1209494 -1095109 -1518431 722697 3932545 5971012 5774165 3558527
12872 3558527 675538 -1186322 -1497849 -1214142 -1251982 -1475419 -1580272 -1799407 -2000575
12863 -2000575 -1249967 747397 2680615 3010599 1586884 -652424 -2577808 -3010886 -1391547
12854 -1391547 975523 1847816 1026453 727302 2104103 3482797 3279328 2267962 1247925
12845 1247925 -776963 -3564887 -3695235 594895 4928137 3785636 -1300849 -3573836
12837 -3573836 -684408 2722595 2600024 409962 -1089470 -1951736 -2502669 -1212769 1779074
12828 1779074 2920008 513987 -1738954 -348904 2018041 783803 -2912748 -4082989
12820 -4082989 -1833765 111030 298775 1218763 3423743 3625420 728099 -1145702 1189004
12811 1189004 4577004 3985990 -215693 -3247215 -2599215 -120043 1702901 2115060 993639
12802 993639 -1416067 -3278043 -2433629 399301 2071367 1434744 922465 2479354 4323723
12793 4323723 3817150 1701094 745872 1123636 211906 -2747896 -4685721 -2810244 1305440
12784 1305440 3672622 2873386 1135920 794738 1637759 2206230 2120104 1980568 1789750
12775 1789750 805021 -1015719 -2452230 -2460235 -1669006 -1706222 -3051138 -4272275 -3767283
12766 -3767283 -1696443 442086 1727943 2380661 2589299 2013403 822776 86440 322426
12757 322426 523990 -358014 -1584559 -1501230 -15988 1053674 378410 -1084747 -1212765
12748 -1212765 881374 4031124 6304776 6623656 5093206 2270416 -1170055 -3923387
12740 -3923387 -4251914 -1872233 798682 895283 -1195849 -2084289 -32555 2401943 1805763
12731 1805763 -1390194 -3564500 -2578915 85479 1721477 1344509 76149 -358985 560783
12722 560783 1279025 -372679 -4141510 -6824155 -6010556 -3312259 -2225551 -3729212 -5963522
12713 -5963522 -7429899 -8085652 -7680515 -5647892 -2801347 -746426 648915 2834699
12705 2834699 5358631 5710122 3128033 15994 -1538380 -2305820 -3647720 -4867349
12697 -4867349 -4483257 -2570673 -409309 930424 746482 -981360 -2701559 -2664945 -1923892
12688 -1923892 -3421708 -6919485 -7928909 -3972379 931880 1192982 -3041690 -6967533
12680 -6967533 -7910831 -7102588 -5534154 -2472516 1292362 2651856 374156 -2625361
12672 -2625361 -3127355 -1830134 -1829222 -4145238 -6694894 -7264723 -5939848 -4388334 -3670814
12663 -3670814 -3274169 -2153323 -354568 830976 485128 -619670 -793483 684493 2837756
12654 2837756 3989700 3230111 1122875 -801718 -1383089 -615846 1019334 3291508 5400398
12645 5400398 5312981 1888383 -2496038 -3821224 -1512008 745068 316381 -836103 180036
12636 180036 2328061 2256776 -566476 -3211578 -3257175 -996454 2003551 4336123 4893612
12627 4893612 3601821 2072452 1899410 2468549 2022836 524673 -337106 256203 1470633
12618 1470633 2481544 3127831 3017537 1803204 372627 54326 637145 858361 746314
12609 746314 1568279 3380270 4629401 4544538 4035285 3688751 2649368 283130 -2414650
12600 -2414650 -3844307 -3348213 -1471276 406077 787095 -440998 -1445123 -671528 829018
12591 829018 995232 178820 699229 2992735 4661444 3903363 1690783 -165632 -1065228
12582 -1065228 -983349 156578 1564876 1936942 1562205 2094052 3408728 3119905 572746
12573 572746 -1207942 339748 3333343 4164043 2590778 1209660 857481 -145004 -2137983
12564 -2137983 -2735814 -524359 2204902 2288903 5238 -1362730 126478 2913237 4422714
12555 4422714 4182986 3450128 2801029 1762739 554330 288298 918232 789563 -676907
12546 -676907 -1532158 -188184 1636516 1077848 -1555151 -3023702 -1560834 1167436 2676823
12537 2676823 2347831 1250032 888332 2158053 4047656 3806805 320830 -3329690 -3296782
12528 -3296782 -528064 366406 -2063280 -4209682 -3361758 -1595675 -1561901 -1941714 -275719
12519 -275719 2242476 2438887 290661 -976154 474196 2965145 3805568 2074283 -1002681
12510 -1002681 -3208392 -3228463 -2147965 -2139249 -3165634 -2838875 -492068 1131422 120914
12501 120914 -1245747 -122210 2167786 2424784 931530 639299 1979302 2589493 1941121
12492 1941121 2062116 3233296 3128247 1437867 1358644 4334383 6683050 4394115 -967730
12483 -967730 -4222354 -3154401 -267354 1453823 1789003 1952902 2195291 1913998 1215337
12474 1215337 1164087 2298721 3426893 2636838 -148680 -2321628 -1313238 2100338 4542578
12465 4542578 4274546 3223032 3969045 5969192 6259749 3526538 -13935 -1244691 237261
12456 237261 1931559 1584664 -339623 -1648726 -1137763 507230 2070866 2815353 2100364
12447 2100364 -477468 -3822171 -5448775 -3929247 -459503 2756524 4622502 4853490
12439 4853490 3185844 512939 -613619 1132781 3385950 2964551 567672 -291368
12431 -291368 1102938 1490637 -999093 -3514412 -2560072 860923 2643888 861817 -2577407
12422 -2577407 -4831370 -4694117 -2640181 -144688 940795 -236851 -2411037 -3295184
12414 -3295184 -2012942 112016 1157421 489631 -858824 -1312914 -410358 535854 -25065
12405 -25065 -1532008 -1583033 725507 2927969 2086828 -1260206 -3943729 -4625495 -5034650
12396 -5034650 -6121612 -5547698 -1192958 4347569 5844795 2156670 -1938314 -1904146 867787
12387 867787 1744662 -381006 -2085644 -827966 1890522 3615662 4200926 4217954 2698190
12378 2698190 -836026 -3794460 -3166079 -77903 1374609 -162372 -1706824 -558669
12370 -558669 2301058 4462022 5176665 4713708 2887760 240518 -992329 617339 3155596
12361 3155596 3444222 1162854 -996075 -1049030 223806 1073135 981633 486852 -27274
12352 -27274 -536081 -875713 -688161 138075 1163147 1626073 1116934 16747 -896911
12343 -896911 -1121621 -418345 1372831 3632063 4484777 2486850 -1085384 -3175763 -2637483
12334 -2637483 -1394608 -1266126 -1515301 -836799 41069 -321092 -1500876 -2203144 -2885303
12325 -2885303 -4862020 -7130733 -6745176 -2841679 1849690 4262069 4009833 2407412
12317 2407412 272475 -1978773 -3318792 -2873351 -1405382 -783899 -1745411 -2900194 -2459930
12308 -2459930 -752449 -262351 -2521006 -5506364 -5615128 -2380211 658126 736757 -488950
12299 -488950 86948 2219188 3183518 2352449 1790790 2624586 3906506 5178029 7009254
12290 7009254 8526057 7685085 5015865 3877258 5530550 7041133 5922055 3865557
12282 3865557 3526110 4314235 4091038 2705431 1063932 -1057079 -3298255 -3214887 -69565
12273 -69565 2136367 -200043 -3874080 -2743989 2891907 6540203 5423178 4064658
12265 4064658 6119725 8429546 6780725 2983694 1592946 2600703 2303882 -148952
12257 -148952 -1859044 -1507626 -1292285 -2723629 -3906823 -2617121 171509 1657540 944545
12248 944545 -232643 -205361 488026 142601 -1509248 -2672180 -1787778 380863 1852772
12239 1852772 1927025 1269034 131113 -1581702 -2712829 -1743532 342196 660860 -1225081
12230 -1225081 -2302060 -918143 265387 -1451915 -4034898 -3438627 395946 3652326
12222 3652326 4012386 2627503 828012 -1946961 -6133302 -10263161 -12233050 -11155499
12214 -11155499 -7803076 -4428594 -3713107 -6109005 -8481134 -7308806 -3115386 224997
12206 224997 427928 -1125122 -2227976 -2341366 -1833796 -1082419 -1061592 -2701715 -4849634
12197 -4849634 -4931597 -2566789 -423603 -310565 -541757 1122986 3727985 4506022 2979868
12188 2979868 1439817 1506812 2043056 961702 -1908585 -4426685 -4464568 -2353341 -649784
12179 -649784 -1214647 -3034910 -3649397 -2255133 -338602 480624 -3435 -1106832 -2125744
12170 -2125744 -2663888 -3054493 -4147664 -5669388 -5669254 -3319982 -1305451 -2793345 -6402134
12161 -6402134 -7295341 -3703647 787555 2474143 1961266 1716043 2068495 2029032 1970344
12152 1970344 2870775 4137451 4411243 3654033 2669294 1487695 -151651 -1648133 -2347939
12143 -2347939 -2564322 -2545337 -1639711 214396 1590520 1601326 1269937 1323405 504458 -1824826
12133 -1824826 -3321587 -1734505 1052553 1229213 -1428121 -3438629 -2783259 -1074385
12125 -1074385 -286833 -230796 -71993 57134 -5592 236130 794931 936399 773181 1589921
12115 1589921 3774229 5762195 5928940 4552444 3188760 2868739 3429344 3982861 3703571
12106 3703571 2655361 1892891 2219291 3043152 3110173 2020669 291625 -1537412 -2897043
12097 -2897043 -2920275 -1449731 136636 431938 10007 653996 2862189 5280879 6220863
12088 6220863 4719418 997225 -2704709 -2908838 1274408 5858624 6030553 2102894
12080 2102894 -1269943 -1675888 -1565028 -3596784 -6541305 -7561738 -6280243 -4535117
12072 -4535117 -3523605 -2994537 -2397092 -1415479 71701 1679320 2762658 3403242 4202046
12063 4202046 4814460 4065979 2001266 229658 -502586 -1365488 -2992000 -3753345 -2222026
12054 -2222026 -89088 -494264 -3780424 -6715369 -6287319 -3205425 -1052680 -2183934
12046 -2183934 -4825728 -4852261 -878762 3366672 3285713 -513632 -2718589 -282029 3630892
12037 3630892 4044476 414984 -3535618 -4782598 -3513883 -1380759 551166 1982588
12029 1982588 2995965 3783408 4108051 3399272 2024522 1595060 2889446 4320881 3941568
12020 3941568 2341531 1842888 3098129 4309987 4000551 2860719 2263445 2301126 2179960
12011 2179960 1754341 1818723 3074893 5084584 6118744 4397187 186687 -3636074 -4230272
12002 -4230272 -2032576 -145779 -258435 -658743 856481 3533157 4738083 3750375 2562207
11993 2562207 2819523 3770376 4025606 3890811 4572567 5838770 6024180 4350061 2046098
11984 2046098 877296 1324083 2390924 2560498 925123 -1873823 -3866044 -3759397 -2567170
11975 -2567170 -2106939 -2169165 -1008186 1204700 1836372 -186064 -2121799 -1075571 1980361
11966 1980361 4124719 4762834 5173128 5096747 3279544 957138 1019736 3187050 3623946
11957 3623946 616204 -2704175 -3167642 -2065420 -2289438 -3491566 -3341124 -2013857 -1834632
11948 -1834632 -2950682 -2867300 -827277 426326 -1278723 -3960580 -4009580 -1104689 1520384
11939 1520384 1465781 -138178 -894764 -493401 -389700 -968814 -925656 354391 1620975
11930 1620975 1867899 2020456 3021609 3533678 1674946 -1564253 -2952221 -1101382 2160009
11921 2160009 4680007 6009359 6016464 3958592 322247 -2372215 -2386922 -1097417 -875916
11912 -875916 -1732505 -1793480 -370578 1241877 1805439 1471094 959640 487071 -169261
11903 -169261 -1005412 -1396195 -520999 1416523 2716925 1953883 100989 -470664 811215
11894 811215 2184866 2431069 2156659 1571024 -403040 -3272095 -3860201 -589408 3173039
11885 3173039 3194689 478248 -248565 2361993 4448455 2864643 -417999 -1439179 590616
11876 590616 3115199 3705642 1997949 -901039 -3434736 -4422828 -3903493 -3014921 -2638692
11867 -2638692 -2588706 -2336744 -1768337 -871962 462875 1790106 1985378 440876 -2024028
11858 -2024028 -3818337 -3778800 -1767149 1049556 2426645 823088 -2452124 -4073293
11850 -4073293 -2546605 -92710 410990 -856598 -1679470 -1528108 -1838824 -2741501 -2269499
11841 -2269499 192302 2081275 1082708 -1354322 -2097040 -702564 746341 1375620 2185477
11832 2185477 3057917 2239675 -325343 -2016843 -1321276 -14909 159376 320605 1524550
11823 1524550 1602388 -1582645 -5486359 -5583224 -1994729 689051 178547 -1107306 -1063803
11814 -1063803 -1038491 -2243527 -2895533 -1493802 94616 -286365 -1272797 -254892 2324979
11805 2324979 4019863 4509303 5623914 7766545 9010620 7794126 4577831 931454
11797 931454 -1510445 -1632185 84097 1529066 1308840 311716 -309912 -1270207 -3299712
11788 -3299712 -4645400 -3199516 -298832 618477 -1067809 -2546556 -2072789 -1134412 -1416157
11779 -1416157 -2314839 -2637759 -2500254 -2231387 -1361727 -74159 144602 -1139694 -1911273
11770 -1911273 -513751 1388295 836055 -1989829 -3590624 -1720342 1634107 2776804
11762 2776804 759763 -1877705 -2525598 -1442865 -779723 -1533411 -2653740 -3054812 -3145548
11753 -3145548 -3713104 -4386784 -4322753 -3732864 -3463306 -3409942 -2717356 -1545561 -1245891 -2312691
11743 -2312691 -3291612 -2559054 -548864 710021 129591 -1157027 -1306414 27002 1607757
11734 1607757 2437340 2663102 2536186 1787973 862021 1349992 3618374 5259052 4224616
11725 4224616 2556203 3821736 7102216 7457623 3323849 -683440 -527575 1572635
11717 1572635 1516023 -2696 382359 2181104 1763895 -1210357 -3090490 -2298791 -1587174
11708 -1587174 -3111054 -5168105 -5517411 -4726356 -4297884 -4050409 -3320596 -2732546 -2886965
11699 -2886965 -2839697 -1530006 457822 1806796 2069000 1495028 466261 -242935 -25457
11690 -25457 183489 -1225504 -3633889 -4139619 -1489884 1848037 2987010 2297501 2088214
11681 2088214 3003350 3719038 3495705 3183359 3750709 5005770 5897927 5610533 4466497
11672 4466497 3711844 3846218 3544467 1447148 -1326992 -2276676 -1091780 73019 195238
11663 195238 640008 1964074 2359145 968349 13109 1222116 2518871 1232972 -1300821
11654 -1300821 -1847274 -698711 -1039944 -3227905 -3864026 -1406429 1142292 1012238 -81117
11645 -81117 854596 2979346 3083097 1002501 -70037 1097095 1586389 -981181 -4252065
11636 -4252065 -4257313 -1248558 688639 -378824 -1800469 -847969 1220536 1660513 691033
11627 691033 653162 1817606 2051819 562952 -827435 -754537 -293582 -826740 -1741526
11618 -1741526 -1468027 379765 2784044 4268466 3610986 852020 -1976803 -2529151 -1027737
11609 -1027737 25795 -561912 -1299099 -1000581 -963076 -2612259 -4776921 -5238233 -3813228
11600 -3813228 -2138035 -1362657 -1676021 -3093584 -4935664 -5374921 -3363124 -415366 1196671
11591 1196671 1291981 990550 -5287 -2728898 -5748017 -5612898 -1538933 2652139 2916562
11582 2916562 -105218 -2261458 -1125524 1691102 3228453 2454993 351682 -1861440
11574 -1861440 -3352085 -3246689 -1207786 1351525 2067406 379331 -1667608 -2257502 -2129545
11565 -2129545 -2669543 -3034846 -1449530 1400265 2984031 2844899 3040721 4236992 4403004
11556 4403004 2564811 906246 1258713 2056934 1127486 -593525 -752311 634088 1774834
11547 1774834 2204749 2529728 2118192 3245 -2507069 -3058220 -1828269 -1027387 -958986
11538 -958986 272620 2695523 3383453 817927 -2314253 -2601306 -410580 977210 -387433
11529 -387433 -3400024 -5720822 -5920031 -4171556 -1861288 -390991 125518 655381 1551185
11520 1551185 1877404 953972 -263811 -270479 905084 1606449 626106 -1199491 -1836096
11511 -1836096 -427116 1519013 1706509 -279449 -2519466 -3088557 -1943260 -71418
11503 -71418 2039948 3973461 4407110 2302945 -1120219 -3136883 -2449784 -287089 1470511
11494 1470511 2122710 1994055 1587676 1276552 1139622 969446 878268 1414112 2307164 1988776
11484 1988776 -175969 -2010040 -1062874 1322430 1197259 -2236086 -4859779 -3079418
11476 -3079418 1316417 3790738 2854908 895772 293008 1194492 2772630 4312506 4780854
11467 4780854 3295846 680354 -930714 -682310 97628 271994 780256 2898738 5561023
11458 5561023 6086061 3539657 39310 -1672568 -1016982 510406 1360358 1128303 298147
11449 298147 -351909 -312081 9566 -537031 -2321555 -3996701 -4076032 -3040925 -2456890
11440 -2456890 -2229343 -769629 1673704 2236770 -495771 -3641691 -3502577 -616915 1222439
11431 1222439 324870 -1262623 -1459092 -762169 -460705 -564364 -616619 -753476 -834231 -70511
11421 -70511 1425216 2228191 1808538 1563611 2374368 2811892 1555839 175372 1234569
11412 1234569 4353529 6344452 5024672 1085152 -3466412 -6739941 -7126530 -4423676
11404 -4423676 -1171307 -632608 -2692299 -3800194 -1884241 900927 1776162 1466247 2391987
11395 2391987 4356842 5027673 4058883 3565637 4244435 4163142 2555215 1886309 3990388
11386 3990388 6414382 5549057 2132590 331288 1572613 2713188 1267353 -691873
11378 -691873 19745 2560374 3205224 710403 -2209924 -2812341 -1422708 -9452 486907
11369 486907 439738 480734 1166938 2733008 4284383 4190032 2309053 904284 1957832
11360 1957832 4225390 4677655 2710998 985604 1531842 2915549 2655603 1064329 632099
11351 632099 2087719 3309801 2602699 1065871 523505 624555 -237273 -1927788 -2483975
11342 -2483975 -978081 1317243 3002110 4105269 4773365 4011577 1209926 -2089215
11334 -2089215 -3721450 -3822383 -4450146 -6197932 -7025393 -5270606 -2276487 -599801 -586301
11325 -586301 -508849 239797 172092 -1488234 -2929256 -2224393 -506308 -606883 -2819108
11316 -2819108 -4219124 -2852819 -669586 -853172 -3474994 -5595860 -5227978 -3476806
11308 -3476806 -2567701 -3070109 -3636162 -2821883 -778042 674079 -138090 -2549627 -3878589
11299 -3878589 -2668547 -702800 -436295 -1246809 -327636 2863498 5425350 4888592 2135222
11290 2135222 -530304 -2190483 -2816665 -1926705 203364 1369964 -131360 -2603810
11282 -2603810 -2817418 -540497 1143202 307089 -1366579 -1589520 -912102 -1362749 -2699795
11273 -2699795 -2192263 1524877 5900215 6971859 4049855 649105 199153 1796792
11265 1796792 1653810 -1434500 -4048334 -2663689 1361337 3426798 1808636 -243199
11257 -243199 846114 4244605 6152243 4801207 2155870 887852 1391967 2230035 2152614
11248 2152614 829234 -1433158 -3594277 -4143866 -2733563 -1260580 -1974243 -4475881
11240 -4475881 -5962234 -4679360 -1696497 1118465 3097128 3857921 2381925 -1210760
11232 -1210760 -4397251 -4865736 -3413046 -2137460 -791833 2306232 6191720 7246069
11224 7246069 3910976 -1097685 -4146385 -4277950 -2912357 -2036909 -3185445 -5964163
11216 -5964163 -7081814 -3457930 2906049 6106227 3786103 469305 1456777 6097800
11208 6097800 9633652 9465073 6807526 3916368 2512429 3574319 5978742 6532041
11200 6532041 3865325 980194 1326639 3869819 5122393 4655555 4871810 6092986 5933818
11191 5933818 3720814 1796796 1629198 1724866 364139 -2142827 -4631890 -6144751 -5421061
11182 -5421061 -1940384 2059567 3365009 2238458 2259859 4891668 7223578 6474768 3878431
11173 3878431 2283431 2290129 2674679 2647959 1897661 190014 -1455043 -1046094 1348927
11164 1348927 2867260 1875363 524978 1104620 2047733 545469 -2396109 -2879703 384759
11155 384759 4441927 6005924 4659906 2053189 31854 -176560 1293570 2746264
11147 2746264 2850698 2599150 3784004 5893629 6575095 5172939 3570221 3043897 2448916
11138 2448916 448274 -2309735 -4379986 -5310093 -5040092 -3062584 198504 2362685
11130 2362685 1431182 -1332865 -2710453 -1660063 -424969 -1144911 -2911125 -3121777 -833776
11121 -833776 2285141 4014626 3787323 2838865 2614222 3162932 3143332 1605470 -419708
11112 -419708 -818880 914744 2749440 2584103 1012642 530667 2129646 3869396 3345550
11103 3345550 818283 -956463 34747 2615786 3696940 1947012 -484197 -570901 1715211
11094 1715211 3400512 2478749 298627 -792922 -543000 -18345 849074 2743550 4745617
11085 4745617 5024630 3581861 2101486 1181821 92065 -737887 130048 1911505 1565252
11076 1565252 -1686209 -4591218 -4366939 -2353738 -1045518 -22519 2247207 4498542
11068 4498542 4070713 1408598 -139839 935974 2527833 2371477 1061787 633582 1451553
11059 1451553 1590542 -734831 -4330902 -5330176 -1647082 3253707 3554717 -1347136 -5548767
11050 -5548767 -4611340 -1522327 -1635980 -4487562 -4997334 -1414544 2525947 3294904 1457742
11041 1457742 -602487 -1491045 -678324 1490461 2970336 1804005 -710186 -1169402 1091669
11032 1091669 2880619 1588320 -1634016 -3949175 -3958242 -1996248 756594 2731079 3075963
11023 3075963 2597116 2256246 1343345 -805662 -2201810 -381989 3187605 4336498 1986750
11014 1986750 -730179 -1512357 -1336257 -1159768 -171096 1329838 1296497 122606 1573924
11005 1573924 6880930 11361149 10203579 4941602 790621 -272251 -196847 -254983 370940
10996 370940 1803943 2564452 1872136 716931 300493 832014 1844422 2559690 2201743
10987 2201743 944261 145815 773434 2102560 2738338 2314338 1485513 878454 668961
10978 668961 669181 533622 426595 1249573 3190696 4546111 3627824 1469494 569928 1145262
10968 1145262 1052305 -524031 -2055828 -2747565 -3725502 -5309406 -5862245 -4438257 -2108270
10959 -2108270 141433 2133715 2560581 -226210 -4364199 -5199647 -1700867 1500682
10951 1500682 736340 -1685884 -1906586 -427459 -32243 -674785 -426965 417791 -31712
10942 -31712 -1801770 -3345255 -4086666 -4041295 -2473238 387414 2014711 747972 -1493570
10933 -1493570 -2388790 -2910965 -4580961 -5317822 -2222333 2918420 5207062 3134236 -199718
10924 -199718 -1821838 -1372186 558809 3049184 4126465 2671424 678409 640693 1489600
10915 1489600 472807 -1819697 -2187871 -125842 1594468 1584080 1197629 1143024 654298
10906 654298 329307 1764013 3782960 3156964 69429 -1250693 1142072 3847119 3340560
10897 3340560 726496 -1026836 -1468081 -1676732 -1479914 -415888 410174 -53653 -812632
10888 -812632 -594142 -125763 -527013 -874883 273728 2038744 2374924 1421379 1187676
10879 1187676 1998069 1722262 -734988 -3177019 -2798575 -95843 1567920 262865 -2080864
10870 -2080864 -2257229 237823 3062920 4298264 4160340 3378920 1770650 -666299 -2725546
10861 -2725546 -3268933 -2556282 -1399652 -29121 1429689 2580660 3584210 4887618
10853 4887618 5526182 3781983 451037 -1182617 -122235 614134 -803741 -1576005 580638
10844 580638 2281959 -620244 -5442228 -5871399 -1678838 1004091 -666367 -2567687
10836 -2567687 -1101058 1536989 2398397 3091382 6228222 10169755 11326181 9402932
10828 9402932 6868231 4951848 3339393 2442642 2915951 3729271 3251684 1610127 -21341
10819 -21341 -1450880 -2638638 -2037291 1430714 5276190 5376866 1485426 -1790303 -679027
10810 -679027 2996554 4336342 1489965 -2544935 -4005975 -2512816 -443061 567109
10802 567109 1005135 1693257 2324217 2409517 2360636 2535727 2131514 311622 -2128244 -3533060
10792 -3533060 -3537139 -3248304 -3471280 -3899031 -4049327 -3989111 -3976842 -4005355 -3711604 -2536965
10782 -2536965 -532539 799083 -341876 -3372575 -5201964 -3931266 -1296917 15196
10774 15196 2604 332822 1016188 608436 -922975 -2019300 -1995331 -1496056 -708182 696959
10764 696959 1974457 1922606 1172808 1677929 3684675 5330177 5602590 5585344 6120163
10755 6120163 6175628 4523368 1676203 -702145 -1440890 -547874 873132 1283922 186566
10746 186566 -1151628 -1325605 -713351 -615586 -1032643 -839619 116728 701442 260736 -641565
10736 -641565 -1255707 -1325149 -929071 -595522 -1095172 -2170493 -2245114 -519265 1578335
10727 1578335 2280508 1725727 940331 -20963 -1099676 -857499 1514067 3823237 3128995
10718 3128995 -118651 -2584366 -2463049 -1241211 -1091255 -2284014 -3250579 -2123847 1342966
10709 1342966 4689527 4817571 1972788 -204065 317771 1402910 807329 -187529 392132
10700 392132 1765321 2790001 4773720 8257664 9909494 6952110 2275276 588572
10692 588572 1654713 2065532 1541573 2165254 3185971 2274473 592804 874376 1692868
10683 1692868 -299791 -3516886 -3445832 -911035 -1219615 -4853053 -6283424 -3128473 582169
10674 582169 1867719 2599996 3810953 3073692 272051 -553851 1718890 2602579 -128266
10665 -128266 -1979607 687784 4340419 4451305 3111869 4949514 9008432 10217280
10657 10217280 6876217 2121422 -744738 -952022 490458 1671179 1068088 -516883
10649 -516883 -966442 -433203 -1189149 -3314340 -4104873 -2681008 -1196413 -399459 1478660
10640 1478660 3999592 3751933 440298 -1416729 364105 1861779 -239811 -3086312
10632 -3086312 -2825037 -1026348 -1441392 -3675875 -4421466 -2559887 465375 3167825 4289439
10623 4289439 3093470 1395585 2171643 4539933 4242342 872475 -542627 2215952
10615 2215952 4439975 2344884 -625487 -121470 1705345 748025 -1562559 -1485023 -155536
10606 -155536 -1179210 -3615523 -3609849 -1322808 -426338 -1760190 -2704267 -2138474 -1350243
10597 -1350243 -554944 1210389 3007118 2577375 37506 -1901075 -1344957 1155840 3820384
10588 3820384 4974417 4202967 3163941 3669179 4542209 3055285 -98102 -1052855 958344
10579 958344 1935680 -465715 -3225716 -3007531 -775664 1051643 2037560 2031086 207485
10570 207485 -1985856 -1263341 2075444 3823841 2783142 2622641 4884623 6268298 5344299
10561 5344299 5312115 6996367 6124008 1358142 -2081400 -1154233 -188298 -2541232 -4340828
10552 -4340828 -1976149 1237740 1667587 1697304 3502539 3579324 -111447 -2631292 -534744
10543 -534744 1181119 -2154658 -6128403 -4992896 -1529880 -1151783 -2456473 -1720786 -681492
10534 -681492 -1811945 -1944913 1444310 3831843 1414387 -1221377 884390 4174336
10526 4174336 3609560 1401958 909226 -251659 -3108310 -2351181 3208835 5268911 154568
10517 154568 -2936292 2114663 6636052 3069918 -813008 2856514 6464684 1919959
10509 1919959 -2867030 553937 3791166 -1736961 -6136985 311789 6129918 -500546
10501 -500546 -7109528 483676 9439376 4075174 -1239907 10586096 20477341 5832394
10493 5832394 -9367518 7642995 30147307 13855844 -1717530 73981611 227651580
10486 227651580 314423243 238180762 83397787 -1439887 9157566 28413687 9756717
10479 9756717 -8458249 2150670 12873496 1240878 -9765350 -693281 9722822
10472 9722822 3870371 -3695630 1632525 7174886 503785 -6082263 -278845 7012262
10464 7012262 3447142 -2414246 564214 5523778 3205972 95877 3968756 7437182
10456 7437182 2208544 -4536449 -3351825 740466 -882320 -4554961 -2989274 675039
10448 675039 310660 -1126720 1301260 4082276 2566414 314161 1531423 2701266
10440 2701266 681446 129908 3999411 6023476 1898941 -1547936 1811765 5769124
10432 5769124 2638339 -2877158 -2134989 2494418 2849335 -796593 -2191277 -1088738
10424 -1088738 -1902731 -4048516 -3625994 -1704070 -1885485 -2577029 -212174 2764815 1501202
10415 1501202 -2294678 -3054082 -748687 131196 -982315 -777365 985000 1551199 1026585
10406 1026585 1751854 2903135 1674786 -1074513 -1886466 -639497 -403531 -2011863 -3153771
10397 -3153771 -2215633 494130 4051233 6322735 4255754 -1727402 -6064448 -4651226
10389 -4651226 -693901 99300 -2254448 -3156274 -919003 1640235 2203275 1431479 756706
10380 756706 748853 1325019 1554166 247868 -1816806 -2128439 -270603 1010700 83024
10371 83024 -1252991 -1408342 -1442677 -1790979 -472128 2728645 4183901 1771115 -1241057
10362 -1241057 -1018536 1420553 2917499 2997254 2585459 1172582 -1214187 -2311817 -1336808
10353 -1336808 -1262507 -3997298 -6638297 -6109550 -4037953 -3110766 -2145853 775752 3533836
10344 3533836 3148635 1062068 523827 1079874 290371 -1286144 -1509024 -1109041 -2100928
10335 -2100928 -3404224 -2546043 -367192 198799 -1141249 -2357665 -2864606 -3381234 -3448704
10326 -3448704 -2502991 -1845908 -2338001 -2123855 67599 1829355 989273 -85179 1622581
10317 1622581 4241859 4236316 2750182 3261640 4763201 3264582 -843655 -2958290 -1769139
10308 -1769139 -906548 -2375954 -3554937 -2187766 -49151 216464 -1236547 -2497762
10300 -2497762 -2371888 -920479 736287 1052181 47439 -83265 1775540 3185097 1517892
10291 1517892 -1618434 -2482702 -660733 906044 596466 -510516 -1429791 -2234946 -2489531
10282 -2489531 -1578701 -351395 3225 51730 738414 1064318 -174366 -1593243 -1122688
10273 -1122688 469492 934152 182614 -408168 -856195 -1547319 -1021256 1634006 3818083
10264 3818083 2720305 15562 -759956 228730 627683 1022946 3207123 4881770 2273434
10255 2273434 -2625656 -3917779 -1036228 472403 -1792254 -3890518 -3402048 -3580692
10247 -3580692 -6514181 -8380341 -5759106 -1571019 -75806 -149820 1485670 3670988
10239 3670988 2818832 -476575 -2001253 -364986 1485232 1171677 -285330 -977559 -644507
10230 -644507 -459 539968 852943 1011633 1386084 2004593 2116562 1315649 644483 1448630
10220 1448630 3313858 4160712 2536490 -709710 -3133677 -2972135 -888256 599571
10212 599571 -257601 -2600004 -4181302 -3955693 -2646859 -1249407 -196672 135722 -584065
10203 -584065 -1856104 -2428449 -1466975 745014 3095038 4274147 3699689 2314625 1685756
10194 1685756 1774169 777668 -2006583 -4637511 -5095838 -3934972 -2866856 -2178768 -1322226
10185 -1322226 -656730 -687419 -913674 -1242738 -2772463 -5052714 -4847474 -656204 3672265
10176 3672265 3628546 592728 -660020 369319 -106114 -2906994 -4270143 -2522622 -1161983
10167 -1161983 -3105029 -6067296 -6281101 -3640097 -669444 1122656 1652806 1017768 -298789
10158 -298789 -1408227 -2166374 -2803221 -2343523 161676 2861597 2843039 1005021 1400777
10149 1400777 4809653 7121968 5753675 3397960 2935490 2684022 43438 -3489819
10141 -3489819 -4726048 -3737423 -2784312 -2242984 -1068723 276701 683524 890902 2038148
10132 2038148 2887481 1500484 -1281733 -2905502 -2853145 -2661061 -2949162 -2992135 -2602696
10123 -2602696 -2086247 -990775 938974 2412667 2305234 1656123 1828022 2058680 1302096
10114 1302096 886864 2258674 3541102 2032295 -860454 -1264018 962365 1978008
10106 1978008 276810 -1039628 497012 3075286 3960931 3226508 2148036 692435
10098 692435 -1274205 -2617792 -2806321 -3046714 -3697129 -2845569 289888 2770099 1581093
10089 1581093 -1742451 -3143433 -1615415 290195 895023 1163088 1958809 2460458 2011583
10080 2011583 1249195 643860 -76625 -410570 855842 3126017 3682701 1306835 -1658388
10071 -1658388 -2504453 -1690032 -1187541 -938327 325295 1751633 1162860 -835202 -938473
10062 -938473 1636944 3200679 876334 -2785722 -3381003 -1056418 228798 -791056
10054 -791056 -916268 1804979 4186271 2281440 -2536983 -5067442 -3216457 -469102
10046 -469102 -849361 -3739895 -5160690 -2937976 990915 3103142 1959318 -731121
10038 -731121 -2032476 -657817 1766957 2461405 718560 -1214182 -1052626 562696 1315416
10029 1315416 822254 937954 2239382 2617174 706971 -1417666 -1245772 -20065 -993827
10020 -993827 -4098445 -5620747 -3682875 -956955 -544420 -1740417 -1874825 -388140 1277506
10011 1277506 2554435 4022219 5353353 5270100 3624149 1803220 886426 708778 795650
10002 795650 962408 871659 102435 -1169599 -2355420 -3190890 -3497242 -2648899 -490216
9993 -490216 1497272 1404548 -593860 -2236831 -1969002 -564214 378997 343042 -339458
9984 -339458 -1514221 -2922461 -3458313 -2001529 721868 2041119 86299 -3486692 -4730198
9975 -4730198 -2111354 1124436 911170 -1997135 -2833291 390090 3747673 2732140 -1664528
9966 -1664528 -4766830 -4515729 -2928266 -2044360 -1677331 -1414409 -1866463 -2919094 -3051329
9957 -3051329 -1649554 -241018 -200694 -714366 -276100 1070153 2342815 3422888 4696788
9948 4696788 5515454 4626236 2175569 48460 -172005 1152091 2485873 3000156 3106861
9939 3106861 3261969 2936528 1352534 -946188 -2081759 -863970 1658467 3291130 3090405
9930 3090405 1989297 1126624 465012 -418740 -859230 368715 2780456 3682139 1245948
9921 1245948 -2541456 -3905499 -2289384 -917368 -1494409 -1301247 2071220 5779135 5283006
9912 5283006 1203107 -1778893 -2081324 -2369356 -3471650 -2672728 405881 1590864 -1398961
9903 -1398961 -4908778 -5068226 -3472943 -3470474 -4497407 -4243445 -3279767 -3264083 -3275932 -2050849
9893 -2050849 -1107621 -1569054 -1003225 2085663 4164470 2350858 379852 2466765 5069290
9884 5069290 2833535 -655194 1687669 5978202 590631 -14476210 -23847598 -17527110
9876 -17527110 -4662909 678703 -1579904 -2019013 1686717 3451623 874623 -1605157
9868 -1605157 -1408056 -1256464 -2745685 -3215707 -1000660 1368030 1396366 212291 -130259
9859 -130259 53285 -488547 -1317666 -1100036 25638 444262 -690344 -2066481 -1631269
9850 -1631269 572515 1939586 679974 -1381917 -1351497 295591 728561 -262745 -83247
9841 -83247 1610470 2051232 759726 1100118 4174048 5818313 3048384 -663509 -684786
9832 -684786 1659750 1866032 -547112 -2411741 -2543559 -2286169 -1784394 -207030 1256642
9823 1256642 824729 -207846 780485 2982064 3108991 699311 -1271033 -870247 1082431
9814 1082431 3437525 5532805 5996422 4001499 1344336 263209 -58630 -1681285 -3779603
9805 -3779603 -4057852 -3184168 -3536082 -4276056 -2348034 1837740 4497869 4454005 4190741
9796 4190741 4411610 2651127 -1365966 -3966732 -3251436 -2185413 -3488534 -5352958 -5115052
9787 -5115052 -3855978 -4133192 -5549533 -5678465 -3875005 -1663770 -363946 -109874 -362537
9778 -362537 -321482 204473 -6373 -2010779 -4338492 -4411529 -2379896 -852956 -605199
9769 -605199 231246 2057708 2481862 468768 -1565174 -1607385 -953921 -1341348 -2041687
9760 -2041687 -1877850 -1501240 -1596070 -1291134 -327422 -290595 -1678947 -2269525 -448974 2339825
9750 2339825 4387969 6101560 7513455 6701329 3453899 1322657 2718804 4872324
9742 4872324 4252478 2189345 2033038 3308539 3346105 2686176 3823128 5936240 6049595
9733 6049595 4653488 4900151 6453285 5622642 2188505 593991 2732335 4562556 2381599
9724 2381599 -1705980 -3478395 -2408360 -730155 662989 2152991 2931761 1667796
9716 1667796 -1031785 -3001764 -3005286 -1527595 295104 1542407 1979006 2250641 2800560
9707 2800560 2603362 561811 -1830749 -1551821 1658655 4569890 4923943 3901962 2881568
9698 2881568 922605 -2260682 -3841934 -1668724 1635122 1911463 -634964 -2354704
9690 -2354704 -1857171 -902298 -123532 1905847 4835753 5768989 3731731 1625556 1968560
9681 1968560 3429799 3498161 2182080 916839 -145886 -1342467 -1558818 328840 2970608
9672 2970608 3875112 2745427 1412969 840014 314481 -427223 -387699 877179 2260322
9663 2260322 2621091 2170530 1736249 1527123 1226583 744029 367654 365911 590262 465554
9653 465554 -289065 -806262 319274 3070757 5482181 5797351 4295154 2156152 -268829
9644 -268829 -2702483 -3720602 -2361649 -228435 265511 -640174 -686513 531184 1009411
9635 1009411 -86824 -1110439 -983605 -804806 -1174887 -604574 1634556 3457462 2969651
9626 2969651 1597334 1800492 3147833 3188186 1187975 -1445797 -3711594 -5595701 -6615560
9617 -6615560 -6095905 -4699253 -3679856 -2899085 -1574834 -605514 -1756400 -4446070 -5690886
9608 -5690886 -3817645 -342802 2348448 3380146 2911053 1214093 -755773 -1372628 -105334
9599 -105334 1611334 2082030 1181804 -47708 -799715 -954644 -833231 -952458 -1509261
9590 -1509261 -1967517 -1752191 -1256732 -1350312 -2037142 -2560175 -2624419 -2402158 -1626251 -124254
9580 -124254 929834 36605 -2242951 -3734783 -3769663 -3853264 -4626926 -4390582 -1958168
9571 -1958168 949071 1959331 1309982 929949 1287296 1278309 760187 932578 1884244 1680383
9561 1680383 -1082404 -4909513 -6767569 -5487272 -2889944 -1417564 -1420671 -1466267 -951875
9552 -951875 -1163496 -3117827 -5375143 -5363623 -2604010 734038 2549514 2743311 2156630
9543 2156630 1064721 -413878 -1544041 -1760608 -1614766 -1944023 -2526775 -2459101 -1515108
9534 -1515108 -203682 1296832 3202609 5011999 5388095 3827570 1853496 1592595 3136054
9525 3136054 4189831 2866448 158232 -1292722 -542364 786543 1078393 711131 762025
9516 762025 1073753 885229 500790 843776 1752967 2103637 1501744 681562 232482 -95591
9506 -95591 -832038 -2264742 -4221365 -5676137 -5164810 -2603702 -111307 222351 -1046683
9497 -1046683 -1585523 -362503 1468273 2423701 2111413 1072835 395788 1056933 2541092
9488 2541092 2898583 1450434 216355 833662 1512830 -257604 -3141728 -3521113 -1172482
9479 -1172482 372027 -570404 -1669090 -992963 72350 -75890 -525812 -222593 -205924
9470 -205924 -1262471 -1872024 -903981 -191084 -1827721 -4563885 -5413901 -3679266 -1200279
9461 -1200279 375976 690013 28224 -741184 -553711 214233 -231680 -2216347 -3420690
9452 -3420690 -2141053 23396 550747 -550906 -1512900 -1426830 -255095 2031040 4314596
9443 4314596 4217825 1498188 -225136 2155621 6614172 8501435 6365297 2480660 -1075765
9434 -1075765 -3706842 -4632414 -3315394 -1258319 -536813 -816855 -298007 1018485 1601491
9425 1601491 1138195 270740 -1437887 -4170352 -5529673 -3269685 271645 504447 -2808212
9416 -2808212 -5433341 -5268421 -4495714 -4377111 -2811750 904366 3307864 1736794 -1295145
9407 -1295145 -1905470 -508596 -425912 -2534962 -4418030 -4083686 -2147641 -603389 -866711
9398 -866711 -2570874 -3509834 -1738294 1697737 3514313 2221189 -339647 -2074589 -3045441
9389 -3045441 -3793366 -3684951 -2575995 -2038230 -3022663 -3966644 -3051516 -904402 589168
9380 589168 767193 51547 -1081874 -1560121 51221 3131357 4658545 3030472 346142
9371 346142 -886333 -1048146 -1229216 -343787 2435045 4555330 3237808 297058 -248722
9362 -248722 1503926 1738588 -564586 -2027332 -602311 1312569 1185843 228663 691345
9353 691345 1999458 2086674 757164 -547424 -1049328 -771863 543048 2835717 4827872
9344 4827872 5310266 4706100 3999624 2867600 485533 -2272123 -3235283 -1778727 93608
9335 93608 72285 -1851065 -3639259 -3594554 -1973705 -395729 -63278 -663628 -826285 458582
9325 458582 2737008 4282998 3654580 1327362 -604060 -823804 -266641 -218462 216549
9316 216549 2652653 5583475 4982193 47691 -4448216 -4006595 -432568 1114296 -443918
9307 -443918 -1468057 70948 1743214 1007447 -1057350 -1932611 -989100 878707 2763154
9298 2763154 3484946 1880270 -1198592 -2990081 -2223912 -634156 -71750 -335842 -1021106
9289 -1021106 -2749392 -4772733 -4325751 -985664 1111692 -1191785 -4623859 -3593365
9281 -3593365 1778976 6054728 6134347 4177108 2992308 2786249 3001788 3425258 2649907
9272 2649907 -812415 -4997450 -5900319 -3448952 -1872272 -2650154 -1903292 2515047 6183239
9263 6183239 4617889 685137 163168 2513945 2097139 -2358994 -5504192 -3363831 1412578
9254 1412578 3997895 3219721 1010699 -907644 -1698551 -970520 455807 812535 -393169
9245 -393169 -1795057 -2360367 -2291383 -1260851 1741632 5684980 7148583 4457261 160414
9236 160414 -2391800 -3054091 -3515504 -3803175 -2761086 -928772 -266916 -1219605 -2113181
9227 -2113181 -1556811 24254 1233821 1026612 -499026 -1722950 -575635 2939980 6032948
9218 6032948 6113095 3765373 1554910 758257 737738 764401 777783 764876 821657 1407285
9208 1407285 2366130 2490765 1342074 383612 676233 792965 -753928 -2306297 -1182228
9199 -1182228 1812463 3285335 2396973 1580149 1864784 1286784 -907979 -2167159 -769505
9190 -769505 1051547 684026 -613497 78374 2591157 4084344 3285402 1672764 819704
9181 819704 735528 746444 418163 -227857 -296390 1531029 4953224 7401462 6868297 4426850
9171 4426850 2394740 1164546 -115361 -803438 539219 2933586 3186457 -27537 -4227112
9162 -4227112 -5991685 -4414898 -1343313 535325 -335926 -2991581 -4416126 -2720308
9154 -2720308 248034 997960 -1071999 -3149494 -3069890 -1701261 -784021 -634450 -930568
9145 -930568 -1693982 -2243610 -1064307 1783413 3749807 2899914 510924 -1054486 -1586854
9136 -1586854 -2143233 -2249556 -571346 2179037 3601409 2989399 2083099 2013473 1624430
9127 1624430 -253498 -2611062 -3608703 -2958244 -1716245 -516750 679257 1444777 800753
9118 800753 -1431385 -3886014 -4680326 -3072870 -98741 2244871 2508309 885773 -908899
9109 -908899 -1021490 872466 3135639 3724321 2376715 839605 571787 870136 157290
9100 157290 -1377639 -1831024 -313660 1818750 2839206 2373895 835349 -1196862 -2300198
9091 -2300198 -908422 1938403 2549459 -679472 -4314183 -4324206 -1896783 -1358499 -3242125
9082 -3242125 -3656833 -839486 2050462 2202762 1259775 1704407 2496573 1484065 -371156
9073 -371156 -747899 -232928 -1135690 -3035583 -3245883 -1433256 -150112 -401468 -121037
9064 -121037 1874210 3414800 2138235 -1053907 -3398945 -3536344 -1884442 721526 2987363
9055 2987363 2827541 -837383 -5943784 -8386352 -5832300 -48029 4770450 5885488
9047 5885488 4185654 2427614 1707285 755643 -1060354 -1958658 -593411 957909 -181005
9038 -181005 -2839106 -2881911 623436 3684619 2927407 -213486 -2491838 -3183398 -3205582
9029 -3205582 -2379053 -325141 1623657 2109381 2015308 2554848 2561812 579248 -1607833
9020 -1607833 -938826 1972739 3268592 1227115 -1985349 -4135183 -5181027 -5145077 -3223739
9011 -3223739 -364579 483638 -1356066 -2494882 -270121 2957291 2992396 -372757 -3603318
9002 -3603318 -4464156 -3902379 -3253154 -2433165 -1428847 -1271026 -2404950 -3470968 -2808572
8993 -2808572 -539240 1532079 1765795 159282 -1724947 -2219737 -1186032 -35531 136038
8984 136038 -26131 824231 2695068 4123153 3945198 2408815 572614 -619198 -654616
8975 -654616 292541 1150437 690524 -1051933 -2476270 -1967954 347783 2638595 3153533
8966 3153533 1902304 500200 336681 1134186 1617110 1272229 630710 -145532 -1707535
8957 -1707535 -3915138 -4967542 -3416641 -413353 1466240 1388194 855065 1169986 1851814
8948 1851814 2008383 1840435 1858476 1628135 423218 -1389162 -2602875 -2573373 -1603927
8939 -1603927 -144279 1638061 3514599 5064289 6032682 6475086 6468746 5883243 4469735
8930 4469735 2227947 -88226 -1052066 50352 1768975 1494521 -1404066 -4412115 -4834043
8921 -4834043 -3040227 -1453164 -1165411 -1443785 -2070695 -3688416 -5490933 -5171212 -2358193
8912 -2358193 147166 234823 -430874 656093 2600100 2626326 712539 -584550 -628719
8903 -628719 -1591545 -4255503 -6183857 -5457137 -3496381 -2395319 -1775306 -353894 1339113
8894 1339113 2148495 2638324 3783442 4483130 2900880 -504063 -3650610 -5758257 -7119604
8885 -7119604 -6838038 -3945718 -498111 -53366 -2489123 -3684671 -1521893 1044551 735067
8876 735067 -1213003 -1544978 -64097 843115 387038 222 355655 563413 326585
8867 326585 507524 1301639 1900093 2279359 3360974 4865291 4868604 2399685 -946271
8858 -946271 -2916357 -2989827 -2002962 -488993 1448474 3256990 4126856 3992209 3579541
8849 3579541 3367513 2937923 1549905 -719097 -2568087 -2529802 -573114 1755836 3018459
8840 3018459 3076136 2251292 434291 -1892885 -2859424 -1258386 1214170 1861734 815907
8831 815907 560096 1677462 2066234 1075430 1046404 3012235 4202641 2619889 1113302
8822 1113302 3038558 6086988 5190826 491049 -2784853 -2436436 -1811403 -2925965 -2673217
8813 -2673217 1078203 4494750 3366140 165013 331837 3681222 5077937 2874298
8805 2874298 1000200 1913574 2684486 294489 -3190720 -3723563 -996643 1820760 2571162
8796 2571162 1858467 1105595 824562 580841 -410707 -2368523 -4308820 -5187219 -5617829
8787 -5617829 -6730982 -7188306 -4008351 2411547 6858409 5271151 207092 -2355767
8779 -2355767 -341352 3114927 4723147 4228791 2667295 557179 -1323417 -1772442 -1012065
8770 -1012065 -1044844 -2990251 -5281277 -5642112 -4024519 -2482947 -2503052 -3383715 -3451054
8761 -3451054 -2444659 -2090441 -3791141 -6106384 -5834899 -2088979 2069445 3182262 1489036
8752 1489036 15278 423111 1569640 1878325 1374130 1145821 2017901 3911518 5666724
8743 5666724 5727377 3898836 1972781 1630324 2409886 2883996 2830444 2609668 1491744
8734 1491744 -1082099 -3241972 -2346976 1195214 4300836 5438506 5768164 5762575 3817127
8725 3817127 -520100 -4594560 -5705792 -4304958 -2658223 -1956152 -2110379 -2830844 -3467313
8716 -3467313 -3117170 -2118021 -2069036 -3258799 -3633096 -1612249 1590957 3841926 4765621
8707 4765621 5094278 4847741 3853170 2812762 2215571 1348162 -152779 -1183545 -1218234
8698 -1218234 -1799337 -3894412 -5384564 -3867001 -805216 117967 -1758390 -3487447 -3110576
8689 -3110576 -1878872 -1390735 -1230449 -486472 530081 1239736 1785700 2045347 1206901
8680 1206901 -540954 -1281094 289046 2674383 3097003 803404 -2224914 -3754842 -3605203
8671 -3605203 -3189300 -3265575 -2886366 -1037481 1210084 1566889 -60047 -650810 1983210
8662 1983210 5564553 5843833 2292680 -1133692 -1315200 281368 343125 -1648239 -3289142
8653 -3289142 -2778427 -745767 1245649 2544288 3417721 4116018 4439878 3964752 2486374
8644 2486374 355178 -1632966 -2804962 -3059224 -2751613 -2331457 -2173273 -2487583 -3091681
8635 -3091681 -3332673 -2517438 -534329 2027282 4374903 5971995 6495055 5754677 4112988
8626 4112988 2696571 2352459 2293477 802524 -2208934 -4459064 -4117931 -2367028 -1666577
8617 -1666577 -2232008 -2162639 -774822 397255 236947 -419132 -579323 -513840 -470879 188433
8607 188433 1423688 1757733 399986 -1323861 -1918052 -1617969 -1106201 -77581 1274581
8598 1274581 1122866 -1430516 -3998030 -3532395 -427914 2303399 3202605 3318791 3511477
8589 3511477 3291873 2327515 990055 -605702 -2286299 -2835804 -1360880 611982 602490
8580 602490 -1325555 -2724380 -2404196 -1592248 -1294007 -956154 -320699 -350348 -1521194
8571 -1521194 -3071632 -4499402 -5902016 -6473097 -4952193 -2224021 -1071304 -2338558
8563 -2338558 -3619104 -2908959 -1288285 -590100 -662553 -638296 -807749 -1292041 -834230 879889
8553 879889 1546748 -500494 -2907659 -2237932 652795 1569718 -767892 -2796190 -1337237
8544 -1337237 2085951 3800461 2820759 1171976 575179 826222 1104616 1136938 786408
8535 786408 -230204 -1605382 -2249140 -1589347 -594424 -664807 -1704720 -2275101 -1823764
8526 -1823764 -1646476 -2838362 -4115431 -3000931 836455 4540477 4892098 1760095 -1639703
8517 -1639703 -1913575 1092495 4176523 4417337 2606189 1983391 3580405 4649623 2706047
8508 2706047 -730195 -2353164 -1700234 -1138837 -1944137 -3015194 -3366829 -3306553 -2842986
8499 -2842986 -1410952 252514 400250 -706626 -456883 2250485 5047945 5518182 4571319
8490 4571319 4590145 5823561 6626181 6159114 4896181 3110394 580868 -2424299 -4995709
8481 -4995709 -6202896 -5449544 -3048274 -776518 -488946 -1649083 -1954070 -1062424 -1321288
8472 -1321288 -3401349 -3952707 -265792 4840994 6206366 3295182 471733 640783 2099847
8463 2099847 2207967 1000730 -105757 -761775 -1249056 -1223355 -347808 809226 1544274
8454 1544274 1952790 2461435 3136852 3810994 4151874 3574630 2091426 1121654 1985970
8445 1985970 3501434 2848003 -641007 -4290904 -5468501 -4430828 -2787598 -1001857
8437 -1001857 916110 1798495 632593 -1357891 -2142664 -1923659 -2496461 -3785947 -3631105
8428 -3631105 -1561898 -133127 -1051910 -2268014 -1160744 1030370 874961 -1814389 -3451283
8419 -3451283 -2109041 -430560 -1418566 -3677423 -3402344 114563 3682498 4640724 3557999
8410 3557999 2091250 506586 -1377248 -2441692 -1326854 1266870 2859196 1957189
8402 1957189 -339090 -1761575 -1312777 110348 1178000 1535352 1498689 984637 -267324
8393 -267324 -1427039 -823165 1748843 3948214 3336174 397749 -2103108 -2490611 -1627519
8384 -1627519 -1080129 -1151769 -1067564 -162597 1493883 3101429 3673406 3028272 2025404
8375 2025404 1390121 924770 530151 995210 2555477 3657019 2834023 1066602 393142
8366 393142 829932 819025 221847 366150 1273542 1498806 944152 1200305 2633707 3702228
8356 3702228 3703888 3593323 3497716 2260333 203965 -723943 -566007 -1754851 -4452938
8347 -4452938 -5098335 -1809288 2189825 3349564 2877354 3718215 5196379 4612317 2352258
8338 2352258 1423987 2848917 4895604 6121878 6205178 4654007 1606115 -988876 -1723686
8329 -1723686 -2115236 -3839533 -5160844 -3570349 -575870 125680 -1694580 -3130910 -3419479
8320 -3419479 -4319837 -5425115 -4021193 -367006 1575620 123114 -1561128 -535756
8312 -535756 2060041 3946076 4851972 4833347 3016989 232135 -479651 1594349 2997991
8303 2997991 1403660 -488631 563263 3040475 3598479 2735754 3181482 4370979 3287919
8294 3287919 222980 -962723 1153974 3340181 2725567 645660 -258737 -44914 -391875
8285 -391875 -1399082 -1821926 -1591124 -1978146 -3414073 -4770291 -5030633 -4497260 -3953341
8276 -3953341 -3550186 -3108114 -2865200 -3145446 -3583141 -3477507 -2842523 -2284777 -1787872 -607031
8266 -607031 1267501 2548690 2215684 805095 -533029 -1357998 -1553728 -769776 568126
8257 568126 786701 -914669 -2687549 -2095308 644963 3164290 4027851 3458363 1728976
8248 1728976 -787303 -2360314 -1368431 857995 1255941 -562821 -1769553 -750978 748659
8239 748659 967092 760849 1237581 1299263 -230634 -1944655 -1731726 -57193 928393
8230 928393 738565 846971 2008753 3206722 3357410 2647885 1876914 1356340 822186
8221 822186 135305 -135890 830510 2706791 3674279 2515423 579724 241877 1695297
8212 1695297 2960942 2897581 2183153 1236823 -517740 -2749754 -3766486 -2792903 -899899
8203 -899899 819673 1996290 1728439 -685121 -3222529 -2598468 547481 1350379 -2464583
8194 -2464583 -6802725 -6835439 -3385120 -534224 502691 1392208 2464908 2463256 1583556
8185 1583556 1248026 1353433 795605 197433 1131157 2994717 3501472 2056457 72574
8176 72574 -1703475 -3548317 -4803237 -4296472 -2603274 -1348172 -474955 1179336 2870670
8167 2870670 2456604 37985 -1797181 -1778532 -1309663 -1556317 -1881229 -1878914 -2365632 -3387007
8157 -3387007 -3573840 -2506987 -1608252 -1691626 -1709634 -1041184 -1000193 -2631511 -4587575 -4689466
8147 -4689466 -2588518 202805 2049371 2182117 857190 -734803 -1335488 -758476 273350
8138 273350 1065870 865596 -1339199 -5234858 -7993345 -6868468 -2902797 103375 298204
8129 298204 -870775 -1989529 -3416638 -4941955 -4685535 -1976012 912701 1663303 857478
8120 857478 489100 1142675 2191428 3295960 4024287 3226406 538100 -2335189 -3378521
8111 -3378521 -2705888 -1987586 -2030681 -2115768 -1375562 111527 1451178 1723474 921674 105727
8101 105727 53136 121104 -475419 -811125 505205 2477293 2439969 -10310 -2141571 -1822076
8091 -1822076 183371 2434074 4718936 6493124 6124159 3596914 1614838 1876982 2462754
8082 2462754 1307772 63450 1413795 4226954 4935895 2937695 1090865 969874 1031637
8073 1031637 74096 -568828 428451 1991169 2385838 1789694 1555558 1862347 1597608
8064 1597608 337767 -694341 -30275 2078931 3627635 3077924 1241598 172236 356171
8055 356171 269348 -979784 -2089971 -1554123 145804 1587800 2537558 3569008 4435210
8046 4435210 4423862 3824477 3569918 3750580 3743636 3432499 3070668 2329447 738372 -1191752
8036 -1191752 -2396767 -2605752 -2465007 -2747820 -4005886 -6080610 -7294853 -5589053 -1612885
8027 -1612885 1014026 225039 -1486361 -889887 895891 344725 -2553207 -4099971 -2533452
8018 -2533452 -122609 1034620 1747979 2919096 3162281 1220118 -1617045 -3469442 -4305805
8009 -4305805 -4604365 -3526207 -641702 2018766 2084362 213700 -848269 -150798 542583
8000 542583 -312435 -1897237 -2194834 -241443 3073125 5853211 6835601 6565281 6672307
7991 6672307 7742417 8609911 8201624 7096164 6379354 5849133 4545614 2445442 368418
7982 368418 -1354899 -2773671 -3174499 -1659856 889427 1962235 365099 -2016226 -2481877
7973 -2481877 -956416 108968 -758334 -2050573 -1642840 -140300 -158558 -2257586 -3523540
7964 -3523540 -1376252 2631930 4695572 3714966 2144584 1863877 1636690 -245636 -2778023
7955 -2778023 -3566202 -2369582 -1459100 -2577345 -4902585 -6207165 -5151774 -2261604 734346
7946 734346 2296659 2084544 732980 -1130038 -3128370 -4526393 -4427851 -3056268 -1875432
7937 -1875432 -1700986 -1580474 -481994 807049 809937 -237655 -764549 -466211 -731285
7928 -731285 -2074147 -2879389 -1771605 17334 77870 -2007362 -4311696 -5107124 -4368481
7919 -4368481 -2742829 -594952 1325514 1730277 517914 -345354 847084 2946528 3335183
7910 3335183 1586457 -179385 -684444 -1045677 -2192690 -2915616 -1941100 -163931 980539
7901 980539 1864287 3333301 4324211 3246441 888822 -608738 -1126525 -2227494 -3807493
7892 -3807493 -4100904 -3177901 -3252989 -4732748 -5051845 -2803104 -242269 79493 -1183275
7883 -1183275 -1912414 -1682651 -1238675 -733335 -503167 -1769020 -4347167 -5341269 -2602660
7874 -2602660 1786810 3917945 2835099 569400 -1382251 -2864125 -3264549 -1975037
7866 -1975037 -398556 -676573 -2346838 -2849946 -1517936 -468149 -1083279 -2102752 -2052794
7857 -2052794 -1420250 -1310864 -1557538 -1212042 136821 2092570 3549954 3023119 191934
7848 191934 -2842045 -3344470 -1151972 1345852 2437374 2639147 2901277 3103290 2826184
7839 2826184 2094020 919323 -571756 -1456827 -912798 309354 994358 1731229 3835660
7830 3835660 6204868 6163160 3957417 3298156 6089288 9444409 9845622 7884957 6559245
7821 6559245 6629931 6206344 4004523 823045 -1876674 -3311672 -3497109 -2970362 -2172784
7812 -2172784 -916111 761651 1511144 213199 -1470195 -637107 2229575 3171387 553334
7803 553334 -2245304 -2070678 -837542 -2061051 -5014233 -6061871 -4319139 -2231478 -1290945
7794 -1290945 -733590 -215841 -417676 -816095 83378 1832318 2095076 289443 -1242876
7785 -1242876 -548796 1470182 2773143 2697965 1910056 1094360 455385 -154654 -793938
7776 -793938 -747623 943767 3440540 3923633 1095363 -2401901 -3163190 -1430949 143614
7767 143614 891630 2022231 2945054 1674666 -883687 -1088342 1824005 3862818 1778861
7758 1778861 -2574390 -5356155 -5606239 -4781198 -3605804 -1930750 -452475 -348146 -1735970
7749 -1735970 -3768310 -5534929 -6162136 -5242892 -3861501 -3714267 -4541652 -4178931 -1875142
7740 -1875142 504640 1506578 1977700 2668646 2480407 914327 -121917 829643 2235752
7731 2235752 2250236 1855537 2606205 3182851 1486601 -1191955 -1613698 505790 2409043
7722 2409043 2762070 2845004 3198228 2388761 -171133 -2953102 -4687705 -5614072 -5676467
7713 -5676467 -3974966 -1001309 935091 811770 421336 1447154 2854356 2761474 1378017
7704 1378017 343124 221802 340402 388616 613005 803560 438215 -318150 -820727 -1027535
7694 -1027535 -1443031 -2046414 -2194007 -1776439 -1724336 -2873472 -4638633 -5369866 -4204809
7685 -4204809 -2218266 -1237239 -1611729 -1917977 -1132284 -165745 -431173 -1622452 -2126177
7676 -2126177 -1341631 -323614 -48198 -192647 3615 548012 847226 553974 -38913
7667 -38913 -195700 602264 1871277 2326148 1386634 66694 -298847 292359 917443 1111697
7657 1111697 769466 -567371 -2808569 -4318156 -3662320 -1964606 -1429792 -1781650 -757384
7648 -757384 1658971 2570417 815062 -815618 -21330 1102515 -518458 -3674744 -4523338
7639 -4523338 -2423313 -456454 -298577 -230132 969317 1524133 -196308 -2602989 -3169619
7630 -3169619 -2091696 -1389522 -1461317 -933692 407837 852348 -567125 -2309039 -2166522
7621 -2166522 -19837 2068233 2170339 386781 -1515661 -2150083 -2067940 -2935914 -5017062
7612 -5017062 -6183015 -4255598 69138 3727200 4663810 3559994 2061149 742182
7604 742182 -370951 -580016 654484 2198073 2135441 299409 -1322581 -1072387 456968
7595 456968 1459148 1081219 -54048 -928243 -1043713 -502595 264422 819473 968343
7586 968343 659152 -251494 -1697100 -2870941 -2703618 -1215920 274814 886134 1492610
7577 1492610 3369480 5808992 6346175 3809124 202652 -1359758 -208045 1419648
7569 1419648 1507572 705158 878340 2105704 2616076 1686121 939317 1873152 3353777
7560 3353777 3045657 730622 -1415848 -1821869 -1284305 -1384400 -2459853 -3816420 -4926421
7551 -4926421 -5594500 -5634138 -5179090 -4870788 -5085303 -5309917 -4783589 -3418725 -1701169
7542 -1701169 -105942 982547 1255495 886035 518179 320442 -513401 -2614479 -5017848
7533 -5017848 -5685372 -3647303 -156896 2581826 3593656 3670069 3797611 3720756 2676501
7524 2676501 1084880 311906 663571 990197 769927 993162 1992333 2153839 447730
7515 447730 -1438827 -1762398 -1967625 -4242166 -6950846 -6324022 -2504564 175949 -386552
7506 -386552 -1507771 -982663 -753625 -2861390 -5350765 -5405499 -3819260 -3055526 -3086093
7497 -3086093 -2484277 -1760816 -2157277 -2606682 -1356894 513198 578656 -847444 -1454631
7488 -1454631 -1025073 -1399798 -2793901 -3454669 -2862031 -2242861 -2017952 -1594388 -1428532
7479 -1428532 -2359077 -3222202 -2242942 -476032 -493518 -1855636 -1606127 543385 1435714
7470 1435714 -389258 -2496228 -2594042 -1392494 -329578 256060 -374769 -3202067 -6490291
7461 -6490291 -6568480 -3195139 -595222 -1236784 -2225930 -404585 2427768 2604579 229495
7452 229495 -1610997 -1339271 399926 2825792 4974543 5027004 2415657 -514435 -1231277
7443 -1231277 -192750 686413 1144741 1938946 2714049 2855354 2918060 2921105 1106841 -2815769
7433 -2815769 -5118614 -2339940 3070709 5261821 2776894 100745 1059807 4166565
7425 4166565 5761769 5076328 4303583 4981355 5936223 4785493 997077 -2927108 -4055169
7416 -4055169 -2742639 -2191288 -3820010 -5250093 -4266719 -2481005 -2719428 -4575653 -5379337
7407 -5379337 -4403309 -3194776 -2453172 -1498562 -566409 -846627 -2052632 -2284234 -667937
7398 -667937 1624358 3049701 2872592 1032720 -1477615 -2537181 -972736 1640225 2795199
7389 2795199 2009676 432914 -1341516 -3035868 -3476207 -2125357 -846623 -1473232 -2567910
7380 -2567910 -1588465 568475 683955 -1460099 -2613201 -1283943 136368 -556513 -2266277
7371 -2266277 -2778552 -1569998 627158 2911241 4084748 3513058 2628102 3433443 5198698
7362 5198698 5049519 2219965 -820767 -1925468 -1376681 -91958 1416988 1813528 -201646
7353 -201646 -2989282 -3116133 -446752 1150364 -514762 -2891715 -3018178 -1707706 -1325722
7344 -1325722 -2230154 -3599970 -5230002 -6420252 -5614002 -3160847 -1829247 -2631340 -3136529
7335 -3136529 -2106281 -2234569 -5167436 -7333228 -4900078 -83976 2129872 1399138 1176937
7326 1176937 2052111 1454317 -530111 -687592 1350185 1907319 -461851 -2226862 -632787
7317 -632787 1927014 2166071 1168342 1959324 4150360 4702969 2906241 1159110 951810
7308 951810 980872 -163595 -1658423 -1826423 -463634 1231385 2200680 2122937 1123360
7299 1123360 -134788 -465237 586579 1520101 184695 -3214456 -5644379 -4710275 -1547641
7290 -1547641 916484 1475966 785650 -811843 -3042172 -3907866 -1363248 2888613 4558882
7281 4558882 2712702 1192131 2522441 3992127 2479458 -143991 -228164 1499644 1452207
7272 1452207 -562821 -1334341 -111921 238805 -1410916 -2325955 -675625 1312415 1115715
7263 1115715 -146304 -21769 1226056 1484462 330465 -709465 -763385 -501595 -635052
7254 -635052 -958798 -933039 -419401 172884 312276 306030 1597536 5004176 8714466 9587600
7244 9587600 6812516 2690113 -685918 -3544173 -6220066 -7026969 -4495795 -460330
7236 -460330 1570596 854257 95576 1403624 3390098 3219749 430191 -2522048 -3318100
7227 -3318100 -2375866 -1906053 -2893509 -4007470 -3730252 -2484399 -1720076 -1715681 -1652956 -1361572
7217 -1361572 -1303168 -989268 644147 2978901 3788293 2264236 138047 -1085962 -2073653
7208 -2073653 -3576413 -4343420 -2995062 -573113 779150 675747 153851 -537310 -1775202
7199 -1775202 -2979797 -3313315 -3345019 -3866759 -3696481 -1187673 2427356 4011407 2936220
7190 2936220 1653089 1454112 800127 -1105356 -2296428 -1436554 -389676 -1042484 -1997824
7181 -1997824 -1210700 152142 -263351 -1664432 -1468409 -151755 -808548 -3818702 -5813063
7172 -5813063 -4796437 -2754884 -1781966 -992940 574091 927248 -2066945 -6688520 -9134400
7163 -9134400 -8268123 -6036648 -3951841 -1821438 246267 1098458 270215 -1274150 -2534080
7154 -2534080 -3302755 -3435502 -2509950 -451942 2276259 4934623 6353238 5416359 2809376
7145 2809376 1153364 1747497 2332624 305603 -2889935 -3499604 -1096691 843138 262322
7136 262322 -966780 -767058 147904 472216 570730 762801 17379 -1680484 -2243857 -942661
7126 -942661 -316410 -1997598 -3247055 -1068178 2370901 2510773 -657462 -2672332 -1187851
7117 -1187851 1641243 3471001 4381603 4451324 2686279 -144828 -1064026 849122 2697303
7108 2697303 2254039 1390748 2625163 4805404 5215989 4084264 3678427 4073597 3300020
7099 3300020 1428239 1092248 3201597 4943111 3514493 -44244 -2390034 -2118493 -850982
7090 -850982 -545335 -1229724 -1729710 -1655784 -1796227 -2652246 -3420944 -3048100 -1879488 -1302520
7080 -1302520 -1715311 -1964900 -1254443 -434801 -452288 -547771 536282 2150141 2305085 684311
7070 684311 -604060 166481 2153100 3313788 2805817 1153485 -849960 -2216320 -1683072
7061 -1683072 843332 3192683 2948336 572478 -1063453 -507075 614647 430565 -426355
7052 -426355 -271521 742643 984047 -100035 -1596613 -3005611 -4651523 -6080749 -5819300
7043 -5819300 -3333993 86021 2938150 4769509 5412231 4481870 2499959 1153081 1306602
7034 1306602 1820182 1398815 511435 218719 162873 -725401 -2296216 -3559141 -4373526
7025 -4373526 -5091631 -5049140 -3349150 -971787 -58157 -840856 -1247656 -154409 846324
7016 846324 -23641 -1957253 -2701209 -1504251 402544 1671000 1929785 1321356 136252
7007 136252 -1001796 -1485899 -1581778 -2377998 -4449861 -6737133 -7137673 -4487790 -13191
6998 -13191 3374020 3495643 789711 -2093524 -2500401 78012 3447279 4323485 1312816
6989 1312816 -3407212 -6086253 -5367149 -3355901 -2380333 -2083825 -837973 1240997 2457831
6980 2457831 2097256 1065345 247717 -147128 205572 1513296 2847487 2991156 2336033
6971 2336033 2233266 2400289 987193 -2303803 -5176807 -5684532 -4459610 -3046996 -1729371
6962 -1729371 -261593 740844 663580 127116 64886 433288 881167 1645279 2631228 2731548
6952 2731548 1437709 135099 294142 1233298 1277826 423223 141650 1046172 2451103
6943 2451103 3849731 4997280 4723821 1721274 -3048577 -6412670 -6199552 -3343018 -412435
6934 -412435 842246 187099 -1513288 -2728539 -2319275 -883489 -247161 -1069109 -1882338
6925 -1882338 -1206949 351971 1148049 952927 1134866 2553433 4331278 4858307 3304002
6916 3304002 73700 -3493015 -5669230 -5327097 -2946545 -354724 940285 963988 567616
6907 567616 -54832 -1396273 -3187230 -3820389 -1990636 1307206 3231802 1947535 -1322673
6898 -1322673 -3583188 -3332399 -1982267 -1757715 -2785004 -3123056 -1538356 902639 2441312
6889 2441312 2664017 2005093 389102 -1956482 -3107570 -1188037 2438655 4126617 2708438
6880 2708438 848785 611994 485182 -1167480 -2392110 -555480 2869328 4093931 2617098
6871 2617098 1315375 1448658 1534884 1185133 1732860 2343989 163440 -3932046 -4468919
6862 -4468919 694728 5780669 4606055 -572680 -2681183 -80840 2424293 2055733
6854 2055733 1606785 3421544 5079247 3755475 1110938 522043 1763053 1795045 -255919
6845 -255919 -1979277 -1474253 193951 1030376 935804 1298444 2444326 2809443 1092478
6836 1092478 -1513908 -2343633 -634451 1243442 721685 -1657374 -3043677 -1936167 283785
6827 283785 1457799 1096746 373697 420243 996586 666455 -1516545 -4357713 -5342024
6818 -5342024 -3662207 -1403346 -738512 -1141106 -938662 -464991 -1308792 -2961149 -2971675
6809 -2971675 -798179 1054268 653045 -795233 -1187629 -410410 473237 1327597 2590690
6800 2590690 3961444 4974755 5942840 6902777 6628389 4358345 1699628 879470 1495458
6791 1495458 1056468 -1114636 -2566246 -1146594 1850574 3348629 2449174 1189494 1399049
6782 1399049 2199290 1384907 -1480044 -4460573 -5672776 -5244782 -4465005 -3946401 -3503549
6773 -3503549 -3201626 -3389108 -3878011 -4072897 -3834145 -3377049 -2569104 -1341307 -478076
6764 -478076 -667511 -959055 203305 2340644 3187347 2002057 637424 473656 376930
6755 376930 -885132 -2170973 -1935957 -1152703 -1815974 -3429250 -3584990 -1804412 -295386
6746 -295386 -558707 -1444262 -1314471 -322139 470342 912657 1625275 2773565 3738150 3634471
6736 3634471 2028647 -278588 -1393285 -257426 1762478 2464840 1731138 1183868 1106526
6727 1106526 38753 -2075119 -2956966 -1538491 6141 -283005 -854907 611083 2908442
6718 2908442 2905200 438643 -1775298 -2760643 -4202124 -6304837 -6394703 -3194978 496628
6709 496628 1494778 338798 -437639 -255537 -308461 -806136 -883726 -488953 -193300 262087
6699 262087 1250344 1780985 882763 -100870 1027339 3764346 5220336 4137534 2282359
6690 2282359 1435512 1296121 1135387 1357232 2201442 2582225 1561626 -131998 -1075390
6681 -1075390 -742481 493025 1905552 2497140 1717478 498687 233910 466971 -633375
6672 -633375 -3049896 -4339900 -3257364 -1727161 -1699453 -2097367 -902934 1337389 2352536
6663 2352536 1475608 71659 -685056 -730754 -418614 -350545 -1219470 -2669881 -3323037 -2945624
6653 -2945624 -3027093 -3973962 -3883262 -1974756 -751914 -1947845 -2734285 220450 4761250
6644 4761250 5898594 3475019 2168544 3888713 5435597 4750203 4221074 5542697 6100976
6635 6100976 3791067 1500874 2763430 5796528 6212133 3834578 2371862 3063647 3016256
6626 3016256 365953 -2523309 -2477820 180706 2249145 1280095 -2409736 -6412373 -8083575
6617 -8083575 -6420411 -2895882 -233874 74156 -980438 -1254248 74861 1604781 1502191
6608 1502191 -40958 -962313 -143364 1163781 1557583 1623950 2118295 1456449 -2116391
6599 -2116391 -6420901 -6781447 -2087795 3634882 6564333 6913156 6270979 4564437 1840698
6590 1840698 76530 409420 859205 -398897 -1609827 -325644 2196670 2924914 1931499
6581 1931499 1648793 2158510 1111577 -1789402 -3876426 -3517990 -1915899 -414802 1022823
6572 1022823 2042610 1561979 227119 537882 3189662 5482973 4758993 1671674 -1155215
6563 -1155215 -2193659 -1696954 -716766 -356235 -881646 -1146056 -166813 799765 -226879
6554 -226879 -2315880 -2255998 409513 1989647 -93733 -3494287 -4719354 -4185056 -4390451
6545 -4390451 -4925843 -3148572 774156 3344108 2833351 1657468 2386097 4055815 4270292
6536 4270292 2966645 1902410 1644038 1365257 1035872 1462665 2098055 1080969 -1815526
6527 -1815526 -4233072 -4340137 -3146660 -2261296 -1142060 1181964 3143354 2513552 555377
6518 555377 613163 2317664 1361591 -3371688 -6598093 -3621734 2742471 6145341 5175539
6509 5175539 3317099 2036214 -713455 -4974935 -6957540 -4434434 -147749 2080029
6501 2080029 1599071 -346482 -3059629 -5467300 -5486576 -2775594 -94079 297610 -261821
6492 -261821 545139 2247361 2940800 2793874 3425717 4789269 5283448 4366333 2772255
6483 2772255 664473 -2261770 -5274961 -7236701 -8300075 -9048111 -8571949 -5714917 -1876766
6474 -1876766 -50725 -872184 -1894408 -1157672 703767 2429380 3913399 4962238 4310754
6465 4310754 1542656 -1250060 -1446963 917809 3211764 3250417 1322288 -794883 -1977243
6456 -1977243 -2491542 -2944933 -3183853 -2731557 -2033115 -2279449 -3617422 -4488345 -3568348
6447 -3568348 -1650118 -623365 -1159328 -2416838 -3404046 -3374603 -1526510 1932688 4618416
6438 4618416 3842575 125510 -2825009 -2396856 30879 1327248 499122 -806754 -844381
6429 -844381 454425 1964846 2683853 2548985 2401188 3007599 3934648 3865503 2392508
6420 2392508 943640 1297571 3427671 5373156 5211332 2850478 -79127 -1911007 -2459166
6411 -2459166 -2709513 -2970744 -2047656 881589 4089480 4594800 1944615 -874875 -1181217
6402 -1181217 189892 761141 188681 70247 664188 430894 -779274 -687830 1846395
6393 1846395 4293465 3617890 653279 -1186788 -899000 -711355 -1712000 -1781543 594462
6384 594462 3054008 2468377 -201231 -1107628 903807 2857938 2237920 375593 -629
6375 -629 1384072 2673706 2847326 2567120 2540755 2571502 2291921 1823300 1516004 1576551
6365 1576551 1941065 2142523 1521366 9026 -1524832 -2166191 -1997654 -1779274 -1762983
6356 -1762983 -1415349 -439588 431010 181224 -983892 -1583548 -926746 -650534 -2809194
6347 -2809194 -6432737 -7919088 -5734709 -2674197 -1767473 -2081522 -1324601 -681600 -2902253
6338 -2902253 -6352872 -5980864 -1095303 2727240 1710509 -618459 733713 4704697
6330 4704697 6682978 5662695 4130919 2677922 -113382 -3014044 -2512576 1398320
6322 1398320 4037152 2102363 -2246895 -4810842 -4280501 -2395952 -1285329 -1929302 -3743163
6313 -3743163 -4824496 -3807126 -1658872 -327811 -16393 350841 614288 -125516 -1004206
6304 -1004206 -448532 462887 -770991 -3215307 -2871481 962456 3740682 2141299 -1079611
6295 -1079611 -1381262 1316902 3618639 3643432 2168483 555087 171797 2237449 5626853
6286 5626853 6405798 2379918 -3073799 -4519415 -1015001 3382467 4956102 3641443
6278 3641443 1445622 47462 90377 1034729 1553259 1154126 939496 1785088 2812929
6269 2812929 2934585 2638941 2697679 2447214 1176784 -72461 -49401 633385 955669 1568664
6259 1568664 3114834 3934162 2181424 -869852 -2377758 -1810241 -620757 746124 2538948
6250 2538948 3609445 2988352 2411824 3604317 4283865 1358192 -2792489 -2645494 1725632
6241 1725632 4067870 1374080 -1964942 -1803833 -334244 -922257 -1953578 -581437 1390063
6232 1390063 787074 -587317 1380512 5678197 7080144 4096057 768228 109613 548596
6223 548596 69077 -417058 241608 794365 -125085 -1582134 -2274495 -2755951 -3651173 -3540969
6213 -3540969 -1106749 1804946 1884373 -1152665 -4046119 -4289766 -3063493 -2987275 -4338376
6204 -4338376 -4992373 -3698796 -1843115 -1389003 -2177717 -2436859 -1478163 -445485 -261506
6195 -261506 -329928 -11661 -105619 -1619790 -3819841 -4810806 -3767850 -1577298 422324
6186 422324 1349460 790304 -923616 -2529384 -2968619 -2705659 -2988117 -3892872 -4189889
6177 -4189889 -3211643 -1717518 -561792 507365 2180355 4385877 6235545 6749999 5460753
6168 5460753 2873743 543776 -28178 928631 1360146 -452132 -3816906 -6177834 -5742673
6159 -5742673 -3276020 -1145845 -764532 -1341557 -1328647 -564460 -177559 -539060 -533496 665613
6149 665613 2229583 2942299 2857272 2589545 1894517 482781 -440098 570275 2514840
6140 2514840 2654662 431686 -1310956 -140687 2592757 3770469 2733053 1620296
6132 1620296 1994520 3081166 3624151 3825020 4533691 5498605 5519462 4039516 1725463
6123 1725463 -531822 -2473906 -4098284 -5044589 -4928941 -4012551 -2897924 -1645542 65077
6114 65077 1797314 2326090 1281817 -39470 -392205 -400576 -1476992 -3410134 -4533559
6105 -4533559 -4216214 -3545541 -3209946 -2425654 -802848 334897 -169193 -1361284 -1677037
6096 -1677037 -1351991 -1476963 -1462795 178508 2704500 3439490 1838632 683758 1804986
6087 1804986 2918699 972908 -3029854 -5397859 -5139988 -4847200 -5973284 -6372394 -3969645
6078 -3969645 -486807 660027 -1094362 -3101700 -3138887 -1660703 -541254 -907238 -2280593
6069 -2280593 -3031193 -1871516 483889 1825567 1454532 1594765 4249355 7583324 7709342
6060 7709342 3898002 -320305 -1634100 -375863 1175015 1711177 938874 -1333944 -4433838
6051 -4433838 -6412745 -6033158 -4325727 -2914282 -1806842 -263302 1140236 1086420 -306101
6042 -306101 -1438460 -1197286 144735 1641501 2337842 1827304 1097055 1902691 4159417
6033 4159417 5227603 3505869 1387719 2149138 4840495 5444324 2990648 1029457 2073711
6024 2073711 3851356 3030311 153880 -1598626 -938526 755728 2232761 3497131 4413183
6015 4413183 4272985 3027676 1563729 566022 77669 11688 38611 -708337 -2467563
6006 -2467563 -3572485 -1977304 1638358 3880383 2553119 -660719 -2401938 -1517775
5998 -1517775 440709 1822482 2369081 2187666 857583 -1674928 -4239702 -5401274 -4965599
5989 -4965599 -3959145 -3350474 -3207671 -2859582 -1595134 414128 1726821 968871 -1080983
5980 -1080983 -1972165 -991997 -482825 -2029521 -3051346 -269983 4357407 5269017 1307232
5971 1307232 -2307116 -1810115 -329048 -2180812 -5484209 -5139184 -819455 3150997 4724950
5962 4724950 5727426 6849496 6387971 4672927 4596006 6193519 5577162 1521074 -1463205
5953 -1463205 309036 4019678 4810963 2583043 399444 -1052152 -2920395 -4089251
5945 -4089251 -2407545 757950 1574010 -630192 -2447324 -1372386 1450230 3771853
5937 3771853 4691411 4177894 2646627 1390477 1379515 1684967 1065410 449764 1328947
5928 1328947 2548327 1967224 698575 1727822 4272493 3993097 -88735 -3292472 -1934034
5919 -1934034 1648129 3353103 3100710 3098270 3214636 1955804 256504 419228 2089180
5910 2089180 2693447 1568383 653831 1105254 1903303 2081281 1987685 1899082 1380982 568124
5900 568124 422660 1175204 1855726 1814348 1556483 1735074 2341366 3140139 3971942 4447084
5890 4447084 4173349 3372472 2572724 1868665 1270600 1384136 2620348 4003306 4039613
5881 4039613 2714679 1399331 798873 307184 -492757 -1097914 -1280098 -1738506 -2840416
5872 -2840416 -3606687 -2735138 -223222 2461756 3589165 2574637 678383 122859 1781174
5863 1781174 3902131 4000898 1812218 -755746 -2430164 -3757047 -5167034 -5621074 -4315963
5854 -4315963 -2538411 -2384216 -4123209 -5991672 -6353656 -5126641 -3259437 -1757601 -1300407
5845 -1300407 -2021205 -3320650 -4252713 -4288087 -3545627 -2366879 -1016588 185511 837696
5836 837696 806339 444346 250344 368860 613241 928940 1500918 2276106 2795659 2876589
5826 2876589 3030845 3556543 3659053 2598374 1489799 2292088 4553910 5038312 1889711
5817 1889711 -2364357 -3807280 -2049112 -66775 94985 -959206 -2189362 -3237184
5809 -3237184 -2975113 97895 4695898 6543410 3379926 -1599343 -3474537 -1496702
5801 -1496702 985336 1523249 885379 554416 504574 269187 337289 1244020 2280346 2222540
5791 2222540 932201 -510166 -1088740 -844069 -696690 -1489481 -3093015 -4403004 -4383831
5782 -4383831 -3139036 -1828489 -1554788 -2355790 -3097651 -2333961 329048 3503531 5029535
5773 5029535 4011276 1586585 -430332 -1160918 -763228 258753 1199129 1134757 -444854
5764 -444854 -3041112 -5438835 -6325769 -4685956 -554159 4150911 6593958 5783631 3708324
5755 3708324 2871548 3454479 3945877 3732789 3527995 3615284 3338552 2510352 1963485 2233719
5745 2233719 2592582 1819780 -513057 -3514869 -5300806 -4301224 -1069673 1657613 1735468
5736 1735468 49622 -951925 -666621 -720411 -2170182 -4127024 -5391666 -5727547 -5029992
5727 -5029992 -2955407 -225521 1210418 455070 -971952 -1094654 124757 1391522 2196186
5718 2196186 3015036 3805028 3584914 1753944 -809505 -2285618 -1535128 792700 2968787
5709 2968787 4168179 5167035 6488221 6775816 4475317 628672 -1898292 -2009704 -1253763
5700 -1253763 -803920 232517 2568358 4846896 5435995 4579756 3354573 1884815 126962
5691 126962 -825278 16047 1722427 2324598 931159 -1942657 -5072368 -6514170 -4417522
5682 -4417522 497680 4545591 4991964 3266177 2417762 2693446 2089918 306144 -789621
5673 -789621 -398364 290885 628202 1397834 2705416 3307249 2763953 2230136 2347144 2212845
5663 2212845 1236755 285491 132444 309037 273430 258728 291740 -63157 -250813 1275670
5653 1275670 4511292 6816768 5703074 1810570 -1835199 -2794652 -956217 1627068
5645 1627068 2196973 -184538 -3158585 -3485735 -1153018 842069 1157967 1854478 4180562
5636 4180562 5526594 3166138 -1080682 -3137023 -2461230 -2201340 -3866775 -5130980 -3606050
5627 -3606050 -148545 2734758 3815490 3285678 1541950 -778378 -2450602 -2542886 -1264375
5618 -1264375 642158 2767504 4769918 5920563 5668871 4388833 3108421 2707293 3498377
$$ [...]
##END NTUPLES=NMR SPECTRUM
##END=
