##TITLE=31Pdec_LR-736-C-K1
 CDCl3, 24 sc
 11.06.2021
##JCAMPDX= 6.0         $$ Bruker NMR JCAMP-DX V2.0
##DATA TYPE= NMR SPECTRUM
##DATA CLASS= NTUPLES
##ORIGIN= UXNMR, Bruker Analytische Messtechnik GmbH
##OWNER= root
$$ XWIN-NMR		Version 3.5
$$ Fri Jun 11 10:39:12 2021 Russian Standard Time (UT+4h)  she@DPX200
##.OBSERVE FREQUENCY= 81.013821
##.OBSERVE NUCLEUS= ^31P
##.ACQUISITION MODE= SIMULTANEOUS
##.ACQUISITION SCHEME= undefined
##.AVERAGES= 24
##.DIGITISER RES= 16
##SPECTROMETER/DATA SYSTEM= spect
##.PULSE SEQUENCE= zgpg30
##.SOLVENT NAME= CDCl3
##.SHIFT REFERENCE= (INTERNAL, CDCl3, 0, 248.564)
##AUDIT TRAIL= $$ (NUMBER, WHEN, WHO, WHERE, WHAT)
$$ ##TITLE= Audit trail, XWIN-NMR		Version 3.5
$$ ##JCAMPDX= 5.01
$$ ##ORIGIN= Bruker BioSpin GmbH
$$ ##OWNER= she
$$ F:/spectra/data/she/nmr/P31/1/pdata/1/auditp.txt
$$ ##AUDIT TRAIL=  $$ (NUMBER, WHEN, WHO, WHERE, WHAT)
(   1,<2021-06-11 10:37:36.71 +0400>,<she>,<DPX200>,
      <created by zg, POWCHK disabled, PULCHK disabled
       configuration hash MD5:
       00 E9 B6 7A A2 85 ED C7 34 08 36 98 17 FE 4E 26
       data hash MD5: 32K
       78 D1 CC 41 2F C8 40 92 2C 01 1C A6 BC 89 CD 04>)
(   2,<2021-06-11 10:37:39.06 +0400>,<she>,<DPX200>,
      <Start of raw data processing
       efp BC_mod = 2 LB = 1 FT_mod = 6 PKNL = 1 PHC0 = -5937.196 PHC1 = 151.4749 SI = 64K 
       data hash MD5: 64K
       CA A9 3B 01 9C C0 19 E5 D1 54 77 9B 81 76 D7 6D>)
(   3,<2021-06-11 10:38:11.18 +0400>,<she>,<DPX200>,
      <pk PHC0 = 106.3503 PHC1 = -166.8 
       data hash MD5: 64K
       61 71 16 AB 44 34 14 F5 5A 1C 50 EA AD 9D 35 4B>)
(   4,<2021-06-11 10:38:37.15 +0400>,<she>,<DPX200>,
      <pk PHC0 = 188.5269 PHC1 = -476.4 
       data hash MD5: 64K
       14 17 80 8F B1 5D 5D 1A FC FB 21 AB A3 2F 26 CB>)
(   5,<2021-06-11 10:38:41.17 +0400>,<she>,<DPX200>,
      <abs ABSG = 5 
       data hash MD5: 64K
       B8 D7 FA C9 D5 8D DB 3F 3D 00 11 6E 08 EF AD 3F>)
$$ ##END=
$$ 
$$ hash MD5
$$ E1 FD 46 98 FB 48 D3 79 16 FE 69 C3 99 77 04 F0
##$RELAX= 
##$RELAX= 
##$RELAX= 
##$RELAX= 
##$RELAX= 
##$RELAX= 
##$RELAX= 
##$RELAX= 
$$ Bruker specific parameters
$$ --------------------------
##$DU= <F:/spectra>
##$EXPNO= 1
##$NAME= <P31>
##$PROCNO= 1
##$TYPE= <nmr>
##$USER= <she>
##$AMP= (0..31)
100 100 100 100 100 100 100 100 100 100 100 100 100 100 100 100 100 100 
100 100 100 100 100 100 100 100 100 100 100 100 100 100 
##$AQSEQ= 0
##$AQ_mod= 1
##$AUNM= <au_zg>
##$AUTOPOS= <>
##$BF1= 81.014009
##$BF2= 200.13
##$BF3= 200.13
##$BF4= 200.13
##$BF5= 200.13
##$BF6= 200.13
##$BF7= 200.13
##$BF8= 200.13
##$BYTORDA= 1
##$CFDGTYP= 0
##$CFRGTYP= 5
##$CHEMSTR= <none>
##$CNST= (0..31)
1 1 145 1 1 1 1 1 1 1 1 1 1 1 1 1 1 1 1 1 1 1 1 1 1 1 1 1 1 1 1 1 
##$CPDPRG= <waltz16>
##$CPDPRG1= <>
##$CPDPRG2= <waltz16>
##$CPDPRG3= <>
##$CPDPRG4= <mlev>
##$CPDPRG5= <mlev>
##$CPDPRG6= <mlev>
##$CPDPRG7= <mlev>
##$CPDPRG8= <mlev>
##$CPDPRGB= <>
##$CPDPRGT= <>
##$D= (0..31)
$$ [...]
##$SUBNAM3= <"">
##$SUBNAM4= <"">
##$SUBNAM5= <"">
##$SUBNAM6= <"">
##$SUBNAM7= <"">
##$SUBNAM8= <"">
##$SUBNAM9= <"">
##$SW= 501.771253377433
##$SWIBOX= (0..15)
0 1 3 0 0 0 0 0 0 0 0 0 0 0 0 0 
##$SW_h= 40650.406504065
##$TD= 32768
##$TD0= 1
##$TE= 0
##$TE2= 300
##$TE3= 300
##$TEG= 300
##$TL= (0..7)
0 120 53 12 22 120 120 120 
##$TP= (0..7)
150 150 150 150 150 150 150 150 
##$TP07= 0
##$TPNAME0= <>
##$TPNAME1= <>
##$TPNAME2= <>
##$TPNAME3= <>
##$TPNAME4= <>
##$TPNAME5= <>
##$TPNAME6= <>
##$TPNAME7= <>
##$TPOAL= (0..7)
0.5 0.5 0.5 0.5 0.5 0.5 0.5 0.5 
##$TPOFFS= (0..7)
0 0 0 0 0 0 0 0 
##$TUNHIN= 0
##$TUNHOUT= 0
##$TUNXOUT= 0
##$USERA1= <user>
##$USERA2= <user>
##$USERA3= <user>
##$USERA4= <user>
##$USERA5= <user>
##$V9= 5
##$VALIST= <valist>
##$VCLIST= <CCCCCCCCCCCCCCC>
##$VD= 0
##$VDLIST= <DDDDDDDDDDDDDDD>
##$VPLIST= <PPPPPPPPPPPPPPP>
##$VTLIST= <TTTTTTTTTTTTTTT>
##$WBST= 1024
##$WBSW= 4
##$XGAIN= (0..3)
0 0 0 0 
##$XL= 0
##$YL= 0
##$YMAX_a= 1936
##$YMIN_a= -2019
##$ZGOPTNS= <>
##$ZL1= 120
##$ZL2= 120
##$ZL3= 120
##$ZL4= 120
##$ABSF1= 248.5645
##$ABSF2= -253.2056
##$ABSG= 5
##$ABSL= 3
##$ALPHA= 0
##$AQORDER= 0
##$ASSFAC= 0
##$ASSFACI= 0
##$ASSFACX= 0
##$ASSWID= 0
##$AUNMP= <proc_1d>
##$AZFE= 0.1
##$AZFW= 0.5
##$BCFW= 0
##$BC_mod= 2
##$BYTORDP= 0
##$COROFFS= 0
##$CY= -3
##$DATMOD= 1
##$DC= 0
##$DFILT= <>
##$DTYPP= 0
##$F1P= 0
##$F2P= 0
##$FCOR= 1
##$FTSIZE= 65536
##$FT_mod= 6
##$GAMMA= 0
##$GB= 0
##$INTBC= 1
##$INTSCL= 5.30512e-09
##$ISEN= 30
##$LB= 1
##$LEV0= 0
##$LPBIN= 0
##$MAXI= 10000
##$MC2= 0
##$MEAN= 0
##$ME_mod= 0
##$MI= 50
##$NCOEF= 0
##$NC_proc= -8
##$NLEV= 6
##$NOISF1= 182.463
##$NOISF2= 159.3651
##$NSP= 0
##$NTH_PI= 0
##$NZP= 0
##$OFFSET= 248.5645
##$PC= 4
##$PHC0= -5642.319
##$PHC1= -491.7251
##$PH_mod= 1
##$PKNL= yes
##$PPARMOD= 0
##$PSCAL= 0
##$PSIGN= 0
##$REVERSE= no
##$SF= 81.014009
##$SI= 65536
##$SIGF1= 159.3651
##$SIGF2= -187.1042
##$SINO= 113.3802
##$SIOLD= 16384
##$SREGLST= <1H.CDCl3>
##$SSB= 0
##$STSI= 65536
##$STSR= 0
##$SW_p= 40650.406504065
##$SYMM= 0
##$S_DEV= 0
##$TDeff= 32768
##$TDoff= 0
##$TI= <>
##$TILT= no
##$TM1= 0
##$TM2= 0
##$TOPLEV= 0
##$USERP1= <user>
##$USERP2= <user>
##$USERP3= <user>
##$USERP4= <user>
##$USERP5= <user>
##$WDW= 1
##$XDIM= 65536
##$YMAX_p= 139139946
##$YMIN_p= -325573358
$$ End of Bruker specific parameters
$$ ---------------------------------
##NTUPLES= NMR SPECTRUM
##VAR_NAME=  FREQUENCY,     SPECTRUM/REAL,   SPECTRUM/IMAG
##SYMBOL=    X,             R,               I
##VAR_TYPE=  INDEPENDENT,   DEPENDENT,       DEPENDENT
##VAR_FORM=  AFFN,          ASDF,            ASDF
##VAR_DIM=   65536,         65536,           65536
##UNITS=     HZ,            ARBITRARY UNITS, ARBITRARY UNITS
##FACTOR=    0.620285442955139, 1,           1
##FIRST=     20137.2065510759, 0,            0
##LAST=      -20513.1999529892, 0,           0
##MIN=       -20513.1999529892, -325573358,  0
##MAX=       20137.2065510759, 139139946,    0
$$ Real data points
##PAGE= N=1
##DATA TABLE= (X++(R..R)), XYDATA
$$ [...]
##PAGE= N=2
##DATA TABLE= (X++(I..I)), XYDATA
13047d240624m522889J479171N929808K629622l153239l150316Q77343J096964
13039c054160k621550l008378J335039L481161L68695k585296j849452j171691
13031i105632k682793j895773L046055N659989J369148l770716k109135L626801
13023e862056N309655K018937l18479Q57412K360208J801561K96983q19465j281330
13014D363426n98006R44634J293619m18087j885335j187403K72549P25846N68028
13005D079271k55805k917417n280744k603691L811048N476235o16414n481810
12997c789327j456124N051682L537189l703072n902634j254264K218301J602651
12989c695598K277131N405628M613432j639909n355839j509299L907602L817275
$$ plain form
13047 -4240624 -8763513 -7284342 -1354534 1275088 -1878151 -5028467 -4151124 -3054160
13039 -3054160 -5675710 -8684088 -7349049 -3867888 -3499193 -6084489 -7933941 -9105632
13031 -9105632 -11788425 -13684198 -10638143 -4978154 -3609006 -7379722 -9488857 -5862056
13023 -5862056 -552401 1466536 1148057 2005469 4365677 6167238 6464221 5644756 4363426
13014 4363426 3765420 4710054 6003673 5585586 3700251 2512848 2785397 3511243 4079271
13005 4079271 3823466 906049 -4374695 -6978386 -3167338 2308897 1692483 -3789327
12997 -3789327 -5245451 -193769 3343420 -359652 -6262286 -7516550 -5298249 -3695598
12989 -3695598 -1418467 3987161 8600593 6960684 1604845 95546 4003148 7820423
12981G820423K07510j529890j657705k952691l741374r39394L225102L734337
12973D166318K92892k571195j869413R94763K838941J695567j607082l297672
12965F43119j25010N652456P507921K664327m049338o443637m159292j258019
12957D32527l87508j042214j558908n46306J981119L545453J571163k294119l513652
12948a812445j439315n05830k706592l810380m77181L608559L460693P70847N92686
12939b318958K815468K952375k7493k475975k249440r15451K81154J900033L305152
12930C266865K484520l57083k597717l043009k659436j579389P64265K560282
12922a160702J158555j781568j468625K492567M742286K377600n85374j74225
$$ plain form
12981 7820423 8027933 6498043 4840338 1887647 -1853727 -2793121 431981 4166318
12973 4166318 4459210 1888015 18602 1013365 3852306 5547873 3940791 643119
12965 643119 518109 6170565 13678486 16342813 12293475 5849838 1690546 432527
12957 432527 45019 -997195 -2556103 -3102409 -1121290 2424163 3995326 1701207 -1812445
12948 -1812445 -3251760 -3757590 -6464182 -10274562 -10751743 -7143184 -3682491 -2911644 -2318958
12939 -2318958 496510 3448885 3421392 945417 -1304023 -2219474 -1938320 -38287 3266865
12930 3266865 5751385 5394302 2796585 -246424 -2905860 -4485249 -3720984 -1160702
12922 -1160702 -2147 -1783715 -3252340 -759773 3982513 6360113 5774739 5600514
12914E600514R88390j194194m462335l486289J023142K907053J95107k001494
12906d30106K8435K631534Q38514l469112m216367l09119K829159J339533j895454
12897b652983k358685p11982p51444k471766k017929J263938K804536J37333k281282
12888i040264K40453M487049L565650k351407n940973l522419O51150K479261
12880i431500L594912N533661M986990K76565l081850k84964L622623P81412o199992
12871b02143p482855j592075K527584M41037j370272J963803M881624J814732
12863I81435k181779q0506M340705K620533l655086n232587n49683K332333l79235
12854a803870l003590j454680L98186n06164k93560L638522O058461K307480l050859
$$ plain form
12914 5600514 6588904 5394710 932375 -2553914 -1530772 1376281 1571388 -430106
12906 -430106 -401671 2229863 3068377 -400735 -4617102 -4926221 -2097062 -757529 -2652983
12897 -2652983 -5011668 -5723650 -6475094 -8946860 -10964789 -9700851 -6896315 -6758982 -9040264
12888 -9040264 -8799811 -4312762 -747112 -3098519 -9039492 -12561911 -11910761 -9431500
12880 -9431500 -5836588 -302927 4684063 4960628 1878778 1593814 5216437 5997849 -202143
12871 -202143 -7684998 -9277073 -6749489 -6308452 -7678724 -5714921 -833297 981435
12863 981435 -1200344 -1280850 3059855 5680388 2025302 -3207285 -3756968 -1424635 -1803870
12854 -1803870 -4807460 -6262140 -5863954 -6370118 -6663678 -3025156 3033305 5340785 2289926
12845B289926l409917q06989j363780m059676l016560J295422K497881l92409
12837f966102j185930K554512N210730K624919j395553j988082m98882l38857
12829a983245o79136P42534K421511J696922k49660n25470O36264J164249R58052
12820D182021O25296r56794l774453m322780q72042J929539n04234m368257k609658
12811a0671362L379794N359604J290837j895409n5776K354891J396946K42926
12803A402451J896621K807930j83900k916894q41399K393817Q15320l633390m633593
12794b893037j989088l76200j37990J922508M094238J450445m037287m460509
12786f426920J391290N187183J660612l922982m619465j164793J728593K514648
$$ plain form
12845 2289926 -1119991 -1926980 -3290760 -7350436 -10366996 -9071574 -6573693 -6966102
12837 -6966102 -8152032 -5597520 -386790 2238129 842576 -1145506 -1644388 -1983245
12829 -1983245 -2662381 -1919847 501664 2198586 1948926 1423456 2059720 3223969 4182021
12820 4182021 4807317 3850523 76070 -4246710 -5118752 -3189213 -3693447 -8061704 -10671362
12811 -10671362 -7291568 -1931964 -641127 -2536536 -2592312 -237421 1159525 1402451
12803 1402451 3299072 6107002 5923102 3006208 2164809 4558626 5373946 1740556 -2893037
12794 -2893037 -4882125 -5258325 -5396315 -3473807 620431 2070876 -1966411 -6426920
12786 -6426920 -5035630 151553 1812165 -2110817 -6730282 -7895075 -6166482 -3651834
12778c651834J959122J09094j983147j878743j27052k79973k040972l80419N257079
12769c016845P664511K604039l684691l749648J15697J147480o30363l25466K112826
12760B237540K189977q94178l406177l440161k200958k46383K140690K548574
12752a071076k96359k890734j762849P43248R53111O28592K690055L991442M64015
12743C449445l797082j945858L425622L785870q49281k016098K342843M659012
12735I054473J344750j787533j179889j508753n067219n741023j72295M471379
12727e86110J703657l216677j967454L439483M857486R92989k416981k281281
12719E25112l06563K096087M197201L511212o73460l684140j586721J712764K00818
$$ plain form
12778 -3651834 -1692712 -1583618 -3566765 -5445508 -5572560 -5852533 -7893505 -8273924 -3016845
12769 -3016845 4647666 7251705 3567014 -182634 -66937 1080543 450180 124714 2237540
12760 2237540 4427517 3533339 127162 -3312999 -5513957 -5760340 -3619650 -1071076
12752 -1071076 -1367435 -4258169 -6021018 -5277770 -4324659 -3696067 -1006012 2985430 3449445
12743 3449445 -347637 -2293495 1132127 4917997 4068716 2052618 4395461 9054473
12735 9054473 10399223 8611690 7431801 5923048 855829 -4885194 -5057489 -586110
12727 -586110 1117547 -2099130 -4066584 -627101 4230385 5223374 2806393 525112
12719 525112 218549 2314636 6511837 10023049 9349589 5665449 4078728 5791492 5992310
12710E992310l971431l726818R23428K663914r11864l272069L20226N159560M420198
12701G597454p70154l419008l98432M183106M913882J436694k052447k473569
12693I017526j450251k282253m425601l804774P65656M776738L881478j60821
12685F317698k427706j621520m16040m81546r77177j393879k237677k843278j784205
12676g865330J82500O06745n92046m87426K225572M588408L344571k39285k016331
12667b52622p66368L58593j089006k869606j489151J958195L014660Q47735l67268
12658f54838J364229K061992j241114m158447j248402M441980N065210j91995
12650E438615m295835l380479j170284j188850j776617j156364p82306q40434
$$ plain form
12710 5992310 2020879 -1705939 -782511 1881403 969539 -2302530 -1982304 3177256 7597454
12701 7597454 6827300 3408292 3009860 7192966 12106848 13543542 11491095 9017526
12693 9017526 7567275 5285022 859421 -2945353 -2179697 2597041 6478519 6317698
12685 6317698 3889992 2268472 1852432 1370886 393709 -1000170 -3237847 -6081125 -7865330
12676 -7865330 -7682830 -7076085 -7668131 -8155557 -5929985 -1341577 2002994 1763709 -252622
12667 -252622 -1018990 -660397 -1749403 -4619009 -6108160 -4149965 -1135305 -287570 -654838
12658 -654838 709391 2771383 1530269 -2628178 -3876580 565400 5630610 5438615
12650 5438615 1142780 -2237699 -3407983 -4596833 -6373450 -7529814 -8312120 -9152554
12642i152554J253083M793448M620906l47018l763092j370375K264157J611894
12634h9551j007391m39491K352674K780626M56797j465414j867150j375124M84324
12625a69700L010218K575603j952776n599988m088675m50212M33062k52872J204834
12616e290506L548860L241082J308889Q54461Q43423r91463k304875j77228K291646
12607C324289Q55453j730308n41372J791409n74718n131744m022240K444853N634546
12598B050168K204785k031362k828947k412982k049286O94437M710445M425123
12590D762381o44458l642496j022313K364209K132465M95068o9020j364727l525254
12581e14145k372003K356922L826655j043240m931975j346473M123021K305555
$$ plain form
12642 -9152554 -7899471 -3106023 1514883 1167865 -2595227 -3965602 -1701445 -89551
12634 -89551 -1096942 -1536433 816241 3596867 4053664 2588250 721100 -654024 -169700
12625 -169700 2840518 5416121 3463345 -2136643 -6225318 -6675530 -6242468 -6495340 -5290506
12616 -5290506 -1741646 1499436 2808325 3662786 4506209 3514746 1209871 1032643 3324289
12607 3324289 4179742 2449434 1908062 3699471 3124753 -2006991 -6029231 -3584378 2050168
12598 2050168 4254953 2223591 -605356 -3018338 -5067624 -4373187 337258 4762381
12590 4762381 4117923 475427 -546886 1817323 3949788 4444856 4375836 3011109 -514145
12581 -514145 -2886148 -529226 3297429 2254189 -2677786 -4024259 98762 2404317
12573B404317m612874o174492M28257O647394N303950n06561l518844j918244
12565a947097M59450O80487M911P22633J951729O67396l031151m523229q95331
12556e910202L892431M087367O29780q38089L37367j046512n969114p507004j139908
12547a3463884P086732Q146413K157524k637988j241709K862416L806506P57965
12539G473975k222329k032868m10718j096680l861468m174045k20278L218936
12531c325475J442522k716521l249804m39656M17226j518474j670799J275247
12523i785734L012416J246576r88440j298643r29343l39289J755900L573367J506159
12514b247031k379845j845526K764983M035821K91469j025562L074611M798055
$$ plain form
12573 2404317 -2208557 -8383049 -7954792 -1307398 3996552 3489991 -28853 -1947097
12565 -1947097 -1487647 -807160 -802249 -79616 1872113 2539509 -491642 -5014871 -5910202
12556 -5910202 -2017771 2069596 2699376 1861287 2198654 1152142 -4816972 -12323976 -13463884
12547 -13463884 -6377152 1769261 3926785 1288797 47088 2909504 6716010 7473975
12539 7473975 5251646 3218778 2808060 1711380 -2150088 -6324133 -6544411 -3325475
12531 -3325475 -1882953 -4599474 -7849278 -8288934 -7871708 -9390182 -11060981 -9785734
12523 -9785734 -6773318 -5526742 -6515182 -7813825 -8743168 -9082457 -7326557 -3753190 -2247031
12514 -2247031 -4626876 -6472402 -3707419 328402 619871 -405691 2668920 7466975
12506G466975q45059o418819m366075M43840L50668j329786K255026P112305M477977
12497I147052l139282n301511p60117J740576r33483k636589p73011m67324l274457
12488f398146l144952K152491N637057K360616k480213k382645P20695J567881
12480a967216M04426M23523R96995l08524k169416j607462N69747J309928N55617
12471a792382N52507J259271N70489j549793k718478j780999q7284P81675M12318
12462d352676j065889k984544l577108j265144L052180O156093N561736K097148
12454C621796q18047o00154J722503K659368O15140j827129j234944J800539L114075
12445I053147M08905l700114m976896k584092L79386Q82883n27092o62844K019241
$$ plain form
12506 7466975 6621916 203097 -4162978 -3719138 -3368470 -4698256 -2443230 4669075 9147052
12497 9147052 6007770 706259 -53858 1686718 753235 -1883354 -2656365 -3123689 -6398146
12488 -6398146 -9543098 -7390607 -1753550 607066 -1873147 -4255792 -3535097 -1967216
12480 -1967216 -1562790 -1139267 -142272 -450796 -2620212 -4227674 -3657927 -2347999 -1792382
12471 -1792382 -1239875 19396 589885 -959908 -3678386 -5459385 -5546669 -4764994 -4352676
12462 -4352676 -5418565 -8403109 -11980217 -13245361 -10193181 -4037088 1524648 3621796
12454 3621796 2803749 2203595 3926098 6585466 7200606 5373477 4138533 5939072 9053147
12445 9053147 9462052 5761938 785042 -1799050 -1419664 -536781 -1063873 -1726717 292524
12436B92524M900191M062090n42468m464242l894111J59462L715407M199344J810642
12427A0238839j713568m004334l239447l61296J067784q96842l697970l664125
12419f270959j075943N92724k67130j668960j249868R09354K898237K993572J110733
12410b028240p91890l44135K265973L977407K602804m31133k372582k567541j969272
12401a658609r66202K48674O97306J53251J42228J317840J711244K2766j544560
12392A23938q53249M0414j615225l508350j092284M498729O816308L156173j713921
12383E852533k623804n25963N04450o05141j793196j739396j023265l35026M27671
12374a861137J570331L089925M362215M135484J770784j422325l252574l069361
$$ plain form
12436 292524 5192715 9254805 8712337 4248095 353984 513446 4228853 8428197 10238839
12427 10238839 8525271 4520937 1281490 920194 1987978 1091136 -2606834 -6270959
12419 -6270959 -7346902 -6754178 -7021308 -8690268 -9940136 -9030782 -6132545 -3138973 -2028240
12410 -2028240 -2820130 -3164265 -898292 3079115 5681919 5250786 2878204 310663 -1658609
12401 -1658609 -2624811 -2376137 -1678831 -1525580 -1383352 -65512 1645732 1668498 123938
12392 123938 -729311 -688897 -2304122 -5812472 -6904756 -2406027 4410281 7566454 5852533
12383 5852533 3228729 2702766 3207216 2602075 808879 -930517 -1953782 -2288808 -1861137
12374 -1861137 -290806 2799119 7161334 11296818 13067602 11645277 8392703 5323342
12366E323342j909934n70987P44181J151847k79639k397537k738889j000567M69869
12357a208314M22358N98966K484219M239075L037214n95465k995765j940793O16893
12348D658388J096917j237009l417419k569588M05047K078875J010459p54153
12340A271517j040511l85743l20134o40445k54971N54371P56242N68891Q69419
12331A378636J317852R60322L8938o30835j305867k380482k703709j139319R26967
12322c537497J181217l3291m03320M61957P93858K58625N37652J804572J900048
12313B963821J04379j402060j364043j591363l028328k713443J817737P040832
12305A827532O737770N93684m754554m522260j737151j619405l211930j398993
$$ plain form
12366 5323342 3413408 2842421 3586602 4738449 4458810 2061273 -677616 -1678183 -1208314
12357 -1208314 -785956 -186990 2297229 6536304 9573518 8978053 5982288 4041495 4658388
12348 4658388 5755305 4518296 1100877 -1468711 -1063664 1015211 2025670 1271517
12340 1271517 231006 -154737 -474871 -1115316 -1370287 -815916 -59674 509217 1378636
12331 1378636 2696488 3656810 3695748 3064913 1759046 -621436 -3325145 -4464464 -3537497
12322 -3537497 -2356280 -2389571 -2792891 -2330934 -1537076 -1278451 -740799 1063773 2963821
12313 2963821 3068200 1666140 302097 -1289266 -4317594 -7031037 -5213300 1827532
12305 1827532 8565302 9158986 4404432 -117828 -1854979 -3474384 -6686314 -8085307
12297h085307L781569N655602O55427n476651n314345q5466K942079J412131p9409
12288d594370J255809K277312M70932j461958r55171l22197j844946k591770N89140
12279g177219M385907L414978q24092j774429K082367N137181L252849j080082
12271G417460l658335l874602l039967j332323J057628K518161K034802O80164
12263A802988m05908j491137k460803j900367L76702K001918J189357n14179o30251
12254b031680N60556J010265N45907Q33300J867014J354548j293021k805661l14508
12245b73280L590918L458554j177086m347769j976316K059372J923382j158873
12237B098902j430500J427472J777775j940435l967067p96658K763698J584242
$$ plain form
12297 -8085307 -4303738 1351864 2007291 -3469360 -8783705 -8869171 -5927092 -4514961 -4594370
12288 -4594370 -3338561 -1061249 -590317 -2052275 -3007446 -3329643 -5174589 -7766359 -7177219
12279 -7177219 -2791312 623666 -200426 -1974855 107512 5244693 8497542 7417460
12271 7417460 3759125 -115477 -3155444 -4487767 -3430139 -911978 1122824 1802988
12263 1802988 1397080 -94057 -2554860 -4455227 -4078525 -2076607 -887250 -1401429 -2031680
12254 -2031680 -1471124 -460859 85048 918348 2785362 4139910 2846889 41228 -273280
12245 -273280 3317638 6776192 5599106 1251337 -724979 1334393 3257775 2098902
12237 2098902 668402 2095874 3873649 1933214 -2033853 -2830511 -66813 1517429
12229A517429j554877j369260J065521J368609J17032R29301K708149J187894
12221E969798k922268m500064k414768n38793k23229J288342M040469L962615
12213D662102K43726k354568j142612N37828j5271j62811K202149L575643O34436
12204H180622l324832l365032j001362j206660l450401k402644K614087N348297
12196A392075J755631l665694m044250N64865L943752K359583j392455k806839
12188a893332j287762N01190O87580l84156j469194j289411Q72878L644374L937475
12179C319642J075290j138001L74464K512581L69715m237825m744046l80304K378061
12170d70423O01426n17939K562867M999032K046906k502114l101123j734664k780183
$$ plain form
12229 1517429 -37448 -1406708 -341187 1027422 1144454 2073755 4781904 5969798
12221 5969798 3047530 -1452534 -3867302 -4406095 -4629324 -3340982 699487 4662102
12213 4662102 4905828 2551260 1408648 1946476 1931205 1768394 3970543 7546186 8180622
12204 8180622 4855790 1490758 489396 -717264 -4167665 -6570309 -3956222 1392075
12196 1392075 3147706 -517988 -4562238 -3997373 -53621 2305962 913507 -1893332
12188 -1893332 -3181094 -2679904 -1992324 -2376480 -3845674 -5135085 -4262207 -617833 3319642
12179 3319642 4394932 3256931 3631395 6143976 6513691 2275866 -2468180 -2848484 -470423
12170 -470423 131003 -386936 2175931 7174963 9221869 6719755 3618632 1883968 -896215
12161h96215l838894n04431L803879K402151k898265m332437r02616J206040J59712
12152e801076M55986L056405L352667L27990j448102o74510j272430l633479k931197
12143h567746J454469L766302J879895O02183K014231J771447j424456k284243
12135g87918P49595J483445k328661l320761K542635P111050K813706m250913
12127D012178l945875J977581M051060J77263l703078m454126l694114j659799
12119g238910J995646L599843r463m518434l643685P03806J833558m03705l10605
12110g991949L098286M826339K696648l21017k187999l127940j824964K517137
12102b315459N568052K901239j782476j620041J819282J337237k510964j808757
$$ plain form
12161 -896215 -4735109 -5239540 -1435661 966490 -1931775 -6264212 -7166828 -5960788 -5801076
12152 -5801076 -5345090 -2288685 1063982 1391972 -56130 -730640 -2003070 -5636549 -8567746
12143 -8567746 -7113277 -3346975 -1467080 -864897 1149334 2920781 1496325 -787918
12135 -787918 -38323 1445122 -883539 -4204300 -1661665 5449385 8263091 4012178
12127 4012178 66303 2043884 6094944 6272207 2569129 -1884997 -5579111 -7238910
12119 -7238910 -5243264 -1643421 -1652884 -6171318 -9815003 -9111197 -7277639 -7681344 -7991949
12110 -7991949 -4893663 -67324 2629324 2308307 120308 -3007632 -4832596 -2315459
12102 -2315459 3252593 6153832 4371356 2751315 4570597 5907834 3396870 1588113
12094A588113M107656O034721J03605n446576l823168k9915r46311l636541j772102
12085c820518K661467K952737r02122k731563l44966K091884J437399n45874j144088
12076c45644j15685J524941K916243K906064O25092k747488m306733k327937J505622
12067c65525L259331Q39561k971314l270336L20811K599961N65887j593868K84550
12058c30942K165415j894796p919355o092781L237040Q156049K777368l997021
12050c899023k812737K387307K831141m62368l07378L288209L740316k05109k754170
12041A806188j159384O83022k82667k038954k217731j483107p65916L39567J460913
12032c658069J627737J689492K664769K463392r65952m234172k243694L095991
$$ plain form
12094 1588113 5695769 11730490 11834095 6387519 2564351 2534436 1588125 -2048416 -3820518
12085 -3820518 -1159051 1793686 891564 -1839999 -2184965 -93081 1344318 798444 -345644
12076 -345644 -461329 1063612 3979855 6885919 7511011 4763523 456790 -1871147 -365525
12067 -365525 2893806 3733367 762053 -2508283 -2187472 412489 978376 -615492 -330942
12058 -330942 1834473 -60323 -7979678 -14072459 -10835419 -2679370 97998 -3899023
12050 -3899023 -6711760 -4324453 -1493312 -1955680 -2263058 1025151 4765467 4560358 1806188
12041 1806188 646804 1329826 1047159 -991795 -3209526 -4692633 -5458549 -5118982 -3658069
12032 -3658069 -2030332 -340840 2323929 4787321 3821369 -412803 -2656497 439494
12024D39494M740358J542012k59700J711159J707170l223969o376465j955841
12016a675782M223943K983553l698009n675347k48746M562470K935780j166193
12008B241669k018629n05667k05173o10809N44434J871431P08816j199898O7803
11999H93977L440482L423190j305570m979643k878506J780155K764668k96815
11991B841938k567362j971532j243597j853858j285639J648961L531561J652976
11983G53448j223427j367519p6788m69659j134140J181313M425760L627345j46590
11974E569743p02889K504834K571637l034302o896681l068715K899661K337255
11966B180543l327620n655971k203755J726618K697518K567890K568775J279894
$$ plain form
12024 439494 5179852 6721864 6462164 8173323 9880493 6656524 280059 -1675782
12016 -1675782 2548161 5531714 1833705 -3841642 -4090388 472082 3407862 2241669
12008 2241669 223040 -282627 -487800 -1098609 -554175 1317256 2026072 826174 893977
11999 893977 4334459 7757649 6452079 1472436 -1406070 374085 3138753 2841938
11991 2841938 274576 -1696956 -2940553 -4794411 -6080050 -4431089 -899528 753448
11983 753448 -469979 -1837498 -1914286 -2383945 -3518085 -2336772 2088988 5716333 5569743
11974 5569743 4866854 7371688 9943325 6909023 12342 -3056373 -156712 2180543
11966 2180543 -1147077 -6803048 -9006803 -7280185 -4582667 -2014777 553998 1833892
11958A833892p03171n19853J405968J366757r47711j465138J150447K985027J391579
11949F497797j160178j906416j679440j729389j105228N10479J379971J062515
11941A870111J257848J855724N29420k343666l205591j314655q5230q38960q26778
11932c101777P61261J031244l07530K45072K404655J177716l207163l361598K452410
11923a905710N187921m68748o126523l260515K436988J570646k177294N72071
11915d171164O647459M830498m237637q238547l102501K125154J884215J158039
11907c104484K784966J685088l220807m255438J396548N000141O40528m382176
11899c455634k025596L163196K839757r96314j237586J000234n65015m673048
$$ plain form
11958 1833892 1130721 610868 2016836 3383593 2435882 970744 2121191 5106218 6497797
11949 6497797 5337619 3431203 1751763 22374 -1082854 -572375 807596 1870111
11941 1870111 3127959 4983683 5513103 3169437 -36154 -1350809 -1436039 -2274999 -3101777
11932 -3101777 -2340516 -1309272 -1616802 -1371730 1032925 2210641 -996522 -4358120 -1905710
11923 -1905710 3282211 2813463 -3313060 -6573575 -4136587 -2565941 -4743235 -4171164
11915 -4171164 2476295 7306793 3069156 -5169391 -8271892 -6146738 -4262523 -3104484
11907 -3104484 -319518 1365570 -1855237 -6110675 -4714127 286014 926542 -3455634
11899 -3455634 -5481230 -2318034 521723 -474591 -1712177 -711943 -1276958 -5950006
11891e950006l837073K762978P327316N082039K06440j439648L26130J872531
11883F350707J049160j133687k157330p89604R99477P3749l232022m972820l226223
11874g038593o22556M08087J095931K650132L122009J122363r35932p01423L28884
11865e71098J61865m163J126474J704203K73051r22392L1076R23894l40388j417006
11855I65516J48731J934464Q84108r62718l60380P65618j177253m167819l245369
11846e215102J078012L356145J511815j071561j557582o79984K71697J035091
11838a271469R01604n21958j386071R0653K156708J840742l69535j712921j633705
11829a905952j315851l63054J888734L356143K055944M76069K136832M981905
$$ plain form
11891 -5950006 -9787079 -7024101 303215 5385254 5591694 4152046 4478176 6350707
11883 6350707 7399867 6266180 4108850 3319246 4318723 4392472 1160450 -3812370 -7038593
11874 -7038593 -7661149 -7253062 -6157131 -3506999 -384990 737373 -198559 -899982 -571098
11865 -571098 -409233 -413396 713078 2417281 2690332 1767940 1799016 2722910 2382522 965516
11855 965516 1114247 3048711 3932819 2970101 2609721 3375339 2198086 -1969733 -5215102
11846 -5215102 -4137090 -780945 730870 -340691 -1898273 -2578257 -2306560 -1271469
11838 -1271469 -369865 -891823 -2277894 -2187241 -30533 1810209 1440674 -272247 -1905952
11829 -1905952 -3221803 -3584857 -1696123 1660020 3715964 4192033 6328865 11310770
11821A1310770L637095k196770p039150p480230n522832l466487o54131L050670
11813h361065M955791L155724k86358j779516l14425J873041J826735r36459l219046
11804c085578j447045L081404M879662J793348j682848j382505K53834p92230
11796A618042k576927o28767L519466L912208m27799l897065k561800J183581
11788A40939L071342J913411o88820k414928j748623K99738R16964k25721j24572
11779A139730J621442M97495m865463p463822j625795O490802O794320N01241
11771C089950k446352N10890K041464j119848l043883j68945K433536P00221j582750
11762D14283o64016M29734j423051l082269j349543O91631m03484j710896N85975
$$ plain form
11821 11310770 14947865 12751095 5711945 -1768285 -7291117 -10757604 -11411735 -8361065
11813 -8361065 -3405274 -249550 -535908 -2315424 -2629849 -756808 1069927 133468 -3085578
11804 -3085578 -4532623 -1451219 3428443 5221791 3538943 2156438 2410272 1618042
11796 1618042 -958885 -1587652 1931814 5844022 5416223 1519158 -1042642 140939
11788 140939 3212281 5125692 4436872 2021944 273321 573059 1490023 1264302 1139730
11779 1139730 2761172 3258667 -1606796 -9070618 -10696413 -4205611 2588709 3089950
11771 3089950 643598 1154488 3195952 2076104 -967779 -1136724 1296812 1997033 414283
11762 414283 -249733 180001 -1243050 -4325319 -5674862 -4983231 -5386715 -7097611 -6511636
11753f511636L798830L304534N43529k7490J260727R38323p38069r06686j64979
11744A497083j268602l037395j798191J474985J609360k307259m411645k21490
11736h463154O671745Q912138M265089k323426m871620k709726j19490m03562
11728I57994j927497j249164J211987J588239j317733l801207k631597M03995
11720f764983J688118J043908Q62813J586580J323158n22582k125785k069786
11712d978559j107196m10203K79015J655805K988504K702615Q67059k74662P65394
11703B487772K266834J531319r55390k061043q79651l3199j033025j665167j02066
11694d43616J542308O59795j562213k463302j990255j187303N62653K974905K633076
$$ plain form
11753 -6511636 -2712806 591728 1135257 1107767 2368494 3306817 2568748 1662062 1497083
11744 1497083 228481 -2808914 -4607105 -3132120 -1522760 -3830019 -8241664 -8463154
11736 -8463154 -1791409 7120729 11385818 9062392 4190772 1481046 1361556 957994
11728 957994 -969503 -2218667 -1006680 581559 -736174 -4537381 -7168978 -6764983
11720 -6764983 -5076865 -4032957 -3170144 -1583564 -260406 -782988 -2908773 -4978559
11712 -4978559 -6085755 -6495958 -6216943 -4561138 -1572634 1129981 1997040 1722378 2487772
11703 2487772 4754606 6285925 5330535 3269492 2389841 2356642 1323617 -341550 -443616
11694 -443616 1098692 1758487 196274 -2267028 -4257283 -5444586 -4881933 -1907028 726048
11685G26048j881384n464939k777226L199251N131069K135406k26300L19409M90054
11676A651388j052701j450069L9477N24540k73150Q40678L427223K600373k190754
11667D117005m657329j359651K671961K045561j205325k411472j571585j080175
11659c451010n96872J008122K146566J283121J24145L56798M04020j110928k039875
11650a875913m57586J459624R23355r96898j776658j491636j276687n71824R42135
11641e122088J412464j15281j308126p9243K003775K363983R43465r40837k398996
11632c240884k011491J345775N096631M671963N36768j418782J055965K731682
11624H767627l30497l922651k590502J491527K383545m15967k469584j779671
$$ plain form
11685 726048 -1155336 -6620275 -9397501 -6198250 -1067181 1068225 841925 1161334 1651388
11676 1651388 598687 -851382 -811905 -287365 -560515 280163 3707386 6307759 4117005
11667 4117005 -540324 -1899975 771986 2817547 1612222 -799250 -2370835 -3451010
11659 -3451010 -4047882 -3039760 -893194 389927 514072 870870 1274890 163962 -1875913
11650 -1875913 -2333499 -873875 49480 -947418 -2724076 -4215712 -5492399 -6064223 -5122088
11641 -5122088 -3709624 -3824905 -5133031 -5212274 -3208499 -844516 98949 -841888 -3240884
11632 -3240884 -5252375 -3906600 1190031 5861994 6398762 4979980 6035945 8767627
11624 8767627 8437130 4514479 1923977 3415504 5799049 5383082 2913498 1133827
11616A133827m17531k09486r72706j950114k138273p41537Q94254L69269j513956
11607e546253j401362N82282O60896j232713n49026K967821L307594r29770k377593
11598d518124K511974N709629N68289n896720l998211K462558L084006j387692
11590a464291j606736L006097L502326k110461n111555j075089L384611K602925
11582A127827J11069L10640J009600n00502j523549M26780K209716M35780k654928
11573I52433l272698j856513p57500J46911J882368L499322L711584K771844Q65561
11564G943312k308024n061574m505899j119830J317713J414304J475238K253790
11556A409030J568695m52055m84937J540856J181764k451918l761011J28929L522188
$$ plain form
11616 1133827 716296 506810 -465896 -2416010 -4554283 -5295820 -4401566 -4032297 -5546253
11607 -5546253 -6947615 -6365333 -5704437 -6937150 -7486176 -4518355 -1210761 -2140531 -4518124
11598 -4518124 -2006150 3703479 4271768 -1624952 -5623163 -3160605 -76599 -1464291
11590 -1464291 -3071027 -64930 3437396 1326935 -3784620 -4859709 -1475098 1127827
11582 1127827 1238896 1549536 2559136 2058634 535085 961865 3171581 3607361 952433
11573 952433 -2320265 -4176778 -4934278 -4787367 -2904999 594323 4305907 7077751 7943312
11564 7943312 5635288 573714 -3932185 -5052015 -3734302 -2319998 -844760 1409030
11556 1409030 2977725 2525670 2040733 3581589 4763353 2311435 -1449576 -1320647 2201541
11547B201541J000573l498853l145570P92071K072813L65850N66765K826418K181768
11538E363376j500416k141522J577682K423077l436582q113706k940244P246757
11530a521578R637349J504817o300638n061521R54034L035752M00677j817162
11522H31730j997739k372449k522280J84160M213888M621148Q83667j924476j032053
11513H85596N08635j37227j449968j694067k031859k829109j749756J488171L183591
11504c825993J628494K21541J205228J439993j374804l456410j132002K394478
11496b899475K362477M85873J270751L673890L210559o1572k263342k460737k420389
11487H98035j518260J625416M071702J837202k847581m071181j172652J201298
$$ plain form
11547 2201541 3202114 -296739 -3442309 -2650238 -577425 -211575 355190 3181608 5363376
11538 5363376 3862960 1721438 3299120 5722197 2285615 -5828091 -8768335 -1521578
11530 -1521578 8115771 9620588 3319950 -1741571 -787537 2248215 2648892 831730
11522 831730 -1166009 -3538458 -6060738 -5876578 -1662690 2958458 3842125 1917649 885596
11513 885596 1394231 1257004 -192964 -1887031 -3918890 -6747999 -8497755 -7009584 -3825993
11504 -3825993 -2197499 -1975958 -770730 669263 -705541 -4161951 -5293953 -2899475
11496 -2899475 -536998 -51125 1219626 4893516 8104075 8042503 5779161 3318424 898035
11487 898035 -620225 1005191 5076893 6914095 4066514 -4667 -1177319 23979
11479B3979J063841N98857M59763p62632j855163l86001J720827P45670j489842
11470A19299k87151K662871J231583l810832m817851j60288K572486o18020l501800
11461f609703n22948M009960L560340n77412l059956k909664k157824o09319K250156
11452f626370L796809K038546k58819J13501J440208N09345j579350j597606K89385
11443a874351J461167J278729Q87375N04811K2438K34708Q86495Q1856k058362
11434A424866k547267q54608p86879l600470m052794J575095P729951O412255
11426E300149q41055m817917j646581K776975K214583j794341l481108p17460
11418c006755L138749L499218p05029n721146o517147k530262J298683Q47474
$$ plain form
11479 23979 1087820 1686677 2146440 1383808 -471355 -857356 863471 1609141 119299
11470 119299 -167852 2495019 3726602 -84230 -4902081 -5062369 -2489883 -3107903 -6609703
11461 -6609703 -7132651 -3122691 437649 -139763 -3199719 -6109383 -8267207 -8876526 -6626370
11452 -6626370 -2829561 -791015 -1049834 -936333 503875 1013220 -566130 -2163736 -1874351
11443 -1874351 -413184 865545 1752920 2257731 2280169 2514877 3401372 3483228 1424866
11434 1424866 -1122401 -1977009 -2763888 -6364358 -10417152 -8842057 -1112106 5300149
11426 5300149 4459094 -358823 -2005404 771571 2986154 1191813 -2289295 -3006755
11418 -3006755 131994 3631212 2926183 -2794963 -9312110 -11842372 -10543689 -9696215
11410i696215j580051q11142L344096N696869L272006n99134j448226N4372j38075
11401a905500k751614l657655N0896N026326N412240Q34509k728926j073916K550014
11392A756374K507374j132192l478799k364924n15611k59062m17373M68254J408772
11383b027187J074959P9837k24783N23191J749790K186921M45193k706418l730043
11374b628540o93701L160438L655557J801309J323481J894932M74183j931079
11366G056580j593744L26763r21805m308356l263391K850563O123979K279332
11358H549921k842072l325192j630987j629271j076563K201961L741053o2332
11350C926518l828385j107130M400374M432358p62065m027722l221870k323331
$$ plain form
11410 -9696215 -11276266 -12087408 -8743312 -3046443 225563 -373571 -1821797 -1767425 -1905500
11401 -1905500 -4657114 -8314769 -8263873 -3237547 2174693 3009202 280276 -793640 1756374
11392 1756374 4263748 3131556 -347243 -2712167 -3227778 -3486840 -3904213 -3435959 -2027187
11383 -2027187 -952228 -872391 -1097174 -573983 1175807 3362728 3807921 1101503 -2628540
11374 -2628540 -3322241 -161803 3493754 5295063 6618544 8513476 8987659 7056580
11366 7056580 5462836 5789599 4867794 559438 -2703953 146610 6270589 8549921
11358 8549921 5707849 2382657 751670 -877601 -1954164 247797 3988850 3926518
11350 3926518 98133 -1008997 3391377 7823735 7061670 3033948 -187922 -2511253
11342b511253k411072q26866J288426k97128m210717m049760J066080M525883
11334g426407K769768K87268J352787L606298L394858J723558R23489L1022k402658
11325D259983m297992k737974J378685M284811L645090K99947k870080l046052
11317I16418j62686K316665J417142r96480q71714J552819J965260j090302l957350
11308A089772l643443j521524L82707K494427M701734M288712J27963m107794
11300C812554m404615j871090l93492o12221R2695K391397L407458R69287k979021
11291D12952m442616j880195K163533L791555J889600q43244j425195l98923n36474
11282a269007k042963j693398J984665N152059L146025k560891n425804k442057
$$ plain form
11342 -2511253 -4922325 -5749191 -4460765 -4757893 -8968610 -13018370 -11952290 -7426407
11334 -7426407 -4656639 -4369371 -3016584 589714 3984572 5708130 6631619 6662641 4259983
11325 4259983 -38009 -2775983 -1397298 2887513 6532603 6832550 3962470 916418
11317 916418 753732 3070397 4487539 3491059 2619345 4172164 6137424 5047122 1089772
11308 1089772 -2553671 -4075195 -3692488 -1198061 3503673 7792385 7920348 3812554
11300 3812554 -592061 -2463151 -2856643 -3468864 -3376169 -984772 2422686 3391973 412952
11291 412952 -4029664 -5909859 -3746326 45229 1934829 1091585 -333610 -732533 -1269007
11282 -1269007 -3311970 -5005368 -3020703 2131356 5277381 2716490 -2709314 -5151371
11274e151371J823657K053901m4513Q93783M330982L798010k295143o433251k959854
11265c983799K460307J368734l571315k534958M982663Q357474K470214m376830
11257E172490m003894k95962m81578k556126n24122L677429L589440N987o57393
11248C926271K108192K570041p84140l478215l632502l581190k762881J825149
11240c809275P067408N261850l233496q111567l665589L267552M484523J501366
11232B762772j47527m11069j755198k496453l17220J766501j30855l429125k625048
11223f783222K117384N665156N337558K548879j074175m353810n074521k429916
11215d046667N37827P96726m54990j018625j972932m214600m252200P46259O609893
$$ plain form
11274 -5151371 -3327714 -1273813 -1318326 -424543 3906439 7704449 5409306 -1023945 -3983799
11265 -3983799 -1523492 -154758 -3726073 -6261031 -1278368 7079106 9549320 5172490
11257 5172490 1168596 872634 391056 -2165070 -2689192 988237 4577677 4583664 3926271
11248 3926271 6034463 8604504 7820364 4342149 709647 -2871543 -5634424 -3809275
11240 -3809275 3258133 8519983 5286487 -2825080 -6490669 -3223117 1261406 2762772
11232 2762772 2615245 2204176 448978 -2047475 -2364695 -598194 -729049 -4158174 -6783222
11223 -6783222 -4665838 999318 6336876 8885755 7811580 3457770 -1616751 -4046667
11215 -4046667 -3508840 -2712114 -3167104 -4185729 -6158661 -10373261 -14625461 -13879202 -7269309
11206g269309P286377L963970K258034K408834J64590l700281l562198P31057
11198B281074K461603q65657l288525p11634K169477J62817l543034k719673K109232
11189a944320N106869L612696J72031k068778j974432N822J770450Q22677k053396
11180C449619k878183m39788J267862o20653l059888k431794o12080q70044j446469
11171g641418Q82515L797983K707139q46629j136008K139711L403628P11063j393127
11162B624857k0402J674077O90330j031402r73581k45882m39143o47859m08681
11153A222314j318908k996371j999851K015033L777184J24104m058606k532219
11145e767320L036156N734310K962930j647245m150743l542898n66624K438658
$$ plain form
11206 -7269309 17068 3981038 6239072 8647906 8812496 5112215 1550017 2281074
11198 2281074 4742677 3877020 588495 -123139 2046338 2209155 -1333879 -4053552 -1944320
11189 -1944320 3162549 6775245 6947276 4878498 2904066 2909888 4680338 5503015 3449619
11180 3449619 571436 131648 1399510 778857 -2281031 -4712825 -5324905 -6194949 -7641418
11171 -7641418 -6758903 -2960920 -253781 -1100410 -2236418 -96707 3306921 4017984 2624857
11162 2624857 2604455 4278532 4968862 3937460 2963879 2717997 2278854 1630995 1222314
11153 1222314 -96594 -3092965 -5092816 -3077783 699401 823505 -3235101 -5767320
11145 -5767320 -2731164 3003146 5966076 4318831 168088 -3374810 -3941434 -1502776
11137a502776J851278k956964o986993n210301O57971M867227N222741L662142
11129c95675J436312j087206j679424Q59708K556877o06888m707840k537530M130423
11120b031243N627059p89127o259902m046460P60051Q84345j424555K1376L703741
11111c554715L291385p94941j756707K081474M346642Q30768m042723m020598
11103c619415L58254L432916K027605j658511l526282j843265J469866K788906
11095e69926M87155l003097l650465m87853L243232L852329J026678k453902l790796
11086e346645k383690K40915J994550K010404J280902J336094K167638K005219
11078C305387l28063l318786m106334k033562M78105J332795J408749K076126
$$ plain form
11137 -1502776 348502 -2608462 -9595455 -14805756 -14147785 -9280558 -4057817 -395675
11129 -395675 1040637 -46569 -1725993 -866285 1690592 1083704 -3624136 -6161666 -2031243
11120 -2031243 3595816 2806689 -3453213 -7499673 -6739622 -5855277 -7279832 -7258456 -3554715
11111 -3554715 -263330 -1058271 -2814978 -733504 3613138 4443906 401183 -3619415
11103 -3619415 -3261161 171755 2199360 540849 -2985433 -4828698 -3358832 -569926
11095 -569926 -82771 -3085868 -6736333 -7224186 -3980954 -128625 898053 -1555849 -5346645
11086 -5346645 -7730335 -7489420 -5494870 -3484466 -2203564 -867470 1300168 3305387
11078 3305387 2977324 -341462 -4447796 -6481358 -6003253 -4670458 -3261709 -1185583
11070a185583J802759j420463n059940m033950J417590M771356K411744j170137
11062b466624r40270R62830L75287o35066K066731N408256K689634m559258p284498
11053d382978k381925L108643L446755J532840J338447Q17371k618429n893011
11045e032287n063708j546086J233688K914847L689501J759899k044891k423117
11037f512154K296563N564127K204317k853594k717617j11586j744658n225810
11029i100412k417284N757330R084092L675855k486692k443976N12305P14993
11021C296211p30343k51949P45275j090880m365911m877800k090332P79623J661748
11012f924358J111389J40637n38547j56643R75356J119518k83035j135546L43570
$$ plain form
11070 -1185583 617176 -803287 -5863227 -9897177 -8479587 -3708231 -1296487 -2466624
11062 -2466624 -3406894 -2444064 -2068777 -2703843 -637112 4771144 7460778 2901520 -4382978
11053 -4382978 -6764903 -3656260 -209505 1323335 2661782 3479153 860724 -5032287
11045 -5032287 -10095995 -11642081 -10408393 -7493546 -3804045 -2044146 -4089037 -6512154
11037 -6512154 -4215591 1348536 3552853 699259 -2018358 -2129944 -3874602 -9100412
11029 -9100412 -11517696 -5760366 3323726 6999581 4512889 2068913 2581218 3296211
11021 3296211 2565868 2313919 3059194 1968314 -2397597 -7275397 -9365729 -8586106 -6924358
11012 -6924358 -5812969 -5672332 -6210879 -6367522 -5392166 -4272648 -4555683 -5691229 -5347659
11003e347659K720271L364291J937817p5107j881555l249275l131478r55283J370097
10994e247881J249133q61508j785983n4459K113537K163702P63397M17873J563803
10985C21614K040186M76195j597217j846570j14343J768762K275941J182908r02355
10976C605121k693443k633908o67803R71612K99099j694799k437106j041700J577254
10967d715673M516529O402269M795794m46261m716504l896735p77198r54853l425029
10958c217661k205275K588783L727493q25020l473178N66646M889410K657042
10950D708240j836924r75807K818140J687418l513418m562971P591K770697J00079
10941A203045k747848j585092K59043r51967k796394j517448J735290L477419
$$ plain form
11003 -5347659 -2627388 736903 2674720 2599613 718058 -2531217 -5662695 -6617978 -5247881
10994 -5247881 -3998748 -4860256 -6646239 -6700698 -4587161 -2423459 -1660062 -1242189 321614
10985 321614 2361800 2837995 1240778 -605792 -720135 1048627 3324568 4507476 3605121
10976 3605121 911678 -1722230 -2390033 -1418421 -1119322 -2814121 -5251227 -6292927 -4715673
10967 -4715673 -199144 6203125 10998919 10552658 5836154 1939419 1162221 207368 -3217661
10958 -3217661 -5422936 -2834153 893340 68320 -3404858 -2838212 2051198 4708240
10950 4708240 2871316 1895509 4713649 6401067 2887649 -1675322 -1667731 1102966 1203045
10941 1203045 -1544803 -3129895 -2870852 -3822819 -6619213 -8136661 -6401371 -2923952
10933b923952K915278J212812j044708k977071k767813j51959K613774L588575
10925D64936K815014P57980k112045l969706l133651j144367q91421j688764l02253
10916i204277K966250L986672J463707r71622q14568n4633m93087l70731J584526
10907a907763K851350J129390j491435j590607O47310K263200J488650j121967
10899B268128l743400m025104q80442L209079M018102R37091k007380j733256
10891a957182J05982N62938j25334K26451J926063K982036J632148j783017m732574
10882a162489m348756p30836K271448J617152o99641r22898K96765p40780l897402
10873h317437m765794j704656J681883K435022J993483K354997K786566K338219
$$ plain form
10933 -2923952 -8674 1204138 159430 -2817641 -5585454 -5737413 -3123639 464936
10925 464936 3279950 4037930 1925885 -2043821 -5177472 -6321839 -7213260 -8902024 -9204277
10916 -9204277 -6238027 -2251355 -787648 -1759270 -2573838 -2628471 -3121558 -3492289 -1907763
10907 -1907763 943587 2072977 581542 -1009065 -361755 1901445 3390095 2268128
10899 2268128 -1475272 -5500376 -6380818 -3171739 846363 1783454 -223926 -1957182
10891 -1957182 -1851200 -1288262 -1413596 -1187145 738918 3720954 5353102 3570085 -1162489
10882 -1162489 -5511245 -6242081 -3970633 -2353481 -3053122 -3976020 -3679255 -4420035 -8317437
10873 -8317437 -13083231 -14787887 -13106004 -10670982 -8677499 -6322502 -3535936 -1197717
10865a197717J840769J586819N14929r53883r06211L08836L61528m56297K78244
10856A377017J629025L07663k062788j31104M777031M136633l793504q549729
10848b309756k734524N555429M622430l022623n540360l82886L648185J705254
10840A541149j232968j173955j400377m394228o012780k599501K415256L994088
10832h863316K757968J986298J309994j426749m558684m048470K75591M134916
10824h432452M540093K892785J849795J679805Q66292j210480l423854m170372
10816e408388k746516K28977L140392M253156L046537J009216L87455J425781
10808E336610J596723j097602m581715m566111l47516L482801K538704j797025
$$ plain form
10865 -1197717 643052 2229871 2744800 1790917 884706 1193542 1555070 1098773 1377017
10856 1377017 3006042 3313705 1250917 1119813 5896844 10033477 6239973 -2309756
10848 -2309756 -5044280 511149 5133579 2110956 -3429404 -3812290 -164105 1541149
10840 1541149 308181 -865774 -2266151 -6660379 -12673159 -15272660 -12857404 -8863316
10832 -8863316 -6105348 -4119050 -2809056 -4235805 -8794489 -12842959 -12567368 -8432452
10824 -8432452 -3892359 -999574 850221 2530026 3396318 2185838 -1238016 -5408388
10816 -5408388 -8154904 -7925927 -4785535 -532379 2514158 3523374 3910829 5336610
10808 5336610 6933333 5835731 1254016 -3312095 -3659611 -176810 2361894 564869
10800E64869m215765k048390J926425L196249O29615k590875k672656M59305K929130
10791a822093J522357k128939l531677j315453J064374M57301j454024p40238
10783g948392L037969O029047M804396R8618m373481n582664l325215K70824K555376
10774d433522J990561j004897m131014m614904j806249J514798J883587l44639
10766a0946279j117780J661759M886330M634499J651601m04344m58285k96570
10758c89069n35018j80505L29083l76200j209914J21155K277204J201889l168242
10749a929617n656364l115958J172212K702454J690565J086403J686921K193301
10741a70083J955841J094616m02443j811881j748819n49687l07405j207879o94536
$$ plain form
10800 564869 -3650896 -5699286 -3772861 -576612 53003 -2537872 -5210528 -4751223 -1822093
10791 -1822093 -299736 -2428675 -5960352 -7275805 -6211431 -5754130 -7208154 -7948392
10783 -7948392 -4910423 1118624 5923020 6021638 1648157 -3934507 -7259722 -6988898 -4433522
10774 -4433522 -2442961 -3447858 -7578872 -12193776 -14000025 -12485227 -10601640 -10946279
10766 -10946279 -12064059 -10402300 -5515970 -881471 770130 365786 -92499 -389069
10758 -389069 -924087 -1104592 -775509 -1151709 -2361623 -2240468 36736 1238625 -1929617
10749 -1929617 -7585981 -10701939 -9529727 -6827273 -5136708 -4050305 -2363384 -170083
10741 -170083 1785758 2880374 2477931 666050 -1082769 -1632456 -1939861 -3147740 -3842276
10732c842276K025306L855638K474055r3787j317355k287208m407231m972074
10724h564932q24019N177779O385576J118315m953836o027121k540934R22646
10716i306526J689632J128795J649715L079536K779239m40051l571079k562846
10708e553585J832498M188250J606462k119095j981122J064913J959412p38123
10700B59610l075923j888730R94267K229709J780484J856581K705262K304737
10692G165997J4350k081152k324928j878191k335771k600742o15542K588870L538483
10683A471374J189290j711449k747686k352484j320286P24925K747467J945286
10675e3563j474819k901838p6886K444824J4858m223822l759331J186351M167393
$$ plain form
10732 -3842276 -1816970 2038668 4512723 4418936 3101581 814373 -3592858 -8564932
10724 -8564932 -9388951 -4211172 2174404 3292719 -1661117 -7688238 -10229172 -9306526
10716 -9306526 -7616894 -6488099 -4838384 -1758848 1020391 580340 -2990739 -5553585
10708 -5553585 -3721087 467163 2073625 -45470 -2026592 -961679 997733 259610
10700 259610 -2816313 -4705043 -3710776 -1481067 299417 2155998 4861260 7165997
10692 7165997 7180347 5099195 2774267 896076 -1439695 -4040437 -4655979 -2067109 1471374
10683 1471374 2660664 949215 -1798471 -4150955 -5471241 -4746316 -1998849 -53563
10675 -53563 -1528382 -4430220 -4507106 -2062282 -2047424 -6271246 -10030577 -8844226 -4676833
10666d676833K311406m02244J8765K688733M585619L870934j9633n595162q437886
10657e656301n163501J541267N571735M810146K073870l41908k305374k797744
10649b267810o46578J744483P09990k471276k900960K88320K953179K729080J271285
10640A409713l73381k746376m113616j840096J938199K430088L52282R03124L946496
10631A906433L330004k099344n184325j588102L399412L477779R2770k043298
10623A291329k372168k646633k444448r47431N98000J431785K450668K705452
10615F6554l66410n039885n370133q8408M318297K903064q64397j428917O93986
10606e176249J431832j97162k028946k445060j215090Q60205J710846K68911q95288
$$ plain form
10666 -4676833 -2365427 -2767671 -2748906 -60173 4525446 8396380 8376747 2781585 -5656301
10657 -5656301 -10819802 -9278535 -3706800 1103346 3177216 2835308 529934 -2267810
10649 -2267810 -2914388 -1169905 -459915 -2931191 -5832151 -5543831 -2590652 138428 1409713
10640 1409713 1036332 -1710044 -5823660 -7663756 -5725557 -3295469 -2943187 -2040063 1906433
10631 1906433 5236437 3137093 -2047232 -3635334 -235922 3241857 3334627 1291329
10623 1291329 -1080839 -3727472 -6171920 -7119351 -6521351 -5089566 -2638898 66554
10615 66554 -299856 -5339741 -10709874 -10798282 -6479985 -3576921 -4441318 -5870235 -5176249
10606 -5176249 -3744417 -3941579 -5970525 -8415585 -9630675 -8770470 -7059624 -6790713 -7686001
10597g686001R15431L109859J244637k858085k977441J649750N270081M577425
10589C245656J789069j062764l617716l680464j72126J821616k030471n629892
10581i337092q03550P077193N627332l589479o621661m44995K813088j839256
10573g118420m141085J299460M953649P92747k443469J657914M937104M93858
10565D31758m331966k359410M33460j835386k857405K236901N098718p01678o194274
10556a0079282k511845L164001J502860j958232J148304N234270J854815l703363
10548e348472k739763O85915p02160k590939Q70892L646303N770k027206M241621
10539c958039Q601261J214438p682935m727198K751902O57618o272953m806753
$$ plain form
10597 -7686001 -6770570 -3660711 -2416074 -5274159 -8251600 -6601850 -1331769 3245656
10589 3245656 5034725 3971961 354245 -3326219 -3498345 -1676729 -3707200 -9337092
10581 -9337092 -10140642 -3063449 2563883 -1025596 -7647257 -8092252 -5279164 -7118420
10573 -7118420 -11259505 -9960045 -5006396 -4213649 -6657118 -4999204 -62100 431758
10565 431758 -3900208 -6259618 -5826158 -7661544 -10518949 -8282048 -3183330 -3885008 -10079282
10556 -10079282 -12591127 -9427126 -7924266 -9882498 -8734194 -3499924 -1645109 -5348472
10548 -5348472 -8088235 -7402320 -8104480 -10695419 -9824527 -6178224 -6172454 -8199660 -3958039
10539 -3958039 4643222 5857660 -1825275 -6552473 -3800571 -3142953 -9415906 -14222659
10531a4222659J927837K417654p44281J150294K963507l194433p885578K76218
10523a7311441J0177722N006461p175218o990462K256810K973550l588760k654327
10515a7305665L711019K113497l741020q24617M907021n17469q694383k751445
10507b3103062Q018067L201709r256584p212940K894716m73264r280592j464181
10499c6676131J0910880J653340j3776606k911803J5484391n64851k9672604j5623683
10491g1177067J9303897l002726o1708321l0802130J14654791K10238440J19761960
10484B97268844n7620906j22649984m9259208J7223464k401946l5968682j7144086
10477B9447496J2573547K115016j9072327q536117J1653187M776999j2420847
$$ plain form
10531 -14222659 -12294822 -9877168 -10621449 -9471155 -6507648 -9702081 -17587659 -17311441
10523 -17311441 -7133719 -2127258 -9302476 -16292938 -14036128 -11062578 -14651338 -17305665
10515 -17305665 -13594646 -11481149 -15222169 -16046786 -11139765 -11657234 -20351617 -23103062
10507 -23103062 -15084995 -11883286 -21139870 -28352810 -25458094 -25931358 -35211950 -36676131
10499 -36676131 -25765251 -24111911 -37888517 -40800320 -25315929 -25880780 -55553384 -71177067
10491 -71177067 -51873170 -54875896 -116584217 -147386347 -32731556 177506884 297268844
10484 297268844 239647938 116997954 67738746 84962210 82560264 46591582 29447496
10477 29447496 42021043 44136059 25063732 16527615 28180802 32957801 20536954
10470B0536954p291644Q247880N573901p441469o681728K598793J025713o619312
10462I949088m342516K775840R87484m134664m39311N535245K017930l798580
10454H550516M14358P442020L349127o561374p147905O51515M012866N84938j902786
10445I393275j730051k451974k082737K561493O355943L155188l073449m898482
10437G229206k911080j532760n41906J038343M35432k232409j525459K752362
10429B711729K800849l062429n313975O25621N818137L536078M33515K689256
10421A0238781M232008n30788m882837k264586J301534p73805k705861J852505
10413F466951O000614J427990n509308l934472L243097N371882J799435l00464
$$ plain form
10470 20536954 13245310 21493190 27067091 19625622 12943894 15542687 16568400 9949088
10462 9949088 5606572 8382412 9369896 5235232 4795921 10331166 12349096 8550516
10454 8550516 8964874 16406894 19756021 13194647 6046742 6698257 10711123 11296061 9393275
10445 9393275 7663224 5211250 3128513 5690006 12045949 15201137 12127688 7229206
10437 7229206 4318126 2785366 2243460 3281803 3717235 1484826 -40633 2711729
10429 2711729 5512578 2450149 -2863826 -2238205 3579932 7116010 7549525 10238781
10421 10238781 14470789 13940001 9057164 6792578 8094112 7320307 4614446 6466951
10413 6466951 12467565 13895555 8386247 4451775 7694872 13066754 14866189 14565725
10405A4565725l59238l061096o553879m778138R34999L553157J496875j082546
10397D715859k430891l257041j954453K291671N030402K488698j730606k443333
10389B710306p82536J0111J045489L211118K384305l083455o312252j731534M862876
10380B314428M923661L76638j076850R18093P22954k309236l600487j869728J50631
10371E50104J463154K413542J139829l142542o111882l617459J916304N516515
10363A27565O303635N274190J471468m030425n667043j172032L280318J952492
10355G540168j787146k069809n4078J57732n56841O8584k75485l153562l710490
10346c840927J451330O194881L526310k658555l843303m30363P84213j045598
$$ plain form
10405 14565725 14206487 11145391 4591512 -186626 748373 4301530 5798405 4715859
10397 4715859 2284968 -972073 -2926526 -634855 4395547 6884245 5153639 2710306
10389 2710306 1927770 1937881 2983370 6194488 8578793 5495338 -816914 -2548448 2314428
10380 2314428 7238089 7614727 6537877 7455970 8178924 5869688 2269201 399473 550104
10371 550104 2013258 4426800 5566629 2424087 -3687795 -7305254 -5388950 127565
10363 127565 6431200 11705390 13176858 9146433 3479390 2307358 5587676 7540168
10355 7540168 5753022 3683213 3629135 3786867 3230026 3298610 3023125 -130437 -3840927
10346 -3840927 -2389597 3805284 7331594 4673039 829736 399373 1183586 137988
10338A37988j180130N26007j80717k850263k573525J126951L560311K723465J166539
10329B456626O41375O95053J381858K324788J254003j839766k531264J077606
10321E460279L728070J111864k587704k089960m16294k717863n884861l694907
10313g091376J801683L791274K216839J917169K221518j140342n721542m677220
10305f681997J214171L974817J125585j407410R9160K252840J687527q1630l44624
10296A838439J669600N239138P162626K783870o453068j0546755l579743N613206
10288C727313M982228k586100m404062J318759L615056k009099o494435l068515
10280d918855K268642K009000j121083o03645L012139M424504J916357j861509
$$ plain form
10338 137988 -1042142 -516135 -696852 -3547115 -6120640 -4993689 -1433378 1290087 2456626
10329 2456626 3098001 3793054 5174912 7499700 8753703 6913937 4382673 5460279
10321 5460279 9188349 10300213 7712509 5622549 5206255 2488392 -3396469 -7091376
10313 -7091376 -5289693 -1498419 718420 2635589 4857107 3716765 -2004777 -6681997
10305 -6681997 -5467826 -1493009 -367424 -1774834 -1675674 577166 2264693 2183063 1838439
10296 1838439 3508039 8747177 15909803 18693673 12240605 1693850 -1885893 3727313
10288 3727313 8709541 6123441 1719379 3038138 6653194 4644095 -1850340 -4918855
10280 -4918855 -2650213 -641213 -1762296 -2365941 646198 5070702 6987059 5125550
10272E125550l954586k629919J680048M933397K971734k171204m003890o93160
10264A257970K744108K609287J152116J002757N45145k177586n275508n669827
10256c811538l043219N27807K439836Q85156k739514l563835Q28957N644519M896822
10247B064991M87659r10720J250948J117307k935021n317837k507711J897899
10239d852485L710167L370145K345490L70989j331193O2927L372553L378708j011188
10230I416113m243327k660802Q7122k84378j881336q12712J996512K803640J133255
10221E554087k38286J74503J124206R03558p50304k452618k430111q12564J35822
10212A208293m51187j85988K281576L673480Q49338l294727l876422j829655j531366
$$ plain form
10272 5125550 1170964 -1458955 221093 5154490 8126224 5955020 1951130 1257970
10264 1257970 4002078 6611365 7763481 8766238 9311383 7133797 1858289 -3811538
10256 -3811538 -6854757 -6326950 -3887114 -3001958 -5741472 -9305307 -8476350 -2831831 2064991
10247 2064991 2552650 1641930 2892878 4010185 1075164 -4242673 -6750384 -4852485
10239 -4852485 -1142318 2227827 4573317 4944306 3613113 3676040 7048593 10427301 9416113
10230 9416113 5172786 2511984 2599106 2314728 433392 -379320 1617192 4420832 5554087
10221 5554087 5315801 5490304 6614510 7518068 6767764 4315146 1885035 1072471 1208293
10212 1208293 757106 571118 2852694 6526174 7375512 4080785 204363 -1625292 -3156658
10203c156658k420254k94175L765983L829868p60503l577620j309236J525656
10195b396939O39429j890865k548969j565294j95020J901599L829374K981281
10187G54596j65232j553854J21514J474726M90328p19462p95807j121541j311446
10178b826178J168528M967270M889047K73563l238414k782398k114653l524311
10170c187546l482830k19431J947198N44917j80698K361471L351770m37497l162507
10161b465153P20331N856675L786887l268648n913383k065494J374299K70046
10153a704440j880720j253423J163786K858678K963618J408478j016428j909048
10145F30501j95809J252654k72014k390636j295747J635767K226763R25447J789431
$$ plain form
10203 -3156658 -5576912 -5871087 -2105104 1724764 964261 -2613359 -3922595 -2396939
10195 -2396939 -1757510 -3648375 -6197344 -7762638 -7957658 -6056059 -2226685 754596
10187 754596 589364 -964490 -842976 631750 1122078 402616 -393191 -1514732 -2826178
10178 -2826178 -1657650 3309620 8198667 8472230 5233816 2451418 336765 -3187546
10170 -3187546 -6670376 -6889807 -4942609 -4397692 -4578390 -2216919 1134851 697354 -2465153
10161 -2465153 -1744822 4111853 7898740 4630092 -1283291 -3348785 -1974486 -1704440
10153 -1704440 -3585160 -4838583 -3674797 -816119 2147499 3555977 2539549 630501
10145 630501 434692 1687346 1415332 -975304 -2271051 -635284 1591479 2516926 4306357
10136D306357M721994N075831J478083j958249k480152k160260k693898k077614
10128D212092P16391K342534K1962l432455l435317l47143J452006Q6237j900626
10119b84319k063880j126137n39735K75336K260990L967768L017534j49426k455584
10110B902547k384504j619794j751002j926313j276428j067187k099019k260457
10102a1482157L65821L819489M914014L866090K746530J154942k134956m664222
10094a414449k745640J975258L833950J302398j505877k002083k010731k294514
10086d861688l90638L595338M836574R66028l427363l371491n23090M18618j073568
10077c831280j886443n87680J522594K977058K843667M62709l153162n164427
$$ plain form
10136 4306357 9028351 14104182 15582265 13624016 11143864 8983604 6289706 4212092
10128 4212092 4928483 7271017 7292979 3860524 425207 78064 1530070 1616307 -284319
10119 -284319 -2348199 -3474336 -4014071 -3738735 -1477745 2490023 5507557 5358131 2902547
10110 2902547 518043 -1101751 -2852753 -4779066 -6055494 -7122681 -9221700 -11482157
10102 -11482157 -11116336 -7296847 -2382833 1483257 4229787 5384729 3249773 -1414449
10094 -1414449 -4160089 -2184831 1649119 2951517 1445640 -556443 -2567174 -4861688
10086 -4861688 -5252326 -1656988 3179586 4145614 718251 -2653240 -3176330 -2757712 -3831280
10077 -3831280 -5717723 -6305403 -4782809 -1805751 1037916 1500625 -1652537 -6816964
10069f816964l907138n78984K853435N240715N444254L034806J79889o70539j016550
10060C762924l804289o847498m819625J260565L611637o79004m683802k188277
10052a4387369L422831N689446M434313L005574J506610j079098k404295n59645
10044c71633J327707P7716j602670K0074K593163J723524j153371j593974j01340
10035I19196m05488j862733n33728L255372M897385K629632q09578l077151l827695
10026A185212k368792J340893M243812L392420N92966m31499R9428n20457k183082
10017E350901l066032l952530o065350o580722k220444M159074O549378M257913
10009a567812J620899M83974q67592k129587p74480K557130M212307L188417J594015
$$ plain form
10069 -6816964 -10724102 -11303086 -8449651 -3208936 2235318 5270124 5450013 4779474 3762924
10060 3762924 -41365 -6888863 -11708488 -10447923 -6836286 -7515290 -12199092 -14387369
10052 -14387369 -10964538 -5275092 -840779 2164795 3671405 2592307 188012 -371633
10044 -371633 956074 1033790 -568880 -548806 2044357 3767881 2614510 1020536 919196
10035 919196 513708 -1349025 -1882753 1372619 6270004 8899636 8090058 5012907 1185212
10026 1185212 -1183580 157313 4401125 7793545 8386511 7955012 8054440 7533983 5350901
10017 5350901 2284869 -1667661 -7733011 -14313733 -16534177 -12375103 -5825725 -1567812
10009 -1567812 53087 537061 -330531 -2460118 -3234598 -677468 3534839 6723256 8317271
10000H317271L1741k220632l352973j153006J754563Q56014k619779l266883l39444
9991a993128J480374K20781r86809j88146Q81555J230474J839404K116151O49192
9982E249848p93069J32837P56797k656933o539515m028139K981612N309441J003379
9973A416258j726178J400989M027204R67448k884184j537676K247452K831802
9965F743115Q81984M980l27577k007954l082680j419028M95713K888n68310J278207
9955B001338K436451n91771m360277l061320K029034M345213J965540n21730O641
9946D249119R13284j137634m582790m690868J10001N156961M241391k113483n874528
9937c728547k005275L552425K265809l303181l018538M086611P342268J494850
$$ plain form
10000 8317271 8349012 6128380 2775407 1622401 3376964 4232978 1613199 -1653684 -1993128
9991 -1993128 -512754 -291973 -1278782 -1466928 -585373 645101 2484505 4600656 5249848
9982 5249848 4456779 4589616 5346413 2689480 -3850035 -7878174 -4896562 412879 1416258
9973 1416258 -309920 1091069 5118273 6085721 3201537 1663861 3911313 6743115
9965 6743115 7625099 7630079 7302502 5294548 2211868 792840 1288553 1291441 723131 2001338
9955 2001338 4437789 3846018 -514259 -3575579 -1546545 2798668 4764208 4242478 4249119
9946 4249119 5162403 4024769 -558021 -5248889 -5138888 18073 4259464 2145981 -3728547
9937 -3728547 -5733822 -2181397 84412 -3218769 -6237307 -2150696 5191572 6686422
9929F686422m752426l082102J505881L37137m445396m789654m50188K232484J652152
9920e105690J529255K371036J124336j686123k163483R5809J779698J813739J855394
9911A613971J918677P63036p73724j575510l066535n442901m512779J831396P628003
9902a616366O284842P70260j200775P39127O71893k569273m226634k569129p56318
9893d472373j90161M51271L08491k100289l585858k14584M907868N634022K525149
9884C263536K36861j740693n705186o858883n25973M970198j497542j2045436
9876a9903118p107557J2790001K3207687J1354649m755988n016158L493308K864299
9868A6927123n167602n894622R13450K136274m336278o918213j564978K714081
$$ plain form
9929 6686422 1933996 -1148106 357775 694912 -3750484 -8540138 -8990326 -6757842 -5105690
9920 -5105690 -3576435 -1205399 -81063 -1767186 -3930669 -3834860 -2055162 -241423 1613971
9911 1613971 3532648 4295684 3521960 1946450 -1120085 -6562986 -11075765 -9244369 -1616366
9902 -1616366 4668476 5438736 4237961 4977088 5648981 3079708 -1146926 -3716055 -4472373
9893 -4472373 -4662534 -4211263 -3902772 -6003061 -9588919 -9803503 -4895635 738387 3263536
9884 3263536 3500397 1759704 -3945482 -10804365 -11330338 -6360140 -7857682 -19903118
9876 -19903118 -27010675 -14220674 8987013 20341662 15585674 10569516 14062824 16927123
9868 16927123 11759521 5864899 6778349 8914623 4578345 -2339868 -3904846 -1190765
9860a190765J321112M14702K622628J866029k859821k904272M422042Q508597
9852A2200252J770939p483237p642081p20534K933098O30318j661481n73106J271118
9843G25286J519243P32995n57126k228965k800016j344375J29848k19853m92667
9834d535630J684240M351353L861649P15145j471199j561709j241567p60457J148371
9825B190196L361823K862348k39720k145206r90621M36905p51580l244857l985660
9816b506372k781684j877671k003564j447995Q34286L228505L496757J680154
9808a377584j62430o13840j11922L99144O68440N58769l15957j389834r09640
9799c254854J595470L719824K992261M37428r83294q70428j403262k844882k478196
$$ plain form
9860 -1190765 130347 545049 3167677 5033706 2173885 -730387 3691655 12200252
9852 12200252 13971191 6487954 -1154127 -1874661 1058437 1688755 27274 -545832 725286
9843 725286 2244529 2977524 2420398 191433 -2608583 -3952958 -3823110 -4042963 -4535630
9834 -4535630 -2851390 1499963 5361612 6076757 4605558 3043849 1802282 1041825 2190196
9825 2190196 5552019 8414367 8174647 6029441 5038820 5475725 4724145 1479288 -2506372
9816 -2506372 -5288056 -7165727 -9169291 -10617286 -9783000 -6554495 -3057738 -1377584
9808 -1377584 -1540014 -2153854 -2265776 -1866632 -1198192 -639423 -955380 -2345214 -3254854
9799 -3254854 -1659384 2060440 5052701 5490129 4506835 3636407 2233145 -611737 -3089933
9790c089933P08842L390813K225014j353000l156013j662626J039125K789846
9782H92068L291813K708209P01417k401480m872255m920584k429418R00194K981413
9773c148623K992860J738443L70854p98543j739327j771780n24211P59489P05942
9764a414896K67760J383906L267540L005560M45504r65734K95597J156769o53512
9755F788494k224902l96928K045721L81253l695808l907132N85846L443494J053641
9746D073679j978408n88482K802216K953085N01211R6524J998929J848806j471256
9737A0236304l760242k505271o77250j250590k442281j494045M79329J032499
9729c81547Q64331J769957K375057L03269k857279l334058j173681J47671j83122
$$ plain form
9790 -3089933 -2381091 1009722 3234736 1881736 -1274277 -2936903 -1897778 892068
9782 892068 4183881 6892090 7593507 5192027 319772 -4600812 -7030230 -6130036 -3148623
9773 -3148623 -155763 1582680 1953534 1154991 -584336 -2356116 -2880327 -2120838 -1414896
9764 -1414896 -1147136 236770 3504310 6509870 6955374 5989640 6285237 7442006 6788494
9755 6788494 4563592 4166664 6212385 6593638 2897830 -1009302 -423456 3020038 4073679
9746 4073679 2095271 1506789 4309005 7262090 7763301 7859825 9858754 11707560 10236304
9737 10236304 6476062 3970791 3293541 2042951 -399330 -1893375 -1414046 -381547
9729 -381547 482784 2252741 4627798 4931067 2073788 -1260270 -2433951 -2286280 -2469402
9720b469402M37249K315901K317465j50998j277661O61917J956670k54646l077249
9711D59246l056175j739526j497228l04232L485248N253103M78638n683560l862065
9702f466551M988801R395491L476786m895562n658863M04402M949024L560891
9694I754419j010381m095766l318785O14335M316811M392617J405018q65840r82877
9685A0209551j408307l427693m622413l229398q59446J140491L501716N014286
9677F318787K120564m168277o665777j943506L497496K597332j723039k150354
9669b116774J122923K025538n17945j641110M23306J999478Q86809r12750j786970
9660e17495k116914j276282J455634L393066J602773j210460l91906K036682J75442
$$ plain form
9720 -2469402 -2032153 283748 2601213 2450215 1172554 1834471 3791141 3536495 459246
9711 459246 -2596929 -4336455 -5833683 -6137915 -2652667 2600436 3079074 -2604486 -6466551
9702 -6466551 -1477750 7917741 11394527 6498965 840102 1244504 6193528 9754419
9694 9754419 8744038 4648272 1329487 1943822 6260633 10653250 12058268 11192428 10209551
9685 10209551 8801244 5373551 751138 -2478260 -3337706 -2197215 1304501 6318787
9677 6318787 8439351 4271074 -2394703 -4338209 -840713 1756619 33580 -2116774
9669 -2116774 -993851 1031687 513742 -1127368 -704062 1295416 2182225 1269475 -517495
9660 -517495 -2634409 -3910691 -2455057 938009 2540782 1330322 938416 2975098 3150540
9651C150540m516211l825051L641519Q688940N049866j713758l825912k327388
9643D322545k286000l220814j589438J388645J656518l68171q22820P13702J027715
9634H21882p59516j940254q80491R34149J694066J284050M37401k20028n01511
9625H69748r51951j800404j469394J486673M722003L997010l23556k964845j569751
9616A995533J9994j206914k439601q34075Q67321n64857k600822j440316R62259
9607e241478L87789k104886k269622P8874J953733L129980M964986N343205J531133
9598G773714l411302m039575j341186r90604l441870l464585K25083K857424K368248
9589c464653K372917M263171M113557O22442j286491J058241K817170j43763l889456
$$ plain form
9651 3150540 -1365671 -5190722 -1549203 7139737 12189603 10475845 6649933 4322545
9643 4322545 2036545 -1184269 -2773707 -1385062 271456 -96715 -919535 -205833 821882
9634 821882 62366 -1877888 -2758379 -1824230 -130164 1153886 1591287 1371259 869748
9625 869748 -82203 -1882607 -3352001 -1865328 2856675 6853685 6530129 3565284 1995533
9616 1995533 2015527 808613 -1630988 -2465063 -1597742 -2162599 -4763421 -6203737 -5241478
9607 -5241478 -4853689 -6958575 -9228197 -9149323 -7195590 -4065610 899376 6242581 7773714
9598 7773714 4362412 322837 -1018349 -2008953 -5450823 -8915408 -8690325 -5832901 -3464653
9589 -3464653 -1091736 3171435 7284992 7907434 6620943 7679184 10496354 10352591 6463135
9580F463135l140140k32002o90418l586107l427835L04075K399507M34325j845906
9571c321366o84073K538519L927125K125109o89029j571582M1214J607386M38911
9562D412214k526759l580112j268078J807468L028717K660646J401413j440148
9554D495361m997215n545188j405190L615154N024265L362571J776502O84660
9546G010920j077907k297689j229394L96911j43402j621414j066084O51851N77257
9537A201049m26777O60164K431525O56550l650943m754631j687190p197k119759
9528g697209l229598k55122K412470Q34607j208673J153778N253317N532136K664649
9519E460355J005194K74491k551816n308764k857551L337543N856948K338510
$$ plain form
9580 6463135 3322995 3090993 2400575 -1185532 -4613367 -4309292 -1909785 -1475460 -3321366
9571 -3321366 -4005439 -1466920 2460205 4585314 3896285 2324703 2365917 3973303 4412214
9562 4412214 1885455 -1694657 -2962735 -1155267 1873450 4534096 5935509 4495361
9554 4495361 -501854 -6047042 -7452232 -3837078 1187187 4549758 6326260 7010920
9546 7010920 5933013 3635324 2405930 2802841 2659439 1038025 -28059 623792 1201049
9537 1201049 774272 1434436 3865961 4522511 871568 -3883063 -5570253 -5577450 -7697209
9528 -7697209 -10926807 -11181929 -8769459 -7934852 -9143525 -7989747 -2736430 2795706 5460355
9519 5460355 6465549 6740040 4188224 -1120540 -3978091 -640548 5216400 7554910
9511G554910j488588j301115K64068q9450r58003l68420L68389L36800J379343
9502E697934L315492K089663l157030o373091l092253K035277K237035q37748
9494A915279o16160L091796M067717Q2524m135038m817738l383790j636061R95202
9485d436269L605262K992297q24562l191277j465506J379585K158263J830708
9477B048501J728377K44914l084770m581155j756390K023286K594774J273235
9469D90772J332794J603289o95500l367108k064159J650644J936171j668130l049418
9460c830645O55424M400514L069982j296177l486871k219140K36762K219218K949925
9451B698992J342456j926600l249882m04826L633872M433814K103496J46555l34417
$$ plain form
9511 7554910 6066322 4765207 5029275 4939825 3981822 3613402 3981791 4318591 5697934
9502 5697934 9013426 11103089 7946059 1572968 -1519285 515992 2753027 1915279
9494 1915279 1299119 4390915 8458632 8541156 4406118 -411620 -3795410 -5431471 -4436269
9485 -4436269 -831007 2161290 1336728 -1854549 -3320055 -1940470 217793 2048501
9477 2048501 3776878 4021792 937022 -3644133 -5400523 -3377237 -782463 490772
9469 490772 1823566 3426855 2731355 -635753 -2699912 -1049268 886903 -781227 -3830645
9460 -3830645 -3175221 1225293 4295275 2999098 -487773 -2706913 -2470151 -250933 2698992
9451 2698992 4041448 2114848 -1135034 -1539860 2094012 6527826 8631322 8777877 8443460
9442H443460j369980l553495m684309l464772j266920N31496K056705K994416
9434c13399K121145L6986m66168J477782K857353J131937j695694k082786l36035
9425B731121K39512j240299k106989o39527J424600J868616R51983K8825p28320
9416B529522j601454j885210q69700Q22646K296006L573209M217465K324368k585518
9407H821334o599252m718559K211963O942570M170738k586104n228367j344114
9399A670209L060557J971236k671233m356474j508143R23675k07054j420271Q17215
9390a720283L215252Q90529l432944k794882K165800L238648j712224m194273
9382d344377J044380O242756K649909m598287m083757L579407O838813J482703
$$ plain form
9442 8443460 7073480 3519985 -1164324 -4629096 -5896016 -5364520 -3307815 -313399
9434 -313399 1807746 1844732 1378564 2856346 5713699 6845636 5149942 3067156 2731121
9425 2731121 2970633 1730334 -376655 -1016182 408418 2277034 3229017 3257842 2529522
9416 2529522 928068 -957142 -1826842 -1004196 1291810 4865019 9082484 11406852 8821334
9407 8821334 2222082 -2496477 -284514 6658056 10828794 8242690 3014323 1670209
9399 1670209 4730766 6702002 4030769 -325705 -1833848 -910173 -1117227 -2537498 -1720283
9390 -1720283 1494969 2385498 -1047446 -3842328 -1676528 1562120 -150104 -4344377
9382 -4344377 -3299997 2942759 5592668 994381 -3089376 490031 7328844 8811547
9374H811547m136586l685570j192344j060472m02899K848461L537220j583538
9366C135819n989999l044969K615638K431547k036514k278632K659922M970496
9358B463308J030428l658012l864303j229788P20302J715165K262993J287336
9350G27429r98363j898720k70960J553528J632270J013531R08701L99438j217772
9341A849082k423340j690493J47793J242452J150150R05538J408833K069814R82357
9332E642186k496839n271083l304485K077973M521724J572528j348825K35201
9324A628380K231814p48120n152944l746433J963832L907379O72263j265638M89667
9315a9800J209162p05639p14221J968684J707157k533007l708604Q47086L849342
$$ plain form
9374 8811547 4674961 989391 -202953 -1263425 -1666324 1182137 4719357 3135819
9366 3135819 -2854180 -5899149 -3283511 -851964 -2888478 -5167110 -2507188 2463308
9358 2463308 3493736 -164276 -4028579 -5258367 -4538065 -2822900 -559907 727429
9350 727429 -270934 -2169654 -2440614 -887086 745184 1758715 2667416 3066854 1849082
9341 1849082 -574258 -2264751 -2116958 -874506 275644 1181182 2590015 4659829 5642186
9332 5642186 3145347 -2125736 -5430221 -3352248 1169476 2742004 1393179 1628380
9324 1628380 3860194 3112074 -2040870 -5787303 -3823471 83908 756171 -509467 -19800
9315 -19800 1189362 483723 -230498 1738186 3445343 912336 -2796268 -1949182 1900160
9306A900160J180825j20952M629493O872162j175560j0534565p616567L536959
9298a328045O754282r95814n930049l52603O157573L602054l322354m743989p73106
9289i32051J535787K13080q43728L90623K287130L499463L640613J709051k206726
9280I293242n249043m916090k183557O62888K771708L287402P55009l146683l149460
9271a874584K359624P165379N147687n51154k010387J738552L939128P61741l784117
9262A2891869m993085l696004k605330j255422J512054L342669J144793l464558
9254B876986n606723l672528q46051J78801N31637J844691K656752R13891j613329
9245b735873r32059L025723N173357J892565l549007m943716j217096K713738
$$ plain form
9306 1900160 3080985 2960033 7589526 14461688 13286128 2751563 -4865004 -1328045
9298 -1328045 5426237 4430423 -1499626 -1852229 4305344 7907398 4585044 -158945 -932051
9289 -932051 603736 816816 -26912 363711 2650841 6150304 9790917 11499968 9293242
9280 9293242 4044199 -871891 -3055448 -2392560 379148 3666550 4421559 1274876 -1874584
9271 -1874584 485040 7650419 12798106 12246952 10236565 11975117 15914245 16675986 12891869
9262 12891869 7898784 4202780 1597450 342028 1854082 5196751 6341544 2876986
9254 2876986 -2729737 -6402265 -7248316 -7069515 -6537878 -4693187 -2036435 -1122544 -2735873
9245 -2735873 -3667932 -642209 4531148 6423713 2874706 -2069010 -3286106 -572368
9237e72368L008853J274518O45818Q35370k52978k220717k803576j730106o88779
9228b503965Q2266J752937L318862J830119k502660m922813k223505K429744L655833
9219I16818R48050j557267j234280M70219J357789J217277P28230J00123m35158
9210B511801n39863n53149p72445j64653K018550L548489J182161l965404o176633
9201b911146k107613M352155O466269K496717k880051m256574r97618K749196
9193B911335K811397k75913j961955J29961K555037J200250j882966j535844J494259
9184E445561J010426m032965o487829j955753L997339M754082K654416L270910
9176H656187M822353J795716m152405o171407l674626k530609l870106k261137
$$ plain form
9237 -572368 2436485 3711003 4356821 5192191 4939213 2718496 -85080 -1815186 -2503965
9228 -2503965 -2421699 -668762 2650100 4480219 1977559 -2945254 -5168759 -2739015 916818
9219 916818 1864868 307601 -926679 -456460 901329 2118606 2846836 2946959 2511801
9210 2511801 1971938 1418789 646344 481691 2500241 6048730 7230891 3265487 -2911146
9201 -2911146 -5018759 -666604 5799665 8296382 5416331 1159757 162139 2911335
9193 2911335 5722732 5446819 3484864 3614825 6169862 7370112 5487146 3951302 5445561
9184 5445561 6455987 2423022 -4064807 -6020560 -2023221 2730861 5385277 8656187
9176 8656187 13478540 15274256 11121851 4950444 1275818 -1254791 -5124897 -7386034
9168g386034L250852N693357J500925k943377j271515L066718K963798j425390
9160C449334m253142l205721j197900n43174m20569L86087J642895K296002J300431
9151e45757r97049j724255J470713N537732M374178k265219p045808n034231l83901
9142f613597Q33189n36602l11020R66832Q7446j613865j44512L383731L716412
9133b31986J22685k179816k09719K653093K374377l99145k619848k872671j326346
9124d689376J358280L390528K670622j68099j725516l48812J278815k13580m044403
9115b491541n976528l470471J268587L797612K399042k89063r11260L89106Q49977
9106d434539m77736j558139q65386N11834J153367J279941J286539O31311n62654
$$ plain form
9168 -7386034 -4135182 1558175 3059100 115723 -1155792 1910926 4874724 3449334
9160 3449334 -803808 -4009529 -5207429 -5750603 -6171172 -5785085 -4142190 -1846188 -545757
9151 -545757 -1542806 -3267061 -1796348 3741384 8115562 5850343 -1195465 -6229696 -6613597
9142 -6613597 -5780408 -6317010 -6628030 -5661198 -5573752 -7187617 -7332129 -3948398 -231986
9133 -231986 -109301 -2289117 -2498836 154257 2528634 2129489 -490359 -3363030 -4689376
9124 -4689376 -3331096 59432 2730054 2561955 836439 487627 1766442 1552862 -2491541
9115 -2491541 -8468069 -11938540 -10669953 -6872341 -4473299 -4762362 -5673622 -5284516 -4434539
9106 -4434539 -4912275 -6470414 -7335800 -6823966 -5670599 -4390658 -3104119 -2472808 -3035462
9097c035462j076567q32875r72612q36200J642298N164130M989049J39543l724405
9088A456899k212576J203896J085776j255037o88024K666927L752232J100671
9080G110764j053937J79318K174677J153636k603000n264431l487172K074433
9072B84288O220342L835074l264342o876620k596795L771134M063690j040968
9064D395803m082504j986001J057724J324030J18108k40571m2583l25361q89340
9055f70695j277246j319179n86014O86638J045543K17958J45504J309800J056486
9046F08795j277435j562073K240325M781020J191265l800742k497372L082521
9038B766304M229125l96985l469864j698918j2648j543215k644800o08748J682001
$$ plain form
9097 -3035462 -4112029 -4944904 -5917516 -6753716 -5111418 52712 5041761 5181304 1456899
9088 1456899 -755677 448219 1533995 278958 -409066 2257861 6010093 7110764
9080 7110764 6056827 6236145 8410822 9564458 6961458 1697027 -1790145 284288
9072 284288 6504630 10339704 7075362 198742 -2398053 1373081 5436771 4395803
9064 4395803 313299 -1672702 -614978 709052 827160 586589 544006 218645 -670695
9055 -670695 -1947941 -3267120 -3853134 -3166496 -2120953 -1902995 -1757491 -447691 608795
9046 608795 -668640 -2230713 9612 4790632 5981897 2181155 -316217 2766304
9038 2766304 6995429 6598444 3128580 1429662 1417014 -126201 -2771001 -3379749 -1697748
9029a697748J723300R32811j18008k895089n251027k236660M893675Q196807M438848
9020G986909o42047k230731k362608k809341j045501K412595J837470l183925
9012c7179m225708K517029Q292799N125288j433922k041942J519971J583051j410723
9003I888664j505521M40966j348972n662273n476780m19921K247817l17099k750489
8994d903608j205581J245119J130722j59883j04949R81060J674153J475302K54903
8985C87238j351344j343140R64150L025829K794880J907427J775991K04791l499230
8976D866592m467432L42079M917989K218684m045503m701054K85669K599058n7272
8967A958810j204981J865566L484304L91515k513617j294457N21682p66302k458135
$$ plain form
9029 -1697748 25552 958363 840355 -2054734 -7305761 -9542421 -4648746 3548061 7986909
9020 7986909 7344862 5114131 2751523 -57818 -1103319 1309276 3146746 -37179
9012 -37179 -4262887 -1745858 6546941 11672229 10238307 8196365 9716336 11299387 9888664
9003 9888664 8383143 8824109 7475137 1812864 -3663916 -4083837 -1836020 -2153119 -4903608
8994 -4903608 -6109189 -4864070 -3733348 -3893231 -3998180 -3017120 -1342967 132335 387238
8985 387238 -964106 -2307246 -1343096 1682733 4477613 6385040 8161031 8365822 4866592
8976 4866592 399160 741239 5659228 7877912 3832409 -868645 -582976 2016082 1958810
8967 1958810 753829 2619395 6103699 6495214 3981597 2687140 3208822 2442520 -15615
8958a5615j136327J142673J198623J32148k9805m04025j901877k276550l96230
8949c686985Q05368o68061k172913j338243l19247j266422j801489P01848M032985
8940e713159M602835K769049Q84592o39273j604578l6763L892204N499504J743267
8931A1397678l453360m728896k950607k171068k021076N70523M059689L603958
8923D306841o15829k892284p54965J543703J82927k591678k789913p75466L76380
8914d010284J37516N04871J744174J633084n38461j960091o5311L254999L720332
8905D420829O66588j850196q86158J356467J420608k14114j030805j251143k536436
8896I5640l588873j959310P25510P37600j046974m43260K080831J775973j143104
$$ plain form
8958 -15615 -1151942 -9269 1189354 1321502 1291697 887672 -1014205 -3290755 -3686985
8949 -3686985 -2881617 -3549678 -5722591 -7060834 -7380081 -8646503 -10447992 -9746144 -5713159
8940 -5713159 -1110324 1658725 2543317 1904044 299466 262703 4154907 9654411 11397678
8931 11397678 7944318 3215422 264815 -1906253 -3927329 -3356806 702883 4306841
8923 4306841 3691012 798728 43763 1587466 1770393 -821285 -3611198 -4386664 -4010284
8914 -4010284 -3872768 -3367897 -1623723 9361 -529100 -2489191 -2554502 700497 4420829
8905 4420829 5087417 3237221 2351063 3707530 5128138 4914024 3883219 2632076 95640
8896 95640 -3493233 -5452543 -4727033 -3989433 -5036407 -5479667 -3398836 -1622863 -2765967
8887b765967p08555L844492N084804j01110l819800J54023N164011K290215m480261
8878D661852m824541O10325J908207k834343m825208l37636L263809J048387j175568
8869b504716J867388M863918J099035n313832n344793R56335N035156K599012
8861C257503j835865k979895r48918J517551L005222L064572J443396q09612j743927
8852C970027q92802L96021J168337J652578J839717J069479p45212k768707m040772
8843A648666l699903j231264K179945L659018J905008n39819n54933Q99630L01147
8834D567495k522785l449487j13668M059475M048916k14039l805535k823330J341316
8825A088358L957170K169149k171545m634739k907704R30737K993202J869497
$$ plain form
8887 -2765967 -3474522 369970 5454774 5353664 1533864 1687887 6851898 9142113 4661852
8878 4661852 -162689 447636 2355843 -478500 -5303708 -5641344 -2377535 -1329148 -2504716
8869 -2504716 -637328 4226590 5325625 11793 -5333000 -4376665 658491 3257503
8861 3257503 1421638 -1558257 -2507175 -989624 2015598 5080170 6523566 5713954 3970027
8852 3970027 3077225 3473246 4641583 6294161 8133878 9203357 8458145 5689438 1648666
8843 1648666 -2051237 -3282501 -1102556 2556462 4461470 3921651 3366718 4266348 4567495
8834 4567495 2044710 -1404777 -1518445 2541030 6589946 6375907 2570372 -252958 1088358
8825 1088358 5045528 7214677 5043132 408393 -2499311 -1568574 1424628 3294125
8817C294125l84144j085928L32739K317172K827088R69684j952826l108579j123509
8808B085822J673029J678696j086980k637526n23818K458575J932788k166156
8800C414430n628194n244323j937744J231262K352353J711697Q66369R81637J524685
8791g27828J081111m3720M12580K885391L991363J146154k509664j963125J562568
8782E834830J574429l583728p142060l504214L327217N518523K155396j182123
8774B998270j443180p30501n41259N42418K416039K132722q74837k787205j285465
8765D27002M69597r62230l366565k234762J901842L879088J277091k370814k532670
8756c512421Q08664L850959L627331P09677k113728k865708j880358o78280j19713
$$ plain form
8817 3294125 2909981 1824053 2156792 4473964 7301052 8270736 6317910 3209331 2085822
8808 2085822 3758851 5437547 4350567 1713041 1189223 3647798 5580586 3414430
8800 3414430 -2213764 -7458087 -9395831 -8164569 -5812216 -4100519 -3234150 -2252513 -727828
8791 -727828 353283 309563 722143 3607534 7598897 8745051 6235387 4272262 5834830
8782 5834830 7409259 3825531 -3316529 -6820743 -3493526 2024997 4180393 2998270
8774 2998270 1555090 824589 283330 825748 3241787 5374509 4499672 1712467 427002
8765 427002 896599 -65631 -3432196 -5666958 -3765116 113972 1391063 -979751 -3512421
8756 -3512421 -2703757 1147202 4774533 5484210 3370482 504774 -1375584 -2053864 -2173577
8747b173577j53840n78978q89506p4632J738319K095238q86286m676946m531745
8738a0131953p7519L709607L407970J448652J378020K412923J923862L42787l00710
8729D113639n24714j979647l530419k875873p85475L78532J028492K741903L651565
8720B218003Q93720l025781k528866J961633L795101M62042k542402j026398J393597
8711A600649M05330j427557P2752K694624J704933j653512k370801j79485R34248
8702A781181L40070R71964K441969J010088k913666m032753o15115K507925J694240
8693C185903m61023o10044J69111l647L1180Q87448j37871l801148n147115l93132
8683f280338N715550N449331r40083n748941m460689j93223K492822K860938K062536
$$ plain form
8747 -2173577 -2327417 -2906395 -3795901 -3870533 -2132214 -36976 -923262 -5600208 -10131953
8738 -10131953 -10209472 -6499865 -3091895 -1643243 -265223 2147700 4071562 4414349 4113639
8729 4113639 3588925 1609278 -1921141 -4797014 -5582489 -5203957 -4175465 -1433562 2218003
8720 2218003 3111723 85942 -2442924 -481291 3313810 3775852 1233450 207052 1600649
8711 1600649 2005979 578422 651174 3345798 5050731 3397219 1026418 846933 1781181
8702 1781181 2121251 3093215 5535184 6545272 3631606 -401147 -1016262 1491663 3185903
8693 3185903 2724880 2114836 2283947 2280300 2311480 3198928 3061057 -740091 -5887206 -6280338
8683 -6280338 -564788 4884543 3944460 -1804481 -6265170 -6458393 -3965571 -1104633 957903
8674I57903N00086j173699j685924j141008q86076q41365K84903J816220J342290
8665h26670j191342k785119j697245M97174K001047K855110K939722J255078j354874
8656A692881j968922J20178J793873O31583j809886l135027l467833l390866j721625
8647a1255644J637686L500895J675016q65055q4722K596739K423545r10876k468606
8638c751022L08539L555186K559788j668202m043618k165880J067548J660308
8630b477353l88901j474393M00372K627416J789285r12100j169719J551950K668098
8621B614655l54781l426143j653291L282218N600611L342288l27730k481040k930829
8612C665958k086071m14411J98805j538050l122767j165783K446607J906235l943252
$$ plain form
8674 957903 1457989 284290 -1401634 -2542642 -3428718 -4270083 -3985180 -2168960 -826670
8665 -826670 -2018012 -4803131 -6500376 -6003202 -4002155 -1147045 1792677 3047755 1692881
8656 1692881 -276041 -155863 1638010 2269593 459707 -2675320 -6143153 -9534019 -11255644
8647 -11255644 -9617958 -6117063 -4442047 -5307102 -5391824 -2795085 -371540 -1282416 -3751022
8638 -3751022 -3442483 112703 2672491 1004289 -3039329 -5205209 -4137661 -2477353
8630 -2477353 -2866254 -4340647 -3940275 -1312859 476426 -435674 -1605393 -53443 2614655
8621 2614655 2259874 -1166269 -2819560 462658 6063269 9405557 9077827 6596787 3665958
8612 3665958 1579887 1165476 1364281 -173769 -3296536 -4462319 -2015712 -109477 -4052729
8603d052729q789032o640845R53192P505601Q592975M529889j168322m086102
8595c155373k065595K179352L655987J361920p16202P9837J349886L17090j386330
8586A620572q81205Q12504O38362j215690j731564j417J603068J122642o67790
8577A299482j684433n76661K223631M145146K344635k391740n215648l013273
8569b868861R77942J402150j636904l065018n57848K458938K493341P34039n4187
8560a16408k39639j768534l719455l018217N86252L405826K645234K876j134920
8551c356985l24677L28251R7915K65441Q47483m9969k383080k801046M96304M132920
8541b747443L976007J165300m6697J061501J647709J022064J291133K256438J130978
$$ plain form
8603 -4052729 -12841761 -19482606 -18529414 -11023813 -2430838 2099051 930729 -3155373
8595 -3155373 -5220968 -3041616 614371 1976291 1260089 1339926 2689812 3006902 1620572
8586 1620572 739367 1551871 2190233 974543 -757021 -758438 844630 1967272 1299482
8577 1299482 -384951 -961612 1262019 5407165 7751800 5360060 144412 -2868861
8569 -2868861 -1890919 -488769 -2125673 -5190691 -5748539 -3289601 -796260 -62221 -116408
8560 -116408 -356047 -2124581 -5844036 -8862253 -8276001 -4870175 -2224941 -2222065 -3356985
8551 -3356985 -3681662 -3353411 -3255496 -2990055 -2142572 -2192541 -4575621 -7376667 -6880363 -2747443
8541 -2747443 1228564 2393864 2347167 3408668 5056377 6078441 7369574 9626012 10756990
8532A0756990j692047k237706r0576J5251l415719m886259r40394K965120P29026
8523A203686m091301l690262J488735L832906P88070k140099j018350J325031
8515b301584J447569L36224P573J65602M05733J371037K041295K00594k995809
8506F78234l501539p90918J114805M20348k05647J22816j369606l868580j320041
8497h720128O910547J1007891L818167o792216p875385N7279M675601N51451m581054
8488i47847l649044k7385N99887l96934P16782K277719P67016k056033k014955
8479d730794J81256N58361r56692q84734J134124J738693J5460j068930k03837
8470d217093L35565k70145O68255L952205N500968K168468k906396m575210k612682
$$ plain form
8532 10756990 9064943 6827237 6736661 6751912 3336193 -1550066 -2490460 474660 1203686
8523 1203686 -2887615 -6577877 -5089142 -1256236 -468166 -2608265 -3626615 -2301584
8515 -2301584 -854015 -517791 -510218 -344616 61117 1432154 3473449 3674043 678234
8506 678234 -2823305 -3614223 -2499418 -2079070 -2284717 -2161901 -3531507 -7400087 -8720128
8497 -8720128 -1809581 9198310 13016477 6224261 -1651124 -1593845 3081756 3633207 -947847
8488 -947847 -4596891 -4624276 -4024389 -4421323 -3704541 -1426822 -659806 -2715839 -4730794
8479 -4730794 -4549538 -3991177 -4947869 -5832603 -4698479 -2959786 -2944326 -4013256 -4217093
8470 -4217093 -3881528 -4151673 -3483418 468787 5969755 8138223 5231827 656617 -1956065
8461a956065l73679J116016K951089L745052Q11122l923419m598594L89045N409090
8452C569657N028484N65847l247211m451003l606932q23682K878704L765152m03734
8443C275282n679816n944337j066748L169717L128186J036898J99091O68270R90045
8434b23412P66796p3536j797863l421128l278512j834040j120881q99621J043074
8425a0839123L959330L878814Q5450k673233j208481J280921R94736j39426J334075
8416c326937L500545K148291j658006l145146j588014m21839l23455J477761M742060
8407A405260N409049K470324k51138q64985k056934m649066m588533M932M214948
8398A093857L301372k21541j417593q18691j837743l538015k383216P10501J561616
$$ plain form
8461 -1956065 -2329744 -1213728 1737361 5482413 6293535 2370116 -2228478 -1839433 3569657
8452 3569657 8598141 9163988 5916777 1465774 -2141158 -2964840 -86136 3679016 3275282
8443 3275282 -2404534 -8348871 -9415619 -6245902 -3117716 -2080818 -1881727 -1213457 -223412
8434 -223412 543384 469848 -1328015 -4749143 -8027655 -9861695 -10982576 -11882197 -10839123
8425 -10839123 -6879793 -3000979 -2915529 -5588762 -6797243 -5516322 -4521586 -4661012 -3326937
8416 -3326937 173608 2321899 663893 -2481253 -4069267 -4491106 -4814561 -3336800 1405260
8407 1405260 6814309 9284633 9033495 8168510 6111576 1462510 -3126023 -3121091 1093857
8398 1093857 4395229 4173688 2756095 1937404 99661 -3438354 -5821570 -5111069 -3549453
8389c549453J41876M46571K876414L080619l71186l060595j703182J045215J604225
8380E10504Q83089J290174J920786N72298j888686k857550k090340j274584p87138
8371c721447J28574R48713N65072j61923O96269K710944K936908k53159m570040
8362g20089n660711j435612N041034P372845K365469n172539o938783j303707
8354f452093M510889M242147L86167j310951q92389j971187l415357o99466M965105
8345f37135O518584J687219l228049l124135j244328k285342m042882j831395
8337h187463K688306L741847O05830j762936p93773O99832J84977q62508l46481
8328d032369J106604J799385J246472k34843j823807j645206J320787M386315
$$ plain form
8389 -3549453 -3407577 -2961006 -84592 2996027 2624841 -435754 -2138936 -1093721 510504
8380 510504 1393593 2683767 4604553 5176851 3288165 430615 -1659725 -2934309 -3721447
8371 -3721447 -3592873 -2644160 -2079088 -2241011 -1544742 1166202 4103110 3849951 -720089
8362 -720089 -6380800 -7816412 -2775378 4597467 6962936 1790397 -5148386 -6452093
8354 -6452093 -1941204 2300943 2687110 1376159 483770 -1487417 -4902774 -5602240 -637135
8345 -637135 5881449 7568668 4340619 1216484 -27844 -2313186 -6356068 -8187463
8337 -8187463 -5499157 -1757310 -1151480 -2914416 -3708189 -3008357 -2823380 -3685888 -4032369
8328 -4032369 -2925765 -1126380 120092 -114751 -1938558 -3583764 -2262977 2123338
8320B123338L428809j154889m116474k307544J324555K469752R70324p65361j931638
8311D0872k864975k619563l62624K099549K277392O75122k30213J4719l47343
8302a317064j776304k420991q93418J908371L951832L687743R89163k071209k377459
8293c19336L76938K294691L72167k408442r17500L851528N227942N85666m283497
8284D780157l250456J672989L845975J390489j466861j571436r47649k699432
8276A753776n804308o056559j428759M786450O741554K286839l944121n067617
8268f732745K24390O151971O845934K711738j559221l037794k327799j057347
8260A219127l48499q20036j733308j049375J544168L071934J252787j648679k144088
$$ plain form
8320 2123338 5552147 4397258 280784 -2026760 -702205 1767547 2737871 1972510 40872
8311 40872 -2824103 -5443666 -5806290 -3706741 -1429349 -754227 -984440 -969721 -1317064
8302 -1317064 -3093368 -5514359 -6407777 -4499406 -547574 3140169 4129332 2058123 -319336
8293 -319336 57602 2352293 2724460 316018 -601482 3250046 8477988 9063654 4780157
8284 4780157 1529701 3202690 7048665 8439154 6972293 5400857 4453208 1753776
8276 1753776 -4050532 -10107091 -11535850 -6749400 -7846 2278993 -1665128 -6732745
8268 -6732745 -6508355 -356384 6489550 9201288 7642067 4604273 2276474 1219127
8260 1219127 870628 50592 -1682716 -2732091 -1187923 1884011 3136798 1488119 -655969
8251f55969r33994r21119j387206N80063L548961K850553j115759k326770R81099
8242F19859K624278j495261n945435l901864K250242N003941K889314N99478K81469
8233B926021j33099j006369m19795O93043m71411k352095o69025L162060K863307
8224D592637j876110l668479K28925K411313k281964o869134k833914N444107
8216d852619O789396L87758l736683p51332K909932J547956j088435M61581M049979
8207E717533L921383m88879m803245n777386l228896J396135N082585M647598
8199F466828J035045q98410M14900N11833l036818n035244r08804M236474K662494
8190E448298l167596m031631J236729M468079K178236K15082J713948J277146
$$ plain form
8251 -655969 -1589963 -2511082 -3898288 -3318225 230736 3081289 1965530 -361240 619859
8242 619859 3244137 1748876 -4196559 -8098423 -5848181 -844240 2045074 2644552 2926021
8233 2926021 2792922 1786553 1366758 2059801 1588390 -763705 -1432730 1729330 4592637
8224 4592637 2716527 -951952 -723027 1688286 -593678 -7462812 -10296726 -4852619
8216 -4852619 1936777 2324535 -1412148 -2163480 746452 2294408 1205973 1667554 5717533
8207 5717533 9638916 9150037 4346792 -1430594 -4659490 -3263355 1819230 6466828
8199 6466828 7501873 6603463 7018363 7530196 4493378 -541866 -1450670 2785804 5448298
8190 5448298 2280702 -1750929 -514200 3953879 6132115 6347197 8061145 9338291
8182I338291l557662n374846O95678O505018K886202m820034m952393J473445
8174B193699L026219k776837o033032j674569K912942J479123j534537q65110
8166c272102L64657j432990k017311K502939O422231K913034l698228m248689
8158b466459M46360J709444k018480l302629P70944L776043J444810j246236Q36181
8149e0022M129976K523181k611894m719411j754106J930591K432755N74099r03253
8140A551916j154561j205675j867938k799901l114268k159641L80808M359089
8132f010171Q120170Q321468L209938l585571n682201j925092J597930P3993l146776
8123I73688k228691J884115L517333J573920L23913J342282J222035j628071l834300
$$ plain form
8182 9338291 5780629 405783 1101461 7606479 10492681 5672647 720254 2193699
8174 2193699 5219918 2443081 -3589951 -5264520 -2351578 -872455 -2406992 -3272102
8166 -3272102 -2907445 -4340435 -6357746 -3854807 2567424 5480458 1782230 -2466459
8158 -2466459 -2020099 -310655 -2329135 -5631764 -4860820 -1084777 360033 -886203 -50022
8149 -50022 4079954 6603135 3991241 -728170 -2482276 -551685 1881070 2455169 1551916
8140 1551916 397355 -808320 -2676258 -5476159 -8590427 -10750068 -10369260 -6010171
8132 -6010171 2109999 10431467 13641405 10055834 4373633 2448541 4046471 4120464 973688
8123 973688 -1255003 629112 4146445 5720365 6044278 7386560 8608595 6980524 3146224
8114C146224k672911N0797J673609J840208M28399k980046n753562l435092L095010
8105d607364O653217L258229k042215k773028j03666N92236j213149j459253P93551
8096i01442J668042j089906m306075l580747R87518M745074L648989r88941l533296
8087c350784o86204L945087M335727K70524k704966j657568J12168o87691k290635
8078b714342j872278l74409K16388Q31327K581840L086754P630l855537l574624
8069e667251Q60887M549767M254540J517508o48997j213307r28440p31254q23804
8060A169649o28401O9796R1789j469631k794677j269963J914330K643019K52417
8051b1672r89535J510397M660848M651721K087440m99517k541651l985323l580749
$$ plain form
8114 3146224 473313 524110 2197719 4037927 4466326 1486280 -4267282 -7702374 -4607364
8105 -4607364 2045853 5304082 3261867 488839 385173 977409 -235740 -1694993 -901442
8096 -901442 766600 -323306 -4629381 -8210128 -7222610 -2477536 1171453 182512 -3350784
8087 -3350784 -4036988 -91901 4243826 4514350 1809384 151816 263984 -423707 -2714342
8078 -2714342 -4586620 -4961029 -4744641 -3913314 -1331474 1755280 1762910 -2092627 -5667251
8069 -5667251 -4806364 -256597 3997943 5515451 4866454 3653147 2724707 1993453 1169649
8060 1169649 541248 611044 702833 -766798 -3561475 -4831438 -2917108 -274089 -21672
8051 -21672 -1011207 499190 5160038 9811759 11899199 11399682 8858031 4872708 1291959
8042A291959j600971p65200j700655j370303J252131K576652P43026o06763R60771
8033G80647J649801j624221m553553k060943K895579L996307J247700r09689j575328
8024a53700k264455j350800K514829M656380O09668m618880k907387L284455L835561
8015C605671k857858p250094l652779K147338L319676J291929N89501J427848
8007a378768J675553R92429k22406j819479k190818J9168K051919K51154k919030
7998c540278j685771L030483M219361M66070j555743J248243L008534o62107m834723
7989c05931l347640J682441M106643K522066k58982k249957k458311q3758K725492
7980B332063J586558l268450n612590k209333K028084J994906J85114J355277
$$ plain form
8042 1291959 -309012 -1074212 -2774867 -4145170 -2893039 -316387 426639 -180124 780647
8033 780647 2430448 806227 -3747326 -5808269 -2912690 1083617 2331317 1421628 -153700
8024 -153700 -2418155 -3768955 -1254126 3402254 4011922 -606958 -3514345 -229890 3605671
8015 3605671 747813 -6502281 -10155060 -8007722 -4688046 -3396117 -2806616 -1378768
8007 -1378768 296785 1289214 1066808 -752671 -2943489 -2924321 -872402 -621248 -3540278
7998 -3540278 -5226049 -2195566 2023795 2489865 934122 2182365 5190899 4528792 -305931
7989 -305931 -3653571 -1971130 2135513 4657579 4398597 2148640 -309671 -393429 2332063
7980 2332063 3918621 650171 -4962419 -7171752 -5143668 -3148762 -2963648 -1608371
7972a608371M023742L315261p06567l236081j730878J578683L152584J330780
7964F119153k572673m769215k709789J018438J771489p0076k1782K105169J332388
7955B203102l144954n056200r75559L771689L560465M89932r01743r50420j628964
7946b632652j569510K26353Q83078q52970r24631K839383N490369K873737r40974
7937E392183p37388R83472m35261k723795j345853J379433M99315k063929j184611
7928b36434J413617O2636m022546m135058O15895M018544K658779m38635j993121
7919b056323j664520L84669L051706K800982j359186l840039j88969M406271K630559
7910D165150k232477j324744M183844M336413k690056p082303l220081K375642
$$ plain form
7972 -1608371 2415371 5730632 5024065 1787984 57106 1635789 4788373 6119153
7964 6119153 3546480 -1222735 -3932524 -2914086 -1142597 -1212673 -1234455 870714 2203102
7955 2203102 -941852 -5998052 -6973611 -3201922 358543 848475 -53268 -1003688 -2632652
7946 -2632652 -4202162 -3975809 -3092731 -3945701 -4870332 -2030949 3459420 6333157 5392183
7937 5392183 4654795 5638267 5203006 2479211 1133358 2512791 3012106 948177 -236434
7928 -236434 1177183 1239819 -2782727 -6917785 -6301890 -2283346 375433 -63202 -2056323
7919 -2056323 -3720843 -3336174 -284468 2516514 1157328 -2682711 -2871680 1534591 4165150
7910 4165150 1932673 607929 4791773 9128186 6438130 -644173 -3864254 -1488612
7902a488612K954819J111327J234122J405391j061011l354021k580182j355311
7894c133478k261220k307238J214751M280332J771681m048968o573370l853653
7886a4911163M39120L018602L493826K465053R88900Q73328K587976L969601L101849
7877F027092R49505o24954j495324k113339j804807k00591J367445J596473Q48291
7868D549791l5688q31452j103004l22722N88329J42592q75377k02385J758518
$$ plain form
7902 -1488612 1466207 2577534 3811656 5217047 4156036 802015 -1778167 -3133478
7894 -3133478 -5394698 -7701936 -6487185 -2206853 -435172 -4484140 -11057510 -14911163
7886 -14911163 -14472043 -11453441 -7959615 -5494562 -4505662 -3632334 -1044358 2925243 6027092
7877 6027092 6976597 6351643 4856319 2742980 938173 737582 2105027 3701500 4549791
7868 4549791 4514103 3682651 2579647 2256925 2845254 2987846 2112469 1910084 3668602
$$ [...]
##END NTUPLES=NMR SPECTRUM
##END=
