##TITLE=31Pdec_LR-733-R2A
 CDCl3, 24 sc
 1.03.2021
##JCAMPDX= 6.0         $$ Bruker NMR JCAMP-DX V2.0
##DATA TYPE= NMR SPECTRUM
##DATA CLASS= NTUPLES
##ORIGIN= UXNMR, Bruker Analytische Messtechnik GmbH
##OWNER= root
$$ XWIN-NMR		Version 3.5
$$ Mon Mar  1 13:11:54 2021 Russian Standard Time (UT+4h)  she@DPX200
##.OBSERVE FREQUENCY= 81.013821
##.OBSERVE NUCLEUS= ^31P
##.ACQUISITION MODE= SIMULTANEOUS
##.ACQUISITION SCHEME= undefined
##.AVERAGES= 24
##.DIGITISER RES= 16
##SPECTROMETER/DATA SYSTEM= spect
##.PULSE SEQUENCE= zgpg30
##.SOLVENT NAME= CDCl3
##.SHIFT REFERENCE= (INTERNAL, CDCl3, 0, 248.564)
##AUDIT TRAIL= $$ (NUMBER, WHEN, WHO, WHERE, WHAT)
$$ ##TITLE= Audit trail, XWIN-NMR		Version 3.5
$$ ##JCAMPDX= 5.01
$$ ##ORIGIN= Bruker BioSpin GmbH
$$ ##OWNER= she
$$ F:/spectra/data/she/nmr/P31/1/pdata/1/auditp.txt
$$ ##AUDIT TRAIL=  $$ (NUMBER, WHEN, WHO, WHERE, WHAT)
(   1,<2021-03-01 13:10:52.34 +0400>,<she>,<DPX200>,
      <created by zg, POWCHK disabled, PULCHK disabled
       configuration hash MD5:
       00 E9 B6 7A A2 85 ED C7 34 08 36 98 17 FE 4E 26
       data hash MD5: 32K
       48 F7 3A E4 05 63 87 A8 F0 3A C0 7E CB 39 10 39>)
(   2,<2021-03-01 13:10:55.73 +0400>,<she>,<DPX200>,
      <Start of raw data processing
       efp BC_mod = 2 LB = 1 FT_mod = 6 PKNL = 1 PHC0 = -2978.892 PHC1 = 74.6025 SI = 64K 
       data hash MD5: 64K
       96 49 64 53 36 86 6D BF E2 A9 3F A0 2A B8 25 F8>)
(   3,<2021-03-01 13:11:17.59 +0400>,<she>,<DPX200>,
      <pk PHC0 = -36.03264 PHC1 = 91.39999 
       data hash MD5: 64K
       EF 54 BA B8 15 34 F3 F1 67 53 2C EE E9 3D 35 D7>)
$$ ##END=
$$ 
$$ hash MD5
$$ 68 67 FF D6 2E 83 4A 74 10 FF 52 23 A7 49 B0 5C
##$RELAX= 
##$RELAX= 
##$RELAX= 
##$RELAX= 
##$RELAX= 
##$RELAX= 
##$RELAX= 
##$RELAX= 
$$ Bruker specific parameters
$$ --------------------------
##$DU= <F:/spectra>
##$EXPNO= 1
##$NAME= <P31>
##$PROCNO= 1
##$TYPE= <nmr>
##$USER= <she>
##$AMP= (0..31)
100 100 100 100 100 100 100 100 100 100 100 100 100 100 100 100 100 100 
100 100 100 100 100 100 100 100 100 100 100 100 100 100 
##$AQSEQ= 0
##$AQ_mod= 1
##$AUNM= <au_zg>
##$AUTOPOS= <>
##$BF1= 81.014009
##$BF2= 200.13
##$BF3= 200.13
##$BF4= 200.13
##$BF5= 200.13
##$BF6= 200.13
##$BF7= 200.13
##$BF8= 200.13
##$BYTORDA= 1
##$CFDGTYP= 0
##$CFRGTYP= 5
##$CHEMSTR= <none>
##$CNST= (0..31)
1 1 145 1 1 1 1 1 1 1 1 1 1 1 1 1 1 1 1 1 1 1 1 1 1 1 1 1 1 1 1 1 
##$CPDPRG= <waltz16>
##$CPDPRG1= <>
##$CPDPRG2= <waltz16>
##$CPDPRG3= <>
##$CPDPRG4= <mlev>
##$CPDPRG5= <mlev>
##$CPDPRG6= <mlev>
##$CPDPRG7= <mlev>
##$CPDPRG8= <mlev>
##$CPDPRGB= <>
##$CPDPRGT= <>
##$D= (0..31)
0 1 0 0 0 0 0 0 0 0 0 0.03 2e-05 3e-06 0 0 0 0 0 0 0 0 0 0 0 0 0 0 0 0 
0 0 
##$DATE= 1614589851
##$DBL= (0..7)
120 120 120 11 120 120 24 19 
##$DBP= (0..7)
150 150 150 150 150 150 150 150 
##$DBP07= 0
##$DBPNAM0= <>
##$DBPNAM1= <>
##$DBPNAM2= <>
##$DBPNAM3= <>
##$DBPNAM4= <>
##$DBPNAM5= <>
##$DBPNAM6= <>
##$DBPNAM7= <>
##$DBPOAL= (0..7)
0.5 0.5 0.5 0.5 0.5 0.5 0.5 0.5 
##$DBPOFFS= (0..7)
$$ [...]
##$SUBNAM2= <"">
##$SUBNAM3= <"">
##$SUBNAM4= <"">
##$SUBNAM5= <"">
##$SUBNAM6= <"">
##$SUBNAM7= <"">
##$SUBNAM8= <"">
##$SUBNAM9= <"">
##$SW= 501.771253377433
##$SWIBOX= (0..15)
0 1 3 0 0 0 0 0 0 0 0 0 0 0 0 0 
##$SW_h= 40650.406504065
##$TD= 32768
##$TD0= 1
##$TE= 0
##$TE2= 300
##$TE3= 300
##$TEG= 300
##$TL= (0..7)
0 120 53 12 22 120 120 120 
##$TP= (0..7)
150 150 150 150 150 150 150 150 
##$TP07= 0
##$TPNAME0= <>
##$TPNAME1= <>
##$TPNAME2= <>
##$TPNAME3= <>
##$TPNAME4= <>
##$TPNAME5= <>
##$TPNAME6= <>
##$TPNAME7= <>
##$TPOAL= (0..7)
0.5 0.5 0.5 0.5 0.5 0.5 0.5 0.5 
##$TPOFFS= (0..7)
0 0 0 0 0 0 0 0 
##$TUNHIN= 0
##$TUNHOUT= 0
##$TUNXOUT= 0
##$USERA1= <user>
##$USERA2= <user>
##$USERA3= <user>
##$USERA4= <user>
##$USERA5= <user>
##$V9= 5
##$VALIST= <valist>
##$VCLIST= <CCCCCCCCCCCCCCC>
##$VD= 0
##$VDLIST= <DDDDDDDDDDDDDDD>
##$VPLIST= <PPPPPPPPPPPPPPP>
##$VTLIST= <TTTTTTTTTTTTTTT>
##$WBST= 1024
##$WBSW= 4
##$XGAIN= (0..3)
0 0 0 0 
##$XL= 0
##$YL= 0
##$YMAX_a= 43382
##$YMIN_a= -43163
##$ZGOPTNS= <>
##$ZL1= 120
##$ZL2= 120
##$ZL3= 120
##$ZL4= 120
##$ABSF1= 0
##$ABSF2= 0
##$ABSG= 0
##$ABSL= 0
##$ALPHA= 0
##$AQORDER= 0
##$ASSFAC= 0
##$ASSFACI= 0
##$ASSFACX= 0
##$ASSWID= 0
##$AUNMP= <proc_1d>
##$AZFE= 0.1
##$AZFW= 0.5
##$BCFW= 0
##$BC_mod= 2
##$BYTORDP= 0
##$COROFFS= 0
##$CY= -3
##$DATMOD= 1
##$DC= 0
##$DFILT= <>
##$DTYPP= 0
##$F1P= 0
##$F2P= 0
##$FCOR= 1
##$FTSIZE= 65536
##$FT_mod= 6
##$GAMMA= 0
##$GB= 0
##$INTBC= 1
##$INTSCL= 5.30512e-09
##$ISEN= 30
##$LB= 1
##$LEV0= 0
##$LPBIN= 0
##$MAXI= 10000
##$MC2= 0
##$MEAN= 0
##$ME_mod= 0
##$MI= 50
##$NCOEF= 0
##$NC_proc= -4
##$NLEV= 6
##$NOISF1= 182.463
##$NOISF2= 159.3651
##$NSP= 0
##$NTH_PI= 0
##$NZP= 0
##$OFFSET= 248.5645
##$PC= 4
##$PHC0= -3014.925
##$PHC1= 166.0025
##$PH_mod= 1
##$PKNL= yes
##$PPARMOD= 0
##$PSCAL= 0
##$PSIGN= 0
##$REVERSE= no
##$SF= 81.014009
##$SI= 65536
##$SIGF1= 159.3651
##$SIGF2= -187.1042
##$SINO= 113.3802
##$SIOLD= 16384
##$SREGLST= <1H.CDCl3>
##$SSB= 0
##$STSI= 65536
##$STSR= 0
##$SW_p= 40650.406504065
##$SYMM= 0
##$S_DEV= 0
##$TDeff= 32768
##$TDoff= 0
##$TI= <>
##$TILT= no
##$TM1= 0
##$TM2= 0
##$TOPLEV= 0
##$USERP1= <user>
##$USERP2= <user>
##$USERP3= <user>
##$USERP4= <user>
##$USERP5= <user>
##$WDW= 1
##$XDIM= 65536
##$YMAX_p= 344645353
##$YMIN_p= -41608217
$$ End of Bruker specific parameters
$$ ---------------------------------
##NTUPLES= NMR SPECTRUM
##VAR_NAME=  FREQUENCY,     SPECTRUM/REAL,   SPECTRUM/IMAG
##SYMBOL=    X,             R,               I
##VAR_TYPE=  INDEPENDENT,   DEPENDENT,       DEPENDENT
##VAR_FORM=  AFFN,          ASDF,            ASDF
##VAR_DIM=   65536,         65536,           65536
##UNITS=     HZ,            ARBITRARY UNITS, ARBITRARY UNITS
##FACTOR=    0.620285442955139, 1,           1
##FIRST=     20137.2065510759, 0,            0
##LAST=      -20513.1999529892, 0,           0
##MIN=       -20513.1999529892, -41608217,   0
##MAX=       20137.2065510759, 344645353,    0
$$ Real data points
##PAGE= N=1
##DATA TABLE= (X++(R..R)), XYDATA
$$ [...]
40965A389q1591j81773o8271R7072Q7989K1933J62829L70180K02422l22089n52556
40954b62466r0459N48641N76091k4844n50765n29665j50087K20220M63767N62986
40944G63419M41052J62451j0543J2434l4574l49430o72714o29469l08750j33377
40934g59501j99142j55279J63278L97387K25420n7433O7506N21592O67270K01831
40924A072929m13874n92722l37323n4028P3129J51470J56870j22407o23952q33342
40914a523250l40615N37280R67889N25136k70727n28034l9515N08395M65454L5802
40904C37815j24078J31410L52515K83996J67605J43235o9756n69159q34140l77802
40894e58359M52389Q17329L96664l35559p33358n35922O5832N72438N02175r9593
$$ plain form
40965 1389 -80202 -261975 -330246 -233174 -145185 -123252 39577 409757 612179 290090 -262466
40954 -262466 -352925 195716 771807 746963 196198 -333467 -483554 -263334 200433 763419
40944 763419 1204471 1366922 1356379 1368813 1334239 984809 312095 -317374 -626124 -759501
40934 -759501 -958643 -1113922 -950644 -553257 -327837 -385270 -317764 203828 871098 1072929
40924 1072929 659055 66333 -270990 -325018 -251889 -100419 56451 -65956 -689908 -1523250
40914 -1523250 -1863865 -1326585 -358696 166440 -104287 -632321 -671836 -163441 302013 337815
40904 337815 213737 345147 697662 981658 1149263 1292498 1222742 653583 -180557 -558359
40894 -558359 -105970 711359 1108023 772464 39106 -496816 -430984 141454 643629 544036
40884E44036o03170n33929j48840O4022J35199L40910M85438J73640l47116m18337
40874c08147n5657K1954m02577o48192k52142L14380M83151M02824L79912K09100
40864A44606k62600n23619j58533K76998N2942m39806k31119N74764Q32246J40444
40854D06323n36919m11571J4486J929j60592J66100O62949M85197k71712o08762
40844b52572j65613K61137M1113l14746n9010N50968O46965N5389n27036n77319
40834c40724k98430m7312J84413M63339N57849K61510j98813m28141l80442l10173
40824e36924l11947j98799J69595O32792Q23049M63450l11468q87920o80727J29626
40814g09273O60327L93301j39397j51460K16141J44989n29172r79748n75796K47986
$$ plain form
40884 544036 -59134 -593063 -741903 -677881 -542682 -201772 283666 457306 110190 -308147
40874 -308147 -363804 -341850 -744427 -1392619 -1644761 -1330381 -847230 -444406 -64494 144606
40864 144606 -117994 -641613 -800146 -523148 -470206 -910012 -1141131 -566367 265879 406323
40854 406323 -130596 -542167 -527681 -525752 -686344 -520244 142705 627902 356190 -252572
40844 -252572 -418185 -157048 -115935 -430681 -489691 61277 708242 763631 236595 -340724
40834 -340724 -639154 -686466 -502053 -38714 519135 780645 581832 153691 -226751 -536924
40824 -536924 -848871 -1047670 -878075 -245283 577766 1041216 729748 -158172 -838899 -709273
40814 -709273 -48946 344355 204958 53498 269639 414628 -114544 -1094292 -1670088 -1422102
40804a422102O85549O14103M66662M08470K16669j44456l53051k03707Q9502J68017
40794E25656p7945m24640n02005j18195M69183P11309L75340j30068k65190o3910
40784D99535o539k57395m35895k34901J12150K02355K5035j29196j47863j75089
40774e47803k74555l11221k01660l7531J13394L05007M94782M53213J02701k23933
40764a27606j58823J41608J53449k62516o21440m90151q6589O7547j35198l44331
40754a864050k91632m2540K26063L81888L04745J1959j95446l2222L20752M06037
40744g74446J47666p3744p1370j18141l76300n27205k94195O2071J76490J74464
40734a674710L48009M92503J58215n15649q13872l90333K88609O10265N10552
$$ plain form
40804 -1422102 -736553 -122450 344212 752682 969351 824895 471844 268137 357639 525656
40794 525656 447711 23071 -478934 -597129 -127946 583363 958703 828635 563445 499535
40784 499535 492996 235601 -200294 -435195 -323045 -120690 -95655 -224851 -372714 -547803
40774 -547803 -822358 -1133579 -1335239 -1372770 -1259376 -954369 -459587 -6374 96327 -127606
40764 -127606 -286429 -144821 8628 -253888 -875328 -1365479 -1452068 -1384521 -1519719 -1864050
40754 -1864050 -2155682 -2198222 -1972159 -1590271 -1285526 -1273567 -1469013 -1501235 -1180483 -774446
40744 -774446 -626780 -700524 -771894 -890035 -1266335 -1793540 -2087735 -2025664 -1849174 -1674710
40734 -1674710 -1326701 -834198 -675983 -1191632 -2005504 -2395837 -2107228 -1496963 -986411
40725i86411K96688J43773N0480L9776J11739J40911M0068r5507j68834k44995
40715f72312l61169l60060j37984J09012J50552Q9496J61965K92098K21034K8649
40705d78719Q2035L83117M32253o730m10094j84384L89968M37846k81225r28983
40695e64916o35446L28455Q31376K91005n82237o62816J90658R82669Q44004M5300
40685A068052n14271n01756l44826l68394l58493j23018R3481P9746O8235K70895
40675f30349M20068K49733N2688J81993L31716J3958m84844m36240J27161M04011
40665B29895R2234k03108m3513K11680J95409J49920K88866K76532r9191l80262
40655G18462j71204J51255Q4730j69571j65660L910M6226Q0912K15164N8371n25910
$$ plain form
40725 -986411 -689723 -545950 -495470 -455694 -343955 -203044 -162976 -258483 -427317 -672312
40715 -672312 -1033481 -1393541 -1531525 -1422513 -1271961 -1182465 -1020500 -728402 -507368 -478719
40705 -478719 -396684 -13567 418686 411956 1862 -182522 207446 645292 364067 -564916
40695 -564916 -1200362 -871907 -40531 250474 -331763 -994579 -803921 178748 1022752 1068052
40685 1068052 553781 52025 -292801 -661195 -1019688 -1142706 -1049225 -969479 -901244 -630349
40675 -630349 -210281 39452 92140 274133 605849 619807 134963 -301277 -174116 229895
40665 229895 322129 119021 75508 287188 482597 632517 921383 1197915 1098724 718462
40655 718462 547258 698513 783243 613672 448012 451922 498148 579060 794224 852595 326685
40644C26685p56230k4536Q42036N99677m55602q69104k52714K77179M0075k49047
40634e21581O5211M34177J50267m37355n49155j18978L78349O62896O32450J79914
40624H76195m27294n46421n4252L38005J63514p8217J21507L21951o7993o49205
40614b210o35464j55706M5351p6340J04162O13069O88523M2833n78084m62679
40604d16545R9419L41830O2632k80948k73376J7216K33094J56443r2132k47850
40594d00217k29293j44417l658K91691N95589N11679l1592n23368m83028n9905
40584d76519K70007L23098K08583R645j72728j43208M0460m7286n34094q03973
40574a326015k75965O25664R16522L52674l23763m15284P073M35084M92127J25303
$$ plain form
40644 326685 -429545 -454081 387955 987632 532030 -337074 -589788 -312609 -272534 -521581
40634 -521581 -456370 -22193 128074 -309281 -858436 -977414 -599065 63831 696281 876195
40624 876195 448901 -97520 -151772 186233 349747 271530 393037 714988 646995 -2210
40614 -2210 -637674 -793380 -748029 -824369 -720207 -107138 581385 624218 46134 -416545
40604 -416545 -317126 24704 87336 -193612 -466988 -449772 -216678 -60235 -152367 -400217
40594 -400217 -629510 -773927 -777585 -485894 109695 621374 589782 66414 -416614 -476519
40584 -476519 -206512 116586 325169 334814 162086 18878 59338 12052 -522042 -1326015
40574 -1326015 -1601980 -976316 -59794 292880 -30883 -446167 -439094 -4010 488117 613420
40564F13420l69953n20292k19730J2080k70226o70413m48694L46172R13176Q47746
40554B33286N43328L55472J10029k98644n10840l11819r2466k38553m79720l29044
40544a018971J28745L67027J67571j70505k93175j40877J25816L05069K75974
40535b53326J10640M2249K11967M81827N60766K78087k54210o61615n62715J0396
40525c5934N16360M83350J19978K62J68141N6088n38243r29922m39470N37820
40515f1570R23450L31252m74985n95398k9130N29924N99976K74784j33317m04724
40505I60262l76641m677L88820K86794l32167p76081m75434K21320N55140M32277
40495H79613L56140M04586J11668m93008o45818r1072L03539j22497o24663j46121
$$ plain form
40564 613420 243467 -276825 -496555 -484475 -754701 -1425114 -1873808 -1527636 -614460 233286
40554 233286 776614 1132086 1242115 943471 432631 120812 28346 -210207 -689927 -1018971
40544 -1018971 -890226 -523199 -355628 -526133 -819308 -960185 -834369 -529300 -253326
40535 -253326 -142686 -100437 111530 593357 1154123 1432210 1178000 516385 -46330 -35934
40525 -35934 480426 963776 1083754 1084016 1252157 1308245 770002 -159920 -599390 -61570
40515 -61570 861880 1193132 718147 122749 93619 623543 1223519 1498303 1364986 960262
40505 960262 583621 578944 967764 1254558 922391 146310 -329124 -107804 447336 879613
40495 879613 1235753 1640339 1752007 1258999 613181 522109 825648 703151 78488 -67633
40485f7633R12903J162037K63076o53533p08655l25219k19466k90053q0684L21331
40475C14104M72481K68406l5422k21940j90139P1021L01696R7277m90327q23092
40465b35935m77367J52617M08731K22925J6112o547j2663j27643k63802l15850
40455f39422k39724j8935K10963J70630j41197k45180J86471O63166M03949m59442
40445a08721q40471j28429Q88661J025484K52758m02159l65493j58002l34865
40436a71237n28672j15176O46264Q86077L75083k23784l77446k67072j96340q8632
40426f0935J14255J39222j23499k91208p5156K32827K79383K16860K85525K72765
40416I90039o0531m11529l93600k11793k59076l76630j81253J95735M05114N73612
$$ plain form
40485 -67633 845270 2007307 2270383 1616850 908195 582976 363510 73457 -7227 314104
40475 314104 786585 1054991 1019569 797629 607490 678511 980207 1077484 587157 -235935
40465 -235935 -713302 -560685 -151954 70971 87083 80536 67873 -59770 -323572 -639422
40455 -639422 -879146 -898081 -687118 -516488 -657685 -902865 -716394 -53228 350721 -108721
40445 -108721 -949192 -1077621 -188960 836524 1089282 687123 321630 163628 -171237
40436 -171237 -699909 -815085 -168821 717256 1092339 868555 491109 224037 27697 -60935
40426 -60935 53320 192542 69043 -222165 -297321 -64494 214889 431749 717274 990039
40416 990039 929508 517979 124379 -87414 -346490 -723120 -904373 -708638 -303524 270088
40406B70088R02186R20864J18690r16655j080040l92608P0946o7826n4346M42774
40396B14073O37836N7275m94907k11020L82942K75284m79420r50735o75696l6511
40386a280879M42553N37462K54723j70952l49943j41586J97671M29463N48039
40377D66551M77634R3813k94442j54252L34744L29099l35798p27527k78885K47103
40367A58040J7731m95656l71587K30513M80656K99217K34235K88525K2199l99579
40357D64294l94550p6736p6790l18302j20850M39879M79467j66514n44963j33987
40347d49052L08510M3386m56869l65614J87676M79768L45412J69498P7402j02704
40337B37413k55303n7821L79568N29330J76925k91141m31448k55718q0161q8611
$$ plain form
40406 270088 1172274 2093138 2211828 1295173 215133 -177475 -106529 -174355 -228701 214073
40396 214073 851909 909184 414277 203257 586199 861483 382063 -568672 -1244368 -1280879
40386 -1280879 -838326 -300864 -46141 -217093 -567036 -708622 -510951 -81488 466551
40377 466551 944185 1037998 743556 589304 924048 1253147 917349 189822 -89063 158040
40367 158040 175771 -319885 -691472 -460959 19697 318914 553149 841674 863873 464294
40357 464294 69744 -6992 -83782 -402084 -522934 -83055 396412 229898 -315065 -449052
40347 -449052 -140542 -97156 -554025 -919639 -731963 -252195 93217 262715 340117 237413
40337 237413 -17890 -75711 303857 833187 1010112 718971 287523 31805 -48356 -136967
40327a36967j83009j64348L6127K88169L93001K74579M4466r0690R124K50317
40317G20769K85380j49693p82283r44761l89339L00595M43731J51102J9362J42938
40307b02199P5690k48786k97172J32525M39000J18084l96891l69902J16072L22837
40297c10742m256l18975j70835J53305J52414j19156j79345J54456N17671M87057
40287C61594P4436l47505m54495j98802K53842O45340P09927L30389k93379p40835
40277C40512p52508m62476j67343L7525K32443L66481K54460m7261j46979J59324
40267a85822M66915K38738l41612m63348J80726Q20799O00151k02787n73078k25282
40257C15400J12778j9023j23065K25716M68313m5470q12879p80730O4308O67137
$$ plain form
40327 -136967 -319976 -484324 -448197 -160028 232973 507552 552018 461328 470452 720769
40317 720769 1006149 856456 74173 -870588 -1259927 -959332 -515601 -364499 -345137 -202199
40307 -202199 -126509 -375295 -672467 -539942 -100942 17142 -379749 -749651 -633579 -310742
40297 -310742 -314998 -633973 -804808 -651503 -499089 -618245 -797590 -643134 -125463 361594
40287 361594 436030 88525 -365970 -564772 -310930 334410 1044337 1374726 1081347 340512
40277 340512 -411996 -874472 -1041815 -1004290 -771847 -405366 -150906 -198167 -345146 -185822
40267 -185822 281093 519831 178219 -285129 -104403 716396 1316547 1113760 540682 315400
40257 315400 428178 409155 286090 511806 980119 934649 121770 -658960 -594652 72485
40247G2485M33639j11028l10744j90769l7936J01432J90132O9866j50396j12625
40237d5944J68183K63043Q2708K3076J58652L5369m32828o46699l12502K8203
40227f78739m4595j20222K01236N16023L63323O6016O6463Q7477k16446m16958
40217a76422n7289L46704R6871l84745j88373M99759O61586J25921k34328p05
40207F88979K40757K2369l31951m04883k36702K1514L00032L72133J09757o6241
40197G15764K48499N72081J72624n63772n59012J51493L53719l50196q52130l83962
40187d94892K48337Q7709m29792l52343K12840M57816K21216j7871q3918j41118
40177b92016q9968K43716N28002K76972l51961p33474o05053j83397L42693Q56161
$$ plain form
40247 72485 506124 395096 84352 -106417 -144353 -42921 147211 217077 66681 -45944
40237 -45944 122239 385282 467990 491066 649718 685087 252259 -394440 -706942 -678739
40227 -678739 -723334 -843556 -642320 -126297 237026 303042 369505 456982 240536 -176422
40217 -176422 -233711 112993 209864 -174881 -363254 136505 798091 924012 689684 688979
40207 688979 929736 952105 620154 215271 -21431 83 300115 672248 782005 715764
40197 715764 964263 1536344 1708968 1145196 586184 737677 1091396 741200 -110930 -494892
40187 -494892 -246555 -158846 -588638 -940981 -728141 -270325 -49109 -66980 -150898 -292016
40177 -292016 -381984 -138268 389734 666706 314745 -418729 -1023782 -1207179 -864486 -8325
40167h325J024643N88866j12919m41700k75614q8301k18019m70228m96477k49149
40157g47223K4799P7529p4224j41190O8631L04654J87939j43210j68079J46992
40147d63382K23111j19746k20672L23756P68833K39349p89921j007983j48426
40138a195081O25707M02829k90076m33049K6458L20655J18300r1701J19942M68517
40128G2501M49104Q9158j77482j76294r7531k1613J63479L16638O8619m82150
40118B04429o52212j31985M55928M44757N4355j73219l19384o46898p16958l4710
40108a515897P41186N05350m46604o39894L22074J115103P61676j2684j99748
40099F30562m3389k13510m84051l16923K3710J7836q0621J95821M81784J49505
$$ plain form
40167 -8325 1016318 1605184 1492265 1050565 774951 686650 468631 -1597 -498074 -747223
40157 -747223 -722424 -644895 -719119 -860309 -791678 -487024 -299085 -442295 -610374 -463382
40147 -463382 -240271 -360017 -580689 -256933 511900 751249 -38672 -1046655 -1195081
40138 -1195081 -569374 -166545 -456621 -889670 -863212 -542557 -424257 -515958 -396016 72501
40128 72501 521605 610763 433281 256987 159456 137843 301322 617960 686579 204429
40118 204429 -447783 -579768 -123840 320917 375272 202053 -117331 -764229 -1481187 -1515897
40108 -1515897 -774711 -269361 -715965 -1355859 -1033785 81318 842994 830310 630562
40099 630562 587173 373663 -110388 -427311 -403601 -385765 -466386 -270565 211219 360724
40089C60724n00063o48412k40498J11810K24107L90650N63896L97643k4438k88282
40079C47137l15173k59309n0884K70394K16941l44666n89564Q5445Q32787N02451
40069F95559m62098o80446n8891K22684j56375k41897K80539M66717q8641m35882
40059d58731J9103M41894J05289l06196K2597N73017M65353k5745j33310k2344
40049F80927k99483o70668l81638L38300N16256j1896m15170k36295O9247Q3164
40039c27256K4107J67898L59946L46112J02147k75099n86724m87595Q1144N07294
40029h8026J60800o01934p57736j7761P61446P59077J65459l03571l31053q8700
40019c41999J77825K88273J45920q8864r1474J43387K08911q9743l56987j81685
$$ plain form
40089 360724 -139339 -787751 -1028249 -916439 -692332 -301682 262214 659857 635419 347137
40079 347137 31964 -227345 -278229 -7835 209106 -135560 -725124 -639679 193108 695559
40069 695559 233461 -446985 -505876 -283192 -439567 -681464 -400925 65792 -22849 -458731
40059 -458731 -439628 2266 107555 -198641 -176044 396973 862326 836581 703271 680927
40049 680927 381444 -289224 -670862 -332562 183694 171798 -243372 -479667 -410420 -327256
40039 -327256 -303149 -135251 224695 570807 672954 397855 -188869 -676464 -595320 -88026
40029 -88026 72774 -529160 -1286896 -1304657 -543211 215866 381325 77754 -253299 -341999
40019 -341999 -164174 124099 270019 181155 89681 233068 441979 352236 -4751 -186436
40009a86436K02048K47431q3997k75949o25M76101O97701N34004J91043r0109
39999A711212k26460k93132l99009n16983m78347k31416j2524o6650k60378k37046
39989a010733M1002K18787J10421j164J60246L91494L37840O9551o7293l4836
39979B15315p5357j43104R9404N89062O94651O0811p75846j009283n31413J16884
39969g58876N24223O69634N56675J44389l09013l41246P5668L75256J33364l21989
39959G48085l47140J42402N69234M44930n8637l88435k85745j7060K6556k09487
39949F24703m69589n66136n50059m96654l19574P1579N42065Q15398P50752M35887
39939H38372N1684k49509l69012k82344n1836K19354M22499M30555J58754k85881
$$ plain form
40009 -186436 15612 263043 179046 -96903 -97528 378573 1076274 1610278 1801321 1711212
39999 1711212 1484752 1191620 792611 275628 -202719 -434135 -446659 -513309 -773687 -1010733
39989 -1010733 -969731 -750944 -640523 -641687 -481441 -89947 247893 317444 250151 215315
39979 215315 139958 -3146 96258 685320 1379971 1440782 664936 -344347 -875760 -758876
39969 -758876 -234653 434981 991656 1136045 827032 485786 561454 936710 1070074 748085
39959 748085 400945 543347 1112581 1557511 1498874 1110439 824694 807634 834190 624703
39949 624703 155114 -411022 -961081 -1457735 -1777309 -1705730 -1163665 -348267 402485 838372
39939 838372 890056 640547 271535 -10809 -62645 156709 579208 1009763 1168517 882636
39929H82636o00489n41221j70513J95330K73566N9190j78504j80280j7137p596
39919b85018k24664l04752J4284M06702M11610J73162J74135L43416J43262l95776
39909D56361n45690p2943K66394o1623m21183j0872P70604Q55830Q1011o56517
39899F61372o96983k89071M9912J83092K61010M33520O94636P46732K30202o02122
39889A672300q66398k18254M41950J55670o54077q34349k28507L14985M29418
39880B12738N19363N94183J04245q09777j116717l90125N27471Q01608N59576
39871A002565J31680n69336j292644j160829K779R65466O68672k17045l29918
39862g98610L96060Q61995N17769j21059m70539m50099j51865K52971L48563p3378
$$ plain form
39929 882636 282147 -259074 -429587 -234257 39309 98499 -80005 -260285 -277422 -285018
39919 -285018 -509682 -814434 -800150 -393448 18162 191324 365459 708875 852137 456361
39909 456361 -89329 -162272 104122 42499 -378684 -389556 381048 1236878 1317889 661372
39899 661372 -35611 -324682 -274770 -91678 169332 602852 1297488 2044220 2274422 1672300
39889 1672300 805902 587648 1029598 1185268 531191 -303158 -531665 -216680 212738
39880 212738 732101 1326284 1430529 620752 -495965 -886090 -358619 442989 1002565
39871 1002565 1134245 564909 -727735 -1888564 -1885785 -920319 -251647 -468692 -798610
39862 -798610 -402550 459445 977214 856155 385616 -64483 -216348 36623 385186 311808
39852C11808m88041k32307M92883Q83946O71915K93203K3308k83966n64268m28542
39842F79939J07495M14205P4064n18993o70209k19129L44459M53089N5262l20027
39832D00155j71126L02005M35255R1990r5526K36635N17337J63955l93272l89829
39822A097579m431k0451m37845m45705J95235P13105M92820j29189n27144n52257
39812C81717l44738q198K22612O0928k85041j97740M03330P63760L42198l49970
39802I88858m47997R2074N22668L03760l46808p98758o18716O8798O41293N33197
39792I38369j28895o13342m18635J80906N36465L52325j15986m00289k49286J33263
39782B14895K66497k1563k92778r0857L09225K43414k89219n41426j28368M08927
$$ plain form
39852 311808 -176233 -408540 84343 968289 1640204 1933407 1956715 1672749 1108481 679939
39842 679939 787434 1201639 1275703 756710 86501 -132628 211831 664920 720182 400155
39832 400155 229029 531034 966289 1058279 962753 1199388 1716725 1880680 1487408 1097579
39822 1097579 1093148 1072697 634852 189147 384382 1097487 1590307 1461118 933974 381717
39812 381717 36979 28781 251393 312321 27280 -170460 232870 996630 1338828 988858
39802 988858 540861 632935 1155603 1459363 1112555 313797 -304919 -236121 405172 938369
39792 938369 809474 196132 -222503 -41597 494868 847193 731207 330918 81632 214895
39782 214895 481392 459829 167051 76194 385419 628833 339614 -201812 -330180 78747
39772G8747M55897J68426L6405Q2732K9464o6987Q0620M00634M84508J83797j95295
39761A738948l26698k25872j31319j86462k81378j89269R7169K57224P8376j13217
39751G17502J41038O22675N88907j06266o43927l55079L28811N43977J91375j29671
39741A899342r6861O5888J61204K45663K81725Q9552k67549m55636l18849n1696
39731A552783J11245J08800k8525k07524k59429j42509n3255q1500L1783M17588
39721A449457O24637K15916l66597k91603L05485L41239n44997j221859o17315
39712a05637O29598R69330P0540q28950p28105q6510J36205q8435q1657K79808
39702A66187L59786j28304n39649k27610M17248M55678k34268p27354l31054M64446
$$ plain form
39772 78747 534644 703070 739475 822207 851671 784684 865304 1265938 1750446 1934243 1738948
39761 1738948 1412250 1186378 1055059 868597 587219 397950 495119 752343 830719 717502
39751 717502 858540 1481215 2070122 1963856 1319929 964850 1293661 1837638 2029013 1899342
39741 1899342 1802481 1868369 2029573 2275236 2556961 2646513 2378964 1923328 1604479 1552783
39731 1552783 1664028 1772828 1744303 1536779 1277350 1134841 1081586 1000086 1031869 1449457
39721 1449457 2074094 2290010 1923413 1631810 1937295 2278534 1733537 511678 -105637
39712 -105637 523961 1493291 1563831 734881 6776 -79734 56471 -31964 -113621 166187
39702 166187 525973 397669 -141980 -369590 47658 503336 269068 -458286 -789340 -324894
39692c24894O95045K01809l02981k70202J18558M20008M76872L60771J61021J7059
39682A553066M7521Q0481k13254p24228q37926k94533K70473J51324l43599l03737
39672f14412L67462P33459K49659l47200j37462N36771N39760l31284r70739n21197
39662d95183M40854P69915K97823j46930n1401J67422k7337m57822n49151j42295
39652a94105L75115N81786L67562j07680n04951m49056R3238O00688M95080j10440
39642A147237n00819k97113O8056L6248k76842l54095j02243R4054O2758N6606
39632f6153J92085J93013o8310k28766j266K71746R6187l72762n23462j81770
39622f89458K06686K92126K09614J57174P5536o4653r9450l4033j53745m87280
$$ plain form
39692 -324894 370151 571960 268979 -1223 117335 537343 1014215 1374986 1536007 1553066
39682 1553066 1600587 1681068 1467814 743586 -94340 -388873 -118400 32924 -310675 -614412
39672 -614412 -246950 486509 736168 388968 251506 788277 1328037 996753 26014 -495183
39662 -495183 -54329 715586 1013409 866479 815078 982500 955163 497341 -51810 -194105
39652 -194105 181010 762796 1130358 1022678 517727 68671 161909 762597 1257677 1147237
39642 1147237 646418 349305 417361 453609 176767 -177328 -279571 -185517 -122759 -66153
39632 -66153 125932 318945 250635 21869 20603 292349 388536 15774 -507688 -689458
39622 -689458 -482772 -190646 18968 176142 251678 187025 87575 53542 -100203 -587483
39612e87483n69528j15116M39413N25781K77212K39206M55681M47058M8265l18740
39602H41749l01118o0423P9513M2702p4398j69740j40367l800n338k61971l88486
39591d41677J6585N72372M89551j72856m42401P0233M93732J07482m18580j21562
39581A52879N70341M68055l65858o07521J84750P62289J11648r29963r25957L7748
39571e41589O02860J87107l52728j97118K84069K98277j26271k88865Q6152M88952
39561D40846L69929j62914n46595m52044r2205R9079m3251k89661l19631p1215
39551a067662K32323L48326K46874Q8377K5207N5988P2502K4272k2861k9815r9976
39540a26445l11383m74234k87879J84425M50024J99970k15849k25321J80663M66051
$$ plain form
39612 -587483 -1157011 -1272127 -832714 -306933 -29721 209485 665166 1112224 1160489 841749
39602 841749 540631 480208 559721 602423 528025 358285 217918 214118 208780 -53191 -441677
39591 -441677 -425092 147280 636831 463975 21574 91807 585539 693021 274441 152879
39581 152879 723220 1191275 825417 217896 402646 1164935 1276583 346620 -579337 -541589
39571 -541589 61271 248378 -104350 -301468 -17399 280878 154607 -134258 -48106 440846
39561 440846 810775 647861 101266 -350778 -442983 -343904 -387155 -676816 -996447 -1067662
39551 -1067662 -835339 -487013 -240139 -151762 -126555 -70567 1935 26207 3346 -26469 -126445
39540 -126445 -437828 -912062 -1199941 -1015516 -565492 -365522 -581371 -806692 -626029 -159978
39530a59978L21781Q982j55950k35901l66993l88006j18977K43100L77438L13405
39520a61099K81609K44972Q588k84498k46573J30271L91282K60329m9308k78737
39510B96836m33545m77281j98627L17602N39789K14634j50595k2249K82823P4630
39500D44017n57719p83936k41989M60833O43077L70408Q9434p2779k35964l23742
39490b08360j46614K11299M57668M87663M22816K97575L749m09272o35947m63269
39480A7308q5265J01824k806q4055J09252L08406K6738o56024r68980l84978N69578
39469a049002Q59925K21689n39966n76144Q9491P95195J008835O64214O8178k83380
39459A259035p9043L72855L61541l06861r17750p38350q807M38994L39441J58307
$$ plain form
39530 -159978 161803 170785 14835 -221066 -588059 -976065 -1095042 -851942 -474504 -161099
39520 -161099 120510 365482 374070 89572 -157001 -26730 364552 624881 575573 296836
39510 296836 -136709 -613990 -812617 -495015 44774 259408 108813 86564 369387 444017
39500 444017 -113702 -897638 -1139627 -678794 -35717 334691 424125 351346 115382 -208360
39490 -208360 -354974 -143675 313993 801656 1224472 1522047 1525796 1116524 480577 17308
39480 17308 -67957 33867 31061 -52994 56258 364664 391402 -264622 -1233602 -1618580 -1049002
39469 -1049002 -189077 32612 -507354 -1083498 -994007 -198812 810023 1474237 1542415 1259035
39459 1259035 1179992 1552847 1914388 1607527 689777 -48573 -57380 381614 721055 879362
39449H79362J52185k4140n32051q09363l30766M74359O81791J29574l89893k82803
39439e1745P5171N2047k05471l2505O00694Q63322K24106o75900p85092k2727
39429D1900O44752M82110j86777n88875m73342j41612J54531L83905M44617J85803
39419I47012k17887l12131L6148L75347K47577j70081k95034P3192M93563M52346
39409A630052m3665n44505o59820l63030Q8026M04062M90803M86144N11033M19710
39399B418810K0925m36342l83666K44001P16351M50079j22475k12714R3669O0297
39389B848935l73520m56728M0766L68710O5144k89745j79514o6379m00570o06236
39379I50863r6352M56660J09409o65707o76453j4469J61451l16402m20247J14429
$$ plain form
39449 879362 1031547 1007407 475356 -334007 -664773 -190414 491377 620951 231058 -51745
39439 -51745 23426 75473 -129998 -162503 438191 1301513 1525619 849719 64627 41900
39429 41900 686652 1168762 981985 393110 -80232 -221844 -67313 316592 761209 947012
39419 947012 729125 416994 453142 828489 1076066 905985 610951 684143 1177706 1630052
39409 1630052 1586387 1041882 382062 19032 107058 511120 1001923 1488067 1999100 2418810
39399 2418810 2439735 2003393 1619727 1863728 2580079 3030158 2907683 2694969 2788638 2848935
39389 2848935 2475415 2018687 2059453 2428163 2493307 2203562 2024048 1957669 1557099 950863
39379 950863 854511 1311171 1420580 754873 78420 63951 225402 -91000 -511247 -396818
39369c96818L13408j62423l35913K34817N31006p9913n72204r035P71716O04705
39359H99346r30J22151O60304M08828n51725r91944n92560k37043k92272j34649
39349g10494M50481P70169M19064j49374m77962n43606k60367M14957Q61906M20582
39339A195356l51992l18344L15298K13401p27563r51083J95127J175424O10216
39330A355840n70082o86571J03578L35064l59579r12145n97182J51767O34046
39321e45264N90558Q2180n38206o54259p0217N41775M90861K3350k08730j69817
39311d57769j60353j0946N05782Q71071M60936l10589n36802k41549j52871l01351
39301c34441r9012L00255J02784n63956o10595J76996O56360K04192k81159L021
$$ plain form
39369 -396818 -83410 -245833 -581746 -346929 184077 104164 -468040 -477075 294641 899346
39359 899346 898416 1020567 1680871 2089699 1537974 546030 -46530 -283573 -575845 -710494
39349 -710494 -260013 510156 929220 779846 301884 -241722 -502089 -87132 774774 1195356
39339 1195356 843364 525020 840318 1053719 326156 -624927 -429800 745624 1355840
39330 1355840 785758 99187 202765 537829 178250 -733895 -1331077 -1179310 -545264
39321 -545264 45294 127474 -410732 -1064991 -1135208 -593433 -102572 -79222 -287952 -457769
39311 -457769 -618122 -629068 -123286 747785 1208721 898132 361330 119781 -33090 -334441
39301 -334441 -433453 -133198 -30414 -594370 -1204965 -1027969 -371609 -167417 -448576 -445555
39291d45555M03249N5339n58464m58109J88993M56794J74955p8614j35267k92559
39281f89238m38282j61400L51592M77993J84049J0813O4788o5958l40685j70247
39271g76575M88254Q46437M66511o5711j17259M4732j24602m30089k58416L55517
39261D28799O69803K50764m31722n71722K5367O95508O23336k18483r92545j008942
39251e29837n60994l64165m16560j13762N37477P06352O0407n27911j99994O01825
39241h07162Q08172K49207k79195k32853J37156L49965J79486l30853p97860o20851
39231a344788K60266R79053P71823Q8986j34430K3661j89490n77262j47585R25122
39221F55356J070089k61106j400873p99326O22932Q63861k23306r65694m79633
$$ plain form
39291 -445555 -42306 13033 -545431 -1003540 -814547 -357753 -182798 -261412 -396679 -689238
39281 -689238 -1127520 -1288920 -937328 -459335 -275286 -264473 -199685 -265643 -606328 -776575
39271 -776575 -288321 558116 1024627 958916 841657 886389 761787 331698 73282 428799
39261 428799 1098602 1349366 917644 345922 371289 1066797 1690133 1471650 479105 -529837
39251 -529837 -1090831 -1454996 -1871556 -1985318 -1447841 -741489 -681082 -1208993 -1408987 -807162
39241 -807162 1010 250217 -28978 -261831 -124675 225290 404776 73923 -723937 -1344788
39231 -1344788 -1084522 -105469 666354 755340 620910 644571 455081 -122181 -269766 655356
39221 655356 1725445 1464339 63466 -735860 -112928 750933 527627 -438067 -917700
39212i17700L33127M66394J16089n9772N1468J93505J97648n1895n12696o98978
39202h82810j51958P10267R42345L87499j46210j77221j27499l26764l83343l1635
39192a87329K58766J27977O681K74051M57391O1559m41984l58555K0832l4981
39182A84408l21599j2245P70375Q82060j10838j148415j097995j93867N03055
39173e45061N30533K86518J82022J61276M2959j16164j43182k3267Q5298N6368
39163E17300o3612j44993j62310j97863k47226j63989J13891M11464N09371L83026
39153I55059J48595r3794k49974k34486j29615j53634k93850k01032K81890P01994
39143G31153M90389k23450o98079n04220J737K36109J08211k3820P1741K31872
$$ plain form
39212 -917700 -584573 -118179 -2090 -61862 -10394 183111 380759 328864 -183832 -882810
39202 -882810 -1034768 -324501 617844 1005343 859133 681912 554413 227649 -155694 -187329
39192 -187329 71437 199414 206095 480146 937537 999096 557112 198557 219389 184408
39182 184408 -137191 -149436 620939 1502999 1392161 243746 -854249 -1048116 -545061
39173 -545061 -14528 271990 454012 615288 658247 542083 398901 375634 460932 517300
39163 517300 453688 308695 146385 -51478 -298704 -462693 -348802 62662 572033 955059
39153 955059 1103654 1009860 759886 525400 395785 242151 -51699 -252731 29159 731153
39143 731153 1221542 998092 300013 -204207 -202470 33639 141850 118030 189771 421643
39133D21643K08144M8278J2939J60767K40813R9601n3582l5047p7788l94861n65079
39122F5828k8638Q27157R10993J2153p16747l86352L26827K96989k90147l30768
39112F87295M09736J025964R26305N02753K11451m4107l06715k00990L69954Q23356
39102D405002O72213K14582M5695L13237Q03528J321608J622708J417021Q66885
39093A1682479O71584J178641J747346J515997N59347k54140m23923l13195m92595
39084A5871541j036897j576556j752471j514630j134108r46383r73799q78368
39076F058329m37756O1303J48952j91941n18561n58202n08514n73851n27377p3766
39066B878616N07499N47632o7790n78093l23460K84932L24892k58584n58238j05603
$$ plain form
39133 421643 629787 678065 691004 851771 1092584 1192185 1138603 1103556 1025768 630907 65828
39122 65828 37190 864347 1775340 1787493 1070746 684394 1011221 1308210 1018063 687295
39112 687295 1097031 2122995 3049300 3552053 3763504 3719397 3412682 3211692 3581646 4405002
39102 4405002 5077215 5291797 5337492 5650729 6454257 7775865 9398573 10815594 11682479
39093 11682479 12354063 13532704 15280050 16796047 17355394 17101254 16677331 16364136 15871541
39084 15871541 14834644 13258088 11505617 9990987 8856879 7910496 6936697 6058329
39076 6058329 5620573 5681876 5830828 5638887 5120326 4562124 4053610 3479759 2952382 2878616
39066 2878616 3386115 3933747 3865957 3287864 2964404 3249336 3574228 3315644 2757406 2651803
39056B651803M15578K83144j38931q1681L31721L27150k29921o53203n11152j14918
39046B279590J23376J41242k4972k96118l16298J69619O79506M77912k47806n34142
39036B451909j08645K12827j11719n42615m74972j55601Q211K04097N61967N24179
39026B569638k71271j086571r69836j15321M97210M57602J32918j30454k26226
39017H57689j8496L93685M52528r1369n62866k86057L17617M48470K68373M27534
39007B207108O67775K30442n36272m51808N10186R73607K60943o34980p32053
38998B494948m13132l46288k32376L80572R50200P08662j6973k78425Q3643L96114
38988C726945K43257j75630n60793p24932n09426n9033Q6603k85304n83406k36508
$$ plain form
39056 2651803 3067381 3350525 3211594 3129913 3461634 3788784 3558863 2905660 2394508 2279590
39046 2279590 2402966 2544208 2519236 2223118 1906820 2076439 2755945 3233857 2986051 2451909
39036 2451909 2343264 2556091 2444372 1901757 1426785 1271184 1279395 1483492 2045459 2569638
39026 2569638 2298367 1211796 241960 126639 623849 1081451 1214369 1083915 857689
39017 857689 839193 1232878 1685406 1594037 1031171 745114 1062731 1511201 1779574 2207108
39007 2207108 2874883 3105325 2569053 2117245 2627431 3601038 3861981 3227001 2494948
38998 2494948 2081816 1735528 1503152 1883724 2833924 3542586 3525613 3247188 3330831 3726945
38988 3726945 3970202 3794572 3233779 2508847 1999421 1940388 2026991 1741687 1158281 921773
38978I21773L75867M87228J06560j27260j2005O7558p5144k20076k59510k85925
38968I79066k25794L8090K98923L29940L24707M27028J94704o31379j203203n47908
38958a5826P02493Q94701k12764r98038l90705O31055P13305P5250k45805j33455
38948A020211j75463l58608k01357J80834K54888P7695J12436K45860P301l79933
38938G83864k30228L52190N28051J24279q9984K41096M70325R3632m59731o44730
38928A168764n50618l57222Q7232N82492L75683o01131j131309l01549R97045
38919B69387J245979M58114o6266J61962L25952n2433l22105K1525M02674J64790
38909B609579l47847m44444j87169o4743l9103K42814N43305K19061o55923j134046
$$ plain form
38978 921773 1297640 1784868 1891428 1764168 1752163 1819721 1744577 1524501 1264991 979066
38968 979066 753272 791362 1090285 1420225 1744932 2171960 2366664 1735285 532082 -15826
38958 -15826 686667 1581368 1368604 370566 -20139 610916 1324221 1399471 1153666 1020211
38948 1020211 844748 486140 284783 465617 720505 798200 910636 1156496 1163797 783864
38938 783864 553636 905826 1433877 1558156 1468172 1709268 2179593 2273225 1813494 1168764
38928 1168764 618146 260924 348156 930648 1306331 705200 -426109 -727658 269387
38919 269387 1515366 1973480 1907214 2069176 2395128 2342695 2020590 2042115 2444789 2609579
38909 2609579 2261732 1817288 1630119 1565376 1526273 1769087 2312392 2531453 1875530 741484
38899G41484o44834J79618L66095q3251k92223J67435O55999M26230k48131m50070
38889H18352K5437L61619m1806o40235n50192J37569N20406J99384k53908k10952
38879C65674K21591N13359L68333j18666o03679o60903j70316L72817L51321r4283
38869E45248j98763K73377O33304L35410k08363l81043l39914n53717p98388m59949
38859a152798L34830P39380M05658n4854l7433K53119K93276N0211j18433q7822
38849F25134p0664j87845k53885m4419L60039N63729K22093n25222j049759q24660
38839a185459k6176O21640O42503K77253P4754J81057K24961j13835o00807o50171
38829e54280l3386P48691R47217L95444l15513n41807k83103l4589r5488k65129
$$ plain form
38899 741484 96650 276268 642363 559112 266889 434324 1090323 1516553 1268422 818352
38889 818352 843789 1205408 1163602 523367 -26825 110744 631150 830534 576626 365674
38879 365674 587265 1100624 1468957 1350291 746612 85709 -84607 288210 639531 545248
38869 545248 346485 619862 1253166 1588576 1380213 999170 659256 105539 -692849 -1152798
38859 -1152798 -817968 -78588 327070 272216 234783 487902 781178 831389 712956 625134
38849 625134 554470 366625 112740 68321 428360 992089 1214182 688960 -360799 -1185459
38839 -1185459 -1211635 -589995 52508 329761 404515 585572 810533 696698 95891 -554280
38829 -554280 -587666 161025 1108242 1503686 1188173 646366 363263 328674 233186 -31943
38819c1943k17670M3654K31072J71515k370q8231q8598r8095k4442K82131O00241
38808G77264M38184k11665o15602k14591N12038O53234J34374k82719k00065m2481
38798I47971j96459m10471l37149p3814J47223K85450K54196q4825m46092k82124
38788a96094K91992M69969K4508k29008K25323O90686M33222j02685k02985j81675
38778A223253n95053q80191k13716P51128O18790m50436q53293q3198N28312O4240
38768A09836n86854l77958K40438L27556K3357k394J48832j9113l10244k07366
38758f53910Q9143J1017k90531j87965K73191M16908R2750q5720K36482O43767
38748E45132O60115L70117Q7393j33548l82975n91135n72047k43413K79078P09727
$$ plain form
38819 -31943 -249613 -205959 25113 196628 194258 106027 17429 -80666 -105108 177023 777264
38808 777264 1215448 1003783 388181 173590 685628 1338862 1473236 1190517 990452 947971
38798 947971 751512 341041 3892 -69922 77301 362751 616947 532122 86030 -196094
38788 -196094 95898 565867 590375 361367 586690 1277376 1710598 1607913 1404928 1223253
38778 1223253 628200 -251991 -465707 285421 904211 453775 -399518 -482716 45596 109836
38768 109836 -477018 -854976 -614538 -286982 -263625 -266019 -117187 -136300 -446544 -653910
38758 -653910 -564767 -553750 -844281 -1032246 -759055 -342147 -249397 -335117 -98635 545132
38748 545132 1205247 1575364 1662757 1529209 1146234 555099 -16948 -260361 18717 728444
38738G28444P48532L54321j70271m71883m49833k12184Q0456K19635M5143k79384
38728E92976l24271N3827M41091L81970n3393m60564o27290n81410l26276J28130
38718g75210N85570Q08899P71860N63196J84837l18369o71412n91270j48246K87961
38708F97816M22133K44895l6451j91584j85944k12556l63655l76282j7098L83937
38698C65211K72916k51876m86380j68262J53050L9385j95669j50481j7556r7947
38688e37609j73232N5006L26313K19693j27579k40146J4381L96476O51608N54027
38678A138938J2753n39195m39266J34314J49243o63139j099935k79201P89917
38669g95571O75621k02144l14241M40325O99869M5635l77485N4881M63060J76036
$$ plain form
38738 728444 1476976 1831297 1661026 1189143 739310 527126 607582 827217 872360 592976
38728 592976 268705 322532 763623 1145593 1092200 631636 4346 -577064 -903340 -775210
38718 -775210 -189640 619259 1391119 1954315 2139152 1820783 1149371 558101 409855 697816
38708 697816 1119949 1364844 1328393 1136809 950865 738309 374654 -1628 -18726 365211
38698 365211 638127 386251 -100129 -268391 -115341 -75956 -271625 -422106 -439662 -537609
38688 -537609 -710841 -655835 -329522 -109829 -237408 -477554 -463173 -66697 584911 1138938
38678 1138938 1151691 612496 173230 307544 456787 -206352 -1306287 -1585488 -795571
38669 -795571 -119950 -322094 -636335 -196010 503859 549494 172009 226890 689950 865986
38659H65986j26269J70538M21934j2744m55437m3196O96355O49173j10384n65073
38649A490883l80723j26884r6835j3485J37056j303l18632j90458M97168J007985
38639B004772P50536M1871m44817n28738m50187l02016N170L12572J90483m60998
38629A118648j025440p58019J90654P46879K25690o82498p87188k3889N62834
38620d32329M30326J91015L69285M79791j962n50160l65341K92275N19447K03034
38610A135381L2980K10698J76921k58590m87805j41554K64207J98177l5219Q9134
38600A184330L38582P0035o52981r88648m45762M39219P98830M78955O5657K5875
38590A314092K04963K45745J49184J28326J27965p1659l10316j13549N20291Q68261
$$ plain form
38659 865986 739717 910255 1332189 1319445 864008 820812 1517167 2166340 2055956 1490883
38649 1490883 1110160 983276 886441 872956 1010012 1008709 690077 499619 996787 2004772
38639 2004772 2755308 2797179 2352362 1823624 1373437 1071421 1076591 1389163 1579646 1118648
38629 1118648 93208 -664811 -474157 272722 498412 -184086 -971274 -995163 -432329
38620 -432329 -2003 189012 558297 1038088 1036126 485966 120625 412900 932347 1135381
38610 1135381 1168361 1379059 1555980 1297390 809585 668031 932238 1130415 1095196 1184330
38600 1184330 1522912 1592947 939966 -48682 -494444 -55225 743605 1222560 1288217 1314092
38590 1314092 1519055 1764800 1913984 2042310 2170275 2098616 1788300 1674751 2195042 3063303
38580C063303L85938m64695p43325k17115M29060N14115Q3261l35250l68577q6750
38570B259965J55143Q5418j94811l31256j78248K9341P3685N6560Q9249o276l31262
38559A707508n36236k98524M1089q9089n21994m93310J65356O63255L74367k56544
38549G55878l82103P5987M45992L00771o9880j84098J9966K29552K04825K0180
38539A417070r3160k9283J31691K94838M29903M36950J45965l77724p28702o27451
38529A000097l20755j88635j29243J99611O32294N98968O2483k80529m279M16995
38519A987007L86354P6120j721Q9495q6691m30643l55203K09795N52312J74779
38509B601604m78395o56521k83088J27308K85526L65750M75347L75245q8338o03729
$$ plain form
38580 3063303 3449241 2984546 2241221 2024106 2453166 2967281 3050542 2715292 2346715 2259965
38570 2259965 2415108 2500526 2305715 1974459 1796211 1825552 1899237 1955797 2045046 2038770 1707508
38559 1707508 1171272 872748 913837 824748 302754 -190556 -25200 638055 1012422 755878
38549 755878 373775 449762 895754 1196525 1126645 942547 962513 1192065 1396890 1417070
38539 1417070 1323910 1294627 1426318 1721156 2151059 2588009 2733974 2356250 1627548 1000097
38529 1000097 679342 490707 361464 561075 1193369 1792337 1854820 1574291 1570012 1987007
38519 1987007 2373361 2449481 2447760 2537255 2450564 2019921 1664718 1874513 2426825 2601604
38509 2601604 2123209 1466688 1183600 1310908 1596434 1962184 2437531 2812776 2724438 2120709
38499B120709p25971m24633l7447K09050L31071L04652M6660k44212j54680K96508
38489A721707M79803J2030n47789m05081K82433N92269J82378k71109j57335K33955
38479B123261L19881R4100p6900r0308o0675P718M9470j96839o73426p66145j82849
38468E47288L49145N4948n47508k90280P50595J157379K48200q37248p48775K32443
38458I16187P74184L43469l91331p00341n14326j10754K21278J95927k15842n20602
38448b151j94719N31123Q64862M79653j26257l76954k53433m0306J13226J63302
38438A158346O4812q2464o9223P6958Q2874r1696j32355P9324J99794J726j80183
38427A107913O208K73246J06623l59550m59643K5679N29692M53694j32374o75781
$$ plain form
38499 2120709 1394738 970105 932658 1141708 1472779 1777431 1824091 1579879 1425199 1721707
38489 1721707 2201510 2213540 1665751 1260670 1543103 2135372 2317750 2046641 1889306 2123261
38479 2123261 2443142 2537242 2460342 2370034 2309359 2317077 2366547 2169708 1496282 730137 547288
38468 547288 896433 951381 403873 113593 864188 2021567 2269767 1432519 683744 916187
38458 916187 1690371 2033840 1642509 942168 427842 317088 538366 734293 518451 -2151
38448 -2151 -196870 334253 1199115 1678768 1552511 1175557 922124 881818 995044 1158346
38438 1158346 1223158 1140694 1071471 1148429 1231303 1139607 1007252 1086576 1286370 1288096 1107913
38427 1107913 1114121 1387367 1493990 1134440 674797 700476 1230168 1683862 1551488 875707
38417H75707p22607k24728M35770O58426J84250m77201n42796J9212M01521J02220
38407G09774l50334k34562K45848L15215j32628l84417m3917L73109K56527k25834
38397E28781m81961l57444j83348j59075j41917j2147J33663K11476K85611L78645
38387B02284L52531R9257k67955n10772m97550k91050m5668J45594K96760M21077
38377i5492M37331K88784J20250J49696L31496L65278J26154j46938k13578j22327
38367A240654J4414K15651L69525J51157m28597p58071m02817J80855L13854J59337
38357A055962L31673O64545L81720m62612q12113k15226M30994K99450j44993
38348A529400p8404L42846M62600L01115K92552L33546O5561k72746k42442j13355
$$ plain form
38417 875707 153100 -71628 364142 1022568 1206818 729617 186821 206033 607554 709774
38407 709774 359440 124878 370726 685941 553313 168896 124979 498088 754615 528781
38397 528781 46820 -310624 -493972 -653047 -794964 -807111 -673448 -461972 -176361 202284
38387 202284 554815 654072 386117 -124655 -622205 -913255 -958923 -813329 -516569 -95492
38377 -95492 341839 630623 750873 900569 1232065 1597343 1723497 1576559 1362981 1240654
38367 1240654 1255068 1470719 1840244 1991401 1562804 804733 401916 582771 896625 1055962
38357 1055962 1387635 2052180 2433900 1971288 1159175 943949 1374943 1674393 1529400
38348 1529400 1450996 1793842 2256442 2557557 2850109 3183655 3249216 2976470 2734028 2620673
38338B620673l68045o23208j87154N39923N09344j99764m44512M542N7298o79171
38328A229926j005109r0649J004167R09874N657l87611r5606K5946j85332n7991
38318A353272M37415M46336l04997r28723o66398J01617N82128O12206M92421
38309B125277L18524K8801j91663o8002K91233M42728J53930l15778n37618l94868
38299A852564j39340k641P2230J93539K18463L699j68233J08890O16759O35039
38289C390969K735n30858l62586J21364K40371L5100m2700l4737l00995o65165
38279A853498n39801J00127N77086M69575J30191N4304J92066J43390k31842o11817
38269B136777n46378L6052O41549O86745K02693k28631l10971l43212n08345m62268
$$ plain form
38338 2620673 2252628 1629420 1442266 1982189 2491533 2291769 1847257 1851799 1909097 1229926
38328 1229926 224817 134168 1138335 2048209 2053866 1666255 1570649 1596595 1411263 1353272
38318 1353272 1790687 2237023 1932026 1003303 336905 438522 1020650 1632856 2125277
38309 2125277 2443801 2472602 2280939 2212937 2504170 2946898 3100828 2785050 2247432 1852564
38299 1852564 1713224 1710583 1782813 1976352 2194815 2198514 2030281 2139171 2755930 3390969
38289 3390969 3393704 2862846 2500260 2621624 2861995 2897095 2854395 2819658 2518663 1853498
38279 1853498 1313697 1413824 1990910 2460485 2590676 2644980 2837046 2980436 2748594 2136777
38269 2136777 1590399 1626451 2268000 2954745 3157438 2928807 2617836 2274624 1766279 1304011
38259A304011k6577L32665K69507J83973M12299M55509r1027m73777J74112J161500
38249C702195R93931l35981j240470q53185n0714K14972K46863N95417Q77245
38240D150273M97801k40649o16461n31694l62290k21301j2842J39871O5110j33499
38230B734319k85053l60861k54987J75216O44604O08856J40605n1415K22272K65203
38220C838759k69296o45777k24445M10554L47739k26954m10001K3333M71217M94643
38210C809772J97688j84416m42365l48761R564J48979p7742j08223M07317Q58777
38200D270590N84580j0142j28420J00925J266l29228k23698K25641K60480j33942
38190D618052j34133M33812P03663K24900k98095k30893L4447j0880k9303M11696
$$ plain form
38259 1304011 1277434 1610099 1879606 2063579 2475878 2931387 2840360 2366583 2540695 3702195
38249 3702195 4696126 4360145 3119675 2266490 2215776 2430748 2677611 3273028 4150273
38240 4150273 4648074 4407425 3790964 3259270 2896980 2675679 2662837 2802708 2867818 2734319
38230 2734319 2449266 2088405 1833418 2008634 2653238 3262094 3402699 3351284 3573556 3838759
38220 3838759 3569463 2923686 2699241 3109795 3457534 3230580 2820579 2843912 3315129 3809772
38210 3809772 4007460 3823044 3380679 3031918 3041482 3190461 3112719 3004496 3411813 4270590
38200 4270590 4855170 4845028 4716608 4817533 4818799 4489571 4265873 4491514 4751994 4618052
38190 4618052 4483919 4917731 5621394 5846294 5548199 5317306 5351753 5340873 5311570 5723266
38180E723266Q37643N34211k34537n71578k58813J10188J86923K36663L91359
38171F955325L01826j77058n35316k60134M07339P81178O01181J98192j11052
38162H161481l54251n52749m59639O1897O44555P59649L72771n2272j60240j055
38152H420147K53187N07620N93699L11367k01416m69530k66765O7069J02442j35918
38142I181902l10576k26867N5125L53917M48548K57394O3596K68044P80717J020611
38132A1892411P08592K54776J11655J84343K14022K94004N61871P66158O33248
38123A5621080L51710K16685J20188q8541q6526M32364J010309R06381K30282
38114A8713932j29097K49329Q12777R26214O69726M75646M39816L55575J73478
$$ plain form
38180 5723266 6560909 7095120 6860583 6289005 6030192 6140380 6327303 6563966 6955325
38171 6955325 7257151 7080093 6544777 6284643 6691982 7473160 8074341 8272533 8161481
38162 8161481 7807230 7254481 6794842 6856739 7501294 8260943 8633714 8581442 8421202 8420147
38152 8420147 8673334 9180954 9774653 10086020 9884604 9415074 9148309 9215378 9317820 9181902
38142 9181902 8871326 8644459 8699584 9053501 9502049 9759443 9823039 10091083 10871800 11892411
38132 11892411 12601003 12855779 12967434 13151777 13365799 13659803 14221674 14987832 15621080
38123 15621080 15972790 16189475 16309663 16221122 16134596 16566960 17577269 18483650 18713932
38114 18713932 18584835 18834164 19646941 20573155 21242881 21718527 22158343 22513918 22687396
38105B2687396R2778K66626O25527J002413J306768J487299J384487Q61424K14750
38096B9929468J42688R09239J771653J802433J145889P76293J079828J519098
38088C9076589J743893K017702K305652K071407J457129J502772K499629L290080
38080E5964853L093437K835135L495905M299392M059085L377735L712755M883750
38072H5722047N445174N238232N580315O864253P891260P953576P857447Q361816
38064A40914120R143386R872310J0854686J1984419J2465538J2284221J2604943
38057B20123623J3902465J4993564J4833312J4046067J3622277J3205709J1888328
38050C16615345R836370P865866O003815L637915O86042k365698n211059p666296
$$ plain form
38105 22687396 22780174 23046800 23672327 24674740 25981508 27468807 28853294 29714718 29929468
38096 29929468 30072156 30981395 32753048 34555481 35701370 36477663 37557491 39076589
38088 39076589 40820482 42838184 45143836 47215243 48672372 50175144 52674773 55964853
38080 55964853 59058290 61893425 65389330 69688722 73747807 77125542 80838297 85722047
38072 85722047 91167221 96405453 101985768 108850021 116741281 124694857 132552304 140914120
38064 140914120 150057506 159929816 170784502 182768921 195234459 207518680 220123623
38057 220123623 234026088 249019652 263852964 277899031 291521308 304727017 316615345
38050 316615345 326451715 334317581 340321396 343959311 344645353 342279655 337068596 329402300
38042C29402300r331871j0188694j1068030j2584548j3994347j4109850j3072968
38035B45051992j2193064j2133575j2254715j1833103j1031787j0359477r815267
38028A65431004q998742p814997o770984o502903o960739p188188o281998m580948
38020A10331505l377660l299938l595422l318883k549743j921959j553902j133670
38012H9580328o67219m37854m23045l31302j02458O5208P2740q227p2538L132
38002H7678765K40561L47581o440o39484j091875j441589k151093k994912l121712
37993G6819802k545725k484551l533547m539259m233560l106963k521748k648827
37985E1205622k575606k057532j811379k108457k271670j809810j165939j006053
$$ plain form
38042 329402300 320070429 309881735 298813705 286229157 272234810 258124960 245051992
38035 245051992 232858928 220725353 208470638 196637535 185605748 175246271 165431004
38028 165431004 156432262 148617265 141846281 135343378 128382639 121194451 114912453 110331505
38020 110331505 106953845 103653907 100058485 96739602 94189859 92267900 90713998 89580328
38012 89580328 88913109 88475255 88052210 87720908 87618450 87683658 87756398 87748171 87675633 87678765
38002 87678765 87919326 88266907 88260467 87620983 86529108 85087519 82936426 79941514 76819802
37993 76819802 74274077 71789526 68255979 63716720 59483160 56376197 53854449 51205622
37985 51205622 48630016 46572484 44761105 42652648 40380978 38571168 37405229 36399176
37977C6399176j328760j569278j319078q15361p23941j255012j625789j004167
37969B6757790O7318J87816p53736j228779m55019L01574j43843q78779n26966
37960B3327376L04432J23988p36178o65824L74252P68914K4197n19556r1113L91134
37950B3301622J85122j05371L2410O4001k74156k25972M92499Q80474L46320j28286
37940B4568663L55868J049333R14997M35503O34491J210985J196696Q07460J029276
37931C2203272J737358J818009J078872N73686Q88141J389078J443354J246145
37923D2377915J078038P44921K01953j31476j68449n00000j395130k130287j972241
37914C8105244j311789j092805j456242j727355j607067j567775j927957k232955
$$ plain form
37977 36399176 35070416 33501138 32182060 31366699 30642758 29387746 27761957 26757790
37969 26757790 26825108 27012924 26259188 25030409 24575390 24876964 24733121 23854342 23327376
37960 23327376 23631808 23755796 23019618 22353794 22728046 23496960 23521157 23001601 22910488 23301622
37950 23301622 23486744 23381373 23413783 23477784 23203628 22977656 23470155 24350629 24696949 24568663
37940 24568663 24924531 25973864 26888861 27324364 27958855 29169840 30366536 31173996 32203272
37931 32203272 33940630 35758639 36837511 37411197 38299338 39688416 41131770 42377915
37923 42377915 43455953 44200874 44402827 44271351 44102902 43602902 42207772 40077485 38105244
37914 38105244 36793455 35700650 34244408 32517053 30909986 29342211 27414254 25181299
37906B5181299j928225j180167n95805m38042n60899q72349j319093j531219j104790
37897A5650710l17607K1476l62660q41756q47134o30679o53887p74157o32138
37888A0612168m08641m85682o51911m16182M8521P6516l92732o76296m18957n9177
37878G227627r328o5196M1671J14819n9894k17045l4139K70254K17050k24471
37868G261348n82816m82824n7299K21942J7087n26848q88079p07663j75189K50947
37858D330606L86239L60874K51074n181l62577o28549o57098l90812J48719O77352
37848D110647P01796J27203m20066l23038J83257L92614J31855j91825l48455
37839D363988m20419l16767J06229M87132K96597k35987l27792J24774L54049
$$ plain form
37906 25181299 23253074 22072907 21477102 21039060 20478161 19605812 18286719 16755500 15650710
37897 15650710 15333103 15354579 14991919 14150163 13303029 12672350 12018463 11244306 10612168
37888 10612168 10203527 9717845 9065934 8649752 8698273 8774789 8382057 7705761 7286804 7227627
37878 7227627 7218299 7153103 7194774 7309593 7249699 7032654 6998515 7268769 7485819 7261348
37868 7261348 6678532 6195708 6138409 6360351 6377438 5850590 4962511 4254848 4079659 4330606
37858 4330606 4716845 5077719 5328793 5323612 4961035 4332486 3675388 3284576 3433295 4110647
37848 4110647 4812443 4939646 4519580 4196542 4379799 4772413 4904268 4712443 4363988
37839 4363988 3943569 3626802 3733031 4220163 4516760 4280773 3952981 4077755 4431804
37830D431804k1884m00027k37708P0700q8098n16094m94113J94266R88197J160492
37820E087535M82944n56110j131918q95333l45484j19774j56958n2380P2879j68850
37810B216551n02287k66376L92298O01722J68401j14442J89093N12868L48491
37801C546319q910j95733l46305m84511k58739K50442L72639k3241j94698J77625
37791B834888L97584N0759k19127L1501J58701k89152n45224J8908N85474K29348
37781C253660l97875j85831M38553K64825n11840n78568K72362Q71935O08387
37772D035608J05747j39107l70802o10285l98913J75524L66029l224k58947q8485
37762B813145M7315l7994O8421L26157N0484p38370r42651m9251Q77345O99649
$$ plain form
37830 4431804 4409920 4009893 3772185 3842885 3754787 3238693 2744580 2938846 3927043 5087535
37820 5087535 5570479 5014369 3882451 2987118 2641634 2521860 2364902 2312522 2385401 2216551
37810 2216551 1714264 1447888 1840186 2441908 2610309 2495867 2684960 3197828 3546319
37801 3546319 3537409 3341676 2995371 2510860 2252121 2502563 2875202 2851961 2657263 2834888
37791 2834888 3232472 3283231 3064104 3095605 3254306 2965154 2419930 2438838 3024312 3253660
37781 3253660 2855785 2669954 3108507 3373332 2861492 2282924 2555286 3427221 4035608
37772 4035608 4141355 4002248 3631446 3021161 2622248 2797772 3163801 3160577 2901630 2813145
37762 2813145 2860460 2822466 2890887 3217044 3267528 2529158 1586507 1537256 2414601 3114250
37752C114250j58313n09931j68259R9241l2214j06815J34685K81284o7701o67463
37742A918764r11602n38054R7519M31093L25255J59591K04753J99025j23599m01225
37732A361520j33591L78927L43066k63807n49289m5513N80734N54094O5382j94387
37722B097136o9570N7460k3328j67680k44331k67940k33047r1533J33625L27424
37712A518216L12119n6080o12276q08926k89655N04413P44738K48297l60391n39067
37702F61388l51949m5266L03037N44731M47418J29171k5780m3827l31411p83237
37692E04275o87091J06436O91519L52060l67454n14006r1583J95514J47623J78369
37682E15662M23901N27196K84253j06616m32207o09307n12304j36858J47152o436
$$ plain form
37752 3114250 2955937 2446006 2277747 2376988 2344774 2237959 2372644 2653928 2586227 1918764
37742 1918764 1007162 469108 566627 997720 1322975 1482566 1687319 1886344 1762745 1361520
37732 1361520 1227929 1606856 1949922 1686115 1136826 1091313 1672047 2226141 2291523 2097136
37722 2097136 2027566 2085026 2061698 1894018 1649687 1381747 1148700 1057167 1190792 1518216
37712 1518216 1830335 1774255 1161979 353053 63398 567811 1312549 1560846 1200455 661388
37702 661388 309439 264173 567210 1111941 1559359 1688530 1662750 1618923 1287512 504275
37692 504275 -182816 -76380 615139 967199 599745 85739 -5844 189670 337293 515662
37682 515662 939563 1466759 1751012 1644396 1212189 602882 90578 -46280 100872 94436
37672I4436l34826k61192K67770P11741O90704L63024N2256p5939M2054L30576
37662A880604M61606J67928l25247n62459n10607m93652m99837j31538O09147
37653E95945J052062P02761n1978m44482k47920J51289L83628M12480L00725J8118
37643B872628m31446q67673j015921p12391n5829O04090Q80380O30980O5398m02012
37633A568204m24869Q316M75827M33802j71688p01081m97628K69044P50594M57886
37623B168407j83365m63256k57646q00r533j73712k49452j50281R0068M02852
37613A173282O30150N48590J01685m25771n93526k48595K44757L45826k1028l23207
37603A432163j17511K68136J53526m13690n74050P5058P14191M03507m68631o85178
$$ plain form
37672 94436 -240390 -501582 -233812 477929 1168633 1531657 1583913 1507974 1550028 1880604
37662 1880604 2342210 2510138 2184891 1622432 1111825 618173 118336 -13202 595945
37653 595945 1648007 2350768 2298790 1854308 1606388 1757677 2141305 2553785 2854510 2872628
37643 2872628 2441182 1573509 557588 -154803 -210632 393458 1273838 1904818 1970216 1568204
37633 1568204 1143335 1151651 1627478 2061280 1889592 1188511 690883 959927 1710521 2168407
37623 2168407 1985042 1521786 1264140 1263340 1253807 1080095 830643 680362 770430 1173282
37613 1173282 1803432 2352022 2453707 2027936 1434410 1185815 1430572 1776398 1755370 1432163
37603 1432163 1314652 1582788 1736314 1322624 748574 823632 1537823 1941330 1472699 787521
37593G87521j3032M68248P0751m51773j67336N14271N07128k08312n63202p3394
37583H70870M62276K28432m39841o76124l48987q4697k24250l46649L8296O78003
37573A57329P85806P5152o95486n40530M49030J108845P05502j09783l22123q430
37563A605312N778l77327l92340K36660P97388P08048K64838r2803m42162q31727
37553A481665q48669l26207J68811J67394J1453J12343J43360k66412o31581l14277
37543c02120L28495M71327J55977Q4730L05661J92407k97986m25867R3589N89129
37533A195342M53691r2847n18716n92094k83974K77764N87185J81357n39642o35185
37523C2881L2010N59483L93158R5504K63281N10818K25166l12695l81201K072
$$ plain form
37593 787521 774489 1242737 1313488 861715 694379 1208650 1715778 1507466 944264 870870
37583 870870 1333146 1561578 1121737 445613 96626 11929 -212321 -558970 -520674 157329
37573 157329 943135 1018287 322801 -217729 231301 1340146 2045648 1935865 1613742 1605312
37563 1605312 1611090 1233763 841423 1078083 1875471 2583519 2848357 2755554 2313392 1481665
37553 1481665 632996 306789 475600 642994 654447 766790 910150 643738 12157 -302120
37543 -302120 26375 497702 653679 738409 1044070 1236477 938491 512624 606213 1195342
37533 1195342 1649033 1556186 1037470 445376 161402 439166 1026351 1207708 668066 32881
37523 32881 64891 624374 1017532 1113036 1376317 1887135 2112301 1799606 1418405 1420477
37513A420477J63717j34054m06140k56474R4373K21674N8226j22763j05820J4461
37503I47677k0640k47289l59831j36498J63844J45941q9911r6537J70944K76776
37493G54476N7735r1761J12567L89614L66463Q0618k43676n18330o45773m46603
37483a84670J4444L83267M84536M62287L58450O7451j75891O4970N68420N00011
37473B543275k86952q08885m01869J88139r283o07306n26694K03557N02659j9607
37463G77034n28602l45364J32815K57062P9889J0426Q8814J02830O3082J12027
37453G50013J66465J9994k84644m51081k99485o037P5444j55642l32271j1542
37443e28786O51088R02913L25615m90662o18158J804N18435L51054j11786k03422
$$ plain form
37513 1420477 1584194 1450140 1044000 787526 881899 1103573 1161799 1039036 933216 947677
37503 947677 927037 679748 319917 183419 347263 493204 403293 306756 477700 754476
37493 754476 812211 720450 833017 1222631 1589094 1669712 1426036 907706 261933 -184670
37483 -184670 -170226 213041 697577 1159864 1518314 1585765 1409874 1474844 2043264 2543275
37473 2543275 2256323 1447438 1045569 1233708 1224425 617119 90425 293982 796641 777034
37463 777034 248432 -96932 35883 292945 372834 383260 472074 574904 637986 750013
37453 750013 916478 936472 651828 200747 -98738 -104775 -29331 -184973 -517244 -528786
37443 -528786 122302 1025215 1350830 860168 242010 243814 762249 1113303 1001517 798095
37433G98095O6376J45526j79798m83627l29459J31799M00288K84236M2238q2041
37423G93633j41924k10273j49455J08955L28163L04229J85900J26443o5321m62679
37413H17671n69265j6565N67992K86705n49003p16980L2732N46618R4757n37674
37403d3012m48200k8577n7947k78196J8519O14519P33108L70042J53513J59288
37393A193057n2251l89215k84452K29854M66343J48151k89379m60287l38136Q5303
37383C08988O47681P06503q5961q83387o07305L20462M78505l02097o50871N8697
37373h785O81722K60399m29699l34922R5082r9868n29084j09490R04528J119840
37363A549723J89918o23429l77654K57197K02482m36359p37218l81274R1675K56221
$$ plain form
37433 798095 864471 1009997 830199 346572 17113 148912 549200 833436 875674 793633
37423 793633 651709 441436 291981 400936 729099 1033328 1219228 1345671 1280350 817671
37413 817671 248406 231841 799833 1086538 537535 -179445 -146713 399905 494662 -43012
37403 -43012 -491212 -519789 -577736 -855932 -837413 -222894 510214 880256 1033769 1193057
37393 1193057 1140806 751591 467139 696993 1163336 1311487 1022108 561821 223685 308988
37383 308988 956669 1663172 1577211 693824 86519 406981 885486 583389 -67482 -8785
37373 -8785 672937 933336 503637 168715 263797 163929 -365155 -474645 429883 1549723
37363 1549723 1739641 1116212 738558 995755 1198237 761878 24660 -356614 -264939 -8718
37353h718L01325M41292L98522j41623q40011r46804k51110O02744Q91219N77020
37343A023856J08242j91085k17892P8708N14971N77979K0669o39566p41524m02570
37333A31788k22668k71884j22336K24287L07370J26197J66324L74759J08722n97735
37323B24824p73691m0666O09934K95037m09360m79304k5302J62766M1697J52457
37313b41608M27714L18959p4960j13298K04966K23529j51071k46447J65559M34023
37303I47366J34681k65324k76579j53653k83199m48231k68711J12545L31199L97688
37293B27782M73433L92334m5332n39742n97130k44087M8977Q7649J31164L41217
37283B76265M89294L44410M1431j09990j2654J49338J41713p5837k89729k51843
$$ plain form
37353 -8718 292607 733899 1132421 990798 150787 -796017 -1047127 -444383 446836 1023856
37343 1023856 1132098 941013 723121 801829 1316800 1894779 1915448 1275882 534358 131788
37333 131788 -90880 -362764 -485100 -260813 46557 172754 339078 713837 822559 224824
37323 224824 -548867 -589533 20401 315438 -93922 -573226 -598528 -435762 -394065 -241608
37313 -241608 186106 505065 430105 316807 521773 745302 594231 347784 513343 947366
37303 947366 1082047 816723 540144 386491 103292 -344939 -613650 -501105 -169906 227782
37293 227782 701215 1093549 1048217 508475 -88655 -332742 -283765 -196116 -64952 276265
37283 276265 765559 1109969 1151400 1041410 1028756 1178094 1319807 1243970 954241 702398
37273G02398k4509J9375k89517n48532k45422M58396Q14136M65047p2301j60499
37263A118572J06829K08955M3143r0711j74695m62432p70901n29897K24612O44345
37253C17820K98121q4291K47768P78132M69168n64220j140469o99438P0163M09739
37243A02493L85038L31977K33052M4766j8930P5668L1698j75928j59502J13041
37233I63373J06296l31376n42853j05423M18317L85677M5311q5892j42394m02385
37223C08651m91246k4612M76012L12333j77004j84371J50124L2958n19206p17336
37213h33697m00765j89694k32213j9998M40021N09744J83015K02960O03257M51412
37203G14042m56074r78538m36694K35843R2894k33130K57084J051391Q74750k04535
$$ plain form
37273 702398 677889 697264 407747 -140785 -386207 72189 886325 1351372 1279071 1118572
37263 1118572 1225401 1434356 1477499 1386788 1212093 749661 -21240 -551137 -326525 317820
37253 317820 615941 531650 779418 1557550 2026718 1462498 322029 -377409 -307246 102493
37243 102493 487531 819508 1052560 1097326 1078396 1154064 1185762 1009834 850332 963373
37233 963373 1069669 738293 195440 90017 508334 894011 939322 853430 711036 308651
37223 308651 -182595 -207207 268805 581138 404134 219763 369887 402845 -116361 -833697
37213 -833697 -1234462 -1424156 -1656369 -1676367 -1236346 -726602 -543587 -340627 262630 714042
37203 714042 257968 -720570 -1157264 -921421 -828527 -1061657 -804573 246818 1121568 917033
37193I17033q17019k98124N35003O84524J28135m69688n40237j6879N82092N56587
37183A261427j06854n46443j50209N38472O21551J05758l53345n29731o01136
37174B39490m27024J68664O51504L55712l27580m00852J64997M29554J00961n7590
37164H97836K99925M34456j44434p19136m49032L44573O81093J95790o22211j047029
37154a28169o34640L98827J111630P50697j42256l38027K40073L74841m03904
37145A229072r41743l59666M51564L37509k27191j18082M35709L80467k10017
37136I77622l47439J2766j9125m62517l27618N13023Q93536K45180n03038n06015
37126D76375j94825j83830j75716J89013M13994L4974l96037j83224L19370L32458
$$ plain form
37193 917033 100014 -198110 336893 1021417 1149552 679864 139627 122748 704840 1261427
37183 1261427 1154573 608130 457921 996393 1617944 1723702 1370357 840626 239490
37174 239490 -187534 -18870 632634 988346 660766 259914 424911 854465 955426 897836
37164 897836 1197761 1632217 1487783 768647 319615 664188 1345281 1541071 918860 -128169
37154 -128169 -762809 -363982 747648 1498345 1356089 1018062 1258135 1632976 1229072
37145 1229072 287329 -72337 379227 716736 489545 371463 807172 1187639 977622
37136 977622 630183 642949 623824 161307 -166311 346712 1240248 1485428 982390 476375
37126 476375 281550 97720 -77996 111017 525011 559985 163948 -19276 300094 632552
37116F32552q3841l16410k77020k67566j65431L03896P55711N44431j68966n86847
37106C70509m11421m5629K21037M40068M93480J58156l01373l43118n27J52823
37096G34005q1357l23109l39747k57998k6528N36280J043319P44883k77174r13685
37086H38889m44696N04921Q68130M25990k51295o45588o02792k16745J56749R9226
37076G32789l10939m77656j00333M06118N76124M79901L16055j1611m49695m90027
37066F70726R0900O51003N04191m4808j75272K30040N50097M12721K5736l46170
37056B569164n78436m65506N1854N13412M17568m964j22500J02435J63958j2491
37046B634494L2335L49751L77982j01332n65392n94483m12856k82468n3734L13800
$$ plain form
37116 632552 548711 232301 -44719 -312285 -477716 -173820 581891 1126322 957356 370509
37106 370509 -40912 -86541 134496 574564 1068044 1226200 924827 581709 581182 734005
37096 734005 652648 329539 -10208 -268206 -294734 241546 1284865 2029748 1752574 838889
37086 838889 394193 899114 1767244 2193234 1941939 1296351 693559 476814 633563 732789
37076 732789 421850 -55806 -156139 249979 826103 1306004 1622059 1610448 1160753 670726
37066 670726 761626 1412629 1916820 1872012 1696740 1926780 2476877 2889598 2915334 2569164
37056 2569164 1990728 1525222 1577076 2090488 2508056 2503092 2380592 2483027 2646985 2634494
37046 2634494 2666829 3016580 3394562 3293230 2727838 2133355 1720499 1438031 1384297 1698097
37036A698097M49672K04201l8256p3203k30308n68660m84461K46958P86445M10243
37026B400728k77022k81082J70594J05365m53631n28522O6655L46000j88902p13870
37016F46313m50644J42495K55440o883n0998J11970O5448r7574Q3046N32708O43261
37005A874582J80229m14004o69389n49579k33676J02449K27331o65l33111l35105
36995a50938K2063L02180K23407L510m0545O8284J11367L4314l1767P760J00028
36984F49663J10013k5098j69957j22558L0772q6597n38779p38728j74029P03697
36974c61601R34150L76427j28022p9718k2954m88430r57242o10220L32341Q29821
36964a75448M11891l56865p43436n48178L8743O67677Q70081M42313j31448j73322
$$ plain form
37036 1698097 2147769 2351970 2313714 2240511 2010203 1441543 957082 1204040 1990485 2400728
37026 2400728 2123706 1842624 2013218 2118583 1664952 1136430 1203085 1549085 1360183 646313
37016 646313 195669 338164 593604 586721 535723 647693 713141 615567 698613 1231321 1874582
37005 1874582 2054811 1640807 971418 421839 188163 290612 517943 517278 184167 -150938
36995 -150938 -128875 173305 396712 400222 359677 427961 539328 573642 541875 549635 649663
36984 649663 759676 734578 564621 442063 472835 386238 -152541 -891269 -1065298 -361601
36974 -361601 572549 948976 820954 741236 718282 229852 -727390 -1337610 -1005269 -175448
36964 -175448 236443 -120422 -863858 -1412036 -1373293 -705616 164465 606778 475330 302008
36954C02008K21767L09611j33658m70578k64980M6082k8856j99656K9720M43587
36944B55047M44942j578l92922m57354l16756l1481M27875Q13589P53538K95250
36934A790150j42375l61699n20723o82531o40401k49992L45501Q09496P62435
36925A109861Q2353o80080o09072L64027J033214M45720n95208o02008L11983
36916H60790N68843l75122j152924o46821L58008N90494K14464J62524M03117
36907I83373K02204l71892n09715m5873L39426K45921p1074l74937o08844n00177
36897g11588R0242N65524L05233j87013M1856P04587N91328l60101q14829k35199
36887i960K30159k28357o69812j11471O53362L70802m93191m96957L98240Q27460
$$ plain form
36954 302008 523775 833386 699728 229150 -35830 10252 -18604 -218260 -188540 255047
36944 255047 699989 698411 305489 -151865 -468621 -500102 -72227 741362 1494900 1790150
36934 1790150 1647775 1286076 765353 82822 -557579 -807571 -462070 347426 1109861
36925 1109861 1192214 512134 -96938 267089 1300303 1746023 1150815 548807 860790
36916 860790 1429633 1054511 -98413 -745234 -387226 203268 417732 580256 983373
36907 983373 1185577 813685 303970 258097 597523 843444 772370 397433 -211411 -711588
36897 -711588 -621346 -55822 249411 62398 104254 808841 1400169 1040068 225239 -9960
36887 -9960 220199 -8158 -677970 -789441 -136079 234723 -258468 -755425 -357185 470275
36877D70275K39792m06368l10972J33342L18458L13100L10898R8210l84074o32960
36867A49701k72223L27958N52662L04412n1066j83971j2451K97263L94376Q4328
36857A590989l46910m67576l11940k27708j89793J51302P22822R82692P45584
36848B649462M24001K76195O0256l38582n93782n40735m60271m52636j95695L04842
36838A133055M31699q4808n86344m39688K9881J66320l4534k21547l89651n60391
36828e56008l41382L57704P24260J35803o36836m52144L60541M95503j83696m71264
36818e67519Q7837M67528J1672m30143m7485M79549J62644n88446o68255p8113
36808a170731K21459o2968k79851r5749P2771K882O2563M05217N92911L66366
$$ plain form
36877 470275 710067 303699 -7273 126069 444527 757627 1068525 1166735 782661 149701
36867 149701 -122522 205436 758098 1062510 1011444 827473 815022 1112285 1506661 1590989
36857 1590989 1244079 776503 464563 236855 47062 198364 921186 1903878 2649462
36848 2649462 3073463 3349658 3409914 3071332 2477550 1936815 1476544 1023908 828213 1133055
36838 1133055 1564754 1479946 893602 453914 483795 650115 615581 394034 4383 -556008
36828 -556008 -897390 -539686 184574 320377 -316459 -768603 -408062 87441 -96255 -567519
36818 -567519 -479682 -12154 -482 -430625 -478110 1439 164083 -424363 -1092618 -1170731
36808 -1170731 -949272 -1012240 -1292091 -1387840 -1315069 -1312187 -1249624 -844407 -251496 114870
36798A14870J05435J38609J75726j39979n80355o90678m63426k22261p7978R5584
36788a544453L03844M04895L48704J84512n6647k68924k25130J23457M57181M69491
36778A96930K84847J95567J43777j40095n61396o70734l07835J54730L31945K50177
36768a22087J06106o1998k44122k84689j13934M7641q054j24750k2168K21812
36758f06243K55961J4966j19767J56007N78860N44583j71841j026076j163580
36749a537130l50025O66353R33118L84908j56458j01669K25825K50312J7362n6329
36739B76267K9257o4454k85581j96180K42768N04768L04486K0871J9134L9858
36729H91194k97465p20364n74495K03437Q44046O22589k54825q37657m86511L96822
$$ plain form
36798 114870 220305 358914 534640 394661 -185694 -876372 -1339798 -1562059 -1640037 -1544453
36788 -1544453 -1240609 -835714 -487010 -302498 -359145 -628069 -853199 -729742 -272561 196930
36778 196930 481777 677344 821121 681026 119630 -551104 -858939 -704209 -372264 -122087
36768 -122087 -15981 -77979 -322101 -606790 -720724 -673083 -681137 -805887 -828055 -606243
36758 -606243 -350282 -335316 -455083 -299076 279784 824367 652526 -373550 -1537130
36749 -1537130 -1887155 -1220802 -287684 97224 -59234 -160903 64922 315234 332596 276267
36739 276267 305524 241070 -44511 -240691 2077 506845 811331 832202 851336 891194
36729 891194 593729 -126635 -701130 -497693 346353 968942 714117 -123540 -610051 -213229
36719b13229Q38905M51881j67538l21601j07833m7180j49555K3079M85422P21917
36709A514268N15625K20066O5887j21804l05387q2220M86571O42048N4999m88785
36699B501268k01326M75198N23709j70966q00471q18196l89716J40276N06041
36690A765817M04215j78638o47805m69449M665O4399k19861j92404K14187M14269
36680A159395K36044J05362J18141p9913l54530r6233N34522M97090m69827j151588
36670D98463n79076M80055O84669L8114m15341k99007j66395k77625k18910J86619
36660f8434M97493L93693J06840q9883k28939k85651l1771M60893O34827J34594
36650A523662o04002q00999k42447N05109P34668K88365l69688o53062l90625
$$ plain form
36719 -213229 625676 1077557 910019 588418 480585 433405 283850 306929 792351 1514268
36709 1514268 2029893 2249959 2315846 2194042 1888655 1806435 2293006 2935054 2990053 2501268
36699 2501268 2299942 2775140 3298849 3127883 2327412 1509216 1119500 1259776 1765817
36690 1765817 2170032 1991394 1343589 874140 878805 943204 723343 530939 745126 1159395
36680 1159395 1395439 1500801 1618942 1539029 1184499 1088266 1622788 2119878 1650051 498463
36670 498463 -80613 399442 1084111 1122225 706884 407877 241482 -36143 -255053 -68434
36660 -68434 429059 822752 929592 839709 610770 325119 293348 754241 1389068 1523662
36650 1523662 919660 118661 -123786 381323 1115991 1404356 1034668 381606 -9019
36641i019R8620L88779L16296J0492k64053k60573M9488L43495K33891j94422
36631G12994l90625p1715L27805K45987j86015l21569P5955M96102L56540k74331
36621I71128p75403o53302l3253M73682L92241r4681l42979m1991L69657K87103
36611E52202k23811n12387k47933J35062O4883l72671n69386k28298K65648L96995
36601g39696J72355j2787J0680N7171M7817J75686M55928N25170J94541j57838
36591G29027j50499k4361j84456m02779j53942M09116N87931K49717J774J25083
36581A186611J74165p5943j38082K57573N21739J19718n16115o67433l73028q8772
36571D00433J65694N21443N87640j0764p29115o93741k9182L48936J74130O3313
$$ plain form
36641 -9019 89601 478380 794676 805168 541115 280542 330030 673525 907416 712994
36631 712994 322369 250654 578459 824446 638431 316862 392817 888919 1245459 971128
36621 971128 195725 -457577 -490830 -17148 375093 280412 -62567 -104558 265099 552202
36611 552202 328391 -183996 -431929 -296867 -231984 -604655 -1174041 -1402339 -1136691 -739696
36601 -739696 -567341 -580128 -569448 -512277 -464460 -288774 167154 692324 886865 729027
36591 729027 578528 554167 369711 -33068 -187010 222106 810037 1059754 1061528 1186611
36581 1186611 1360776 1284833 1146751 1404324 1926063 2045781 1529666 862233 489205 400433
36571 400433 566127 1087570 1675210 1664446 935331 241590 212408 561344 735474 798787
36561G98787K65989K23424l37497q03370o20744j04650J77670K14232K55329K48289
36551C17459P8028m7245N8339J53354n8807m36221o48869o35441m69689r9247
36541a788339M01585O47728M50036K18996L91927P09319N85665K3313l98017l62471
36531H79742j16461N0214J01843R595k71315m86766k62462K46023L98650N921
36521E54984l00029N897N21729N39630J13905j31596n2948j19344m94543p04959
36511f7274m38496n1633O4497R9051L60776O24501M64311l4679m14317n02680
36501A04057m46821k67025Q6565L58055K36947p0721r0761J36483J37434j32098
36491E2115k07514J029R327l12992l92956O5258M89140L71600J22956L02122N63560
$$ plain form
36561 798787 1064776 1288200 950703 147333 -473411 -578061 -400391 -186159 69170 317459
36551 317459 395487 348242 406581 559935 501128 64907 -583962 -1219403 -1689092 -1788339
36541 -1788339 -1386754 -739026 -288990 -69994 321933 1031252 1616917 1640230 1242213 879742
36531 879742 763281 813495 915338 924933 653618 166852 -95610 150413 549063 554984
36521 554984 254955 260852 782581 1322211 1436116 1304520 1251572 1132228 637685 -67274
36511 -67274 -505770 -557403 -492906 -393855 -33079 591422 1055733 1021054 606737 104057
36501 104057 -342764 -609789 -523224 -165169 71778 1057 -89704 46779 184213 52115
36491 52115 -155399 -154370 -145043 -458035 -850991 -785733 -296593 75007 197963 500085 1063645
36480A063645K11974n44863p89064k41706L64235L29367j99063n76009l83232
36471g64716K66335Q25760P40919O2037m91881l64665J56078M25610L17681J65177
36461A338335J07895L2172n9438j42018l88631p61626p21890k3902N60559J96244
36451A37700o03111n79157L30362Q38027K83834m24346l22072K25423L48918M5540
36441B81118q7452R6551K87548L56035L10446m1528p36726j228173r39377q5187
36431a786745N84344P07568N08068K39062o0197l17052l70877j82236J60988N59308
36421D2231Q15442O44428O0998m53608n01696k92145k70431m33304m30782k03328
36411a022195m1014l3286P7444L89607N73045L22127j48583l18351k7496K80594
$$ plain form
36480 1063645 1275619 730756 -58308 -300014 64221 393588 194525 -381484 -764716
36471 -764716 -498381 327379 1068298 1130335 638454 273789 429867 855477 1173158 1338335
36461 1338335 1446230 1478402 1418964 1276946 888315 126689 -595201 -619103 -58544 137700
36451 137700 -465411 -1044568 -714206 123821 407655 -16691 -338763 -113340 235578 281118
36441 281118 193666 290217 577765 933800 1244246 1202718 465992 -762181 -1701558 -1786745
36431 -1786745 -1202401 -494833 13235 252297 192100 -124952 -495829 -678065 -517077 42231
36421 42231 857673 1502101 1563099 1109491 607795 315650 45219 -388085 -818867 -1022195
36411 -1022195 -1063209 -1096495 -1019051 -629444 -56399 265728 117145 -201206 -228702 51892
36401E1892J08912m01495n88451j57147L68213L72826L7573n619K66817K26614
36391B80135l30562p52663m47143L27304R00768R42732M86938k66982q30334o53456
36381c43263Q7015M58733K3055m44534j05865O15289O86525O0465l36097o1745
36371F39578L37896L60235K18724K38279K76083R4939j73743k65782j61827j1991
36361A552391P2755N1467m566P8465K72737K06818k85803o83023m08202K06533
36351A059572L20034r2573j85477L22395O10899J10069n06542m11647M470j92195
36341A039005q52238q65344J09764J010248P81932k53597q96167n52680K10458
36332b68619M77692L1913m80953l57742L02487P22877M59602l6804j22237J09739
$$ plain form
36401 51892 160804 -240691 -829142 -986289 -618076 -245250 -207677 -213296 53521 280135
36391 280135 -50427 -803090 -1250233 -922929 -22161 920571 1407509 1140527 310193 -343263
36381 -343263 -256248 202485 225540 -218994 -324859 290430 976955 1037420 701323 639578
36371 639578 977474 1337709 1556433 1794712 2070795 2165734 1991991 1726209 1564382 1552391
36361 1552391 1625146 1676613 1672047 1750512 2023249 2230067 1944264 1261241 853039 1059572
36351 1059572 1379606 1287033 1101556 1423951 2034850 2144919 1638377 1226730 1231200 1039005
36341 1039005 186767 -678577 -568813 441435 1223367 969770 73603 -479077 -268619
36332 -268619 209073 240986 -239967 -597709 -295222 427655 887257 850453 728216 837955
36322H37955Q2803k63395l66810M891L21929R5322l74010m49308n5716K85868
36312A19529J84258j83969l26520L1003O03547P38555J66308m94672m12346K59702
36302F85395M93261r4558o13668k95662K92028K58033r6444P5293M90789J40445
36292A334912p67867q44789J99509Q60858J31014r00747p60091K23774O83918
36283A60491L50418P0940J99796L00312K24640K68757L17416o7611o91556q57729
36273B75874m98250k31365k41577o6417L76063N14720J32320k21984j32219J25994
36263C3159K02825J44931Q016k99029n54588l25579K35658M26875P8825j58003
36253b06910R8937L80836K51325Q154M0330J70176J20457K4328P815j49866m89759
$$ plain form
36322 837955 920758 657363 290553 295444 617373 712695 338685 -110623 -166339 119529
36312 119529 303787 119818 -206702 -175699 427848 1166403 1332711 838039 425693 685395
36302 685395 1178656 1084098 470430 174768 466796 724829 628385 703678 1194467 1334912
36292 1334912 567045 -277744 -78235 782623 913637 12890 -747201 -523427 160491
36283 160491 510909 581849 781645 1081957 1306597 1575354 1892770 1825159 1133603 275874
36273 275874 -222376 -453741 -695318 -761735 -385672 129048 261368 39384 -92835 33159
36263 33159 235984 380915 388931 89902 -464686 -790265 -554607 -127732 -48907 -206910
36253 -206910 -107973 272863 524188 532342 572672 742848 863305 887633 895448 745582 255823
36242B55823n80861k08882J80641J61599o0263r7629P3994L48048O86261P90760
36232A549491K55671o12165q74220k83726K47670r48n38328n70513j57588K00035
36222g84621M15334N55350L81756j46556m96276l17961R01O8950P4847J35565
36212a12711o8996m32304k10969O02290Q32454l0079p39429k21019O10435M04404
36202F34076l52394l18890L44133M78222J15246J79886M62235m0477r57997q24628
36192b80588L92526J050571M08496m18115m80746k10234j12789P3817L46482J12862
36182H82282n12228n57724J08624M18426k3057k61005J84592M38912o658l06559
36172C65605Q2039L21757j78866n82851k32336N2282m05800o76197Q9916Q56352
$$ plain form
36242 255823 -325038 -533920 -353279 -191680 -251943 -349572 -275578 72470 758731 1549491
36232 1549491 1805162 1192997 318777 35051 282721 281773 -256555 -827068 -984656 -784621
36222 -784621 -369287 186063 567819 421263 -75013 -392974 -392073 -323123 -248276 -112711
36212 -112711 -181707 -614011 -824980 -222690 609764 579685 -159744 -380763 229672 634076
36202 634076 281682 -37208 306925 785147 900393 1080279 1542514 1502037 544040 -280588
36192 -280588 111938 1162509 1571005 1152890 672144 461910 349121 422938 769420 882282
36182 882282 370054 -187670 -79046 339380 316323 55318 239910 678822 672164 365605
36172 365605 447644 769401 590535 7684 -224652 -172370 -578170 -1254367 -1164451 -308099
36162c08099L62778n41864k11999R64653J167080J46705m95330l3003L87806j14344
36152A324383p48660n25192J49313K38412l51871p77715m60763K77200O69078
36143b05815L36182l12950n29534r1796M88447O76736M46740k939n18335p78197
36133d91461m60154J02682J66612k04365q1548P08213J012858J70832p38281n36227
36123c50839J90467J94033l32026k81621L49956N97015L00711J62296K28009j04324
36113I53677o39121n03138K28423N29875J74944j1575J65574p7115q09989r53930
36103i42375j36062N18524K15916k69104q0983K76422O0168k61075R1286O87102
36093A59819N49112k04795n80746k64526R8868L4879k38654l73340k84674j8117
$$ plain form
36162 -308099 54679 -487185 -699184 265469 1432549 1579254 1083924 1050921 1438727 1324383
36152 1324383 575723 50531 199844 438256 86385 -691330 -1152093 -874893 -205815
36143 -205815 130367 -182583 -712117 -803913 -315466 361270 808010 805071 286736 -491461
36133 -491461 -951615 -848933 -682321 -886686 -968234 -260021 752837 923669 185388 -350839
36123 -350839 -160372 33661 -298365 -579986 -230030 366985 667696 829992 1058001 953677
36113 953677 314556 -188582 39841 569716 744660 733085 898659 821544 11555 -942375
36103 -942375 -1078437 -559913 -343997 -613101 -694084 -417662 -357494 -618569 -527283 159819
36093 159819 708931 504136 -76610 -341136 -242268 -207389 -446043 -819383 -1104057 -1122174
36083a122174K74109L30826J38308N0325K07882K27993j08558l38887n2319L20553
36073g1942J46809l56341m77115j46710R0239Q2044K04156N05946N48378K21743
36063G47207j5665P6169J67252N2592M3087K89301L24769j86940p30836o19506
36053A47430q5499M8788l11976l73705K05793O25306J35339o88182o91367J19419
36043h68654N46374l353o37893l54197M84070P78223L21236o7173J22440M34828
36033G55901K68800k56297n27647k13343L87986O50863K75877k97719l51276J23106
36023H16251L25455j59589o51990m39393L9602m0924m20766k03368M51847M36868
36013A53993l95807q17510j63607O01737M75863o1138m5800L65244L67919n5855
$$ plain form
36083 -1122174 -848065 -517239 -378931 -328606 -120724 107269 -1289 -340176 -392495 -71942
36073 -71942 74867 -281474 -758589 -905299 -815060 -733016 -528860 -22914 525464 747207
36063 747207 731542 807711 974963 1027555 1070642 1359943 1684712 1497772 766936 147430
36053 147430 61931 110719 -201257 -574962 -369169 256137 391476 -296706 -988073 -868654
36043 -868654 -322280 -325633 -963526 -1317723 -833653 -55430 265806 198633 321073 755901
36033 755901 1024701 768404 240757 27414 415400 1066263 1342140 1044421 693145 816251
36023 816251 1141706 982117 330127 -109266 -69664 -110588 -531354 -734722 -282875 153993
36013 153993 -241814 -1059324 -1222931 -621194 -145331 -206469 -252269 112975 480894 425039
36003D25039k68809j34359k9903J6079K50532M55612K03167k56327k49922J93413
35993F04522L42611l6707l35417j65545K5038k11526n18575k93161L46571O94810
35983D52621M13107r7705l13544k34649k06926k64933l4971N58004Q74780L42421
35973A488205n46616p16409m4362L92805n3797n72760j74645O75951O97400k65119
35963H80653r90095o21254K56792N81183J67088l25081l74597j16674K5027n2421
35953e69379j6903L62146P15679M76073k09297n14560j22202K55425J758m04026
35943b5286k22453K72103K81879j28503j95131J63934K41940j31126k49269K18838
35933B26926O21941L82880j51342l74889k70111j49570j13296j48778k82863l47364
$$ plain form
36003 425039 156230 21871 -8032 8047 258579 714191 917358 661031 411109 604522
35993 604522 947133 910426 575009 409464 434502 222976 -295599 -588760 -242189 452621
35983 452621 865728 768023 454479 219830 12904 -252029 -287000 271004 1145784 1488205
35973 1488205 941589 225180 180818 573623 519826 -52934 -227579 448372 1145772 880653
35963 880653 -109442 -730696 -473904 107279 274367 -50714 -425311 -541985 -516958 -569379
35953 -569379 -586282 -224136 491543 967616 758319 243759 121557 376982 378740 -25286
35943 -25286 -247739 24364 306243 177740 -17391 146543 388483 257357 8088 226926
35933 226926 848867 1231747 1080405 705516 435405 285835 172539 23761 -259102 -606466
35923f06466q9179K92435K96987l5037j24091J36806K05008k5126O4851N78651
35913F94839O31094j89468q83251m96378L31849L71806l06536o30450k52247K16766
35903e11976M03280M33106J96640m63841r31293l94615P02691J005550K13698
35894F53240n04286l70162k2410j41039k58230J92893O24258J91350o67717p46485
35884a048588J22976Q31278N99654n5576k34114J14433K98062p7157n95018n92809
35874f36859k0932M69543L37343j71779l87128q7212L40281N19392M35017J86960
35864I84626j17480j98808J18466L96422N360p80303q90538l5797O62176K63410
35854D07534n32988m53191L88628P34517J59268m02187k28775J93051J71545r0584
$$ plain form
35923 -606466 -695645 -403210 -106223 -141260 -265351 -128545 76463 51337 116188 694839
35913 694839 1325933 1136465 253214 -243164 88685 460491 153955 -476495 -728742 -511976
35903 -511976 -108696 324410 521050 57209 -874084 -1268699 -566008 439542 653240
35894 653240 148954 -221208 -243618 -384657 -642887 -449994 174264 365614 -302103 -1048588
35884 -1048588 -925612 -94334 505320 449744 215630 330063 628125 550968 -44050 -636859
35874 -636859 -657791 -188248 149095 -22684 -409812 -497024 -156743 362649 797666 984626
35864 984626 867146 668338 786804 1183226 1188586 408283 -482255 -518052 144124 407534
35854 407534 -125454 -578645 -190017 544500 703768 301581 72806 265857 437402 346818
35844C46818k0677L03321L31355o7034m53785m39880o7848L28293L87388j5776
35834F32175n51660o51719j64205L88315M39071P2532j79190n5920K38956M43509
35824F11864M67329K48610k37831p34643p87906k80590L22682M84377K21696j1277
35814C04311O174K3927j73815l57413k13815J13115K45055K20722M08276P17883
35804A294420N30122k74225q34277m59496K27212J33660n90616p23288J01937
35795e94551P52153L27951m65187m63270J94997M61147R0390j44005J49138M25479
35785G34242K40826p3765j42822j96854n00914p24879m49585J11587M41013M43682
35775a17469L18716J8536n26371q47652l62969O02426R56165K67879n64328n11240
$$ plain form
35844 346818 326141 629462 960817 893783 439998 118 -67730 260563 647951 632175
35834 632175 80515 -571204 -735409 -347094 91977 164509 -14681 -70601 168355 611864
35824 611864 1079193 1327803 1089972 355329 -432577 -713167 -390485 93892 315588 304311
35814 304311 310485 334412 160597 -196816 -410631 -297516 -52461 168261 576537 1294420
35804 1294420 1824542 1550317 716040 256544 483756 617416 26800 -696488 -594551
35795 -594551 157602 485553 20366 -442904 -247907 213240 303630 159625 308763 734242
35785 734242 975068 901303 758481 561627 60713 -664166 -1113751 -1002164 -561151 -117469
35775 -117469 201247 219783 -306588 -1154240 -1517209 -914783 41382 309261 -255067 -766307
35765g66307K01361M96182q535n22518k28556O37289J144539Q02465l203n86753
35755A165964o52123l70462l2376J89813K30440R8954p0336o4167J80940M30119
35745A106766L66266j2860l30216k49714J06274K72404k6572n47618p83248n10097
35735f08615k3686K00829L7010j94550j67146M7924J28045n5918l09133l66468
35725a311708j07601L93060Q05057O59767r2077p19083m44216M06530O68952o40
35715B58041n42912j37841M13782m3084j007170r75322J02631O20740j25110p60297
35705b196542l2704J166223J207601J80909m86492k87273j2282p9211M2292N70594
35695G3115Q58442M99570j9638k01583k10301k51715j03348K67882L81572O2328
$$ plain form
35765 -766307 -564946 -68764 -77299 -599817 -828373 -191084 953455 1755920 1752717 1165964
35755 1165964 513841 143379 111003 300816 531256 630210 559874 495707 676647 1106766
35745 1106766 1473032 1460172 1129956 880242 986516 1258920 1232348 684730 -98518 -608615
35735 -608615 -632301 -431472 -394462 -589012 -756158 -708234 -580189 -636107 -945240 -1311708
35725 -1311708 -1419309 -1026249 -221192 438575 346498 -372585 -816801 -410271 258681 258041
35715 258041 -284871 -422712 -8930 -52014 -1059184 -2034506 -1931875 -1311135 -1436245 -2196542
35705 -2196542 -2229246 -1063023 144578 325487 -161005 -448278 -460560 -539771 -497479 73115
35695 73115 931557 1431127 1411489 1209906 999605 747890 644542 912424 1293996 1356324
35685A356324j22627J82081M02795m5931p13406p63063k35128J48322J31211N8619
35675C99197O2128n1534j54480J25976N80312M54300m00287j076327p46186K23642
35665e83259P82825N34628N0223n9466J16947J31193j05662k79942k29402j54906
35655B03179j81659p1924L33724O68897M76121o6756l74072l34870l47881m45692
35645a40933j55196N05425P16420R5437m89682j42115N97136M96748m58922j007809
35635A6509m68201L78514N43566R3697k90527l39110k36269r9934N7911J23128
35625b20716M2890m407R0927J22666q5668l09528k18386J15059L04407J58101
35615d655j42932l08351j95046J30445M44477N44303M39681K58515k0579m73116
$$ plain form
35685 1356324 1233697 1415778 1818573 1772642 1059236 296173 61045 209367 340578 399197
35675 399197 461325 409791 255311 381287 961599 1415899 1015612 -60715 -806901 -583259
35665 -583259 199566 734194 784417 724951 841898 973091 867429 587487 358085 203179
35655 203179 21520 -50404 283320 952217 1428338 1361582 987510 652640 304759 -140933
35645 -140933 -296129 209296 925716 1021153 531471 389356 986492 1483240 1024318 16509
35635 16509 -451692 -73178 470388 564085 273558 -65552 -301821 -401755 -343844 -220716
35625 -220716 -177826 -182233 -91306 31360 -54308 -363836 -582222 -467163 -162756 -4655
35615 -4655 -147587 -455938 -650984 -520539 -76062 468241 907922 1166437 1145858 672742
35605F72742q31528o03087J72958O87459L07951n06359p52349k09032L65162L86090
35595c09993J66304K11468L46894Q3717m33624m91560J51609Q36998Q41413K43170
35585A646396l43630n77570n42095l19061Q6511M37435L81922r91j93566L8476
35575F13827K88983J19554l06720n10981l67166j45566m9771k9573K9585J75081
35565a82747L71227M55930K53480j36262l75129l45695k70748k18789O9631N74175
35555A95073P35568K85488j68910l6365K47578o8189o98067p09032r2998K07254
35545a02600q1843j43549L70132N74125j54329r49303o80496L33832Q75881N98768
35535F40618J86445K5425j93420n50644n76614j05341L18548K32970r4836j53429
$$ plain form
35605 672742 -158786 -761873 -588915 98544 406495 -99864 -852213 -1061245 -696083 -309993
35595 -309993 -143689 67779 414673 498390 64766 -426794 -275185 561813 1403226 1646396
35585 1646396 1302766 725196 183101 -135960 -49449 387986 769908 768917 575351 613827
35575 613827 902810 1022364 715644 204663 -162503 -308069 -357840 -387413 -357828 -182747
35565 -182747 188480 644410 897890 761628 386499 40804 -229944 -448733 -379102 195073
35555 195073 930641 1216129 1047219 1010854 1258432 1190243 492176 -216856 -309854 -102600
35545 -102600 -184443 -327992 42140 616265 461936 -487367 -1167863 -834031 41850 640618
35535 640618 827063 852488 659068 108424 -468190 -573531 -254983 -22013 -116849 -270278
35525b70278R3587K97414K49940M4711j11472o7500J51189K91408R7891l36449
35515D40441o01607m13073J05303N86757P16112L86199k17766o57736n77193p8639
35505c11202L62372L91161O9081k88125l92507j36346L12121N47706K96308j90923
35495F59646l31935Q9200O10772O25223Q0265n14988o87256m17608K569L24213
35485D40101M54803L62380O7414k53036l37613j39464P8641J11529J34225L84951
35475A303931O28634L68886l27889p06878l24429K36541J26920n53156q90906
35466a38346m58801J44682K29210n4494j01141J84466L19208N1877k39530j17648
35456a80517K68420L98590J22702j40216j9922K68796K57251p0827k70309j38813
$$ plain form
35525 -270278 -176691 120723 370663 415374 303902 236402 387591 678999 776890 440441
35515 440441 -161166 -574239 -468936 117821 833933 1220132 1002366 344630 -232563 -311202
35505 -311202 51170 442331 511412 223287 -169220 -305566 6555 554261 850569 659646
35495 659646 327711 416911 1027683 1652906 1733171 1218183 530927 113319 115888 440101
35485 440101 894904 1257284 1324698 1071662 734049 594585 673226 784755 918980 1303931
35475 1303931 1932565 2301451 1973562 1266684 942255 1178796 1305716 752560 -138346
35466 -138346 -597147 -452465 -223255 -277749 -378890 -194424 124784 176661 -62869 -180517
35456 -180517 87903 486493 609195 468979 449057 717853 975104 904277 633968 495155
35446D95155j7997j92269l60988r8293L95521N03942J08418k28820j25077O9506
35436E49098j14952m86826m78991k0892L66468L27082O4342j19652k50528m19040
35426e83891m49590j70479K16145L87181L48116K69937P6654l12061m78289O8519
35416f27758R14796R84279P0227o67882l15888M26092L52789l51853m94815J13212
35406D03199L73076k06822o66501k26169M07432K74736k07837j4082O57037O11971
35396A406040l97456j186856q25388J82853Q11667Q08373N46164K04817k34931
35387A315283n28037l66177M9316J85135l6805j04174K69625O00394K57829n70720
35377A071669r96404n65677J35277K77495j31562m01415k08401Q3097J70041K42659
$$ plain form
35446 495155 477158 284889 -76099 -174392 221129 725071 833489 604669 479592 549098
35436 549098 434146 -52680 -531671 -552563 -186095 140987 205329 85677 -164851 -583891
35426 -583891 -1033481 -1203960 -987815 -600634 -252518 17419 94073 -217988 -696277 -627758
35416 -627758 287038 1271317 1341544 673662 357774 783866 1136655 784802 289987 403199
35406 403199 776275 569453 -97048 -323217 84215 358951 151114 137032 794069 1406040
35396 1406040 1008584 -178272 -1003660 -820807 -9140 799233 1345397 1550214 1315283
35387 1315283 787246 421069 470385 655520 618715 514541 784166 1384560 1642389 1071669
35377 1071669 75265 -490412 -355135 -77640 -209202 -610617 -819018 -735921 -565880 -323221
35367c23221M10955L04725k73788p69784n73589N521J59107j81255k90044J19531
35357a411842L92979j2286o04427n17416K53082Q22288N43272k58251p45884n14640
35347b053125O8512L89101L03123J90642L00405L33749m0855m83194l12323M23010
35337h80955P79164J51595p62202p70862K14478R92167O05318m38745q70155l00863
35327a281060L79793K97501k79575m98166k08845k7611j97992j90687K83183O12810
35317a110649K43626k85800j00732N49317N76467k30510q01917l81133M04349
35308a136982N92259K41044L5614J04693M9746j63573j60954R6246K37448J46827
35298D2368O6298J9132k27496n44849m52826O4176M06782L12548K87073O36872
$$ plain form
35367 -323221 87734 392459 118671 -651113 -1224702 -1219181 -1060074 -1241329 -1531373 -1411842
35357 -1411842 -1018863 -1031149 -1635576 -2152992 -1899910 -1077622 -534350 -792601 -1538485 -2053125
35347 -2053125 -1984613 -1595512 -1292389 -1101747 -801342 -467593 -508448 -991642 -1303965 -880955
35337 -880955 -101791 49804 -712398 -1483260 -1268782 -276615 328703 -110042 -980197 -1281060
35327 -1281060 -901267 -603766 -883341 -1381507 -1590352 -1617963 -1815955 -2006642 -1723459 -1110649
35317 -1110649 -867023 -1152823 -1253555 -704238 -127771 -358281 -1160198 -1541331 -1136982
35308 -1136982 -544723 -303679 -268065 -163372 -113626 -277199 -438153 -341907 -104459 42368
35298 42368 108666 127798 -99698 -644547 -1097373 -1033197 -626415 -313867 -26794 610078
35288F10078P38431r670r86159j020826j02428N45193K17803l53714k45871K90206
35278c16957L80566p7102l92308k49080p7560j81533k06870K04003P20297P09469
35268E12925R0385n45038n94211l9510N50556N25520k03618r42790q38146J37147
35258a346780J028768R44691P7251n91853m99107o7133j0476l85274n86078j96252
35248a632243M54928P36507N35076L10923L32980K72769j79993o65276n97219
35239d31548o1391K98706K27722P7424M4015j19473m29975m34608k1765K11600
35229f39293p7484k99938R7205N75585L09950l74579m25012K46017O04802J46752
35219A64005l71088k20526K11225K05512j36326k13660O8339K82051K02372o018
$$ plain form
35288 610078 1348509 1338839 352680 -668146 -770574 -225381 -7578 -361292 -607163 -316957
35278 -316957 63609 -13493 -405801 -654881 -732441 -913974 -1120844 -916841 -196544 512925
35268 512925 603310 58272 -535939 -575449 -24893 500627 297009 -645781 -1483927 -1346780
35258 -1346780 -318012 626679 703930 112077 -387030 -454163 -464639 -849913 -1435991 -1632243
35248 -1632243 -1177315 -440808 94268 405191 738171 1010940 830947 165671 -431548
35239 -431548 -492939 -194233 33489 110913 154928 35455 -394520 -829128 -850893 -639293
35229 -639293 -716777 -1016715 -919510 -343925 -33975 -408554 -833566 -587549 17253 164005
35219 164005 -207083 -427609 -216384 -10872 -147198 -360858 -292519 -10468 191904 185886
35209A85886j56351j57430O5941L85302L95952p0220n43562m53621P5925M10622
35199A38444K87923N5410M7047J80152K51679K37282J58634k6823k54797l28884
35189G46067j93819j1908J11226K12125K09360q0143m90662m87078N8363M41636
35179E15167Q623p81222q54793n8969N71516L20821j83572N664O94090Q83601
35169A120926K77562l88217m97577k67028j40926j33222o7530K1774L7265J4506
35159b2467l4738j42998j57134Q8028L14239Q0373l93989l90625J31058L50455
35149a77798o6945l55304M7967N15211L39750m8653K4211J83774j84198n32258
35139b54243J597Q43780O96588k48540n35445J12217L94493j98139m90537J93371
$$ plain form
35209 185886 29535 -127895 -61954 323348 719300 649080 105518 -348103 -272178 138444
35199 138444 426367 481777 528824 708976 960655 1197937 1356571 1329748 1074951 746067
35189 746067 552248 540340 651566 863691 1073051 992908 502246 15168 73531 515167
35179 515167 523790 -257432 -1112225 -1171194 -599678 -278857 -462429 -456765 237325 1120926
35169 1120926 1398488 1010271 512694 245666 104740 -28482 -96012 -74238 -36973 -22467
35159 -22467 -57205 -200203 -357337 -269309 44930 125303 -268686 -659311 -528253 -177798
35149 -177798 -244743 -600047 -552080 -36869 302881 254228 278439 462213 278015 -254243
35139 -254243 -252646 591134 1287722 1039182 503737 615954 1010447 812308 321771 515142
35129E15142P14989P2663q30075o87114J31517M26538J64610J44401L50760J50809
$$ plain form
35129 515142 1230131 1302794 472719 -214395 -82878 343660 508270 652671 1003431 1154240
$$ [...]
##END NTUPLES=NMR SPECTRUM
##END=
