##TITLE=31Pdec_LR-733-CR6-C1H
 CDCl3, 24 sc
 5.04.2021
##JCAMPDX= 6.0         $$ Bruker NMR JCAMP-DX V2.0
##DATA TYPE= NMR SPECTRUM
##DATA CLASS= NTUPLES
##ORIGIN= UXNMR, Bruker Analytische Messtechnik GmbH
##OWNER= root
$$ XWIN-NMR		Version 3.5
$$ Mon Apr  5 13:38:33 2021 Russian Standard Time (UT+4h)  she@DPX200
##.OBSERVE FREQUENCY= 81.013821
##.OBSERVE NUCLEUS= ^31P
##.ACQUISITION MODE= SIMULTANEOUS
##.ACQUISITION SCHEME= undefined
##.AVERAGES= 24
##.DIGITISER RES= 16
##SPECTROMETER/DATA SYSTEM= spect
##.PULSE SEQUENCE= zgpg30
##.SOLVENT NAME= CDCl3
##.SHIFT REFERENCE= (INTERNAL, CDCl3, 0, 248.564)
##AUDIT TRAIL= $$ (NUMBER, WHEN, WHO, WHERE, WHAT)
$$ ##TITLE= Audit trail, XWIN-NMR		Version 3.5
$$ ##JCAMPDX= 5.01
$$ ##ORIGIN= Bruker BioSpin GmbH
$$ ##OWNER= she
$$ F:/spectra/data/she/nmr/P31/1/pdata/1/auditp.txt
$$ ##AUDIT TRAIL=  $$ (NUMBER, WHEN, WHO, WHERE, WHAT)
(   1,<2021-04-05 13:37:24.82 +0400>,<she>,<DPX200>,
      <created by zg, POWCHK disabled, PULCHK disabled
       configuration hash MD5:
       00 E9 B6 7A A2 85 ED C7 34 08 36 98 17 FE 4E 26
       data hash MD5: 32K
       0C 15 36 36 9C 60 C3 75 32 E4 67 33 18 4D 92 2A>)
(   2,<2021-04-05 13:37:30.60 +0400>,<she>,<DPX200>,
      <Start of raw data processing
       efp BC_mod = 2 LB = 1 FT_mod = 6 PKNL = 1 PHC0 = -5350.878 PHC1 = 1413.602 SI = 64K 
       data hash MD5: 64K
       A4 72 42 39 1B 73 1B F3 30 D6 3B C0 C5 20 D0 16>)
(   3,<2021-04-05 13:37:51.89 +0400>,<she>,<DPX200>,
      <pk PHC0 = -51.24601 PHC1 = 160.8001 
       data hash MD5: 64K
       7B E4 90 75 C7 44 5B 36 CB 00 FB 66 81 F0 D2 CB>)
(   4,<2021-04-05 13:37:55.26 +0400>,<she>,<DPX200>,
      <abs ABSG = 5 
       data hash MD5: 64K
       15 87 B3 BC 21 70 16 F2 D6 0D C8 EB 13 E1 4B 8F>)
$$ ##END=
$$ 
$$ hash MD5
$$ B3 13 01 9B 4E 3D 8D C6 24 C1 47 88 60 A7 08 14
##$RELAX= 
##$RELAX= 
##$RELAX= 
##$RELAX= 
##$RELAX= 
##$RELAX= 
##$RELAX= 
##$RELAX= 
$$ Bruker specific parameters
$$ --------------------------
##$DU= <F:/spectra>
##$EXPNO= 1
##$NAME= <P31>
##$PROCNO= 1
##$TYPE= <nmr>
##$USER= <she>
##$AMP= (0..31)
100 100 100 100 100 100 100 100 100 100 100 100 100 100 100 100 100 100 
100 100 100 100 100 100 100 100 100 100 100 100 100 100 
##$AQSEQ= 0
##$AQ_mod= 1
##$AUNM= <au_zg>
##$AUTOPOS= <>
##$BF1= 81.014009
##$BF2= 200.13
##$BF3= 200.13
##$BF4= 200.13
##$BF5= 200.13
##$BF6= 200.13
##$BF7= 200.13
##$BF8= 200.13
##$BYTORDA= 1
##$CFDGTYP= 0
##$CFRGTYP= 5
##$CHEMSTR= <none>
##$CNST= (0..31)
1 1 145 1 1 1 1 1 1 1 1 1 1 1 1 1 1 1 1 1 1 1 1 1 1 1 1 1 1 1 1 1 
##$CPDPRG= <waltz16>
##$CPDPRG1= <>
##$CPDPRG2= <waltz16>
##$CPDPRG3= <>
##$CPDPRG4= <mlev>
##$CPDPRG5= <mlev>
##$CPDPRG6= <mlev>
##$CPDPRG7= <mlev>
##$CPDPRG8= <mlev>
##$CPDPRGB= <>
##$CPDPRGT= <>
##$D= (0..31)
0 1 0 0 0 0 0 0 0 0 0 0.03 2e-05 3e-06 0 0 0 0 0 0 0 0 0 0 0 0 0 0 0 0 
0 0 
##$DATE= 1617615444
##$DBL= (0..7)
120 120 120 11 120 120 24 19 
##$DBP= (0..7)
150 150 150 150 150 150 150 150 
##$DBP07= 0
##$DBPNAM0= <>
##$DBPNAM1= <>
$$ [...]
##$SUBNAM3= <"">
##$SUBNAM4= <"">
##$SUBNAM5= <"">
##$SUBNAM6= <"">
##$SUBNAM7= <"">
##$SUBNAM8= <"">
##$SUBNAM9= <"">
##$SW= 501.771253377433
##$SWIBOX= (0..15)
0 1 3 0 0 0 0 0 0 0 0 0 0 0 0 0 
##$SW_h= 40650.406504065
##$TD= 32768
##$TD0= 1
##$TE= 0
##$TE2= 300
##$TE3= 300
##$TEG= 300
##$TL= (0..7)
0 120 53 12 22 120 120 120 
##$TP= (0..7)
150 150 150 150 150 150 150 150 
##$TP07= 0
##$TPNAME0= <>
##$TPNAME1= <>
##$TPNAME2= <>
##$TPNAME3= <>
##$TPNAME4= <>
##$TPNAME5= <>
##$TPNAME6= <>
##$TPNAME7= <>
##$TPOAL= (0..7)
0.5 0.5 0.5 0.5 0.5 0.5 0.5 0.5 
##$TPOFFS= (0..7)
0 0 0 0 0 0 0 0 
##$TUNHIN= 0
##$TUNHOUT= 0
##$TUNXOUT= 0
##$USERA1= <user>
##$USERA2= <user>
##$USERA3= <user>
##$USERA4= <user>
##$USERA5= <user>
##$V9= 5
##$VALIST= <valist>
##$VCLIST= <CCCCCCCCCCCCCCC>
##$VD= 0
##$VDLIST= <DDDDDDDDDDDDDDD>
##$VPLIST= <PPPPPPPPPPPPPPP>
##$VTLIST= <TTTTTTTTTTTTTTT>
##$WBST= 1024
##$WBSW= 4
##$XGAIN= (0..3)
0 0 0 0 
##$XL= 0
##$YL= 0
##$YMAX_a= 16208
##$YMIN_a= -17622
##$ZGOPTNS= <>
##$ZL1= 120
##$ZL2= 120
##$ZL3= 120
##$ZL4= 120
##$ABSF1= 248.5645
##$ABSF2= -253.2056
##$ABSG= 5
##$ABSL= 3
##$ALPHA= 0
##$AQORDER= 0
##$ASSFAC= 0
##$ASSFACI= 0
##$ASSFACX= 0
##$ASSWID= 0
##$AUNMP= <proc_1d>
##$AZFE= 0.1
##$AZFW= 0.5
##$BCFW= 0
##$BC_mod= 2
##$BYTORDP= 0
##$COROFFS= 0
##$CY= -3
##$DATMOD= 1
##$DC= 0
##$DFILT= <>
##$DTYPP= 0
##$F1P= 0
##$F2P= 0
##$FCOR= 1
##$FTSIZE= 65536
##$FT_mod= 6
##$GAMMA= 0
##$GB= 0
##$INTBC= 1
##$INTSCL= 5.30512e-09
##$ISEN= 30
##$LB= 1
##$LEV0= 0
##$LPBIN= 0
##$MAXI= 10000
##$MC2= 0
##$MEAN= 0
##$ME_mod= 0
##$MI= 50
##$NCOEF= 0
##$NC_proc= -7
##$NLEV= 6
##$NOISF1= 182.463
##$NOISF2= 159.3651
##$NSP= 0
##$NTH_PI= 0
##$NZP= 0
##$OFFSET= 248.5645
##$PC= 4
##$PHC0= -5402.124
##$PHC1= 1574.402
##$PH_mod= 1
##$PKNL= yes
##$PPARMOD= 0
##$PSCAL= 0
##$PSIGN= 0
##$REVERSE= no
##$SF= 81.014009
##$SI= 65536
##$SIGF1= 159.3651
##$SIGF2= -187.1042
##$SINO= 113.3802
##$SIOLD= 16384
##$SREGLST= <1H.CDCl3>
##$SSB= 0
##$STSI= 65536
##$STSR= 0
##$SW_p= 40650.406504065
##$SYMM= 0
##$S_DEV= 0
##$TDeff= 32768
##$TDoff= 0
##$TI= <>
##$TILT= no
##$TM1= 0
##$TM2= 0
##$TOPLEV= 0
##$USERP1= <user>
##$USERP2= <user>
##$USERP3= <user>
##$USERP4= <user>
##$USERP5= <user>
##$WDW= 1
##$XDIM= 65536
##$YMAX_p= 481835639
##$YMIN_p= -26308390
$$ End of Bruker specific parameters
$$ ---------------------------------
##NTUPLES= NMR SPECTRUM
##VAR_NAME=  FREQUENCY,     SPECTRUM/REAL,   SPECTRUM/IMAG
##SYMBOL=    X,             R,               I
##VAR_TYPE=  INDEPENDENT,   DEPENDENT,       DEPENDENT
##VAR_FORM=  AFFN,          ASDF,            ASDF
##VAR_DIM=   65536,         65536,           65536
##UNITS=     HZ,            ARBITRARY UNITS, ARBITRARY UNITS
##FACTOR=    0.620285442955139, 1,           1
##FIRST=     20137.2065510759, 0,            0
##LAST=      -20513.1999529892, 0,           0
##MIN=       -20513.1999529892, -26308390,   0
##MAX=       20137.2065510759, 481835639,    0
$$ Real data points
##PAGE= N=1
##DATA TABLE= (X++(R..R)), XYDATA
$$ [...]
40469F914637L020072J297961l552741o399740l225384K260783L825896J795398
40461E936882R78708J933965J043513k056993l813037l009032j736566o62541
40453a385101J059549K102651R72494L38345K933100M787034M03586o331643n804956
40444i24941J956890N671362k18419o652545l733827M691898P683684K793592
40436A1267694k950165m380313k932823j278831K76597J674143K037422J432198
40428E145922P45037m6276j038710q30036J306926K705964K55660m353487o033505
40419b142505l335779m29362p32521j994254l59490L098908L681856K80665k639917
40410d572399j428700J776466K898614J929604J367422O68487k550881o193475
$$ y = [6914637, 9934709, 11232670, 7679929, 1280189, -1945195, 315588, 4141484, 5936882, 6915590, 8849555, 9893068, 7836075, 4023038, 1014006, -722560, -1385101, -325552, 1777099, 2749593, 3087938, 6021038, 10808072, 11211658, 4880015, -924941, 1031949, 6703311, 6484892, -167653, -3901480, 790418, 8474102, 11267694, 8317529, 3937216, 1004393, -274438, 2159, 1676302, 3713724, 5145922, 5890959, 5844683, 4805973, 3975937, 5282863, 7988827, 8244487, 3891000, -2142505, -5478284, -5907646, -6640167, -8634421, -8993911, -5895003, -2213147, -1932482, -4572399, -6001099, -4224633, -1326019, 603585, 1971007, 2639494, 88613, -6104862]
40402f104862m701042J867691N833260K576060k242973j300211L211291L767799
40394B907013k79512k541616n50602J090366n90430k296316q32839J802141K503576
40385A211781J502625J75618j377540k369658j184080P32356n28082m427399m839145
40376a1103524P00406N753864L933393j217402j516972L350093N556300J009550
40368F465708m861421m965098L85121M934591M366044J04119l569251l969633
40360a109820j501256J796211M044247M103900J784399j568848l633121l490925
40352D24787k610775k224504j265977J004325K257911M24875j760649r8378L922444
40343G4059M670383J296013r04030N37641J357647j378508l561141j004945L067986
$$ y = [-6104862, -10805904, -8938213, -3104953, -528893, -2771866, -4072077, -860786, 2907013, 2627501, 85885, -464717, 625649, 35219, -2261097, -3093936, -1291795, 1211781, 2714406, 2890024, 1512484, -857174, -2041254, -1308898, -1836980, -6264379, -11103524, -10403118, -4649254, -715861, -1933263, -3450235, -100142, 5456158, 6465708, 1604287, -3360811, -2975690, 1958901, 6324945, 6429064, 2859813, -1109820, -2611076, -814865, 3229382, 7333282, 9117681, 7548833, 3915712, 424787, -2185988, -4410492, -5676469, -4672144, -2414233, -1989358, -3750007, -3848385, 74059, 4744442, 6040455, 5136425, 5674066, 7031713, 5653205, 2092064, 1087119, 4155105]
40334D155105L115175m2979j457039p6947J222285J430790J560310P78896j980623
40325H704973l976723j924164J822010K204926l06516p62590J385620J471766
40317H619302j560258k820510j75646J718865l45549k244805K35618L589232K069786
40308I086035k708078m217676j077442J872857K004147J980247L322684K826205
40300A3088979j636731o146614n635673j228031J499113M38830j052834k11634
40292h84595J227903Q55858j55587L85659J222596l50120k964875k029623L149371
40283D56587P033635M723325j691395o114549n678964k386677Q88327L072322
40275C02611M079244L805209K284647j62276k641694l328159j042605K184773
$$ y = [4155105, 7270280, 7227301, 5770262, 5693315, 6915600, 8346390, 9906700, 10685596, 8704973, 4728250, 2804086, 4626096, 6831022, 6524506, 5761916, 7147536, 8619302, 7059044, 4238534, 4062888, 5781753, 5436204, 3191399, 3427017, 7016249, 9086035, 6377957, 2160281, 1082839, 2955696, 4959843, 6940090, 10262774, 13088979, 11452248, 5305634, -330039, -1558070, -58957, 379873, -672961, -884595, 343308, 1199166, 1043579, 1429238, 2651834, 2301714, -663161, -2692784, 456587, 7490222, 12213547, 10522152, 4407603, -1271361, -3658038, -2769711, 302611, 4381855, 8187064, 10471711, 10309435, 7667741, 4339582, 3296977, 5481750]
40267E481750K591391J1902j286740Q11277K405209k60387m205619m140847q43307
40258E64629O94898k25369M3429J609731L57764l776115n026264r52823L064469
40249c645651K134385r89475j361106N12201J363886J290324J868972J655054
40241B828590q12746k361086M76395M583317M009085o91807l312365j705087O500
40232C020796n37479m32910K018901L514910J534043j162322j378158n80328j339117
40223D658336k402714j614343o66428k063239l445208l59856N857209Q231397
40215H195154L316024l882562o176088k615254J700274K613030J132438O56765
40207D939781J918705K293416O3314k490958k095417L80096Q11347j776089l263254
$$ y = [5481750, 8073141, 8085043, 6798303, 7609580, 10014789, 9754402, 5548783, 1407936, 564629, 1259527, 1034158, 1077587, 2687318, 3045082, -731033, -5757297, -6710120, -3645651, -1511266, -2500741, -3861847, -3349646, -1985760, -695436, 1173536, 2828590, 2015844, -345242, 131153, 4714470, 8723555, 8031748, 4719383, 3014296, 3020796, 2483317, 2050407, 4069308, 7584218, 9118261, 7955939, 6577781, 5997453, 4658336, 2255622, 641279, -25149, -2088388, -5533596, -5893452, -36243, 8195154, 11511178, 7628616, 1452528, -1162726, 537548, 3150578, 4283016, 4939781, 6858486, 9151902, 9215216, 6724258, 4628841, 5008937, 5820284, 4044195, 780941]
40198G80941q26514K146629R47092l154725m803547k405900M98964J309648J153529
40189d353883J180054O63491K7293J352947L941019L546610j211580n324214l700196
40180c878459J764569N066131M003707J466041P4193o97039k105980l651627l587868
40171a546332r07427K835020L702041l94545n254429m018735K976663O705718
40163D097974J538822n888906n706217J015870M673035J819415j164620L57285
40155G42658K561402J012567j895998j850124J99087N62186r38805j595091m04728
40146a606846J390900K582480K362339L63129j897706k017366n09742m40114j923448
40137a696374j178320K796949N329813L094305n62989j357258p44700k044182
$$ y = [780941, -45573, 2101056, 3048148, -106577, -4910124, -7316024, -6817060, -5507412, -4353883, -3173829, -2510338, -2483045, -1130098, 2810921, 6357531, 5145951, -178263, -3878459, -2113890, 2952241, 6955948, 8421989, 8496182, 7799143, 5693163, 2041536, -1546332, -2453759, 381261, 4083302, 3688757, -1565672, -5584407, -2607744, 4097974, 5636796, -252110, -5958327, -4942457, -269422, 1549993, 385373, 742658, 3304060, 4316627, 2420629, 570505, 769592, 1331778, 392973, -1202118, -1606846, -215946, 2366534, 4728873, 5092002, 3194296, 1176930, 667188, 227074, -1696374, -2874694, -77745, 5252068, 8346373, 7783384, 6426126, 5681426, 3637244]
40129C637244l896830l191098j135736l98223P43332M572776O833523J611456
40121H776444p477097r580290j531995P194908P282126Q25283l873287l436962
40113a820870q73437N28820L67997j15268M98762K445326L486082R94614l563270
40104A948756n067232j399305L191395L716323R47404n77563O88728J760397m8027
40095E160876l386159m751924k881673j90820L98212o25006j27314K699053M493145
40086G88390K526684j050021k530267j987231j547039l70713L493530P187947
40078F511280N069885k459276p863545o215829j029445K030397K376821K223435
40070F43723J477850q57319l100685k769257l09858K027189L271899L292266J534829
$$ y = [3637244, -259586, -3450684, -4586420, -4984643, -4241311, 331465, 7164988, 8776444, 1299347, -8280943, -9812938, -2618030, 4664096, 5489379, 1616092, -1820870, -2694307, -2165487, -1797490, -1912758, -1413996, 1031330, 4517412, 5512026, 1948756, -3118476, -4517781, -1326386, 2389937, 3337341, 2759778, 3448506, 5208903, 5160876, 1774717, -2977207, -5858880, -6049700, -5651488, -6276494, -6403808, -3704755, 788390, 3315074, 2265053, -265214, -2252445, -3799484, -4170197, -676667, 6511280, 11581165, 9121889, 1258344, -4957485, -5986930, -3956533, -1579712, 643723, 2121573, 1264254, -1836431, -4605688, -4915546, -2888357, 383542, 3675808, 5210637]
40061E210637j209324k099924n2761J990242J347368k66005k4012R79262j88330
40052E687153k843673l329523m22849L262859M851719L431990n02536m914403
40044E220737o173274k303310L599502N772247K100703l628564n973137l176527
40036d561623J613653L745039J995372j05833P65543K389226R5804m882249n437274
40027d382342Q61868O752060N162594m62061j568321K911275O020780L491197
40019A8787050j503960m436184m624918l428436j850672j073737j755704k198046
40011b084607m61011J832480J468954r36023j705540j40265Q32375K61404M58080
40002d74153J901094J980171K68566j8350K092146K884374J58620k589636j579558
$$ y = [5210637, 4001313, 1901389, 1848628, 3838870, 5186238, 4920233, 4896221, 5875483, 5687153, 2843480, -486043, -908892, 2353967, 7205686, 10637676, 10135140, 5220737, -952537, -3255847, 343655, 6115902, 8216605, 4588041, -1385096, -4561623, -2947970, 797069, 2792441, 2686608, 3452151, 5841377, 5937181, 1054932, -4382342, -3520474, 3231586, 8394180, 7932119, 6363798, 9275073, 15295853, 18787050, 17283090, 12846906, 8221988, 4793552, 2942880, 1869143, 113439, -2084607, -2545618, -713138, 755816, -180207, -1885747, -2026012, -1193637, -932233, -474153, 1426941, 3407112, 3675678, 3657328, 5749474, 8633848, 8792468, 6202832, 4623274]
39993D623274J409080K254140N47059j207450j991902k283735j588267N35518
39985B297717K265862J424652j197175k765640j840282Q05048L477750M129960
39977H597892J436078k855834m565024k105357J074959J237999o09708j074218
39969A136787K61647J092000O96584O12279J391967J497497l71288l460550n328537
39960b471614l508927J677121N548263L347227k599959m179800J276901N904213
39952D993425K339645m745830n441719J97742K975586n7333j369186L222169O465963
39943H580462J548899n758129n276625J849102M745702j165963q051183o908894
39935a0436629J286548Q197462P886601J664550m321640m732222J40569M601626
$$ y = [4623274, 6032354, 8286494, 8833553, 7626103, 5634201, 3350466, 1762199, 2297717, 4563579, 5988231, 4791056, 2025416, 185134, 990182, 4467932, 8597892, 10033970, 7178136, 2613112, 507755, 1582714, 2820713, 2211005, 1136787, 1398434, 2490434, 3187018, 3799297, 5191264, 6688761, 6317473, 2856923, -2471614, -5980541, -4303420, 1244843, 4592070, 1992111, -2187689, -910788, 4993425, 7333070, 2587240, -2854479, -2656737, 318849, 261516, -1107670, 2114499, 8580462, 10129361, 4371232, -905393, 943709, 5689411, 4523448, -3527735, -10436629, -9150081, -952619, 6933982, 8598532, 4276892, -455330, -314761, 4286865]
39927D286865L952201M5503j710473J61395K086337J366433p21648k253700l249386
39918C963527l843236l305149k047829j315205j1842M145108R067961Q771065
39910A5424400J992394m444465m634682j638063j842851n002137n613300j907635
39902g666339K347307L900088K849348M64400j267269M93931N155727O480234
39894A2757427O10619o095578m904471J439252K281519l679402n965251J60243
39886c395642N530404K502634k246978N66090O869730O105588j405877n632229
39878H893720k748423J142116J581999R53750J278470P71197p27458o24225L85968
39869A0907114j598773n793391o249377j631100J867619O24443n96667K513091
$$ y = [4286865, 8239066, 8284569, 6574096, 6735491, 8821828, 10188261, 9466613, 7212913, 3963527, 120291, -3184858, -5232687, -6547892, -6559734, -2414626, 6653335, 15424400, 17416794, 12972329, 8337647, 6699584, 4856733, -145404, -5758704, -7666339, -5319032, -1418944, 1430404, 1894804, 627535, 1121466, 6277193, 12757427, 13368046, 7272468, 2367997, 3807249, 6088768, 2409366, -3555885, -3395642, 2134762, 4637396, 2390418, 2956508, 9826238, 15931826, 14525949, 8893720, 6145297, 7287413, 8869412, 9823162, 11101632, 11872829, 11145371, 10521146, 10907114, 9308341, 3514950, -2734427, -4365527, -2497908, -1873465, -2470132, 42959]
39861D2959N671637K895214l023245l800243K455067Q518894P261284k92513o722086
39852A3006968o078266K58940N080925L287428k266384m783081k344942Q27125
39844F988713J400817M46823o31227k426383m140023l013258N62100K355618J229470
39835B772650J331290M155355M395732j446766p766422p315932j763292J789399
39827c847986J493238R74337J376691O56605m01145J160459L961278L393201k96721
39818H469957j801975K92611J159258j602528l551082j061253K330277J741206
39810E976471j205788j372086J756360L781976J997980j778062m477810m640526
39802C8515k261050J339246L394410J977701j105747j820635R03014L287675J416423
$$ y = [42959, 5714596, 8609810, 5586565, 1786322, 4241389, 12760283, 20021567, 19729054, 13006968, 6928702, 7187642, 12268567, 15555995, 13289611, 8506530, 6161588, 6988713, 8389530, 8836353, 8205126, 5778743, 1638720, -1374538, -812438, 1543180, 2772650, 4103940, 8259295, 12655027, 11208261, 3441839, -3874093, -5637385, -3847986, -2354748, -1380411, -3720, 652885, 251740, 1412199, 5373477, 8766678, 8469957, 6667982, 6960593, 8119851, 6517323, 2966241, 1904988, 4235265, 5976471, 4770683, 3398597, 5154957, 8936933, 10934913, 9156851, 4679041, 38515, -2222535, -883289, 2511121, 4488822, 3383075, 1562440, 2465454, 5753129, 7169552]
39793G169552l308656n354872j812138L794620N641785K496996j368581j920068
39785E338638J67619J499652L97319k166404m540128n346991l397959J135488
39777f912766N517053O258506K752533j809362l612017j978062K44346J47215
39769F07446j467509q45930L269542O596165M372851j522730m380445j746343
39761D883047J676494J408650j221591l086267l949453l813626n17796N333101
39753G12559P590292K667311l357180k673873K277539K889280j484106k994779
39745E627043P83963K406358k835906q682098p403269o82285M691774O528712
39737D34292O647253N022203J033197k312351j658100Q46771M86809k466044l458757
$$ y = [7169552, 3860896, -1493976, -3306114, 488506, 6130291, 8627287, 7258706, 5338638, 5506257, 7005909, 7403228, 5236824, 696696, -4650295, -8048254, -6912766, -1395713, 4862793, 7615326, 5805964, 2193947, 215885, 460231, 607446, -860063, -1705993, 1563549, 8159714, 12532565, 11009835, 6629390, 4883047, 6559541, 7968191, 6746600, 3660333, -289120, -4102746, -4620542, 712559, 8302851, 10970162, 7612982, 4939109, 7216648, 10105928, 8621822, 5627043, 6411006, 8817364, 5981458, -2700640, -10103909, -10786194, -6094420, 434292, 7081545, 12103748, 13136945, 10824594, 9166494, 10013265, 10500074, 8034030, 4575273]
39728D575273j206128P61256K91061n42194J15807O87210q14184l372565m356883
39719c861347k675648M89348K909740K934981J075431j47812Q08219K250079J659517
39710E442508m06185j180179q5420M78372q88863k443584k101619k12468J709753
39701C12315L209833M314061M085301J614031j957097l880425k534682Q83792
39693F047129L425834K859159n94085m358223n310581k127821L462638P592274
39685A0996324P027552J969856l710396n750329l530539n18398l79362l077030
39677C027678n239124l985415J74537M124675N325817L964674J924444Q2973k258822
39668G141437m864869n224577j808807K268678K005048k486780m938818r02365
$$ y = [4575273, 3369145, 4130401, 4421462, 3879268, 3995075, 4682285, 3868101, 495536, -3861347, -6536995, -6047647, -3137907, -202926, 872505, 724693, 1532912, 3782991, 5442508, 5036323, 3856144, 3770724, 4249096, 3360233, 916649, -1184970, -1397438, 312315, 3522148, 7836209, 11921510, 13535541, 11578444, 7698019, 5163337, 6047129, 9472963, 12332122, 11738037, 7379814, 2069233, -58588, 3404050, 10996324, 18023876, 19993732, 16283336, 10533007, 7002468, 6484070, 6104708, 3027678, -2211446, -6196861, -6022324, -1897649, 3428168, 7392842, 9317286, 9400259, 7141437, 2276568, -2948009, -4756816, -2488138, -483090, -2969870, -7908688, -8811053]
39660h811053N803703P697310L266363j596141j730128J246704K382743J60224
39652H419725k532578k842749q89002J567686L282333L683507K382615j90523
39644A2881014k244980k016438R3806J585863N61048k002235l196956j525423
39636D135699R91524O60194l347178o809321m489581L052095Q695391O692603
39628I581426l08032m981736m637089k618181r69121K426914P504878Q902244
39620A4901303L686145k511001k906736L42025K46283l208126l462567P87579
39612G874905K869767o43579m049615j949389K227092K555827J51659Q9021K478249
39603A1603937L177153J341521L4089J70429m77365k267941k707668j027100N13079
$$ y = [-8811053, -3007350, 4689960, 7956323, 6360182, 4630054, 5876758, 8259501, 8419725, 5887147, 3044398, 2155396, 3723082, 7005415, 10688922, 13071537, 12881014, 10636034, 8619596, 8713402, 10299265, 10860313, 8858078, 5661122, 4135699, 5127223, 5787417, 2440239, -4369082, -8858663, -5806568, 2888823, 9581426, 9273394, 4291658, -345431, -2963612, -3932733, -1505819, 5999059, 14901303, 18587448, 16076447, 13169711, 13511736, 13758019, 10549893, 7087326, 7874905, 10744672, 10101093, 6051478, 4102089, 6329181, 8885008, 9036667, 9125688, 11603937, 14781090, 16122611, 16156700, 16327129, 15849764, 13581823, 10874155, 9847055, 10360134]
39594A0360134N60450J89870l1556q30324j537134m48937J279210J97812l433804
39585F305721m375400J55265N305616M594663j138827m910845k869126J548150
39577D615217L132205J190163j179184j723484q60806O519O5774p01462j413282
39568C131660n69545K081404M022660K238970k341609m739079j901968K823320
39560D745813L606038l65916m138353l731951o18448J551472J942460K170292
39552E161407K695079K173930J17641j829554j896017n35349K6607j343805k854205
39543A715734j799672J515941L531472K182296J3729L46647K038557J443373j322175
39534I665902k293739j81236J390310k42717k525268j745069J636748M347182
$$ y = [10360134, 10920584, 11110454, 11078898, 10248574, 8711440, 8262503, 9541713, 9739525, 6305721, 1930321, 2085586, 7391202, 11985865, 10847038, 5936193, 3067067, 4615217, 7747422, 8937585, 7758401, 6034917, 5174111, 5180630, 5246404, 4544942, 3131660, 2562115, 4643519, 8666179, 10905149, 8563540, 3824461, 1922493, 4745813, 8351851, 7985935, 3847582, 115631, -502817, 1048655, 2991115, 5161407, 7856486, 10030416, 10148057, 8318503, 6422486, 5887137, 5913744, 4569939, 1715734, -83938, 1432003, 4963475, 7145771, 7159500, 7506147, 9544704, 10988077, 9665902, 7372163, 7190927, 8581237, 8338520, 5813252, 4068183, 5704931, 10052113]
39526A0052113M679145L020432L1550l170722m576565l392424j481429r17354
39518D244746j283960q88975O09485K074692K236214N23258k015154k749362p00814
39509B050130R31474r35525l262407o64629M697380M315219l284078q308214l639680
39500h100330M385373N897917J899511L75770K654157L055310k30238k987340
39492F950130k854811j438454P15682L717016L984452j447486p055224m544341
39484a973036L235971M293825m274402j0375326m154193P724827J1826571N567149
39476A1871386k209361m256105j595529J117079J418418J68999l76107L96721
39468F535501K39442k311692m108680j386154L080186K798641j918121l352067
$$ y = [10052113, 14731258, 17751690, 17783240, 14612518, 10035953, 6643529, 5162100, 4244746, 2960786, 2071811, 2681296, 4755988, 6992202, 7515460, 5500306, 2750944, 2050130, 2981604, 2046079, -1216328, -1880957, 2816423, 7131642, 3847564, -4460650, -8100330, -3714957, 2182960, 4082471, 4458241, 7112398, 10167708, 9937470, 6950130, 4095319, 2656865, 3372547, 7089563, 11074015, 9626529, 2571305, -1973036, 1262935, 5556760, 1282358, -9092968, -13247161, -5522334, 6304237, 11871386, 9662025, 5405920, 3810391, 4927470, 6345888, 6514887, 6138780, 6535501, 6774943, 4463251, 354571, -1031583, 2048603, 4847244, 2929123, -422944]
39460d22944J557737O007989M025247p03707j911676l86709k86478j072084j13708
39451F693667O18824k236570o128747n495827m99446L418549L746538K931668
39443C048656K834689K547583J643258R41337O730k168237m225940l775597j207607
39434c55128J042557K105481K351423R23593k626457n483007m280710J56985M125924
39425b039339N675952M641361M69777n454375p707203k813169M157768N225066
39417B155838Q64650j160572J650019L027668r10655m712544k337074L117783
39409A695113M322521O14980k120015o96840J983482K634875J629829K00150k133146
39400H130949m908464m726033L53366N870787M902642k361357p253515l470308
$$ y = [-422944, 1134793, 7142782, 11168029, 10464322, 8552646, 8165937, 7879459, 6807375, 6693667, 7312491, 5075921, -1052826, -6548653, -7048099, -3629550, 116988, 3048656, 5883345, 8430928, 10074186, 11015523, 11022253, 8854016, 4628076, 852479, -355128, 687429, 2792910, 5144333, 6067926, 3441469, -2041538, -6322248, -6165263, -2039339, 3636613, 8277974, 8747751, 3293376, -4413827, -7226996, -3069228, 2155838, 3020488, 1859916, 3509935, 6537603, 5626948, 914404, -1422670, 1695113, 6017634, 6632614, 4512599, 3815759, 5799241, 8434116, 10063945, 10264095, 8130949, 3222485, -1503548, -1150182, 4720605, 9623247, 7261890, 8375, -3461933]
39392c461933M244912O478837J814809k409912j279427J926608K282323k03854
39384I392363k884716m360244l473635P30368N213888M240193k099789n989375
39376G69053k695674K287853K117534j054063j297397O38381J96733j504381O9158
39367d72803L595155L866742J471528J350138K574604o09452p005403p801491
39359c030982j76018P445997P314256J838685k562599m051378l760192j890406
39351A127363L71996L78213r94543P75848N779468P451950K319461l988786n092997
39342H127973k624442j382976r37649J660740M651838L714070o95364l859273
39334H654917l560254j774706n26321J02199L92492L50272K66450L76147Q79365
$$ y = [-3461933, 782979, 7261816, 9076625, 6666713, 5387286, 7313894, 9596217, 9392363, 6507647, 2147403, -1326232, -595864, 4618024, 8858217, 6758428, 769053, -1926621, 361232, 2478766, 1424703, 127306, 765687, 962420, -541961, -472803, 3122352, 6989094, 8460622, 9810760, 12385364, 11775912, 4770509, -3030982, -3207000, 4238997, 11553253, 13391938, 10829339, 6777961, 3017769, 1127363, 1499359, 1877572, 883029, 1658877, 7438345, 14890295, 17209756, 13220970, 8127973, 5503531, 4120555, 3182906, 4843646, 9495484, 13209554, 12514190, 8654917, 5094663, 3319957, 2793636, 2895835, 3288327, 3638599, 3905049, 4281196, 5160561]
39325E160561K546647N026957M972134n7960n942153n903657p63876J645209r04961
39316E778901j387912L625474O548611J112483n868618m305383L298859N897509
39308A4699924L04093o370982q591455p112800k993634L533523Q180979N825688
39300G475336l23334j376793L874620O825040K726644k140553j175785K332994
39292A8218169J550855l010697n457805l995512k254857k504058k697958n75506
39284g27369K718402M144705K520534O3568p481K275204K880558j046902o373449
39275F447770p138718k178684L445097M810279K017458j637449l478262k778950
39267d91459p43456L47353p2130N08114L583997N476085J640580n261599p055487
$$ y = [5160561, 7707208, 12734165, 17706299, 17648339, 11706186, 5802529, 5038653, 6683862, 5778901, 4390989, 8016463, 14565074, 15677557, 9808939, 5503556, 8802415, 14699924, 15004017, 8633035, 41580, -7071220, -10064854, -6531331, 1649648, 7475336, 7152002, 5775209, 9649829, 16474869, 19201513, 17060960, 15885175, 18218169, 19769024, 16758327, 11300522, 7305010, 5050153, 2546095, -151863, -727369, 1991033, 6135738, 8656272, 8719840, 8712359, 10987563, 13868121, 12821219, 6447770, -690948, -2869632, 575465, 5385744, 7403202, 5765753, 2287491, -491459, -1234915, -887562, -959692, -451578, 3132419, 8608504, 10249084, 4987485, -2068002]
39258b068002j129406N381632N077447m79283m360753l514996n10173J522066
39250h1468J733803N81759p18919m10701J654700K837055R26721k300010l138056
39241A084884r85035J224329J534046J245832J827234J950032k18365k936728
39233D726229k126943K511269N474805K334604l113187k991933L176444O457788
39225A6449076Q08450p434217p746330k49491M472751K78317o559971o818842
39217f800257n16308M672957M346781J892138K204695M723213M795152N03556
39209A5821927m513676n837678l776418j795927p98958J276877M165048M264597
39201H805792O97680k194156j342855L91392k28663j074161O19237K023940m96199
$$ y = [-2068002, -3197408, 2184224, 7261671, 6782388, 2421635, -1093361, -1603534, -81468, 1652335, 2234094, 1515175, 1104474, 2759174, 5596229, 6522950, 4222940, 1084884, 99849, 1324178, 2858224, 4104056, 5931290, 7881322, 7662957, 4726229, 2599286, 5110555, 10585360, 12919964, 9806777, 6814844, 9991288, 16449076, 17257526, 9823309, 2076979, 1827488, 6300239, 6578556, 18585, -6800257, -7316565, -2643608, 1703173, 3595311, 5800006, 10523219, 15318371, 15821927, 11308251, 5470573, 1694155, -101772, -900730, 376147, 4541195, 8805792, 9503472, 7309316, 5966461, 6357853, 6129190, 5055029, 5674266, 7698206, 7202007]
39192G202007l821164k536114J557543K302616j13791N1624L214912L604459N5877
39183A1517969j745899J04476L01137l033484l630224J781942O069607K218208
39175A3583732n455144p892132l951619N86955K445119K340548N66843k076108
39167A48194j719568L584919Q597541P062032J174049j708435k69490j1010l153614
39158A3704618n064299k394235J366413J495357j036222j712179P23655K829807
39150I912915J493507j770333k688172P8940K870659J889108j572844l392205
39142F821575k753707k206940k367858j400555J94282j55765j235194J313268
39134a790894O688186P982283K532466l407337m121073j941538r13136J00635
$$ y = [7202007, 3380843, 844729, 2402272, 4704888, 4591097, 4642721, 7857633, 11462092, 11517969, 9772070, 9876546, 10177683, 7144199, 3513975, 5295917, 11365524, 13583732, 8128588, 236456, -3715163, -3128208, -683089, 1657459, 2224302, 148194, -1571374, 2013545, 10611086, 17673118, 18847167, 17138732, 16869242, 16858232, 13704618, 8640319, 6246084, 7612497, 9107854, 8071632, 6359453, 7083108, 9912915, 11406422, 9636089, 6947917, 7026857, 9897516, 11786624, 10213780, 6821575, 4067868, 1860928, -506930, -1907485, -1713203, -1868968, -3104162, -1790894, 4897292, 12879575, 15412041, 12004704, 7883631, 5942093, 5028957, 5129592]
39126E129592K447411K676416q85966k947544J17300K774638m18668m460096k337954
39117B095129K119271R51536l282958k094130L130103L536183n80676J8937O149646
39108A2043041P690000J332988l371768p68945J526572k798717o839595k427055
39100F386521N497114O654356Q38657m113386m773037l596736j822612O78463
39092E749340J248184k128782n264392k645641L670584O465175L468272q91571
39084I671169k887175k832092j423764J633505M703844M523578P04210l140286
39076A0952989l648807j026091K031643K993216J366493p20554o15395J129460
39068A2462954Q24645l024125o567509n227821L1102L674449K193996k296619
$$ y = [5129592, 7577003, 10253419, 9367453, 6419909, 6537209, 9311847, 8893179, 4433083, 2095129, 4214400, 5165936, 1882978, -211152, 2918951, 6455134, 5874458, 5893395, 12043041, 19733041, 21066029, 17694261, 16925316, 18451888, 15653171, 8813576, 6386521, 11883635, 18537991, 19376648, 15263262, 10490225, 6893489, 5070877, 5749340, 6997524, 4868742, -395650, -3041291, 629293, 7094468, 10562740, 9671169, 6783994, 3951902, 2528138, 4161643, 8865487, 13389065, 14093275, 10952989, 7304182, 6278091, 8309734, 11302950, 12669443, 11948889, 11333494, 12462954, 13287599, 10263474, 3695965, -1531856, -1500754, 2173695, 4367691, 2071072]
39060B071072m824948k733268J678052L484162Q51947k312592j372854K403280
39052g55149L666944J141190n48677J675478M539059L482319r45763m523481m733538
39043B998382k336596N46961K063872J704955P16500L19217K4975m34091P25613
39034F329788L836310M678304Q8450n164867l800352K633675N472614J893854
39026A5967776k229349l086331l221052l308788K09706N912638O094301n81055
39018A5757846n128971k431923R06124o49989j847569J930556M348831l58746
39010A2526159n422881k939554J733609O2945l497460k56326M960041J611531
39002H778064o082119m810100M080439N713283k763384p106503n26383N153424
$$ y = [2071072, -2753876, -5487144, -3809092, -324930, 527017, -1785575, -3158429, -755149, 2911795, 4052985, 3504308, 5179786, 9718845, 13201164, 12255401, 7731920, 2998382, 661786, 1208747, 3272619, 4977574, 5694074, 6013291, 6038266, 5604175, 6329788, 10166098, 14844402, 14932852, 9767985, 5967633, 8601308, 14073922, 15967776, 13738427, 10652096, 7431044, 4122256, 4331962, 10244600, 16338901, 15757846, 10628875, 8196952, 9103076, 8453087, 6605518, 8536074, 12884905, 12526159, 7103278, 4163724, 5897333, 5960278, 2462818, 2206492, 7166533, 8778064, 2695945, -2114155, 1966284, 7679567, 4916183, -2190320, -2716703, 2436721]
38994B436721L08149o775114m975698J977203M041921J197446J17978J603729
38986f7665J652392K97201N09304J545739N65312j586611j750373N08060L082858
38977D756217M232465L016989o7342j834328m202J926000o67182m521914k441382
38968D395321L534159L454526l938679p855542l165267J107716j819015m061526
38960h348307K513078J0218954P110378k902181n678982J510919P564849N293128
38952A7281836o33208l875626m104944k934389n75256J636401J691251P32188
38944I218253J198847J703274p05456m131492l629208J150739N517844O201892
38936A6524693L439608j727447p029511p914272k724949K909671K632906j746207
$$ y = [2436721, 2744870, -4030244, -9005942, -7028739, -2986818, -1789372, -1671394, -67665, 1584727, 1881928, 2391232, 3936971, 4502283, 2915672, 1165299, 1673359, 4756217, 8988682, 12005671, 11938329, 10104001, 10099799, 12025799, 11358617, 6836703, 4395321, 7929480, 11384006, 7445327, -410215, -3575482, -2467766, -4286781, -8348307, -5835229, 4383725, 11494103, 8591922, 2912940, 4423859, 11988708, 17281836, 16648628, 12773002, 8668058, 5733669, 5158413, 6794814, 8486065, 9218253, 10417100, 12120374, 11414918, 7283426, 3654218, 4804957, 10322801, 16524693, 19964301, 18236854, 11207343, 3293071, 568122, 3477793, 6110699, 4364492]
38928D364492l757323k051855j45662Q33216J801946Q43814l187752m802639J101926
38919d999837Q446049O808386j846220n033748P63083N004696R39200l786261
38911F295348p66590N394777N463577R5982l053506j793340m24300j134019j822990
38902H254939j276214n60926K51797K215514M560213M977414K780382l32271k287694
38893A8583154k303703j448152j839703l761356m134396o46582L419940K755067
38885A0624269j742065l543976k54594K830102J088542k792156l679107j117100
38877A413915J733442K732401J391866j881586m607294l497455Q12006L562216
38869A659511K376028L65094Q09366K672865L568029L205266J727759j334404
$$ y = [4364492, 607169, -1444686, -1590348, -757132, 1044814, 1888628, -1299124, -6101763, -4999837, 3446212, 10254598, 8408378, 3374630, 4137713, 9142409, 10081609, 6295348, 5528758, 10923535, 16387112, 16483094, 13429588, 11636248, 11211948, 10077929, 8254939, 6978725, 6417799, 6669596, 8885110, 13445323, 18422737, 21203119, 20870848, 18583154, 16279451, 14831299, 12991596, 9230240, 5095844, 4449262, 7869202, 10624269, 8882204, 5338228, 5083634, 7913736, 9002278, 6210122, 2531015, 1413915, 3147357, 5879758, 7271624, 5390038, 782744, -2714711, -1902705, 1659511, 4035539, 4400633, 5209999, 7882864, 11450893, 14656159, 16383918, 15049514]
38861A5049514m421034m518120k122276q56238p72568J839393O133218N783858
38853A6115747k26271m050779j216475J845974q50422m131456j020781M250005
38845A0715542L067206k862099m803114j629181J42791r99726k85552K450930
38837E796797J800274k333183l379479M33928L032849J314903m18769K27734n55772
38828E919282l838170l876861J729114O032082L099698k605062l862739j715963
38820H81381j687430l764308l696777j194693K51782k5837M41811K057594K822394
38811c914083K477732K652597L460421L415261J995059k92746k902352m121141
38803B770748j545059L617923N831733K190431l080591m762206l629709k781415
$$ y = [15049514, 10628480, 6110360, 3988084, 3131846, 2359278, 4198671, 10331889, 16115747, 15889476, 11838697, 10622222, 12468196, 11617774, 7486318, 6465537, 10715542, 13782748, 10920649, 6117535, 4488354, 4631145, 3631419, 3345867, 5796797, 7597071, 5263888, 1884409, 2318337, 5351186, 6666089, 6247320, 6475054, 5919282, 2081112, -1795749, -66635, 5965447, 9065145, 6460083, 2597344, 881381, -806049, -4570357, -8267134, -9461827, -9210045, -9235882, -8794071, -6736477, -3914083, -1436351, 1216246, 4676667, 8091928, 10086987, 9794241, 6891889, 2770748, 1225689, 4843612, 10675345, 12865776, 9785185, 5022979, 1393270, -1388145]
38795a388145j047198L632171P369272M494880k711480o019413k946896P36835
38787B120026Q16482l71547l54386o69877j729352k69264M094046N706170J170824
38778A0513122m097967l193670K106127M419081J586547j614776j525020L43497
38770H536941J515611J932163K044364J319463m0142p75179j059108k686866n540007
38761E247240o263041k336154L875923O972347M244181j377766m340920k291366
38753C730444J528091K298397n24026l149279l147580k225971k111432j199160
38745d800516J782401L966038K531757K77777J586193M332972K440371l477709
38737H639284n507247o52228L823662J717637k180934j66795N371766N457445
$$ y = [-1388145, -2435343, 1196828, 8566100, 13060980, 10349500, 4330087, 1383191, 2120026, 2936508, 2564961, 2210575, 1540698, -188654, -457918, 3636128, 9342298, 10513122, 6415155, 3221485, 5327612, 9746693, 11333240, 9718464, 8193444, 8536941, 10052552, 11984715, 14029079, 15348542, 15308400, 14533221, 13474113, 10787247, 5247240, -1015801, -3351955, 523968, 7496315, 11740496, 10362730, 6021810, 3730444, 5258535, 7556932, 7032906, 3883627, 736047, -1489924, -3601356, -4800516, -3018115, 947923, 3479680, 3757457, 5343650, 9676622, 12116993, 8639284, 3132037, 2479809, 6303471, 8021108, 5840174, 5673379, 11045145, 16502590]
38729A6502590j191020o112152l794622J363868L015192J239628m59971j403896
38721I159617k779913l868405l252913j683639n57822N63529K148041K468016
38713B196511K45768k280916k244049o53851m80633j316039m8201L233680M322615
38704B974885J214513k314023j911923J087771J800025q73784k466778O72705
38696A83391N830308P047870K813709k150426l391917k245120k563437m020282
38688A504096k663974J986369M861005K357756k122088k916726k9030J601221
38680D578629k85915k452702j387728K030683M403573L994377J595388j130946
38672A1345359k713528k310191m19645J234266J326483K13831p62056q57343l99182
$$ y = [16502590, 15311570, 9199418, 5404796, 6768664, 9783856, 11023484, 10563513, 9159617, 6379704, 2511299, -741614, -2425253, -2983075, -2419546, -271505, 2196511, 2442279, 161363, -2082686, -2736537, -3217170, -4533209, -4581410, -1347730, 2974885, 4189398, 1875375, -36548, 1051223, 2851248, 1977464, -489314, 183391, 6013699, 13061569, 15875278, 13724852, 10332935, 8087815, 5524378, 1504096, -1159878, 826491, 5687496, 8045252, 5923164, 3006438, 2977408, 4578629, 4292714, 1840012, 452284, 2482967, 6886540, 10880917, 12476305, 11345359, 8631831, 6321640, 5901995, 7136261, 8462744, 8676575, 7914519, 7057176, 6657994]
38663F657994R9700Q04691K126971L407669K906963J15669k621770k609580o34939
38654A0253368J77291n22219K20730K854871L146427j138779n228272l720456
38646F042961Q73408J815262j237627k054462J667421M720803L220740L39433
38638A5387939k03628m00460k925036m773175j919592K911799L558800k8875j750080
38629I857692J213675M481707L137700k016237o438720o973077l757424M99601
38621D917K351291Q77213p51134O10315K858446J158456m132069o498520k016392
38612e537477M821541O832636K914397j894704l147433q25011K338007L721103
38604I223059K536852M12967l87874j83258j518182m436451m903554n06554M848294
$$ y = [6657994, 6757694, 7562385, 9689356, 13097025, 16003988, 16119657, 13497887, 10888307, 10253368, 10430659, 9908440, 10129170, 12984041, 16130468, 14991689, 9763417, 6042961, 6916369, 8731631, 7494004, 5439542, 7106963, 11827766, 15048506, 15387939, 15184311, 14783851, 11858815, 7085640, 5166048, 8077847, 11636647, 11607772, 9857692, 11071367, 15553074, 18690774, 16674537, 10235817, 3262740, -494684, 4917, 2356208, 3233421, 2482287, 3092602, 5951048, 7109504, 2977435, -3521085, -5537477, -715936, 6116700, 9031097, 7136393, 3988960, 3163949, 5501956, 9223059, 11759911, 12172878, 11785004, 11601746, 10083564, 5647113, 743559, 237005, 5085299]
38595E085299N569089J937069j030930j067298m01384m45747K02800J683454J696086
38586A3228438M9953k15843J549942J545662j832636l917182p66585L753162L465492
38577A6860403n09377k101711m34266l47910l023928l744847o26283J769402O18496
38568H459979k71977J854392K643708j659423n942079l353676L085825M641568
38560I458317N96113j425707J324920K893416J12533j622948J322382L150475
38552A5809501j917662q871481q568372j087462N502278O946594N346340J872099
38544A5031835l981898p886918l050688Q076352J2995284M980930o986784r999030
38536I179083l630379K226247K107424l31249r87581p69382j121707n20747J803030
$$ y = [5085299, 10654388, 12591457, 11560527, 10493229, 10091845, 9646098, 9848898, 11532352, 13228438, 13278391, 13062548, 14612490, 16158152, 14325516, 10408334, 9641749, 13394911, 16860403, 16351026, 14249315, 13815049, 13467139, 10443211, 6698364, 6072081, 7841483, 8459979, 8188002, 10042394, 12686102, 11026679, 5084600, 1730924, 4816749, 9458317, 10054430, 8628723, 9953643, 12847059, 12959592, 11336644, 12659026, 15809501, 13891839, 5020358, -3548014, -4635476, 866802, 7813396, 13159736, 15031835, 11049937, 3163019, 112331, 8188683, 21183967, 26164897, 19178113, 9179083, 5548704, 7774951, 9882375, 9551126, 8563545, 7794163, 6672456, 6151709, 7954739]
38527G954739L168730J498762j118855j724624q28581p08049j386012j162705
38519E693405K43060J804590L299467M473584L094737k483718q654915q519291
38511a049081o09719P348756O674489j688432q241307o274181J352221P443077
38503D955823Q698932O303353J559070m599069q790067o849193K96591O011949
38495G587389N341968M91418l048484l249699j797401N9013K260023L647457K620172
38486A3911856J03652j074836k7208J346660J324435q1674k175918l716676k660065
38477F950226J205719M088596K449325j035260m37977M266101O469168K767791
38469B6723689k187113l335653k132248k039480k265465q23697N04861m27312
$$ y = [7954739, 11123469, 12622231, 11503376, 9778752, 8950171, 8242122, 6856110, 5693405, 5936465, 7741055, 11040522, 15514106, 18608843, 16125125, 7470210, -1049081, -1658800, 5689956, 12364445, 10676013, 2434706, -3839475, -2487254, 4955823, 13654755, 19958108, 21517178, 16918109, 8128042, 1278849, 1575440, 7587389, 12929357, 13420775, 10372291, 7122592, 5325191, 5384204, 7644227, 11291684, 13911856, 14015508, 12940672, 12913464, 14260124, 15584559, 15502885, 13326967, 9610291, 6950226, 8155945, 12244541, 14693866, 13658606, 13220629, 17486730, 23955898, 26723689, 24536576, 21200923, 19068675, 17029195, 14763730, 13940033, 14444894, 14017582]
38461A4017582j472671l30347L13004k296204m616604k274949J475020P19001
38453E533832k490738j595744K306986K148820j770563j548630L816762N614674
38445A2015399N25430l448844j453774j32454l995694n358018J637121P588367
38437G377533J880686p885583o079653N930964J1354260L620330n547904n933208
38429D717425j906069q01444j093703Q43397K369906O49811o04688K364477O203510
38420A2742622O018797K653215r17215m576862p120141l877336N058963J0335034
38412B0317077M930570m552354o424237K3101N387116M216795m66153m887462
38404A8544453p955124p526331j790342M904328N343951n0650l038079M47109
$$ y = [14017582, 12544911, 12214564, 12527568, 10231364, 5614760, 3339811, 4814831, 5533832, 3043094, 1447350, 3754336, 5903156, 4132593, 2583963, 6400725, 12015399, 12540829, 9091985, 7638211, 7505757, 3510063, -1847955, -210834, 7377533, 9258219, 1372636, -4707017, 1223947, 12578207, 16198537, 10650633, 4717425, 2811356, 2009912, 916209, 1759606, 4129512, 4779323, 4174635, 6539112, 12742622, 18761419, 21414634, 20497419, 15920557, 8800416, 4923080, 9982043, 20317077, 25247647, 20695293, 14271056, 14294157, 19681273, 23898068, 23431915, 18544453, 10589329, 3062998, 1272656, 6176984, 11520935, 11470285, 8432206, 8879315]
38396H879315M882216M150104k76550l365392l625035k650163j386050l0444R53431
38387G531432J685528K383167J554062j941350n082294l662769O38053J875334
38379D981163o53728j380473J190886J257427l100611m130571L147870J0245031
38371A1556994O690647k991602n342168J243868M310846k613288r825750o621784
38363c592237K923285P098718L213406j374299j588888K55515J013952J191569
38355I141021J523978N58738j946688k965726k90189L527608L886306j17183m524249
38346H793616m940785j108325K996352L327222J06543k292579l87731L981343
38338A0475656N597721K241313k585369m120878k002835J54289m0864j207604
$$ y = [8879315, 13761531, 17911635, 17635085, 14269693, 10644658, 7994495, 6608445, 6578001, 7531432, 9216960, 11600127, 13154189, 11212839, 6130545, 2467776, 3105829, 4981163, 4327435, 2946962, 4137848, 5395275, 2294664, -1835907, 1311963, 11556994, 18247641, 15256039, 9913871, 11157739, 15468585, 12855297, 3029547, -3592237, -668952, 6429766, 9643172, 8268873, 6679985, 6935500, 7949452, 9141021, 10664999, 11223737, 9277049, 6311323, 6021134, 9548742, 13435048, 13317865, 8793616, 3852831, 2744506, 5740858, 9068080, 9174623, 6882044, 6494313, 10475656, 16073377, 18314690, 15729321, 11608443, 9605608, 9759897, 9719033, 8511429]
38330H511429j165086k78066j72927m02720J019824L578039L489329j138645o230386
38321G210791n765178M98523O280280O358771K148578j494710k233259q85329
38313A2118467J356976L214065K537663j116547m065608k533582J292362J621374
38305A4425170k167088m127574q88889K959331K126914j167484j250212J813414
38297A1723582K968144O81744j361810j113428q63723j875700j754705N53454
38289H957558K005461P91591J12053K672631N006798K241486l724942o178310
38281A1884326k977448J090602J677329r1559j193754j110715n06788J052460
38273I824453L289740L639933N47676l251640l736238r21051J675254K247100
$$ y = [8511429, 7346343, 7068277, 6895350, 6492630, 7512454, 11090493, 14579822, 13441177, 7210791, 1445613, 1944136, 8224416, 14583187, 16731765, 15237055, 13003796, 12118467, 13475443, 16689508, 19227171, 18110624, 14045016, 11511434, 12803796, 14425170, 12258082, 8130508, 7241619, 10200950, 12327864, 11160380, 9910168, 11723582, 14691726, 15373470, 14011660, 12898232, 12034509, 10158809, 8404104, 8957558, 10963019, 11754610, 11866663, 14539294, 19546092, 21787578, 18062636, 11884326, 8906878, 9997480, 11674809, 11583250, 10389496, 9278781, 8771993, 9824453, 13114193, 16754126, 17301802, 14050162, 10313924, 9392873, 11068127, 13315227]
38265A3315227K277193K826812K486794K26897k265081k854000j858190r95890
38257A3159762p76127n75237j57564M76388J591055K436024R69588k907684n381157
38248H835048l085960J601526L368837J606475Q44003L088912M659330K554447
38240B3472618o96086j556023p62633m36301L59237K742189L864369P88218l747230
38231B4028358m752409k430675o94201J41986K750674N614664L704706k681403
38223B5681700o644549m450523n06187P6556j727351k557775j933549m32930K485136
38214I990528N237413L537258k784438o895070l580761L165975N969728L807324
38206A8447957Q39115r88217k387025k473408j20720K149750J312680m61753J236030
$$ y = [13315227, 15592420, 18419232, 20906026, 21132923, 18867842, 16013842, 14155652, 13159762, 12383635, 11808398, 11650834, 12127222, 13718277, 16154301, 17123889, 14216205, 8835048, 5749088, 7350614, 10719451, 12325926, 13169929, 16258841, 20918171, 23472618, 22776532, 21220509, 20457876, 20021575, 20380812, 23123001, 26987370, 27775588, 24028358, 19275949, 16845274, 16151073, 16293059, 19043733, 24658397, 28363103, 25681700, 19037151, 14586628, 14080441, 14156997, 12429646, 9871871, 7938322, 7505392, 9990528, 15227941, 18765199, 15980761, 9085691, 5504930, 8670905, 14640633, 18447957, 19287072, 18298855, 15911830, 13438422, 13317702, 15467452, 16780132, 16318379, 17554409]
38197A7554409N457177O827596L621660l96015k218861k801790l595455m118417
38189B0330304l664771k323877k66979J661043J909897J110322K314050N318248
38181B6388237M798276j202230n623816k113812L923621K950993l193334m165326
38173B1762609J727474N118850J525878k351510j704809j276973m361707n045900
38165A5393912Q04326O062230L164769k730123j600636N291824P589128J873575
38157C5849005m185338l726398J039387L634161R56229m809440q310466n287234
38149A5159906K451372P733929O351625K028948J0750m09583k277614l820700
38141B7228633j335947L183996M086335P30337j971290j207077J029249K457531
$$ y = [17554409, 23011586, 29839182, 33460842, 33064827, 30845966, 28044176, 24448721, 20330304, 16665533, 14341656, 14074677, 15735720, 17645617, 18755939, 21069989, 26388237, 31186513, 29984283, 24360467, 22246655, 26170276, 29121269, 25927935, 21762609, 23490083, 28608933, 30134811, 27783301, 26078492, 24801519, 20439812, 15393912, 16198238, 22260468, 25425237, 22695114, 21094478, 26386302, 33975430, 35849005, 31663667, 27937269, 28976656, 32610817, 33567046, 28757606, 20447140, 15159906, 17611278, 25345207, 31696832, 33725780, 33736530, 33326947, 31049333, 27228633, 25892686, 29076682, 33163017, 33893354, 31922064, 30714987, 31744236, 34201767]
38133C4201767K542989N33346l370112n456467k474552K323055K789697o16099
38125C0473624j099912L890356Q425638O442362o39060o904555q555417n503867
38117B6529169J34014N027666O510558M793173J792028j603640m577322m378235
38109C4227411L61018N335921M877131L60837j361425J517721K967181j261715
38101D7024080o996111p759170l057365K706742O087317O309893L966503Q08900
38093D9090789j039702j347571j466341j397720l1668J580630J075966o46282
38085D5818101k02222K091813J976029j288366k932960p73139O65034j812921
38077D3541369l450783J262865Q720859J0118989L524409l914035n480890j730277
$$ y = [34201767, 36744756, 37278102, 33907990, 28451523, 25976971, 28300026, 31089723, 30473624, 29373712, 33264068, 41689706, 48132068, 47493008, 40588453, 32033036, 26529169, 26663183, 31690849, 38201407, 42994580, 44786608, 43182968, 38605646, 34227411, 34588429, 39924350, 44801481, 45162318, 43800893, 45318614, 48285795, 47024080, 40027969, 32268799, 29211434, 31918176, 38005493, 44315386, 48281889, 49090789, 48051087, 46703516, 45237175, 43839455, 43807787, 45388417, 46464383, 45818101, 45615879, 47707692, 49683721, 48395355, 45462395, 44689256, 45354290, 43541369, 40090586, 41353451, 50074310, 60193299, 63717708, 59803673, 54322783, 52592506]
38069E2592506K488500L707620J568579j987424l808749j684874L152555O342674
38061F2371387M308271j667902n690798l010197L904468P174887L106371k707959
38053F7788528l093687P17349J950777q17184k326221O5814K853933L345079L274501
38044G3758889L474194J644742j925999k940489l66792J277843r9165p87343R33426
38035G4969306J374054k73150J010994N507909N037115k742040o441328K197598
38027H0640458J2657458J0090225j426865n210035K371246Q516424N475432k39037
38019A12875306k015709j972588j752640K262659R086570J0095170K339931m842420
38011A26076279l052835L768345P318029O367181L999392R16727j985433j135090
$$ y = [52592506, 55081006, 58788626, 60357205, 58369781, 54561032, 52876158, 56028713, 62371387, 66679658, 65011756, 59320958, 56310761, 60215229, 67390116, 70496487, 67788528, 64694841, 65412190, 67362967, 66545783, 64219562, 64285376, 67139309, 70484388, 73758889, 77233083, 78877825, 76951826, 74011337, 73644545, 74922388, 74823223, 74035880, 74969306, 76343360, 76070210, 77081204, 82589113, 87626228, 84884188, 78442860, 80640458, 93297916, 103388141, 101961276, 96751241, 99122487, 107638911, 113114343, 112875306, 110859597, 108887009, 107134369, 109397028, 118483598, 128578768, 130918699, 126076279, 123023444, 126791789, 134109818, 140476999, 144476391, 145393118, 143407685, 142272595]
38003A42272595L251149M683614N78523j893282K942540Q960106P358353K77812
37995A68431410l605587k450465r37732q7180L003741P112244P722944N360057
37987A84549432M963339O941923O320746J431141l126119l162807Q17765O351715
37979B05087135J0952448J1423982O472982J11101k290612r19922K58246Q99703
37971B31995063L801501P767508Q000444M301383K061611L523057M554375K426976
37963B68431918N97347K436301N455282N672705L690440K552574K607599K163810
37955B93607976J161577J025071K042745L039983K853173J170839j019030j724889
37947C02157445k53773J344060J250497R73148K236789K557960j105347n466562
$$ y = [142272595, 145523744, 150207358, 150785881, 148892599, 151835139, 160795245, 168153598, 168431410, 164825823, 162375358, 161437626, 161350446, 164354187, 171466431, 179189375, 184549432, 189512771, 196454694, 202775440, 204206581, 201080462, 197917655, 198735420, 205087135, 216039583, 227463565, 233936547, 234047648, 231757036, 230837114, 231095360, 231995063, 235796564, 243564072, 251564516, 255865899, 257927510, 261450567, 266004942, 268431918, 269029265, 271465566, 276920848, 282593553, 286283993, 288836567, 291444166, 293607976, 294769553, 295794624, 297837369, 300877352, 303730525, 304901364, 303882334, 302157445, 301903672, 303247732, 304498229, 305471377, 307708166, 310266126, 309160779, 303694217]
37939C03694217m202882J545999L256095k322287p898303o794944k507192j695276
37931B83075427l434996k364699J322279K473263j58517k447003k095566j629385
37923B74740803l520736o693759q746561q493322n974731k603847j069323k466221
37915B35172303m090165k852975j25619k9656l434318o966321p850602o569580
37907B03253067m690298l156251k948567m417341n557392l873420m97792M92270
37899A78604276k257400n209643m751690j747928L71261J58494j119094k121732
37891A61926544k875580l769557m483292m410986l722811l382888l778844l906399
37883A31596187k900733j842864k235874k965457j567887J046286Q26574k812455
$$ y = [303694217, 299491335, 301037334, 304293429, 301971142, 294072839, 287277895, 284770703, 283075427, 279640431, 277275732, 278598011, 281071274, 280912757, 278465754, 276370188, 274740803, 271220067, 264526308, 255779747, 247286425, 241311694, 238707847, 237638524, 235172303, 231082138, 228229163, 228103544, 228073888, 224639570, 217673249, 209822647, 203253067, 198562769, 195406518, 192457951, 188040610, 182483218, 178609798, 178112006, 178604276, 176346876, 171137233, 166385543, 164637615, 165008876, 165167370, 164048276, 161926544, 159050964, 155281407, 150798115, 146387129, 142664318, 139281430, 135502586, 131596187, 128695454, 126852590, 124616716, 121651259, 120083372, 121129658, 121956232, 119143777]
37875A19143777m817791k128822P43225j237441m621477k463419L633095M813652
37867A13064799j157572n984765l875755l69449k508455o797427m873650K563853
37859I0061579O177663J603096n291373p980644p028286n383245k230878L437926
37851G3365838P343827M313277l269038p329386m838162j277195j535989k529516
37843F4243656R50545O588443O643905r29091q956877j0032012m798969P77661
37835E4487261K812118J443557j670076m392391m347515j237605K039387K831478
37827E1966214J867522Q39664q71731l896494n490092k739358K030192L589503
37819D7295420J174426r52286m33553K87782j008777k647561k195492j25608J293123
$$ y = [119143777, 114325986, 112197164, 112940389, 111702948, 107081471, 104618052, 108251147, 113064799, 111907227, 105922462, 102046707, 101677258, 99168803, 92371376, 87497726, 90061579, 96239242, 97842338, 92550965, 84570321, 77542035, 72158790, 69927912, 73365838, 80709665, 85022942, 81753904, 74424518, 69586356, 68309161, 66773172, 64243656, 65194201, 71782644, 78426549, 77497458, 68540581, 58508569, 53709600, 54487261, 57299379, 58742936, 57072860, 52680469, 48332954, 47095349, 49134736, 51966214, 53833736, 54673400, 53801669, 49905175, 44415083, 41675725, 43705917, 47295420, 48469846, 47517560, 47084007, 47371789, 46363012, 43715451, 41519959, 41394351, 42687474]
37810D2687474N43243k319991n134557m323747P45047M935070L133005j954366
37802C8311178l302680m19593L98282k524849l061430J359637M019005K36909
37794C5016459l619991m60132M721303K260443o031759q970429k959937L624512
37786B3580469M057225J754454K158106M018346L197729k22381k891522k897547
37778C2754879p07667J838216J947553j610562n521924n084117r15138J827762
37770B4529002J435525J393981K873766J893595l005715o487857m414821q40498
37762A7376978j410405l947972k115885M033301P792282N397653K37075k775357
37754B4587670k428110k78911J690109J748928l79399k615014k945367k102853
$$ y = [42687474, 43230717, 40910726, 35776169, 31452422, 32197469, 37132539, 40265544, 38311178, 35008498, 34588905, 34987187, 32462338, 29400908, 30760545, 34779550, 35016459, 31396468, 30936336, 35657639, 37918082, 31886323, 22915894, 19955957, 23580469, 27637694, 29392148, 31550254, 35568600, 38766329, 38543948, 35652426, 32754879, 32047212, 33885428, 35832981, 34222419, 28700495, 23616378, 22701240, 24529002, 25964527, 27358508, 30232274, 32125869, 29120154, 22632297, 18217476, 17376978, 15966573, 12018601, 9902716, 13936017, 21728299, 27125952, 27363027, 24587670, 22159560, 21880649, 23570758, 25319686, 24940287, 22325273, 19379906, 17277053]
37746A7277053j493996p7716L104290M840215J213310n132969o758488j694587
37738A1277112L376904K709073o24516l85220K955452L182614k133909p877439
37730A2480071p830785j804291M766036O630037L375936p92794j601922P55934
37722A5978222K358534J118297l41972J016075L512102K953851r96129m233228
37714B1365752m156372k698515k366239k490548j290987R12992K726712L864634
37706A5867429M199713K632428p49278l281825l044116j648356r94224K83514
37698A3265285L297952M439029L1733n970846n762373N93855M480331J607944
37690A5982910j951473l34028K852440J697015j768677k028389l03397j770845
$$ y = [17277053, 15783057, 15705341, 18809631, 23649846, 24863156, 19730187, 12971699, 11277112, 14654016, 17363089, 16738573, 16353353, 19308805, 22491419, 20357510, 12480071, 4649286, 2844995, 7611031, 14241068, 17617004, 16824210, 15222288, 15978222, 18336756, 19455053, 19113081, 20129156, 23641258, 26595109, 25598980, 21365752, 17209380, 14510865, 12144626, 9654078, 8363091, 9276083, 12002795, 15867429, 20067142, 22699570, 21950292, 18668467, 15624351, 13975995, 12981771, 13265285, 16563237, 21002266, 21033999, 15063153, 9300780, 9894635, 14374966, 15982910, 14031437, 13697409, 16549849, 18246864, 16478187, 14449798, 14146401, 12375556]
37682A2375556n136323l960848K091265N811362L310994j084090k467843j225635
37674I714438N75747K341031K531210n77055l682848r39112N657324O125326k787681
37665A8958380j0545545p121975K340289N653985J481302q49807K704433N449209
37657A8070271J650970m958309p648051n435756j617859J985963N324730P268636
37649A4640595O165053K573768p64215j809604j295664j684471l800045m939942
37641I085475k099587K810950M151652M81998k538162l87250L056952J603473
37633A6165501k904632l138198J876913M901479J622225l248777l840798j252012
37625A0181701J40946p3424M92529J603945R91283r97298j496697L93341K364393
$$ y = [12375556, 7239233, 3278385, 5369650, 11181012, 14492006, 13407916, 10940073, 9714438, 10290185, 12631216, 15162426, 14585371, 10902523, 9963411, 15620735, 21746061, 18958380, 8412835, 1290860, 3631149, 9285134, 10766436, 9916629, 12621062, 18070271, 19721241, 14762932, 7114881, 1679125, 61266, 2047229, 7371959, 14640595, 20805648, 23379416, 22615201, 20805597, 19509933, 17825462, 14025417, 9085475, 6985888, 9796838, 13948490, 14430488, 11892326, 11505076, 14562028, 16165501, 13260869, 10122671, 11999584, 16901063, 18523288, 15274511, 11433713, 10181701, 10322647, 10249223, 10741752, 12345697, 13336980, 12339682, 10842985, 11236326, 13600719]
37616A3600719K277718N33244j130074j613890j135988r06787j841513k927977
37608F855452j801898J995225N365440M822137P63138k963452l537123j748801
37600I750118j10535Q3033p19591j426502r66471J130963L486547L079852j147052
37591A3160362n198627l678849K445020N467449J174743m269559k644564L951467
37583A0407442O044095J071274l633222l306840k061702l090721j951515L851066
37575G329877P072352J566776n830232m954150J200586J798371l188221l366308
37567A629051L265500O188605K78607n387422k531266L847706N397576L295219
37559A5983576K829401K910129O2752k956238j602766J527491O50741l329207
$$ y = [13600719, 15878437, 16411681, 15281607, 13667717, 12531729, 11624942, 9783429, 6855452, 5053554, 7048779, 12414219, 17236356, 17999494, 15036042, 11498919, 9750118, 9639583, 9722616, 9003025, 7576523, 6610052, 7741015, 11227562, 14307414, 13160362, 7961735, 4282886, 6727906, 12195355, 13370098, 9100539, 6455975, 10407442, 16451537, 17522811, 13889589, 10582749, 8521047, 5430326, 3478811, 7329877, 14402229, 15969005, 10138773, 5184623, 6385209, 8183580, 4995359, 1629051, 4894551, 11083156, 11361763, 5974341, 3443075, 7290781, 12688357, 15983576, 18812977, 21723106, 21785858, 18829620, 17226854, 18754345, 19405086, 16075879]
37551A6075879m574677j640529J813903L571464L935515K489974l84475j290367
37543A9996687J200081K522867p64640l766158p79516L705105J072497o595994
37535A6590929q517855k025509L543757K022124r60789R18805M010031J846365
37527A7427858l345076l840737J880220P044494N516650j399495p195191o911109
37519I177614j570262L405405M393750L207191L116725L401234J428445j550281
37511B5009821j733214O70542J642980K37865m41748L54796J4128q39140K011766
37502B6927796P363378O895476k402448j0758533p611179L481001R694488O196403
37494C9786382N76746L64934L707113M711745K337897P7839j88750j4857o59513
$$ y = [16075879, 11501202, 9860673, 11674576, 15246040, 19181555, 21671529, 21287054, 19996687, 21196768, 23719635, 22954995, 19188837, 18409321, 22114426, 23186923, 16590929, 8073074, 6047565, 9591322, 11613446, 10652657, 11571462, 15581493, 17427858, 14082782, 10242045, 12122265, 19166759, 24683409, 23283914, 16088723, 9177614, 7607352, 11012757, 15406507, 18613698, 21730423, 25131657, 26560102, 25009821, 23276607, 23947149, 25590129, 25827994, 25386246, 25741042, 25755170, 24916030, 26927796, 34291174, 41186650, 38784202, 28025669, 20414490, 23895491, 33589979, 39786382, 40363128, 40728062, 44435175, 49146920, 51484817, 51562656, 51373906, 51359049, 50699536]
37485E0699536o72864J565937M563465N205605L370731K327949L390213L392077
37477G3842649L66520j515245K330925Q381280Q732662K899622j303857K87853
37469I4022409L052215L078004L792615Q087531J0970972P083857L68485j326863
37461A29129225K332414N602010O568237P678342Q258085M933494o58294k435144
37453A61408369J009151M815104O185271P072947P311217L166648m156346o489276
37445A80323085l37774O025721L566647m487769q075644n285705l382483n813520
37437A62532558p083961k975951J517424n31200p312332j0751516p808650l638791
37429A23947581l198439m844530m607929k906401l054236n062888n447519l131413
$$ y = [50699536, 50026672, 51592609, 56156074, 61361679, 64732410, 67060359, 70450572, 73842649, 74209169, 72693924, 75024849, 83406129, 92138791, 95038413, 93734556, 94022409, 97074624, 100152628, 103945243, 112032774, 123003746, 130087603, 130456088, 129129225, 131461639, 137063649, 143631886, 151310228, 159568313, 164501807, 163843513, 161408369, 162417520, 167232624, 173417895, 180490842, 187802059, 190968707, 186812361, 180323085, 179985311, 186011032, 189577679, 185089910, 177014266, 171728561, 168346078, 162532558, 155448597, 152472646, 153990070, 153458870, 146146538, 135395022, 127586372, 123947581, 120749142, 115904612, 111296683, 108390282, 105336046, 100273158, 94825639, 91694226]
37421I1694226j274191j933272k751392j418859j84097k288786o018567o625884
37413F9199178l466218q41522j254360k016862k54335K344928K516636N47116
37405F6774561q91385j442407k918846m930111m561234j366535Q55868n50592
37397E0969319k819433k064810K41971n16693m123837m966599p32124L433034
37389C9420828K525119r49585j645849R4457O5818j674157j040521K292490L937879
37380D3026479K326816Q33166Q51905q31125n111447p134817l594816J668992
37372C2035153L391021J645545q91320l502497m985149k073854M194014N895335
37364C5708248j024919q120382n065267M390215O829400j463181r422370p028262
$$ y = [91694226, 90420035, 88486763, 85735371, 84316512, 84132415, 81843629, 75825062, 69199178, 65732960, 64891438, 63637078, 61620216, 61365881, 63710809, 66227445, 66774561, 65883176, 64440769, 61521923, 56591812, 52030578, 50664043, 51519911, 50969319, 48149886, 46085076, 46327047, 45810354, 41686517, 36719918, 35987794, 39420828, 41945947, 40996362, 39350513, 39444970, 39510788, 37836631, 36796110, 39088600, 43026479, 45353295, 46186461, 47038366, 46207241, 41095794, 33960977, 30366161, 32035153, 35426174, 37071719, 36180399, 32677902, 27692753, 25618899, 29812913, 35708248, 34683329, 26562947, 21497680, 25887895, 32717295, 31254114, 21831744, 14803482]
37356A4803482K308252Q269571O047377j052240o642024o237820p62297L631230
37348B0365531K439286j002298o25774K584299K549376r72150j772879J591157
37340B5156548L027375j2653j863060O07523J591907l064204p064759l552143
37332A4826534K794999K913079j987421k953405J846866M831638J708228k514866
37324B1465652k341736M69323J150548r62331k733417j810545J215989L573162
37316B0026645K555646j432497m465848l583148o01132R24291R28947J646281
37308A5999185K555369Q72815l030019m842082j885992L432396O507471M850223
37300B4459366l26591m775575m238922P60590M251364J766032l488571n012099
$$ y = [14803482, 17111734, 25381305, 31428682, 30376442, 23734418, 17496598, 16734301, 20365531, 22804817, 21802519, 21176745, 23761044, 26310420, 25338270, 23565391, 25156548, 28183923, 28171270, 26308210, 26915733, 28507640, 25443436, 18378677, 14826534, 17621533, 20534612, 18547191, 15593786, 17440652, 22272290, 23980518, 21465652, 19123916, 19593239, 20743787, 19781456, 17048039, 15237494, 16453483, 20026645, 22582291, 21149794, 16683946, 13100798, 12499666, 13423957, 14352904, 15999185, 18554554, 19427369, 16397350, 11555268, 9669276, 13101672, 19609143, 24459366, 24132775, 19357200, 15118278, 15878868, 20130232, 21896264, 18407693, 13395594]
37292A3395594k051076M71429K59381K01070J966871K840434J174483r4768J204637
37283A9368055J706211k490706q470580r000381k168094N372969O193884R17395
37275A1428753k845577o155N723015O701889J300993m288839m764773k285074
37267A0964232j656328k582753j386774J731484K803823R40282n29479k62567
37259A0021920p14166k400726j996969J280376K728077n69441m029668k029774
37251B289629L165432M483842M20085l222459j930079K040385L898184K214022
37243A3359041j092645l727950m001406j065466L431148N298950K137829k548882
37235A1790619k375144L713395Q691415N482733l575544q918528n730353L06204
$$ y = [13395594, 11344518, 11815947, 12075328, 12276398, 14243269, 17083703, 18258186, 18163418, 19368055, 21074266, 18583560, 10112980, 1112599, -1055495, 4317474, 10511358, 11428753, 8583176, 8577021, 14300036, 21001925, 22302918, 18014079, 13249306, 10964232, 9307904, 6725151, 5338377, 7069861, 9873684, 10813966, 10284487, 10021920, 9307754, 6907028, 4910059, 6190435, 8918512, 8349071, 4319403, 2289629, 5455061, 9938903, 10358988, 7136529, 5206450, 7246835, 11145019, 13359041, 12266396, 8538446, 4537040, 3471574, 6902722, 12201672, 14339501, 11790619, 9415475, 13128870, 21820285, 27303018, 23727474, 14808946, 9078593, 9384797]
37227I384797J447841j696773k531165R12077L329589N40040m421873n745210
37219A219323k131129K619079M233078J519136l019335n021696k434024J589270
37211a426298K083264j190548l610654k562621m43455O20746K406760N893074
37203A770268P289167L435354j887807k465775J186394K724446m02702l727916
37195G921429l015958K06111K273349K491475K055466Q94996j456182l629978
37187G740708l709336j887328k942Q33716P65958K74364J45320J416138L773971
37178I350569M782653K496656j565529l933128l605524k915290l453304l378069
37170b220966n34593L287015L926195N87447k707253k471902j98847O00990o5969
$$ y = [9384797, 10832638, 9135865, 6604700, 7516777, 10846366, 11386406, 6964533, 1219323, -911806, 1707273, 5940351, 7459487, 4440152, -581544, -3015568, -1426298, 656966, -533582, -4144236, -6706857, -7150312, -6529566, -4122806, 1770268, 9059435, 12494789, 10606982, 8141207, 9327601, 12052047, 11649345, 7921429, 4905471, 5111582, 7384931, 9876406, 11931872, 12826868, 11370686, 7740708, 4031372, 2144044, 2141102, 2974818, 3740776, 4015140, 4160460, 5576598, 9350569, 14133222, 16629878, 15064349, 11131221, 7525697, 4610407, 1157103, -2220966, -2755559, 531456, 4457651, 5045098, 2337845, -134057, -332904, 268086, 202117]
37161B02117P33592L376490M495552K210896p45603j145131J04008J05777j156908
37152H180790j297194J68238J302561J251470J060531Q53042n34464k487480k615009
37143E882485j035860j060572l512132m049838M64953O049375O551962K448737
37135A1739110m73199r3977K46012r63375p97511J506220J652244k419005n856176
37126D540343m203617n81629K2612o64254J814325N415966M409968l57413k495456
37117G900845p79173M6788n39339K214625P139661N638928l925260j0599024o515081
37108E82970J042264J841310j459327l27531L749916L081819j017561n99672L291104
37099A0185292J622133n429785o722298J013057O420547J781950m473107k186390
$$ y = [202117, 935709, 4312199, 8807751, 11018647, 10273044, 9127913, 9231921, 9337698, 8180790, 6883596, 7051834, 8354395, 9605865, 10666396, 11519438, 10984974, 8497494, 5882485, 4846625, 3786053, 273921, -3775917, -3310964, 2738411, 9290373, 11739110, 11265911, 11171934, 11417946, 10454571, 9657060, 11163280, 12815524, 10396519, 4540343, 336726, -244903, -222291, -886545, 927780, 6343746, 10753714, 10396301, 7900845, 7121672, 7168460, 6629121, 8843746, 15983407, 21622335, 17697075, 7098051, 582970, 1625234, 3466544, 2007217, 1679686, 5429602, 8511421, 7493860, 6894188, 10185292, 11807425, 6377640, -344658, 668399, 7088946, 8870896, 4397789, 2211399]
37091B211399M074465L762995k045551l756414L05103K433844n83079k874098
37083C528664k77016L012717J841712k082619l612150j503133J232675K235273
37075D376123K032213J849071J263629r95883m276242n437530k438663K357121
37067a270161M659216L639042K119620J539791K36162k586907m779158m437568
37059h79963k104997J085187M129472M643540J001124l337868k835270J612982
37051C314207L168478j22449k049528R68704L511609Q73045k187043L22773M673765
37042A2473561L271273k755809n672069l151544L41978K315167L927541L979052
37034A4729150k34241n817307n965646l3090M863387L819429j65684j977693o54013
$$ y = [2211399, 6285864, 10048859, 8003308, 4246894, 4551997, 6985841, 6402762, 3528664, 3251648, 6264365, 8106077, 6023458, 2411308, 908175, 2140850, 4376123, 6408336, 8257407, 9521036, 8525153, 4248911, -1188619, -3627282, -1270161, 3389055, 7028097, 9147717, 10687508, 10923670, 8336763, 3557605, -879963, -2984960, -1899773, 2229699, 6873239, 7874363, 4536495, 1701225, 3314207, 6482685, 6360236, 4310708, 5279412, 8791021, 9664066, 7477023, 7799796, 12473561, 15744834, 12989025, 7316956, 4165412, 4507390, 6822557, 10750098, 14729150, 14494909, 8677602, 2711956, 2678866, 7542253, 11361682, 11195998, 9218305, 8564292]
37025H564292J646317K599304N83941l737569o427908m260958P94048M268477
37017D029944M700095K895385j247335o180019o519632l5258O357455N193752
37009I194387M178n63666K720885J830420l298527m067909J307109M177542L80237
37000A1684656l247663j860924n99575l456727m824114J30461N641887M315494
36992G783495j246356l788985k221099K83922L024446N396810L770911j839710
36984A1163434l945031J710114P494000M645103k770276m383191L25004K805379
36976A7044536l12016m023770m830473m399164l651043j519147N31475K23116
36968i36486O1593L717485P778653N366228k290948o435061l630002K25350J73699
$$ y = [8564292, 10210609, 12809913, 13393854, 9656285, 3228377, -1032581, -238533, 4029944, 8730039, 11625424, 10378089, 4198070, -2321562, -2356820, 4000635, 9194387, 9198565, 8634899, 11355784, 13186204, 9887677, 5819768, 7126877, 11304419, 11684656, 8436993, 6576069, 5976494, 2519767, -2304347, -2173886, 3468001, 7783495, 6537139, 2748154, 527055, 810977, 3835423, 9232233, 13003144, 11163434, 7218403, 8928517, 16422517, 21067620, 18297344, 13914153, 14239157, 17044536, 16732520, 12708750, 7878277, 3479113, -171930, -1691077, -1159602, -936486, -874893, 2842592, 10621245, 15987473, 13696525, 7261464, 3631462, 3856812, 4030511]
36959D030511j427651j132122M5446J68075k21181n88284j412351j419608J064854
36950h92311L451701J572260k464035k128575K641033M282971j93844l949099
36942B320101j264014L761603M655779K103780J12800j500310m049504m262266
36934A877969Q04458O390647N296310j194948m963547k931695j70430o27289j606716
36925B874759K95725L322728L836443J601369j367979m298008o778118o622956
36917g136037k237006L793202O730457N269495K408510O52135o52267k261833
36909F566656k518962k53136K224945K259481J335155K523032M388387K348234
36901A8873792l381786o501969l508987R92446J298586j320988k017357l41840
$$ y = [4030511, 2602860, 1470738, 1516184, 1684259, 1463078, 874794, -537557, -1957165, -892311, 2559390, 4131650, 1667615, -460960, 2180073, 6463044, 6269200, 2320101, 1056087, 4817690, 9473469, 11577249, 11690049, 10189739, 6140235, 1877969, 2682427, 9073074, 14369384, 13174436, 8210889, 5279194, 5108764, 4481475, 2874759, 3170484, 6493212, 10329655, 11931024, 10563045, 6265037, -513081, -7136037, -9373043, -5579841, 1150616, 6420111, 8828621, 9480756, 8828489, 6566656, 4047694, 3794558, 6019503, 8278984, 9614139, 12137171, 16525558, 18873792, 15492006, 8990037, 5481050, 6473496, 7772082, 6451094, 4433737, 4091897]
36893D091897N49732L40086J371342L108710K513325j56181j265091j9928K66933
36884A0800825j869492l516540k287946L45917K180310K985334K612872J31694
36876A1382974l331882m270065j336201K485499L800548K332957m64077l278506
36868G321247m361050k447142M22735M89759j862944j706069K925327P103941
36860G885804N610161J69213l327658k365999P44473L008058L095632R17894k240349
36851A3497229l893142k717735q3553J816156J924715j93900m245969p429502
36843a325701n943935k86186M053545L615797J513765J946024L454502J895857
36835H923668k167157l933506j491815J796119K197440l87333l555952m893345
$$ y = [4091897, 4641629, 4981715, 6353057, 9461767, 11975092, 11818911, 10553820, 10533892, 10800825, 8931333, 5414793, 3126847, 3472764, 5653074, 8638408, 11251280, 11382974, 8051092, 3781027, 2444826, 4930325, 8730873, 11063830, 10599753, 7321247, 2960197, 513055, 935790, 1425549, -437395, -2143464, 781863, 7885804, 13495965, 13665178, 10337520, 7971521, 8715994, 11724052, 14819684, 15737578, 13497229, 9604087, 6886352, 6802799, 8618955, 10543670, 10349770, 6103801, -1325701, -7269636, -7555822, -3502277, 113520, 1627285, 3573309, 7027811, 8923668, 6756511, 2823005, 1331190, 3127309, 5324749, 4937416, 1381464, -3511881]
36827c511881l204834M95072L176360K743495N26411n94071K65014J742651K289002
36818C927219R52148k159561m455281k293682L603170O804462K848235m036651
36810E190059o276116l119614j58506J86149J277755M609539N962774K151818
36802I823858l233518m603658j744376J138950J610751R21030R02895J680413
36794F496345K121952J080009j330664l128797k340872K58090K066938K316761
36786G539762K142077J046814k582319o437429m964932K009560O514948K993299
36778H261780k962999k732664K170129L141424j219461l355672m1028K383500
36770E645009l69719k773442N38696M587677J981173m292012n256670j82698L143487
$$ y = [-3511881, -6716715, -6221643, -3045283, -301788, 224623, -369448, -104434, 1638217, 3927219, 4879367, 2719806, -1735475, -4029157, -425987, 6378475, 9226710, 5190059, -1086057, -4205671, -4364177, -4178028, -2900273, 1709266, 7672040, 9823858, 6590340, 1986682, 242306, 1381256, 2992007, 3913037, 4815932, 6496345, 8618297, 9698306, 8367642, 5238845, 2897973, 3156063, 5223001, 7539762, 9681839, 10728653, 8146334, 1708905, -3256027, -1246467, 5268481, 8261780, 5298781, 2566117, 4736246, 7877670, 6658209, 3302537, 3261509, 5645009, 5275290, 2501848, 3040544, 7628221, 9609394, 5317382, 60712, -121986, 3021501]
36761C021501J505556N9940J835756K517568r20739m069638k297133J861917L593284
36752G108012L194697L211758K307331j855804o271039n597153p01463J642542
36744C038881j748547n961337m632031J997200P598661O929117J122169l983539
36736D360574m278076j328846P90248R90802Q48781K24077k192387m183052j746341
36727f514220L177868L422813j961988m155172K363569R935200Q208556q20908
36719A3655718o717849n629288k225663O49359M180805O276835K334270n383373
36711G140814q281332l641803J723748K360760Q17798N87079L63576o19831J179888
36702A630697O889319J0560254O739735j491203o806397o546187l381452l38234
$$ y = [3021501, 4527057, 4586997, 6422753, 8940321, 8019582, 3949944, 1652811, 3514728, 7108012, 10302709, 13514467, 15821798, 13965994, 7694955, 2097802, 1396339, 3038881, 1290334, -4671003, -9303034, -7305834, 292827, 7221944, 8344113, 4360574, 82498, -1246348, -456100, 534702, 1383483, 1607560, -584827, -4767879, -6514220, -3336352, 86461, -1875527, -6030699, -3667130, 6268070, 14476626, 13655718, 6937869, 1308581, -917082, -267723, 3913082, 10189917, 12524187, 7140814, -1140518, -4782321, -3058573, -697813, 119985, 707064, 1070640, 450809, 1630697, 8520016, 19080270, 25820005, 24328802, 17522405, 10976218, 7594766, 7256532]
36694G256532J121749P35038J08664J350003L318658K522935r36438k644482q60184
36685A1972475N42011j487978m429605m596325k081866J077185L500185L404127
36677G900209k34231l764681j721455M429165O695800K197475k527626k121891
36669A0852765K8780p70797k695299k353830j138557j115283n82124J039111J97542
36660C462308l623023m662424n72981K188296p19792l285592K26860M613947L165088
36651G92687r5613J451414L845468K1797n508910l279059M001371N309259j14273
36642F424141k566250N45805J393323k976811n670869k804417P09976J102200
36634c842902P96081J137743P7523j261356L79673K200768r92851n068757j273560
$$ y = [7256532, 8378281, 9113319, 9221983, 10571986, 13890644, 16413579, 15477141, 12832659, 11972475, 12514486, 11026508, 6596903, 2000578, -81288, 995897, 4496082, 7900209, 7665978, 3901297, 2179842, 6609007, 13304807, 15502282, 12974656, 10852765, 10881545, 10110748, 7415449, 5061619, 3923062, 2807779, 2225655, 3264766, 3462308, -160715, -4823139, -5396120, -3207824, -3927616, -7213208, -6986348, -2372401, 792687, 697074, 2148488, 5993956, 6015753, 506843, -2772216, 1229155, 6538414, 6424141, 3857891, 4403696, 5797019, 2820208, -2850661, -5655078, -4945102, -3842902, -3046821, -1909078, -1831555, -3092911, -2713238, -512470, -1505321, -6574078, -7847638]
36625g847638O966460O805315k312475o001864J335163P055117K173412l800415
36617D373075n67395N332275L539127k060474k416966p189j697160l664521J077996
36608C908768O908428L346585n949988p766669m68726M623987K240954r44835
36600E898504l17539K60524j540729j971856O8904J0212l272316m335407n42377
36591e742080L474609L860858K689072K204023R27682j606297k662183j472371
36583A673313o59344n98828J328501M200163L304522j362564l651199j135340
36575C099224R74513p13959k017830M91730K734549N99325k237173p25993K635499
36566D839885K516995J6305m02046L17127j641860m069739j387257M422140M833777
$$ y = [-7847638, -881178, 5924137, 3611662, -2390202, -1055039, 6000078, 8173490, 4373075, 3805680, 9137955, 12677082, 10616608, 8199642, 8192453, 6495293, 2830772, 3908768, 10817196, 14163781, 8213793, 447124, -21602, 4602385, 6843339, 5898504, 5580965, 5841489, 4300760, 2328904, 2397808, 2408020, -864296, -5199703, -5742080, -2267471, 1593387, 4282459, 6486482, 7414164, 5807867, 3145684, 1673313, 1013969, 415141, 1743642, 5943805, 9248327, 7885763, 4234564, 3099224, 4073737, 3359778, 1341948, 1833678, 4568227, 5167552, 2930379, 2204386, 4839885, 7356880, 7373185, 6971139, 7288266, 5646406, 1576667, 189410, 4611550, 9445327]
36557I445327j631723n615877o33572O780912O469158r17218n728646l077087
36549E091274K004498L115070M26665j743633j316646J99681P05181k93082j638269
36540F550739j615404J84229J859289J370321k98838k48425J762215K612077P41458
36531A2917661j305464j158401k79034n71405m66480J735648L267132N27854m368370
36522A0299141o023082l862338k225437k596738j783832J428273L878094L822355
36514B936436L300488K883754J97557l890167m175457K96951L130095M81157k581803
36505B579011j198198N90004k315954n605839k325358M170344M562210j241156
36497g84936m050446l55907L288888K384170P69217J630116J694722j042819k296955
$$ y = [9445327, 7813604, 2197727, 1564155, 8345067, 14814225, 13897007, 8168361, 5091274, 7095772, 10210842, 10637507, 8893874, 7577228, 7776909, 8482090, 8189008, 6550739, 4935335, 5119564, 6978853, 8349174, 8050336, 7801911, 9564126, 12176203, 12917661, 11612197, 10453796, 10174762, 9603357, 9136877, 10872525, 14139657, 14667511, 10299141, 4276059, 413721, -1811716, -4408454, -6192286, -4764013, -885919, 2936436, 6236924, 9120678, 9318235, 5428068, 1252611, 1549562, 4679657, 5160814, 2579011, 1380813, 1970817, -345137, -5950976, -8276334, -4105990, 456220, -784936, -4835382, -5191289, -1902401, 481769, 1250986, 2881102, 4575824, 3533005, 1236050]
36488A236050K72390J489637k149357m764080n38483N043774L122720l264995
36480D47656l019187M706365P728195m55838r538016o771576M675741J0445996
36472H219336M671618m021106o151886k840906o39575j186226j139581R68329
36464b119997L191220M229366M372901K848852j145595m460839k144696M495506
36456I266718O825409l06193j0152382j1438625k586717O602480P666630K973569
36448H850889M52465K635469M723071K290685k866102n648360m046942n11346
36440E879829K079479L183227K983259Q53939k662556m594024l124260q96855
36432C702038j347981l009141j843660J340658J422565k090806k828181K591555
$$ y = [1236050, 1508440, 2998077, 848720, -3915360, -4453843, 589931, 3712651, 447656, -2571531, 2134834, 9863029, 9407191, -130825, -6902401, -2226660, 8219336, 12890954, 8869848, 2717962, -122944, -762519, -1948745, -3088326, -2119997, 1071223, 5300589, 9673490, 12522342, 11376747, 6915908, 4771212, 9266718, 16092127, 15785934, 5633552, -5805073, -8391790, -1789310, 5877320, 8850889, 9303354, 11938823, 16661894, 18952579, 16086477, 10438117, 6391175, 5879829, 7959308, 11142535, 14125794, 14979733, 12317177, 7723153, 4598893, 3702038, 2354057, -655084, -2498744, -1158086, 264479, -1826327, -4654508, -2062953]
36424b062953Q076602O450047J30181k764419n45403O88207k350046m821783j491855
36415A308578M923216P048579K584831k980662l797419r87710j34756k576339
36407E388318l382047K73760L368881O17816l787483j781563M657346N059830
36399A0414858k398340o219550M92878P736246L348874p914848j1536670m596798
36391a0673350K394890L089847K286903M351424O007391M036536J031141m98270
36383A2026512k224440m442490l461830J229662L685834L00233l677177j909056
36375A527248L142985M061308n53019m781703m124362o47406J132525J73404p67023
36366h36043N51054K757497K951902J228630O08072J601724M89520m125523o965314
$$ y = [-2062953, 6013649, 12463696, 12593877, 9829458, 9284055, 9972262, 7622216, 2800433, 1308578, 6231794, 13280373, 15865204, 12884542, 9087123, 8099413, 7964657, 5388318, 2006271, 2280031, 5648912, 6266728, 2479245, 697682, 5355028, 10414858, 8016518, 1796968, 2289846, 10026092, 13374966, 5460118, -6076552, -10673350, -8278460, -5188613, -2901710, 1449714, 7457105, 11493641, 12524782, 12026512, 9802072, 5359582, 1897752, 3127414, 6813248, 7113481, 3436304, 1527248, 4670233, 8731541, 8178522, 3396819, -727543, -1374949, -242424, -69020, -836043, -284989, 2472508, 5424410, 6653040, 7261112, 8862836, 9352356, 5226833, -1738481]
36357a738481l249926K985932M254686J082838L68829L229792L411722j002089
36349I343303l385243M80431N146238L967279j408376m953500m583893j967916
36341B638323J413974L598196J754258l212638n551638k162027K673691L826701
36333D978840K308751J553483J142075p84719k614665j953064k17487J53168R1474
36324D657856J067802J231884q73808k284413n53663Q32278j973776n373559l044413
36315f313812L608348O956334M212970M5546j759672k483783l488856l264507
36307b487432j235925M82104R39966J792952L433622L662195J746154J03346K28784
36298H665766K54474j536499l553692l324609j143575N01407L6004j726695k491716
$$ y = [-1738481, -4988407, -2002475, 2252211, 3335049, 3703878, 6933670, 10345392, 9343303, 5958060, 6438491, 11584729, 15552008, 14143632, 9190132, 4606239, 2638323, 4052297, 7650493, 9404751, 6192113, 640475, -1521552, 1152139, 4978840, 7287591, 8841074, 9983149, 9198430, 6583765, 4630701, 4413214, 4566382, 4657856, 5725658, 6957542, 6083734, 3799321, 3245658, 4077936, 2104160, -3269399, -6313812, -2705464, 4250870, 8463840, 8509386, 6749714, 4265931, 777075, -2487432, -3723357, -3241253, -2301287, -508335, 2925287, 6587482, 8333636, 8436982, 8665766, 8920240, 7383741, 3830049, 505440, -638135, -136728, -100724, -1827419, -4319135]
36289d319135o42289K737106M455805K868254r797j398866j364216j509728j565473
36280g48339j17974K079924K459795J58579l006845m694560l471355N93680M677182
36271b069913M544576J32565k502468J002827N741742L626022l919201o602348
36263d6198n9708P281603O122733r73007m671998k548594m07919j510075k176071
36254A010766M23817K821878J425743p22125J321717N670170N741771N84325l226594
36245A5051468j630380Q56487j186542n164334m733731r0709K390968M9100k729659
36236B812668j995018L93374J039225L41304O77187K066971K360263L46354k891789
36227E150539m836756l527357R0105K517753K069111J115630J483768O10755l265745
$$ y = [-4319135, -4961424, -2224318, 2231487, 5099741, 5089944, 3691078, 2326862, 817134, -748339, -866313, 1213611, 3673406, 3831985, 825140, -3869420, -7340775, -6747095, -2069913, 2474663, 2607228, 104760, 1107587, 6849329, 10475351, 6556150, -46198, -105906, 7175697, 13298430, 12325423, 7653425, 5104831, 4696912, 3186837, 1010766, 1434583, 4256461, 5682204, 4960079, 6281796, 11951966, 17693737, 18278062, 15051468, 13421088, 14277575, 13091033, 7926699, 3192968, 3102259, 5493227, 5542327, 2812668, 817650, 1211024, 2250249, 2591553, 3268740, 5335711, 7695974, 8042328, 5150539, 313783, -3213574, -3123469, -605716, 1463395, 2579025, 4062793, 4673548, 1407803]
36218A407803n425241j019459N282474M678103j642076l717173J037110L906490
36210D508031J14076l358347o10989L230265K243910J68791J861463K969437j747401
36201I379236p010956m930709J329920L026259M80656O79539L469036K115878
36193H538859l654330o419455l041233J708974L803816L838799K478684j35624
36185G118490j246409Q16370J765324j973917n034014j053396M833760L077716
36177H303924l641459m258229J701775L770962m81608j825885K629951L752352
36169I951783k164280n466747R8341O422561N146832L21224j723437l214999o210298
36160C160980m693462L763332R137956L699541l942001k293762M173746L692568
$$ y = [1407803, -4017438, -5036897, 245577, 4923680, 3281604, -435569, 601541, 4508031, 4622107, 1263760, 652771, 3883036, 6126946, 6295737, 8157200, 11126637, 9379236, 2368280, -2562429, -1232509, 1793750, 2274406, 2953945, 6422981, 8538859, 4884529, -1534926, -4576159, -2867185, 936631, 4775430, 7254114, 7118490, 5872081, 6688451, 8453775, 6479858, 1445844, 392448, 5226208, 8303924, 4662465, 404236, 2106011, 5876973, 5395365, 3569480, 6199431, 9951783, 7787503, 2320756, 2419097, 8841658, 13988490, 14309714, 12586277, 9371278, 3160980, -1532482, 2230850, 11368806, 15068347, 11126346, 8832584, 13006330, 16698898]
36152A6698898k490806l853845J80872O29381l677722m543337k76972J354107
36144D020576k056120l054024J838160N494423K166543l608404n272140l484534
36136c955520j976593p52855J436879K876506J799163k1475n1130J467671K929734
36127C752380L468471K345968o16217l156989k493634L51965J636010L78120j094784
36118D571290j753777k407572j978095J279446M662641L275927j598565k905632
36110C145663J390976M575118J541996l376249l586331j4079J825801O99435l06818
36101E895512j81110n65052j061805N13186L104285K603051j677320m796393k771553
36092A062801J442353J701686k644647n277215j373464M995926N292365j962539
$$ y = [16698898, 14208092, 10354247, 10535119, 11164500, 7486778, 2943441, 2666469, 4020576, 1964456, -1089568, 748592, 6243015, 8409558, 4801154, -470986, -3955520, -5932113, -6684968, -5248089, -2371583, -572420, -593895, -645025, 822646, 3752380, 7220851, 9566819, 8950602, 5793613, 3299979, 3651944, 5287954, 5666074, 4571290, 2817513, 409941, -1568154, -288708, 4373933, 7649860, 6051295, 3145663, 4536639, 9111757, 10653753, 7277504, 3691173, 3677094, 5502895, 6202330, 5895512, 5714402, 5149350, 4087545, 4600731, 7705016, 10308067, 8630747, 3834354, 1062801, 2505154, 4206840, 1562193, -3715022, -5088486, -92560, 5199805, 3237266]
36084C237266q199651n665897K167631N513028J764842j780140O71315N326963
36076C035357N390253J033735k144071j915389j123636j462542j169673K30662
36068A874696J60684j676910r66979M236481Q039109L913294m674381p599809
36060C306185k131895L440670K332313j741811k414803q23689j188943j538092
36052g60065K438524P391915N906183q38207l918645q93505J035141j587871k591041
36043F182429J592794M084866q21745o886809n567999L88940K513911M11280m6877
36034A850790J636378J207869n01728J164665M684108L814526j010999k810020
36026A0035589m32076o51350n581152p883429k701566M110739M927639Q56591
$$ y = [3237266, -4962385, -10628282, -8460651, -2947623, -1182781, -2962921, -2291606, 3035357, 8425610, 9459345, 7315274, 5399885, 4276249, 2813707, 1644034, 1874696, 2035380, 358470, -608509, 3627972, 11667081, 15580375, 10905994, 3306185, 1174290, 4614960, 6947273, 5205462, 2790659, 1966970, 778027, -760065, 1678459, 9070374, 14976557, 14138350, 10219705, 9326200, 10361341, 8773470, 6182429, 7775223, 11860089, 11038344, 4151535, -1416464, -1027524, 1486387, 1897667, 1850790, 3487168, 4695037, 4193309, 5357974, 10042082, 13856608, 12845609, 10035589, 9603513, 8952163, 3371011, -4512418, -7213984, -3103245, 1824394, 2680985]
36018B680985j993597j491683K92085J789098K518133K072969J521562K596083
36010I985635L650504Q24575m876453p082442l344454Q46816Q78242j31431J913126
36001B664118M085560J428059m129601o394719l927429n48313J253321J996917
35993c572087J817179M46578n45962R0351K45752k241047m944064m044935m93793
35984a3242028J844617K625751M309032O212632N110362J463588o68020k28975
35976G426959j68259j320134j033613R32402J004165j709627l124132j019593
35968I88168J272872J301512K036231N408247O558033R48303o431850o513451
35960E568065O40760N581942K787448k883209m906417l640971k622976j841782
$$ y = [2680985, 687388, -804295, -512210, 1276888, 3795021, 5867990, 7389552, 9985635, 13636139, 14460714, 9584261, 2501819, -842635, 4181, 882423, 750992, 2664118, 6749678, 8177737, 4048136, -2346583, -6274012, -6822325, -5569004, -3572087, -1754908, -1308330, -1854292, -1763941, -1518189, -3759236, -8703300, -12748235, -13242028, -11397411, -8771660, -4462628, 1750004, 6860366, 8323954, 7655934, 7426959, 7258700, 5938566, 4904953, 5837355, 6841520, 5131893, 2007761, 988168, 2261040, 3562552, 5598783, 11007030, 17565063, 18513366, 12081516, 5568065, 6208825, 11790767, 14578215, 11695006, 6788589, 3147618, 524642, -1317140]
35952a317140L33778K231172J238678j009500q71690J100302J133420j107594
35944A731426j843059L93388K415976J764283J29151l99144n71968j214063q57852
35935A548138J065874J889417j77586k259150p63540K831393L874435J047329
35927I056310k418210l309537j360158J653044L227985J552008k002219l206006
35919C193217m02226K283929N12824l412861l607888O79942M299627L940887J793413
35910I280864P94697P03108L06894j34108k42764n36669j016871j121881j337579
35901F695691k163734j834578J320260M460863K697789l325962o943333m147342
35893c240346J362267L735968J923845q81784j488596J299860N762722P058443
$$ y = [-1317140, -983362, 1247810, 2486488, 1476988, 605298, 1705600, 2839020, 1731426, -111633, 281755, 2697731, 4462014, 4591165, 4192021, 3620053, 2405990, 1548138, 2614012, 4503429, 4325843, 2066693, 1303153, 4134546, 8008981, 9056310, 6638100, 3328563, 1968405, 3621449, 6849434, 8401442, 6399223, 3193217, 2790991, 5074920, 5587744, 2174883, -1433005, -753063, 3546564, 7487451, 9280864, 10075561, 10778669, 11085563, 10951455, 10708691, 10172022, 9155151, 8033270, 6695691, 4531957, 2697379, 4017639, 8478502, 11176291, 7850329, 906996, -3240346, -1878079, 1857889, 3781734, 2899950, 1411354, 2711214, 8473936, 15532379]
35885A5532379J599112o948829j0081508m779977K599383M898376K456741J46877
35877E422554J00408Q01284N70049r41722k585279j715384K512243N413162J511693
35868A1089008n876062o679074J397663Q019031M924553k108957l255007J83107
35860G694262P5568l774340m058386O77909L677707J452820j602967j628919l29970
35851B183684L27339J278677K151691N15731k571742k618846O66413K283311O75068
35842D891326N11598L618759M492483l46321n157379l317153K327733M209063
35834A1230109J338326j157476j261790j589039k619606j376866K336110M191671
35826A1091439J742118j745807k140320j05089M81867j896233m478404l634813
$$ y = [15532379, 17131491, 10182662, 101154, -4678823, -2079440, 2818936, 5275677, 5422554, 5522962, 6324246, 6894295, 5952573, 3367294, 1651910, 4164153, 9577315, 11089008, 5212946, -1466128, -68465, 7950566, 12875119, 10766162, 7511155, 7694262, 7769830, 3995490, -62896, 615013, 4292720, 5745540, 4142573, 2513654, 2183684, 2511023, 3789700, 5941391, 6457122, 3885380, 1266534, 1932947, 4216258, 4891326, 5402924, 9021683, 13514166, 13167845, 8010466, 4693313, 7021046, 11230109, 12568435, 11410959, 10149169, 8560130, 5940524, 4563658, 6899768, 11091439, 12833557, 11087750, 8947430, 8842341, 9324208, 7427975, 2949571, -685242]
35818f85242P26478M621641M396524J286856k72631Q90505J004134k211189n020713
35809D736363l189771Q63995J463436j355805k123914Q34550K654251K02185k668594
35800A416696j538938J556982J911418m16725j688227p39783O18375J867910L488057
35791F475765L386629r25131o463587o656694n52121M898668M041849n10299k985055
35782G10024k343426j358650j234449j391323k098137l048140j429374M032490
35774h160985Q757083P021018K47903m267354k770580J457697M086504M305626
35766A0676912K650584q08254m333470m759806j997319P4711r30068k717414k352777
35757d496901m04903Q57180P43650o3683o94489k5605K161335L629481K261443
$$ y = [-685242, 41236, 4662877, 9059401, 10346257, 10073626, 10964131, 11968265, 9757076, 4736363, 1546592, 2410587, 3874023, 2518218, 394304, 1228854, 3883105, 4085290, 1416696, -122242, 1434740, 3346158, 2929433, 1241206, 501423, 1119798, 2987708, 6475765, 9862394, 8937263, 2473676, -4183018, -4735139, 163529, 4205378, 3695079, 710024, -1633402, -2992052, -4226501, -5617824, -7715961, -10764101, -12193475, -8160985, 596098, 7617116, 7865019, 3597665, 827085, 2284782, 6371286, 10676912, 13327496, 12519242, 8185772, 3425966, 1428647, 1503358, 573290, -2144124, -4496901, -4901804, -4044624, -3300974, -3364657, -4059146, -4084751, -1923416, 1706065, 3967508]
35748C967508p1709j47874P57927q73249l175801r69962L707881K334093n569155
35739d0341q537320m8591R944302R197455J153057k094053R44774J399251l304152
35730H614382n899882k666582J192765J601673J101782J619789P09944j778976
35722D494895j442588K623023M817563J905297j795142j983581q42130j748862
35714F028475l293538k989947j944801j610110m90579J961610K709051L10363
35706F80524j704296n62552J084832K85418r05828L00589K060464J567810K85915
35697C092876O22563Q56792j579802m754537n085031k907507o65968J645728M603289
35688d171597N799719L176380n03049j249301M84363K134596L854678N919582
$$ y = [3967508, 3895799, 3747925, 4505852, 3632603, 456802, -513160, 3194721, 5528814, -40341, -8577661, -8626252, 1318050, 10515505, 11668562, 9574509, 10519283, 11918534, 8614382, 2714500, 47918, 1240683, 2842356, 3944138, 5563927, 6273871, 4494895, 3052307, 5675330, 10492893, 12398190, 10603048, 8619467, 7777337, 6028475, 2734937, -255010, -2199811, -3809921, -4300500, -2338890, 370161, 680524, -1023772, -1586324, -501492, -216074, -1121902, -821313, 1239151, 2806961, 3092876, 3715439, 4572231, 2992429, -1762108, -6847139, -9754646, -10420614, -8774886, -4171597, 1628122, 4804502, 4301453, 3052152, 3536515, 5671111, 9525789, 15445371]
35680A5445371M867120j321416p034427n331648J314141M124972R69368j680402
35672A1353079l2975J733914n61282m708952o545483n406886k485322J587331
35664e066576M990343M758962J139228j556186n21429K225277L568802L039141
35656A2577562J503927n05961j883904j575137r54534k136519l585401j742911
35648A697122K469635L951370J362066r23363o35623j100928l859021m329958
35640a368700L47721M907027L442956j213750k300170J96404J001662n08866K46678
35631D750962L938286N194643J170287l945025n359773l637170j553789P21929
35623A280350L924522O072179M175729j404839o581241p181738k313635M669510
$$ y = [15445371, 20312491, 18991075, 11956648, 6625000, 7939141, 12064113, 13033481, 11353079, 11320104, 13054018, 12492736, 7783784, 1238301, -4168585, -6653907, -5066576, -76233, 4682729, 5821957, 4265771, 3744342, 5969619, 9538421, 12577562, 14081489, 13575528, 11691624, 10116487, 9161953, 7025434, 3440033, 1697122, 4166757, 8118127, 9480193, 8556830, 7921207, 6820279, 2961258, -1368700, -1020979, 3886048, 7329004, 6115254, 3815084, 4011488, 5013150, 4504284, 4750962, 8689248, 13883891, 15054178, 11109153, 5749380, 2112210, 558421, 1280350, 5204872, 11277051, 15452780, 14047941, 7466700, 284962, -2028673, 2640837]
35615B640837Q058913M527411k945072p430614n342685J03851L489474L174339
35607F276454J156686r62758l042350m136183k345335J918134M655181K518911
35599F038740k242607l570122P58102N490006M312776j476317m389132r60520
35591C960926L804433M146566J371342N0087p975k187471n288800m245231Q19738
35582B423615L073943q73952n303149l950157P28381K183239j1941q53843J156526
35573a427338K426977J465720J291727L182555L575096j0361m222849m483185
35565A798342j452497N06533m39272j912814r41237K887309P029585P451019K178782
35556A7105750n116795p441947k693170K856386K397683k407727m501065j843511
$$ y = [2640837, 10699750, 15227161, 12282089, 4851475, -491210, -387359, 3102115, 6276454, 7433140, 6470382, 3428032, -708151, -3053486, -1135352, 3519829, 6038740, 3796133, 226011, 984113, 6474119, 10786895, 9310578, 4921446, 3960926, 7765359, 11911925, 13283267, 13333354, 13325379, 11137908, 5849108, 1603877, 2423615, 5497558, 4623606, -679543, -4629700, -3901319, -1718080, -1730021, -2583864, -1427338, 999639, 2465359, 3757086, 6939641, 10514737, 10504376, 6281527, 1798342, 345845, 852378, 413106, -1499708, -2440945, 446364, 7475949, 14926968, 17105750, 11988955, 4547008, 1853838, 4710224, 7107907, 4700180, 199115, -1644396]
35548a644396O81755k70421j958840j287324J14355k50595r58899K27757J583407
35539c763201L37466j707706n43328K912648L350264o30130l778148j883659J991268
35530c714526K381239l26209q35701K692155N513876K897733k995410n375594
35522B37563j184859N140823O993310L177910j419637k268583k13109P91100p94559
35513A0459959k757940k663711p09956J105777J229777k44022j515829m27090
35505D476965K816624M782580K653344j446463k708823m71594N35947k876799
35497G761781p462208p965581l825023J344479M674518N311029K941785j048638
35489A732142k600394L80503L480576R52388m979735n984462J36564N481587L367143
$$ y = [-1644396, -962641, -1233062, -3191902, -4479226, -4364871, -4615466, -5574365, -5346608, -3763201, -3425735, -5133441, -5676769, -2764121, 586143, -43987, -3822135, -5705794, -3714526, -1333287, -1659496, -2495197, 196958, 5710834, 8608567, 5613157, 237563, -947296, 4193527, 11186837, 14364747, 12945110, 10676527, 10463418, 11254518, 10459959, 7702019, 5038308, 4328352, 5434129, 6663906, 6419884, 4904055, 4476965, 7293589, 12076169, 14729513, 13283050, 10574227, 10102633, 10638580, 7761781, 299573, -7666008, -11491031, -10146552, -5472034, -161005, 2780780, 1732142, -868252, -487749, 2992827, 3945215, -1034520, -7018982, -6882418, -1400831, 1966312]
35480A966312k234296l345795N70800L860925M300610M614268N450627L747059
35472A8930510q92192m069013l068651q37697q30519j758162p46742J208099Q01505
35463H737138k019282l704919k192920M88197J352196K70319m43108O34477K272674
35454E394772K315261M60623j489341k004833j306461k17564R43355J577301P22506
35445F395619r76244j267504L5656j201k253500k583774J622164N163823J736770
35436G871809n007249n296103J786568O336714L064181r09604J117617L927203
35428A2891136n1894o768272o484174M47055M550022K326045j65182Q85685J757515
35419I387936j05370j212665O29122J870298K09782q62425R77734J801973j426333
$$ y = [1966312, -267984, -3613779, -3042979, 817946, 5118556, 9732824, 15183451, 18930510, 18038318, 13969305, 10900654, 10062957, 9232438, 7474276, 6727534, 7935633, 8737138, 6717856, 3012937, 820017, 1308214, 2660410, 2930729, 2487621, 3122098, 5394772, 7710033, 8170656, 6681315, 4676482, 3370021, 3152457, 4095812, 5673113, 6395619, 5419375, 4151871, 4187527, 4186326, 1932826, -650948, 971216, 6135039, 7871809, 2864560, -2431543, -644975, 5691739, 8755920, 7846316, 8963933, 12891136, 12839242, 6070970, -413204, 33851, 4583873, 6909918, 6744736, 7630421, 9387936, 9282566, 8069901, 8699023, 10569321, 10779103, 9916678, 10894412, 12696385, 11270052]
35410A1270052m363103k106911K146228K051218j716111l337834j640116o27247
35402A676176j172122K88992M002193M963067J163182k341938j273917R53547
$$ y = [11270052, 6906949, 4800038, 6946266, 8997484, 7281373, 3943539, 2303423, 1676176, 504054, 793046, 4795239, 9758306, 10921488, 8579550, 7305633, 8259180]
$$ [...]
##END NTUPLES=NMR SPECTRUM
##END=
