##TITLE=31Pdec_LR-733-CR5
 CDCl3, 24 sc
 4.03.2021
##JCAMPDX= 6.0         $$ Bruker NMR JCAMP-DX V2.0
##DATA TYPE= NMR SPECTRUM
##DATA CLASS= NTUPLES
##ORIGIN= UXNMR, Bruker Analytische Messtechnik GmbH
##OWNER= root
$$ XWIN-NMR		Version 3.5
$$ Thu Mar  4 09:53:55 2021 Russian Standard Time (UT+4h)  she@DPX200
##.OBSERVE FREQUENCY= 81.013821
##.OBSERVE NUCLEUS= ^31P
##.ACQUISITION MODE= SIMULTANEOUS
##.ACQUISITION SCHEME= undefined
##.AVERAGES= 24
##.DIGITISER RES= 16
##SPECTROMETER/DATA SYSTEM= spect
##.PULSE SEQUENCE= zgpg30
##.SOLVENT NAME= CDCl3
##.SHIFT REFERENCE= (INTERNAL, CDCl3, 0, 248.564)
##AUDIT TRAIL= $$ (NUMBER, WHEN, WHO, WHERE, WHAT)
$$ ##TITLE= Audit trail, XWIN-NMR		Version 3.5
$$ ##JCAMPDX= 5.01
$$ ##ORIGIN= Bruker BioSpin GmbH
$$ ##OWNER= she
$$ F:/spectra/data/she/nmr/P31/1/pdata/1/auditp.txt
$$ ##AUDIT TRAIL=  $$ (NUMBER, WHEN, WHO, WHERE, WHAT)
(   1,<2021-03-04 09:52:53.50 +0400>,<she>,<DPX200>,
      <created by zg, POWCHK disabled, PULCHK disabled
       configuration hash MD5:
       00 E9 B6 7A A2 85 ED C7 34 08 36 98 17 FE 4E 26
       data hash MD5: 32K
       33 9C C9 C0 D8 03 52 BB F2 F1 43 AA CC 7E 8A 6F>)
(   2,<2021-03-04 09:52:55.67 +0400>,<she>,<DPX200>,
      <Start of raw data processing
       efp BC_mod = 2 LB = 1 FT_mod = 6 PKNL = 1 PHC0 = -3083.87 PHC1 = 313.401 SI = 64K 
       data hash MD5: 64K
       00 56 9F 34 8D BA C2 E0 11 54 A5 20 18 FF 38 E9>)
(   3,<2021-03-04 09:53:21.59 +0400>,<she>,<DPX200>,
      <pk PHC0 = -148.3423 PHC1 = 371.3997 
       data hash MD5: 64K
       E4 3F FE 4D 45 E5 42 F2 8F 6C B9 AF AA 7A 45 A9>)
(   4,<2021-03-04 09:53:24.45 +0400>,<she>,<DPX200>,
      <abs ABSG = 5 
       data hash MD5: 64K
       EE 19 4F 01 D8 E8 89 18 09 5E F9 3F D2 45 63 07>)
$$ ##END=
$$ 
$$ hash MD5
$$ EC 72 A8 C7 78 E5 2E 51 3B 5E 14 78 95 81 47 98
##$RELAX= 
##$RELAX= 
##$RELAX= 
##$RELAX= 
##$RELAX= 
##$RELAX= 
##$RELAX= 
##$RELAX= 
$$ Bruker specific parameters
$$ --------------------------
##$DU= <F:/spectra>
##$EXPNO= 1
##$NAME= <P31>
##$PROCNO= 1
##$TYPE= <nmr>
##$USER= <she>
##$AMP= (0..31)
100 100 100 100 100 100 100 100 100 100 100 100 100 100 100 100 100 100 
100 100 100 100 100 100 100 100 100 100 100 100 100 100 
##$AQSEQ= 0
##$AQ_mod= 1
##$AUNM= <au_zg>
##$AUTOPOS= <>
##$BF1= 81.014009
##$BF2= 200.13
##$BF3= 200.13
##$BF4= 200.13
##$BF5= 200.13
##$BF6= 200.13
##$BF7= 200.13
##$BF8= 200.13
##$BYTORDA= 1
##$CFDGTYP= 0
##$CFRGTYP= 5
##$CHEMSTR= <none>
##$CNST= (0..31)
1 1 145 1 1 1 1 1 1 1 1 1 1 1 1 1 1 1 1 1 1 1 1 1 1 1 1 1 1 1 1 1 
##$CPDPRG= <waltz16>
##$CPDPRG1= <>
##$CPDPRG2= <waltz16>
##$CPDPRG3= <>
##$CPDPRG4= <mlev>
##$CPDPRG5= <mlev>
##$CPDPRG6= <mlev>
##$CPDPRG7= <mlev>
##$CPDPRG8= <mlev>
##$CPDPRGB= <>
##$CPDPRGT= <>
##$D= (0..31)
0 1 0 0 0 0 0 0 0 0 0 0.03 2e-05 3e-06 0 0 0 0 0 0 0 0 0 0 0 0 0 0 0 0 
0 0 
##$DATE= 1614837172
##$DBL= (0..7)
120 120 120 11 120 120 24 19 
##$DBP= (0..7)
150 150 150 150 150 150 150 150 
##$DBP07= 0
##$DBPNAM0= <>
##$DBPNAM1= <>
##$DBPNAM2= <>
$$ [...]
##$SUBNAM3= <"">
##$SUBNAM4= <"">
##$SUBNAM5= <"">
##$SUBNAM6= <"">
##$SUBNAM7= <"">
##$SUBNAM8= <"">
##$SUBNAM9= <"">
##$SW= 501.771253377433
##$SWIBOX= (0..15)
0 1 3 0 0 0 0 0 0 0 0 0 0 0 0 0 
##$SW_h= 40650.406504065
##$TD= 32768
##$TD0= 1
##$TE= 0
##$TE2= 300
##$TE3= 300
##$TEG= 300
##$TL= (0..7)
0 120 53 12 22 120 120 120 
##$TP= (0..7)
150 150 150 150 150 150 150 150 
##$TP07= 0
##$TPNAME0= <>
##$TPNAME1= <>
##$TPNAME2= <>
##$TPNAME3= <>
##$TPNAME4= <>
##$TPNAME5= <>
##$TPNAME6= <>
##$TPNAME7= <>
##$TPOAL= (0..7)
0.5 0.5 0.5 0.5 0.5 0.5 0.5 0.5 
##$TPOFFS= (0..7)
0 0 0 0 0 0 0 0 
##$TUNHIN= 0
##$TUNHOUT= 0
##$TUNXOUT= 0
##$USERA1= <user>
##$USERA2= <user>
##$USERA3= <user>
##$USERA4= <user>
##$USERA5= <user>
##$V9= 5
##$VALIST= <valist>
##$VCLIST= <CCCCCCCCCCCCCCC>
##$VD= 0
##$VDLIST= <DDDDDDDDDDDDDDD>
##$VPLIST= <PPPPPPPPPPPPPPP>
##$VTLIST= <TTTTTTTTTTTTTTT>
##$WBST= 1024
##$WBSW= 4
##$XGAIN= (0..3)
0 0 0 0 
##$XL= 0
##$YL= 0
##$YMAX_a= 33292
##$YMIN_a= -33272
##$ZGOPTNS= <>
##$ZL1= 120
##$ZL2= 120
##$ZL3= 120
##$ZL4= 120
##$ABSF1= 248.5645
##$ABSF2= -253.2056
##$ABSG= 5
##$ABSL= 3
##$ALPHA= 0
##$AQORDER= 0
##$ASSFAC= 0
##$ASSFACI= 0
##$ASSFACX= 0
##$ASSWID= 0
##$AUNMP= <proc_1d>
##$AZFE= 0.1
##$AZFW= 0.5
##$BCFW= 0
##$BC_mod= 2
##$BYTORDP= 0
##$COROFFS= 0
##$CY= -3
##$DATMOD= 1
##$DC= 0
##$DFILT= <>
##$DTYPP= 0
##$F1P= 0
##$F2P= 0
##$FCOR= 1
##$FTSIZE= 65536
##$FT_mod= 6
##$GAMMA= 0
##$GB= 0
##$INTBC= 1
##$INTSCL= 5.30512e-09
##$ISEN= 30
##$LB= 1
##$LEV0= 0
##$LPBIN= 0
##$MAXI= 10000
##$MC2= 0
##$MEAN= 0
##$ME_mod= 0
##$MI= 50
##$NCOEF= 0
##$NC_proc= -3
##$NLEV= 6
##$NOISF1= 182.463
##$NOISF2= 159.3651
##$NSP= 0
##$NTH_PI= 0
##$NZP= 0
##$OFFSET= 248.5645
##$PC= 4
##$PHC0= -3232.212
##$PHC1= 684.8007
##$PH_mod= 1
##$PKNL= yes
##$PPARMOD= 0
##$PSCAL= 0
##$PSIGN= 0
##$REVERSE= no
##$SF= 81.014009
##$SI= 65536
##$SIGF1= 159.3651
##$SIGF2= -187.1042
##$SINO= 113.3802
##$SIOLD= 16384
##$SREGLST= <1H.CDCl3>
##$SSB= 0
##$STSI= 65536
##$STSR= 0
##$SW_p= 40650.406504065
##$SYMM= 0
##$S_DEV= 0
##$TDeff= 32768
##$TDoff= 0
##$TI= <>
##$TILT= no
##$TM1= 0
##$TM2= 0
##$TOPLEV= 0
##$USERP1= <user>
##$USERP2= <user>
##$USERP3= <user>
##$USERP4= <user>
##$USERP5= <user>
##$WDW= 1
##$XDIM= 65536
##$YMAX_p= 357322971
##$YMIN_p= -2906524
$$ End of Bruker specific parameters
$$ ---------------------------------
##NTUPLES= NMR SPECTRUM
##VAR_NAME=  FREQUENCY,     SPECTRUM/REAL,   SPECTRUM/IMAG
##SYMBOL=    X,             R,               I
##VAR_TYPE=  INDEPENDENT,   DEPENDENT,       DEPENDENT
##VAR_FORM=  AFFN,          ASDF,            ASDF
##VAR_DIM=   65536,         65536,           65536
##UNITS=     HZ,            ARBITRARY UNITS, ARBITRARY UNITS
##FACTOR=    0.620285442955139, 1,           1
##FIRST=     20137.2065510759, 0,            0
##LAST=      -20513.1999529892, 0,           0
##MIN=       -20513.1999529892, -2906524,    0
##MAX=       20137.2065510759, 357322971,    0
$$ Real data points
##PAGE= N=1
##DATA TABLE= (X++(R..R)), XYDATA
$$ [...]
41092a75052l8603K03914J48073p2018p6384J23242J45686q9933j96733M0728
$$ -175052 -213655 -9741 138332 66314 -10070 113172 258858 168925 -27808 12920
41082A2920K93237J83025j80929m11869l40255q0014J93639L37828K82160J25241
$$ 12920 306157 489182 308253 -103616 -443871 -523885 -330246 7582 289742 414983
41072D14983M1832J9643j02983k82026k39721Q8236L70898L19205M9689j55734
$$ 414983 456815 476458 373475 91449 -148272 -60036 310862 630067 679756 524022
41062E24022k02037j27958L3948J56872M0668k65298m12462k24330M7221J34400
$$ 524022 321985 194027 227975 384847 425515 160217 -252245 -476575 -429354 -294954
41052b94954J14814J22769M4662j74132k52190o371K27442P5565k11658j15964
$$ -294954 -180140 -57371 -12709 -186841 -439031 -445402 -217960 -142395 -354053 -470017
41042d70017K85982M04937N4340k98745k82185q3312N370K9174J13679J53067
$$ -470017 -184035 220902 275242 -23503 -305688 -389000 -383630 -354456 -240777 -87710
41032h7710M5706m4678N4092K13879K08822O4939k3139l132R956o5553k09037
$$ -87710 -42004 -86682 -32590 181289 390111 455050 431911 428779 438735 373182 164145
41021A64145l52067l89699k37511K3426J77746J47364Q9342J17506J05141o9317
$$ 164145 -187922 -577621 -815132 -791706 -613960 -466596 -377254 -259748 -154607 -223924
41011b23924k45089j76371Q4105K26612Q2231k02117l69385k83155J5792L33308
$$ -223924 -469013 -645384 -561279 -334667 -252436 -454553 -823938 -1107093 -1091301 -757993
41001g57993M32737K68203O8114M0166P0780p0812k98241k79247L3482K69893
$$ -757993 -325256 -57053 11061 51227 122007 51195 -247046 -526293 -492811 -222918
40991b22918J73623l1860k1436J38128J57769J3935n9270K0140R9733R1809N1276
$$ -222918 -49295 -81155 -102591 35537 193306 207241 147971 168111 267844 359653 410929
40980D10929m0258k46916m02999k21909K06190L83577P4300l18049l11955n692
$$ 410929 370671 123755 -279244 -501153 -294963 88614 162914 -155135 -467090 -472782
40970d72782J62998Q7085J2127K0563n5696k09695j70643J45218M24364L54533
$$ -472782 -309784 -222699 -210572 -190009 -245705 -455400 -626043 -480825 -56461 298072
40960B98072P445l01328l52548j40279J67365L12543J70116o4244r1488P1965
$$ 298072 305517 4189 -348359 -488638 -321273 -8730 161386 97142 5654 77619
40950G7619J32473k774r3879j076Q4257Q186o3280L7384J55909Q8772n0230m0517
$$ 77619 210092 207318 113439 112363 196620 204806 141526 178910 334819 423591 373361 332844
40938C32844N0451P781j23352j04091Q4586J99684R8276j04577k33742k10521
$$ 332844 383295 391076 267724 163633 248219 447903 546179 441602 207860 -2661
40928b661m8872J16950P5109j83631l25904p5855L30189M01491P0107k28059j77774
$$ -2661 -51533 65417 140526 -43105 -369009 -444864 -114675 286816 356923 128864 -48910
40917d8910M6806J32727M3116o5187r5631k8237J24149K39718J45231j26289l09682
$$ -48910 -2104 130623 173739 108552 12921 -15316 108833 348551 493782 367493 57811
40906E7811k54785j08876k6396P5005K68353L43140P6950l29723m18399q2987
$$ 57811 -196974 -305850 -332246 -257241 11112 354252 431202 101479 -316920 -399907
40896c99907K66959K40930n4622k12593n3819K08716K81068J17631p9583j05314
$$ -399907 -132948 107982 53360 -159233 -213052 -4336 276732 394363 314780 209466
40886B09466M4420J81579J21897j17038l21244l04328j04865P9477J24037O2947
$$ 209466 253886 435465 557362 440324 119080 -185248 -290113 -210636 -86599 -23652
40876b3652l8335j57642k18721q6509K04785L63971J93404p4449o3084J72636
$$ -23652 -61987 -219629 -438350 -524859 -320074 43897 237301 162852 99768 272404
40866B72404J98289j21016l72438k13960J07708J65695P489J062J83265K10044
$$ 272404 470693 349677 -22761 -236721 -129013 36682 44171 45233 228498 438542
40856D38542n3775l11941l02729j43771n6233k3499P4951J89182J77317N0976
$$ 438542 384767 72826 -229903 -373674 -429907 -453406 -378455 -189273 -11956 39020
40846C9020m1452k4947M2991Q6945Q0176J6488r9210k25415k87665k18931j5493
$$ 39020 -2432 -27379 15612 102557 182733 199221 100011 -125404 -413069 -632000 -647493
40835f47493K15242K96326J45873j07937k50786k15121j12036m2928J4665J07482
$$ -647493 -432251 -135925 9948 -97989 -348775 -563896 -675932 -718860 -704195 -596713
40825e96713J86974J52944j5947k14144k93070j97887k1632R8248J21929R4909
$$ -596713 -409739 -256795 -272742 -486886 -779956 -977843 -999475 -901227 -779298 -684389
40815f84389L2631o2093q5090P9816L17075L42014J10848n7456O5627K61325J88698
$$ -684389 -651758 -713851 -798941 -719125 -402050 -60036 50812 -6644 58983 320308 509006
40804E09006j13809l20336k80821j18947L3004J24850R4069n0176j14244N1796
$$ 509006 395197 74861 -205960 -324907 -291903 -167053 -72984 -123160 -237404 -185608
40794a85608K82474L03236J19266n8627j55860k12466j66745m805L0358k12220
$$ -185608 96866 400102 519368 460741 304881 92415 -74330 -79135 -48777 -260997
40784b60997l88869r9575L97291M90582J73319K7455K19782K56002p7890k89678
$$ -260997 -649866 -749441 -352150 138432 311751 339206 558988 814990 737100 447422
40774D47422n4959J76141o1726m60395m69836j61502J6143j7127l7232k8732q9816
$$ 447422 392463 568604 506878 46483 -423353 -584855 -568712 -585839 -623071 -651803 -741619
40763g41619p9047J21389K32682n490k84224j47051K43782L51574J17156m7259
$$ -741619 -820666 -699277 -466595 -472085 -756309 -903360 -659578 -308004 -190848 -238107
40753b38107j5725o3812k40334k46743k4148R4212n4507k20848j90529o2701J8915
$$ -238107 -253832 -317644 -557978 -804721 -828869 -734657 -789164 -1010012 -1200541 -1263242 -1244327
40742a244327L8869m1703k36374l15720m0907L78457M90606K67944J03035J39494
$$ -1244327 -1205458 -1247161 -1483535 -1799255 -1840162 -1461705 -971099 -703155 -600120 -460626
40732d60626J31266N248q925R3672K8759j71726j07901K35706L36369J5552j89724
$$ -460626 -329360 -324112 -333037 -239365 -210606 -382332 -490233 -254527 81842 97394 -92330
40721i2330P1423L37951J22516k57035k37115P7161K06078J17349Q4168M2253
$$ -92330 -20907 317044 439560 182525 -54590 22571 228649 345998 430166 472419
40711D72419k04674l81082q9759L70746L03454k82827o07326k67249K25213K74693
$$ 472419 267745 -113337 -203096 167650 471104 188277 -419049 -686298 -461085 -186392
40701a86392o375j31295P1355L86513N24075L11325j50292m25815j78993K67761
$$ -186392 -192767 -324062 -252707 133806 657881 969206 818914 393099 214106 481867
40691D81867K30402l53716p26517l43555L57600N93074K58503j25589k25937j65668
$$ 481867 712269 358553 -367964 -711519 -353919 239155 497658 372069 146132 -19536
40681a9536j06295k6113O8449O7499l5028j00124n6932K5770R0487J38906J30157
$$ -19536 -125831 -151944 -83495 -15996 -51024 -151148 -208080 -182310 -91823 47083 177240
40670A77240P221j59929k13024j10862K7890R3343P9314J6030o6115r9530k5282
$$ 177240 184461 24532 -188492 -299354 -271464 -178121 -98807 -82777 -148892 -248422 -273704
40659b73704J05529J72772J39908P7954L7338q607p9201j30605j09516j1111J19003
$$ -273704 -168175 4597 144505 222459 259797 251190 171989 41384 -68132 -79243 39760
40648C9760J99838J58682J6168j03214j06947m4847k1552n0545p4697p6324o7251
$$ 39760 239598 398280 414448 311234 204287 159440 137888 87343 12646 -63678 -130929
40637a30929j6008J03516K21323K34841J39217R183r7192j28662l0168J26711
$$ -130929 -146937 -43421 177902 412743 551960 561143 463951 335289 305121 431832
40627D31832J23478r7098k24610K8328M04526L50819j74342n53940l42998J32729
$$ 431832 555310 458212 233602 261930 666456 1017275 842933 288993 -54005 78724
40617G8724K86023O3769j28154q1804L7437P8385Q1340P3962J5415l5412K0030
$$ 78724 364747 428516 300362 218558 255995 334380 415720 489682 505097 469685 489715
40606D89715Q1201m1285k62830k90913j01118K349r0956q9166J78516L80254J51876
$$ 489715 570916 529631 266801 -24112 -125230 -122881 -213837 -303003 -124487 255767 407643
40595D07643k94513m14894p3482L20802L89780J76362o8513j98064j79023k5202
$$ 407643 113130 -301764 -375246 -54444 335336 511698 443185 245121 66098 40896
40585D0896J45596J50414k9959j71924q2197J32253J99657M8938j03602o3188
$$ 40896 186492 336906 306947 135023 52826 185079 384736 433674 330072 266884
40575B66884P3425P0197q5321j48949k421J18663m2001l31243l61420p9137J59541
$$ 266884 340309 410506 325185 176236 173815 292478 250477 -80766 -442186 -521323 -361782
40564c61782J41619P9146J68399K10904k0266l06044k75567j5550N9630j04926
$$ -361782 -220163 -141017 27382 238286 218020 -88024 -363591 -379141 -319511 -424437
40554d24437j14323K07785N03159M21898J17769n9532q6747j69702l01515k54625
$$ -424437 -538760 -330975 172184 594082 711851 652319 565572 395870 94355 -160270
40544a60270K3801K76954K49267j5632k30789j56232J58822L95382K85054p0308
$$ -160270 -136469 140485 389752 374120 143331 -12901 145921 541303 826357 756049
40534G56049l09598k67433j40051j18860r4403P5315K11273M6267k84088l40671
$$ 756049 446451 179018 38967 -79893 -174296 -98981 112292 158559 -125529 -466200
40524d66200l500L29794K87543o308j84241j37698l5432J5571O3805J19689J14054
$$ -466200 -469700 -139906 147637 141329 -42912 -180610 -216042 -200471 -136666 -16977 97077
40513I7077O3252O8827J18076Q1911l4999n4314O6048J06077n9394j90686l4108
$$ 97077 160329 229156 347232 429143 394144 339830 405878 511955 452561 261875 227767
40502B27767K16487J56032j96417l87828k00408O4398J09204N6797J03772J24745
$$ 227767 444254 600286 403869 16041 -184367 -119969 -10765 46032 149804 274549
40492B74549k9479j42309K3394K12460K0513l70856l73893P4830L53605R1154
$$ 274549 245070 102761 126155 338615 359128 -11728 -385621 -310791 42814 133968
40482A33968k90191k67698K1968J28232K6291K0413J30339Q8434j21895j93343
$$ 133968 -156223 -423921 -401953 -273721 -247430 -227017 -96678 -8244 -130139 -323482
40472c23482K114K24436K67848K27716K41877K35722Q9384j27590k50510k37365
$$ -323482 -321368 -96932 170916 398632 640509 876231 965615 838025 587515 350150
40462C50150j71365j22100r1513m8240L0975J15094J19321J6304q6765q1798k4552
$$ 350150 178785 56685 -34828 -83068 -52093 63001 182322 198626 111861 30063 5511
40451E511k6473l3660Q2357K30346J63596r5059j85396O0264K92557J33637k17503
$$ 5511 -20962 -54622 27735 258081 421677 326618 141222 201486 494043 627680 410177
40440D10177k52336O6323K41643K6427j92891l9375K29915J54815j41326j30252
$$ 410177 157841 224164 465807 492234 299343 259968 489883 644698 503372 373120
40430C73120K34163L84375K2801l91434l32678M1165K24509J27563L7617L3330
$$ 373120 607283 991658 1014459 623025 290347 331512 556021 683584 721201 754531
40420G54531m9438j67814j07709M1681l5758k74609k25854J87828M42959J95984
$$ 754531 705093 537279 429570 471251 435493 160884 -64970 122858 565817 761801
40410G61801j98217k89879k04406k70608l65462j73960J52699J88258l4369n8270
$$ 761801 563584 273705 69299 -201309 -566771 -740731 -588032 -399774 -434143 -492413
40400d92413K26168L91871J71840j34313j57548J6113P7722j4914n8041K6927
$$ -492413 -266245 125626 297466 163153 5605 21718 99440 84526 26485 53412
40390E3412Q5610k5058k23166k74600p3932J75796J71268p0237j85446J7101K47091
$$ 53412 139022 113964 -109202 -383802 -457734 -281938 -110670 -180907 -366353 -349252 -102161
40379a02161J72248o7482j27915m3069r5185k28432j17164J96652K91155P9111
$$ -102161 70087 2605 -125310 -168379 -263564 -491996 -609160 -412508 -121353 -42242
40369d2242k4110J69736K77889K1730k71021k27303m3686q1683k21058j33726
$$ -42242 -66352 103384 381273 403003 131982 -95321 -139007 -220690 -441748 -575474
40359e75474Q0169Q2015o7588k0818K09250K65554Q8502K945J14857J36475o4278
$$ -575474 -495305 -413290 -480878 -501696 -292446 -26892 61610 64555 179412 315887 251609
40348B51609k17473j37343k3248m4909k2120J88958L27986J08048k73541l76521
$$ 251609 34136 -103207 -126455 -171364 -193484 -4526 323460 431508 157967 -218554
40338b18554j35738J10760J39305N1438k3993j16029k16840j68755R3347L46490
$$ -218554 -354292 -243532 -104227 -52789 -76782 -192811 -409651 -578406 -485059 -138569
40328a38569L02611k9477l39025l64748j55215M4931R3191O3216Q1977J47635
$$ -138569 164042 134565 -204460 -569208 -724423 -679492 -586301 -523085 -441108 -293473
40318b93473J67356J18232P2774P0979O3962J1198m9404p1243p0508p9491q4598
$$ -293473 -126117 -7885 64889 135868 199830 211028 161624 90381 19873 -59618 -144216
40307a44216n8958j0561L8963P2794N1824n2599j63106j40747L428O5840n3992
$$ -144216 -203174 -213735 -174772 -101978 -50154 -102753 -265859 -406606 -403178 -337338 -391330
40296c91330j37156P0604M24362M91864J35446k72204l31850j01497P3575L6903
$$ -391330 -528486 -457882 -33520 458344 593790 321586 -10264 -111761 -38186 -1283
40286a283q9217j64233j38788J7425K43283K91786n234l81309l66103N9511L77247
$$ -1283 -90500 -254733 -393521 -376096 -132813 158973 153739 -227570 -593673 -534162 -156915
40275a56915K49297k2746j3132J71323J36267j06512j58674R9755L20249K40169
$$ -156915 92382 69636 56504 227827 364094 257582 98908 198663 518912 759081
40265G59081L4657m2584m3406j35570k71941k86356j69499m7117J3413J8464k8469
$$ 759081 793738 751154 707748 572178 300237 13881 -155618 -202735 -189322 -170858 -199327
40254a99327q0945k9745J36082K42582J35741j04747k61220k06650L3029L18646
$$ -199327 -280272 -310017 -173935 68647 204388 99641 -161579 -368229 -335200 -16554
40244a6554M22641J87790k13929l65243j18008J55697M9002k98702l85152k8938
$$ -16554 406087 593877 379948 14705 -103303 52394 101396 -197306 -582458 -611396
40234f11396M11865N00141J76683k49509l95699j14053L34425M70328J27233k98683
$$ -611396 -199531 300610 477293 227784 -167915 -281968 52457 522785 650018 351335
40224C51335l31560k7197J71463Q3395n5830m8596L7145J23598K23868K16226
$$ 351335 19775 -7422 164041 247436 191606 143010 180155 303753 527621 743847
40214G43847q1250m81446m92654k6582L63698K50021m9626j3948K44604K07348
$$ 743847 662597 181151 -311503 -338085 25613 275634 226008 212060 456664 664012
40204F64012j66285l61143j25376J62404J10157j22846j40722Q4849K19181N4819
$$ 664012 497727 136584 11208 173612 283769 160923 20201 105050 324231 379050
40194C79050k41230l59436j92332P4145J75862P0766j7968Q8934K59603K32773
$$ 379050 137820 -221616 -413948 -339803 -163941 -93175 -111143 -22209 237394 470167
40184D70167L772j72125j52483o1264l3399l9201m5961j16041k07354j07611K31835
$$ 470167 473939 301814 149331 88067 54668 15467 -30494 -146535 -353889 -461500 -229665
40173b29665M92526L70562J9669j63535r4480k8923q7880j12275l6792m5299k01512
$$ -229665 262861 633423 653092 489557 395077 366154 278274 165999 129207 83908 -117604
40162a17604k44567J2593L28486L49824R9908j29367k10237j87230n148L61133
$$ -117604 -362171 -349578 -21092 328732 428640 299273 89036 -98194 -103342 257791
40152B57791N78136K46538m09284o48756k15954K50730J40975k47101k39865J47400
$$ 257791 835927 1082465 673181 24425 -191529 59201 200176 -46925 -286790 -139390
40142a39390L15183Q5163r3610K3160J14830k9871r9203J32339L08551O5242l09768
$$ -139390 175793 260956 167346 190506 305336 275465 176262 308601 617152 682394 372626
40131C72626l15284l6126O1649o8381o7099J06510J08631q9635p8573K31532L38406
$$ 372626 57342 21216 82865 14484 -52615 53895 162526 72891 -5682 225850 564256
40120E64256m2122m31755l02851R6989J80172k9730j7789K84618L53803n3105
$$ 564256 522134 90379 -212472 -115483 64689 34959 17170 301788 655591 602486
40110F02486m75811m39861r9229J18241J34529J24737P9890j04143k53968p9429
$$ 602486 126675 -313186 -412415 -294174 -159645 -34908 44982 -59161 -313129 -392558
40100c92558L10218M50428J57900k12392k72659p3862R8878J50198J64320J49394
$$ -392558 -82340 368088 525988 313596 40937 -32925 65953 216151 380471 529865
40090E29865M7922q7890j53460j67685k00178j88426l5457J61230K03162Q5904
$$ 529865 577787 489897 336437 168752 -31426 -219852 -255309 -94079 109083 194987
40080A94987k5839q4529j52219j30258J49953N05138M75551J2228l07506o6106
$$ 194987 169148 84619 -67600 -197858 -47905 457233 932784 945012 637506 571400
40070E71400L39390K60434k38252n02434k62584P5830J43265N8979J9095o2839
$$ 571400 910790 1171224 932972 430538 167954 243784 387049 446028 465123 402284
40060D02284k33783k41457N6612L42002K61902l1514j36363l676R7572P2001M9958
$$ 402284 168501 -72956 -16344 325658 587560 556046 419683 416007 513579 585580 635538
40049F35538L2116j06569k76812k38616l3982L2522q6978q1838J65901L20560
$$ 635538 667654 561085 284273 45657 11675 44197 -42781 -124619 41282 361842
40039C61842J08869k34200l20040j54408k4976k4982n957R9227J94121K09356
$$ 361842 470711 236511 -83529 -237937 -262913 -287895 -293852 -194625 -504 208852
40029B08852J48397K595j74413j95294K6101K52142J95137n1164j46180l3315
$$ 208852 357249 359844 185431 -9863 16238 268380 463517 412353 266173 232858
40019B32858l848j98799l88244l53165j73083J3230K26442M22549L48468p7259
$$ 232858 229010 30211 -358033 -711198 -884281 -871051 -644609 -222060 126408 49149
40009D9149m56780l42535J33495M07919K27043r7853k03464j09410k1212J9853
$$ 49149 -407631 -750166 -616671 -208752 18291 -79562 -283026 -392436 -413648 -393795
39999c93795R2537J80052K03583J76900J59665J19650p918j63638k08240j11454
$$ -393795 -301258 -121206 82377 259277 418942 538592 530674 367036 158796 47342
39989D7342K5006J28908K15990K66733J81681n5100k64946k56636q6617L031p5397
$$ 47342 72348 201256 417246 683979 865660 810560 545614 288978 202361 205392 129995
39978A29995j36013l3493O7320n2745k40270j18808K88739M45918L3040n09027
$$ 129995 -6018 -39511 27809 -24936 -265206 -384014 -95275 350643 383683 -125344
39968a25344n28003o5357K38743R2200j02228L5444K85722K64505N9261K8494
$$ -125344 -653347 -718704 -479961 -387761 -489989 -454545 -168823 95682 154943 183437
39958A83437J84874K00058n0236l09776l16585p9844K22939L96999K98892j8016
$$ 183437 368311 568369 518133 208357 -108228 -188072 34867 431866 730758 712742
39948G12742k54671j90915q133k6727j87882j41466J55692L26996J59606p7777
$$ 712742 458071 267156 259023 232296 44414 -97052 58640 385636 545242 467465
39938D67465p6379Q3712J61492J23246M3940j02967k96886l36547j31539O7249
$$ 467465 391086 474798 636290 759536 803476 700509 403623 67076 -64463 2786
39928B786J0988j53629j33248M0044J22318J03298J58576K37860J08505j85416
$$ 2786 13774 -139855 -273103 -233059 -110741 -7443 151133 388993 497498 312082
39918C12082k98760r9212J33143J34301r525r0522q3622o3885k7365M0848P1597
$$ 312082 13322 -85890 47253 181554 172029 81507 -2115 -66000 -93365 -52517 19080
39907A9080K6887n089N9840J73042K32505K01528J00701k5568j11176j32845j63775
$$ 19080 45967 40878 100718 273760 506265 707793 808494 782926 671750 538905 375130
39896C75130k52398k95356j87068l4867j9357r2055n6184Q9285J66035J55507
$$ 375130 122732 -172624 -359692 -394559 -413916 -505971 -562155 -472870 -306835 -151328
39886a51328K04552K86106K06643q24o5290N5123Q2614q5234j95948j10280k1624
$$ -151328 53224 339330 545973 545149 479859 534982 617596 532362 336414 226134 204510
39875B04510k0068R4916L18422K67580j46058l89021j08617K32600R0060k54065
$$ 204510 184442 279358 597780 865360 719302 330281 221664 454264 544324 290259
39865B90259k03208J12200J11523j66203j53829J65750J77967k78713n99764l99030
$$ 290259 87051 199251 310774 144571 -9258 156492 334459 55746 -544018 -943048
39855i43048l8214R4289J16924J66224P6830r7107O3556N49672O81338J64182
$$ -943048 -981262 -886973 -770049 -603825 -526995 -624102 -560546 -10874 670464 834646
39845H34646l05318j16790K42882M5634l97234k85167K38512L01776j89168l78529
$$ 834646 529328 412538 655420 701054 303820 18653 257165 558941 369773 -8756
39835h756Q5156M77966K30006j94147j67338R2338K9460k71037l09852n1469R3026
$$ -8756 76400 554366 784372 590225 422887 515225 544685 273648 -36204 -87673 5353
39824E353Q180n422J63898K32365J6402k56556k81973o2368J75915K69346K08086
$$ 5353 13533 8111 172009 404374 420776 164220 -117753 -180121 -4206 265140 473226
39813D73226O4278p2624j44865j54323j19106l1244R1183J63851J30227M8417
$$ 473226 537504 464880 320015 165692 46586 15342 106525 270376 400603 449020
39803D49020p94l3609q7006q8601M8413K24736K12467n1396l52619m33057k50861
$$ 449020 448226 414617 327611 239010 287423 512159 724626 673230 320611 -112446 -363307
39792c63307K7997K09708J96300J2978k08230l03103j94435N5820L11111M47488
$$ -363307 -335310 -125602 70698 83676 -124554 -427657 -622092 -566272 -255161 192327
39782A92327L94125J69915q7168j99082j15494L5988J05644P5540J8116k0911
$$ 192327 586452 756367 669199 470117 354623 390611 496255 571795 589911 569000
39772E69000k3664L6169J20891R2834r8423k49042j25843J50331J96585q6167
$$ 569000 545336 581505 702396 795230 696807 447765 321922 472253 668838 582671
39762E82671l23648j85159J51241K90475J82555Q6438R8276O9636l7945p4618
$$ 582671 259023 73864 225105 515580 698135 784573 882849 952485 914540 839922
39752H39922k2757o1650k13513k34116l159K47469K69654J31805L6750J8720J2113
$$ 839922 817165 755515 542002 307886 304727 552196 821850 953655 990405 1009125 1021238
39741A021238L1682Q6431P9890j7164n7671L8446J07854J695j63285k18754k19651
$$ 1021238 1052920 1139351 1219241 1202077 1144406 1182852 1290706 1292401 1129116 910362 690711
39730F90711k72532k76770r9017J54596K90462K84471J62881j27322m49235l92854
$$ 690711 418179 141409 42392 196988 487450 771921 934802 807480 358245 -34609
39720c4609J30258N18867K43957k84870k77623J90862K95450j87939n29395k68154
$$ -34609 95649 614516 858473 573603 295980 486842 782292 594353 64958 -203196
39710b03196O9058p9843l78347k20896K53141M49386K55053L6538m5228j03100
$$ -203196 -134138 -213981 -592328 -813224 -560083 -110697 144356 180894 135666 32566
39700C2566r0522J04875K54027M9969k87896k45862J51979L16932j0811l80112
$$ 32566 -57956 46919 300946 350915 63019 -182843 -30864 286068 275257 -104855
39690a04855l23694K2067K34479J82594K5483j05233j72151j54311r4153r3974
$$ -104855 -428549 -406482 -172003 10591 36074 -69159 -241310 -395621 -489774 -583748
39680e83748j44323r8250Q6602K39271K12233P9275l909k928K5323M5013L5953
$$ -583748 -728071 -826321 -739719 -500448 -288215 -208940 -212849 -215777 -190454 -145441 -109488
39669a09488k4999j08901j39858q5487L1402J87062L13640K62352j5992l00468
$$ -109488 -134487 -243388 -383246 -468733 -437331 -250269 63371 325723 309731 9263
39659I263l22715j32214j892L648O6482K04203J74363r2021k96975k04669K5662
$$ 9263 -313452 -445666 -447558 -443910 -377428 -173225 1138 -90883 -387858 -592527 -566865
39648e66865J49730K00207K71815K07682j40496n05061m53399o284L50654L05812
$$ -566865 -417135 -216928 54887 262569 122073 -382988 -836387 -842671 -492017 -186205
39638a86205O0845n0490j953K5955j1349Q769J30709K17828J28672q5916k21943
$$ -186205 -125360 -175850 -177803 -151848 -163197 -154428 -23719 194109 322781 236865 14922
39627A4922j56723N52M3969n8389j16203K3388K50129L06442R5924j95922k93257
$$ 14922 -141801 -141249 -97280 -155669 -271872 -248484 1645 308087 404011 208089 -85168
39616h5168j12948J48690K23044P3027o5295L833J70234J90556M3983q0461j09513
$$ -85168 -198116 -49426 173618 246645 181350 185183 355417 545973 589956 509495 399982
39605C99982j52198k25630j85391p253J24079J14581Q4902P7269n1745k73978
$$ 399982 247784 22154 -163237 -170490 -46411 68170 153072 230341 178596 -95382
39595i5382k76292L0679K46717Q5538j09039O3455K90063O674n48685n38875J57754
$$ -95382 -371674 -340995 -94278 -8740 -117779 -54324 235739 242413 -306272 -845147 -687393
39584f87393O43792L08578k85867l06704J47720L70010J64735m9504o2913j10863
$$ -687393 -43601 264977 -20890 -327594 -179874 190136 354871 305367 242454 131591
39574A31591k91055l41838j24462J39017K53017K83157K67680P7488k51242l96117
$$ 131591 -159464 -501302 -625764 -486747 -233730 49427 317107 394595 143353 -252764
39564b52764j97597O2342Q3639j3515L4929J55994R7013q4809r3005Q6291J34551
$$ -252764 -450361 -388019 -304380 -317895 -282966 -126972 -29959 -114768 -207773 -121482 13069
39553A3069n7830j72397L7946L29696L10508J0779j80439p4052J05363Q4188j11251
$$ 13069 -44761 -217158 -179212 150484 460992 471771 291332 217280 322643 406831 295580
39542B95580k51662j95930m19J54248Q5594k25537n23995m64507j7702M16384
$$ 295580 43918 -152012 -152431 1817 87411 -138126 -662121 -1126628 -1144330 -727946
39532g27946M39810J21714j23166o0161J49047K42537J63715J0203j46166k68753
$$ -727946 -288136 -166422 -289588 -349749 -200702 41835 205550 215753 69587 -199166
39522a99166k88982j53429Q7847K96872L35719J53927j35474k89442j71235M8879
$$ -199166 -488148 -641577 -553730 -256858 78861 232788 97314 -192128 -363363 -314484
39512c14484Q4990o4255j13557N9656K16068J38039l9093q7169m9420p5176q4986
$$ -314484 -229494 -293749 -407306 -347650 -131582 6457 -32636 -119805 -169225 -244401 -329387
39501c29387O7577K39269J76582k7313n6358P5621L9067j94146k26197J02063
$$ -329387 -261810 -22541 154041 126728 70370 145991 185058 -9088 -235285 -133222
39491a33222L75702K19795j28925k13669k2549J20611J01580M8742j6330j51431
$$ -133222 242480 462275 333350 119681 97132 217743 319323 368065 351735 200304
39481B00304k22409o6134J38855P5730j64174j73276J02915K48356N3801j41790
$$ 200304 -22105 -88239 50616 126346 -37828 -211104 -108189 140167 193968 52178
39471E2178k5845J68444O2042k33397k81554J4040K98627L00317J41301M5283
$$ 52178 26333 194777 256819 23422 -258132 -244092 54535 354852 496153 541436
39461E41436K980j15886k75032k89210j07148P7505P1612m9661n1363J08442K10995
$$ 541436 544416 428530 153498 -135712 -242860 -165355 -93743 -143404 -194767 -86325 124670
39450A24670J17541k3140m8195n4077j60925j94827M7998L40464K61095j19920
$$ 124670 242211 219071 170876 116799 -44126 -238953 -190955 149509 410604 290684
39440B90684k61178M0773L32178K03498j24041k16770o5885N4048P2001Q4371
$$ 290684 29506 70279 402457 605955 481914 265144 199259 253307 325308 409679
39430D09679N5875p2184j56401p3589K2311l148M6995L18875M74176J53951l16698
$$ 409679 465554 393370 236969 163380 185691 182543 229538 548413 1022589 1176540 859842
39419H59842k88364K24424N34888K90925j18330k73318k48706k26086j26140R2039
$$ 859842 571478 795902 1330790 1621715 1503385 1230067 981361 755275 629135 721174
39409G21174K13700J39102R2262K05754K67078J23591l3281l7387k3848q5899
$$ 721174 934874 1073976 1166238 1371992 1639070 1762661 1729380 1691993 1668145 1582246
39399A582246n7021R4564Q7313j48283k35567j7509N1846l26449o43373l34181
$$ 1582246 1525225 1619789 1707102 1558819 1323252 1305743 1357589 1031140 387767 53586
39389E3586K42456L34682l242q9167J74809J85461k26347m42905r3830L27947
$$ 53586 296042 630724 627482 538315 713124 898585 672238 229333 135503 463450
39379D63450K62524j15093l05883k19169p4142N7972K05087K51373R5620j28396
$$ 463450 725974 610881 304998 85829 11687 69659 274746 526119 621739 493343
39369D93343k40288k46632k13546j20220J1838P5646Q1862J40199J60188p3364
$$ 493343 253055 6423 -207123 -327343 -315505 -239859 -157997 -17798 142390 69026
39359F9026m14615l82312J16191N21156L73254o6240k76285j80861k6335R1704
$$ 69026 -345589 -727901 -611710 -90554 282700 216460 -59825 -240686 -267021 -175317
39349a75317J69649P7269j76051k44211N0791L09397J32237j79993p2709L42047
$$ -175317 -5668 71601 -104450 -348661 -297870 11527 143764 -36229 -108938 233109
39339B33109M51642J15273j86553j70021p9694j13653j09117K6320Q3979l5916
$$ 233109 684751 800024 613471 443450 363756 250103 140986 167306 251285 215369
39329B15369j19726m9829k2670j56569k55251j75340q3076j20642j34076L1285
$$ 215369 95643 45814 23144 -133425 -388676 -564016 -647092 -767734 -901810 -870525
39319h70525K42993L16405K87463K40983J12034j22221k73780j91286l13R1280
$$ -870525 -627532 -311127 -23664 217319 329353 207132 -66648 -257934 -258247 -166967
39309a66967O4786J8106N7M8700K01053L44939K76589J9643j56297j45616j41314
$$ -166967 -102181 -84075 -84018 -35318 165735 510674 787263 806906 650609 504993 363679
39298C63679k22770j65514J06246K38078m1044m09991l62523O4328L71707K97835
$$ 363679 140909 -24605 81641 319719 278675 -131316 -493839 -429511 -57804 240031
39288B40031N0713j09393j58489j56210j03684k6050N683p238J3077Q4775J24302
$$ 240031 290744 181351 22862 -133348 -237032 -263082 -257399 -264637 -251560 -166785 -42483
39277d2483M5276j42903k95296k07676J33559M07446K98975k1093q7403J42167
$$ -42483 2793 -140110 -435406 -643082 -509523 -102077 196898 175805 88402 230569
39267B30569J96723j18194l48088j35678J55220N1013k16563j25742K05621K13530
$$ 230569 427292 309098 -38990 -174668 -19448 31565 -184998 -310740 -105119 108411
39257A08411j34030k84257l4340J76284M0652j73162j65560m4313L4896J78049
$$ 108411 -25619 -309876 -344216 -167932 -127280 -300442 -466002 -510315 -475419 -297370
39247b97370M04480M15654N7150l20149l08308o267J80086J05684m2146r5559
$$ -297370 107110 522764 579914 259765 -48543 -54810 125276 230960 188814 93255
39237I3255n6151K7657J17939J56301J06581j262j13835j69250q3797J36764K96420
$$ 93255 37104 64761 182700 339001 445582 444320 330485 161235 77438 214202 510622
39226E10622K05304m3424k00577k18875k20820j67529Q0493L65295L06923j15197
$$ 510622 715926 672502 471925 253050 32230 -135299 -54806 310489 617412 502215
39216E02215m38740l34208q066J66577J00506q1996k41727k07707J02831M13492
$$ 502215 63475 -270733 -278799 -112222 -11716 -93712 -335439 -543146 -440315 -26823
39206b6823L12185j16126l16729r8446P7100r0032k07309R1711M32015K87526
$$ -26823 285362 169236 -147493 -245939 -168839 -258871 -466180 -374469 57546 345072
39196C45072j26618k18302J0127N5818j78882k81816j02858L6174k1873k6453
$$ 345072 218454 152 10279 66097 -112785 -394601 -497459 -461285 -483158 -509611
39186e09611J37710K02798K7778j03414M0379K27111J28182j55036k29200M4178
$$ -509611 -371901 -169103 -141325 -244739 -204360 22751 150933 -4103 -233303 -189125
39176a89125L70368L76080L1817l06086k92743k3836O7851j94614m61994l57528
$$ -189125 181243 557323 589140 283054 -9689 -33525 34326 -160288 -622282 -979810
39166i79810j3480J75011J40114J24793J98839J89402O0783j0024M3634R8290
$$ -979810 -993290 -818279 -678165 -553372 -354533 -165131 -104348 -114372 -70738 27552
39156B7552R7239R6378O6322n4813j43599m6373R1825J4266j69707j13639J51465
$$ 27552 124791 221169 287491 232678 89079 42706 134531 148797 -20910 -134549 16916
39145A6916K00671q9050k97124j10603J99254K18811j8037j72974r8274Q4466
$$ 16916 217587 128537 -168587 -279190 -79936 138875 120838 -52136 -150410 -65944
39135f5944K33287K78188J79317k1631j82666k05533j24249p793J09898J80919
$$ -65944 167343 445531 624848 603217 420551 215018 90769 82976 192874 373793
39125C73793J61431R0177K0938q0016k09051j92425Q4977M05915M61925K98719
$$ 373793 535224 625401 646339 566323 357272 164847 249824 655739 1117664 1416383
39115A416383K08450K46968K14971P2879q095K0025Q2864K58736O10222Q21596
$$ 1416383 1624833 1871801 2086772 2159651 2151556 2171581 2254445 2513181 3123403 3944999
39105C944999N60074J68149L29104R50003J098046L02231p57887j216290j061917
$$ 3944999 4505073 4673222 5002326 5952329 7050375 7352606 6594719 5378429 4316512
39096D316512q09331o92045o54574o76623o43408l10928J92470K94102j68551
$$ 4316512 3507181 2815136 2160562 1483939 840531 529603 722073 1016175 847624
39087H47624n37684k82392J76005J88219r0629j15495N1872m496j37360J16582
$$ 847624 309940 27548 203553 391772 301143 185648 237520 233024 95664 212246
39077B12246N50643M85667o2450l19580J3224L09427O8279l24134k75440J36750
$$ 212246 762889 1248556 1186106 866526 879750 1189177 1257456 933322 657882 794632
39067G94632L99759L03735O8630m2485K6097J26064N0098j97000l09069p4582
$$ 794632 1194391 1498126 1566756 1524271 1550368 1676432 1726530 1529530 1220461 1145879
39057A145879K45960K55412J7093q1402L8163J16068R6557J66884K56099O9486
$$ 1145879 1391839 1647251 1664344 1582942 1621105 1737173 1833730 2000614 2256713 2326199
39047B326199k96564l62464n0423J19115j36537l84372j82612K07501K42653j06790
$$ 2326199 2029635 1667171 1616748 1735863 1599326 1214954 1032342 1239843 1482496 1375706
39037A375706m05687l86075j68338J4809L3123j10990k74054k75902j12581N2605
$$ 1375706 970019 583944 415606 430415 463538 352548 78494 -197408 -309989 -257384
39027b57384J37374J89153J85317N0943j05842q4331N0128L9168r9326p4112J31747
$$ -257384 -120010 69143 254460 305403 199561 115230 165358 204526 105200 31088 162835
39016A62835J69391o4835j91472L7476L14941K73621L6967n5430K8856R4082P3852
$$ 162835 332226 267391 75919 113395 428336 701957 738924 683494 712350 806432 880284
39005H80284J2982r8652k24064k16717o8975K174r9953j80207j03058k3650p4975
$$ 880284 893266 794614 570550 353833 284858 287032 187079 6872 -96186 -119836 -194811
38994a94811j31675q7419m7053m3899P5816K72780K26723j05965k77640j8173
$$ -194811 -326486 -413905 -460958 -504857 -429041 -156261 70462 -35503 -313143 -331316
38984c31316L11821L11386J50594J54112J93341J0274k12445j65922r554q3990
$$ -331316 -19495 291891 442485 596597 789938 800212 587767 421845 412291 328301
38974C28301k66540j80730J30800K81657J46685q2129k67692l12817l0108M83422
$$ 328301 61761 -118969 11831 293488 440173 358044 90352 -222465 -252573 230849
38964B30849O51613J71996l67397k92899P8036j4619m39852l90301J84568M53156
$$ 230849 882462 1054458 687061 394162 472198 457579 17727 -372574 -188006 265150
38954B65150J16763j33844J21667L40233N7578k86032j67515J29041J09466o5036
$$ 265150 381913 248069 369736 709969 767547 481515 314000 443041 552507 487471
38944D87471j335J39398j4965k95524k68547L582J07149j4943p4962o500J0608
$$ 487471 486136 625534 610569 315045 46498 50080 157229 142286 67324 60824 71432
38933G1432k8194J0601M5505q2580k20771r8632J67034K05316r436j16283O2627
$$ 71432 43238 53839 99344 16764 -204007 -302639 -135605 69711 60275 -56008 6619
38922F619K89428K98222J12864p4266j17082R37J31759P3467j37665j99408J0117
$$ 6619 296047 594269 707133 632867 515785 516722 648481 721948 584283 384875 394992
38911C94992J85854N8551j54311j21972K0697o8396k83161k16652J08962K28056
$$ 394992 580846 639397 485086 363114 383811 315415 32254 -184398 -75436 152620
38901A52620j3293k29053j40403M9515J05728J22074J96190J61668o2350k00507
$$ 152620 139327 -89726 -230129 -180614 -74886 47188 243378 405046 342696 142189
38891A42189k8049K15381J54136j60814l34294j72951J13877K17728N6282j75519
$$ 142189 114140 329521 483657 322843 -11451 -184402 -70525 147203 203485 27966
38881B7966j90813Q1450L51632K88946q176j20558O2844J73333k7677k53073j81733
$$ 27966 -162847 -81397 270235 559181 551005 430447 493291 666624 638947 385874 204141
38870B04141J6436K7263n2148K5392J02319j03294l31760p3775M89401N78682
$$ 204141 220577 247840 195692 221084 323403 220109 -111651 -185426 303975 882657
38860H82657K3462l72156n2830L91220J59714m70133n91086r5851K33909L0847
$$ 882657 906119 533963 481133 872353 1032067 561934 -29152 -125003 108906 139753
38850A39753j63578O1823K69283k6599m61665l64691J81172M86652K87009j1295
$$ 139753 -23825 37998 307281 280682 -180983 -545674 -364502 122150 409159 397864
38840C97864p7722n0878q8974o4771Q2502J29718l5193j62432o8344J4318j43777
$$ 397864 320142 269264 180290 115519 198021 327739 292546 130114 61770 76088 -67689
38829f7689k88039n8449L38683L52392n2817k89761l2335K89921J76998j66711
$$ -67689 -355728 -414177 -75494 276898 224081 -65680 -98015 191906 368904 202193
38819B02193j91323J05159J86086j45203m17174k25668J52719K20238J2541l9827
$$ 202193 10870 116029 302115 156912 -260262 -485930 -333211 -112973 -100432 -140259
38809a40259J64883K93139J79136O7103J30576J65548j4694k21163k07830p5860
$$ -140259 24624 317763 496899 564002 694578 860126 845432 624269 416439 340579
38799C40579m5222m8687Q9071K36523J18821j89029l31589k16067j03191j35403
$$ 340579 295357 246670 335741 572264 691085 502056 170467 -45600 -148791 -284194
38789b84194j56414o9255J136J7163J35205L41065L31128j4662l43519k82741
$$ -284194 -440608 -509863 -508727 -491564 -356359 -15294 315834 301172 -42347 -325088
38779c25088N2734K73727K41965J10923L267p2632q8863l2143j970p3906j45335
$$ -325088 -272354 1373 243338 354261 357528 284896 196033 163890 161920 88014 -57321
38768e7321r3036K1048P6957J02264J57317J53704J2067j26849r6183K750l5320
$$ -57321 -150357 -129309 -52352 49912 207229 360933 373000 246151 149968 152718 117398
38757A17398j53415j16963Q8413K30001J86668P6145K2924K8203O2861P8589l3198
$$ 117398 -36017 -152980 -64567 165434 352102 428247 451171 479374 542235 620824 587626
38746E87626k64659l43773n2665L54581L96017L7712k35485j06691J68522J97649
$$ 587626 322967 -20806 -73471 281110 677127 714839 479354 372663 541185 738834
38736G38834j8991k02761k07115r5390K9993Q5482O731j62370k67843k21105q0070
$$ 738834 719843 517082 309967 214577 244570 330052 336783 174413 -93430 -314535 -394605
38725c94605P8717K21052K64460J26915q1326j29125M361R4194L2324l3141q195
$$ -394605 -315888 -94836 169624 296539 215213 86088 90449 184643 216967 183826 175631
38714A75631m668n2561J1937J83033J55956j72503m10167k23341J17086J62879
$$ 175631 170963 118402 130339 313372 469328 296825 -113342 -336683 -219597 -56718
38704e6718N596O3210L20831L57646R3026q0725k916j7959l17247m99707j48706
$$ -56718 -51122 12088 332919 690565 783591 702866 699950 681991 364744 -134963 -283669
38693b83669M81088P38394L70251k58456o29986n23866j02172K50322K46355K261
$$ -283669 197419 935813 1306064 1047608 417622 -106244 -208416 41906 288261 290522
38683B90522p8500J63016M04829L00132l6469k38544k06601j18225m2917J05831
$$ 290522 212022 375038 779867 1079999 1043530 804986 598385 480160 437243 543074
38673E43074K62662J95548j32658m44374m69100k00763J84180M59068M04072k613
$$ 543074 805736 1001284 868626 424252 -44848 -245611 -61431 397637 801709 799096
38663G99096m13281m08818l6600K31452J49240l3527p3576j00486k28662k06947
$$ 799096 385815 -23003 -59603 171849 321089 287562 213986 113500 -115162 -322109
38653c22109J40559M40199K43184k16516k96463Q4010L20598M6253l59237l77119
$$ -322109 -181550 258649 501833 285317 -11146 72864 393462 439715 80478 -296641
38643b96641k2485L37952M78756L71317O0731k51749k77634l8401P8276j03728
$$ -296641 -319126 18826 497582 868899 929630 677881 400247 361846 440122 336394
38633C36394k36382j8769K54767J39284k32966l64504j66997k1o678N1867K55369
$$ 336394 100012 81243 336010 475294 242328 -122176 -289173 -289194 -295872 -244005 11364
38622A1364L22308R6489j72352k13675p9477N3930J37246J55486N3719j03620
$$ 11364 333672 430161 257809 44134 -35343 18587 155833 311319 365038 261418
38612B61418j42118n4669j7361m9722L1946K18332K25356j2684j34822R9909L84732
$$ 261418 119300 64631 47270 -2452 29494 247826 473182 460498 325676 425585 810317
38601H10317L08474l5226k35637j66141l7325J6825N2434Q5577O1736K3795N7644
$$ 810317 1118791 1083565 847928 681787 644462 661287 713721 799298 861034 884829 942473
38590I42473J12973R8549P9362J47509J87953L4234k15928l15815k48159k07950
$$ 942473 1055446 1153995 1233357 1380866 1568819 1603053 1387125 1071310 823151 615201
38580F15201k40090j88129j3993J12050Q9315J6627o158K077K1868P5932J20733
$$ 615201 375111 186982 172989 285039 374354 390981 384823 386900 408768 484700 605433
38569F05433P5144k6292q0250j00421j66367k20863j43651N290P3139J13289K87452
$$ 605433 680577 654285 574035 473614 307247 86384 -57267 -51977 21162 134451 421903
38558D21903M69804L20817j52567m83052l66755p0668J1924q1917o3209J00698
$$ 421903 891707 1212524 1059957 576905 210150 139482 151406 69489 6280 106978
38548A06978J90983J31054O6008R0057J42523J58597J23478J263k00072l14946
$$ 106978 297961 429015 495023 585080 727603 886200 1009678 1010941 810869 495923
38538D95923j71967J26138K62095R8219j43813j79801j8366R9320N2339j5207
$$ 495923 323956 450094 712189 810408 666595 486794 468428 567748 620087 604880
38528F04880O1868K04859K05699O7271L7042K23289L62168J52669k92533n62832
$$ 604880 666748 871607 1077306 1144577 1181619 1404908 1767076 1919745 1627212 1064380
38518A064380m65613j84364O3472K54072L90294L76556J89061k7068j50099k02915
$$ 1064380 598767 414403 477875 731947 1122241 1498797 1687858 1660790 1510691 1307776
38508A307776j97753o4044J58290K63715J58475R8p0838j18981j82743j14410
$$ 1307776 1110023 1045979 1204269 1467984 1626459 1626557 1555719 1436738 1253995 1139585
38498A139585J18911K21864l1746l73185l64550m0292J46047j6051k44739k24782
$$ 1139585 1258496 1480360 1448614 1075429 710879 670587 816634 800583 555844 331062
38488C31062l466J71653J67586J0334j95051k90250j67598O1769J35605m3606
$$ 331062 327596 499249 666835 677169 482118 191868 24270 86039 221644 178038
38478A78038k71894k94745j01055J04982J63764J26647J66723L34500M38872K64918
$$ 178038 -93856 -388601 -489656 -384674 -220910 -94263 72460 406960 845832 1110750
38468A110750r0101k69818j25332P4226N2889o9610m2301M3964q4294l44738l45877
$$ 1110750 1020649 750831 625499 699725 752614 683004 640703 684667 600373 255635 -90242
38457i0242j4539K26278N8342k84087l75850j54144J23096K78217L16341K42868
$$ -90242 -104781 121497 179839 -104248 -480098 -634242 -511146 -232929 83412 326280
38447C26280M1494j77963k17314l5822J56715J26879j03059k70481j84480M0171
$$ 326280 367774 189811 -27503 -63325 93390 220269 117210 -153271 -337751 -297580
38437b97580J46175Q5281L5576N3842l5287k67945l33558j2820L88959M03917
$$ -297580 -151405 -66124 -30548 23294 -11993 -279938 -613496 -626316 -237357 166560
38427A66560O7443j66420j01496K8340M8016N4277Q0340o998j55973j10228R8114
$$ 166560 234003 67583 -33913 -5573 42443 96720 177060 170062 14089 -96139 1975
38416A975P6977k79956n12917k69898J28158J68981j17017l01457j97861L1086
$$ 1975 78952 -201004 -713921 -983819 -855661 -686680 -803697 -1105154 -1303015 -1271929
38406a271929K19495K90082J63959q2697j36952J40715L99153K45007j65028l68281
$$ -1271929 -1052434 -762352 -598393 -681090 -818042 -677327 -278174 -33167 -198195 -566476
38396e66476k72196j53799j03856N0981L05460M20245L43778K74657K51023P8022
$$ -566476 -838672 -992471 -1096327 -1045346 -739886 -319641 24137 298794 549817 627839
38386F27839k47358m12731k27447J07143K77894J79683r0049l20973k75538N5518
$$ 627839 380481 -32250 -259697 -152554 125340 305023 214974 -105999 -381537 -326019
38376c26019L18844K10404n8616p2919J15000J14352n7470K5484L70279M15959
$$ -326019 -7175 203229 144613 71694 186694 301046 243576 269060 639339 1055298
38366A055298l0300l63279j04246L17076K49224j62991k78972J1957K21140Q7639
$$ 1055298 1024998 661719 557473 874549 1123773 960782 681810 693767 914907 1002546
38356A002546j30730j82229j18143j9371J30475K28966R9768j64635k49250q5427
$$ 1002546 871816 689587 571444 552073 682548 911514 1011282 846647 597397 511970
38346E11970N3199J1947j5620J42533L29430L05782R0981j17270k03905j69889
$$ 511970 565169 577116 561496 704029 1033459 1339241 1430222 1312952 1109047 939158
38336I39158m6711P9199P1078r1556k30749j71543L0663J56989P9071j18311k30335
$$ 939158 892447 971646 1042724 951168 720419 548876 579539 736528 815599 697288 466953
38325D66953j08002K04196M62305M11087M0088l69148m91866k53752J24723L49553
$$ 466953 358951 563147 1025452 1436539 1476627 1107479 615613 361861 486584 836137
38315H36137L08623J27957n165m8260r7075j92735k30448j12874Q0661J70897
$$ 836137 1144760 1272717 1267552 1219292 1122217 929482 699034 586160 666821 837718
38305H37718R9663j1409l3052R018m981q3908o4616J62623M12276L57505k0514
$$ 837718 937381 925972 892920 901938 896957 813049 748433 911056 1323332 1680837 1660323
38294A660323l35719k94609q3462k1644m5221Q5287K24362J7942l74674l47750
$$ 1660323 1324604 1029995 946533 924889 879668 964955 1189317 1207259 832585 484835
38284D84835J88587N21483J55741m24923m94215j21189J10209O3012N8706J46643
$$ 484835 673422 1194905 1350646 925723 431508 310319 420528 483540 542246 688889
38274F88889P2531r6880j0890K67642K62409j00262l10450j10362R6569l2812
$$ 688889 761420 664540 653650 921292 1183701 1083439 772989 662627 759196 726384
38264G26384k09792o2929J99970J48996j68912l53583k62297p3304J06016K90532
$$ 726384 516592 453663 653633 802629 633717 280134 17837 -55467 50549 341081
38254C41081L73187K14321m6912r9625R5954K38242J02083j84258l39587k53078
$$ 341081 714268 928589 881677 782052 878006 1116248 1218331 1034073 694486 441408
38244D41408m2008J19138J62911J38142Q7180j4536j36422j24658O6141J75042
$$ 441408 399400 518538 681449 819591 906771 892235 755813 631155 697296 872338
38234H72338m1317l34978k13345K79727M95246J07015l54949k71863J56302K74989
$$ 872338 831021 496043 282698 562425 1057671 1164686 809737 537874 694176 969165
38224I69165k1215k34824j09528O6838N5049K2570J38320K47959J84053O2541
$$ 969165 947950 713126 603598 670436 725485 748055 886375 1134334 1318387 1380928
38214A380928L4092J5963r5054j83472j29592m7502n1833J0032K81404N12644
$$ 1380928 1415020 1430983 1335929 1152457 1022865 975363 923530 933562 1214966 1727610
38204A727610L39239j10553k99241l9918K29032J16586j46055j32508O6410K8887
$$ 1727610 2066849 1956296 1657055 1617137 1846169 1962755 1816700 1684192 1750602 1779489
38194A779489k27149k17414J79248M16981J04731l27639k43441K35824M37671
$$ 1779489 1552340 1334926 1514174 1931155 2035886 1708247 1464806 1700630 2138301
38185B138301J58507j24693p4316O8122K3322q0736p9166j23339l05916l18554
$$ 2138301 2296808 2172115 2097799 2165921 2189243 2108507 2029341 1906002 1600086 1281532
38175A281532P8441N21435M60659l3935l48029j58085K31405M09095L27061J45639
$$ 1281532 1359973 1881408 2342067 2308132 1960103 1802018 2033423 2442518 2769579 2915218
38165B915218o8309l01356m39515l41062k0675L17583M32205K56539j2833j09414
$$ 2915218 2846909 2545553 2106038 1764976 1744301 2061884 2494089 2750628 2737795 2628381
38155B628381j3253M6181m6797j19655k3349R6126M3344r4457j12753l7485k9516
$$ 2628381 2615128 2661309 2614512 2494857 2471508 2567634 2610978 2516521 2403768 2366283 2336767
38144B336767n8853L0219K08527L06198L01421K79038J78752q5884l06171j48514
$$ 2336767 2277914 2308133 2516660 2822858 3124279 3403317 3582069 3496185 3190014 3041500
38134C041500L23377O43191N34844K08651j0376n1733L603J13791K25824K50628
$$ 3041500 3364877 4008068 4542912 4751563 4741187 4689454 4693057 4806848 5032672 5283300
38124E283300J99964J70310J41158k4k00189k58402j48677n8189m4213N4453K71765
$$ 5283300 5483264 5653574 5794732 5794708 5594519 5336117 5187440 5129251 5085038 5139491 5411256
38113E411256L82300K50732M0708o4670q6805o3376P5260K77893L11930J26647
$$ 5411256 5793556 6044288 6084996 6020326 5933521 5870145 5945405 6223298 6535228 6661875
38103F661875k545R7412K15822J54517J07190L16662O01613O04767L49394J70626
$$ 6661875 6659330 6756742 6972564 7127081 7234271 7550933 8152546 8757313 9106707 9277333
38093I277333J95524K55546K61811L21441M82259O53870P88355Q91995Q87204
$$ 9277333 9472857 9728403 9990214 10311655 10793914 11447784 12236139 13128134 14015338
38084A4015338P27166O14159Q05253J196785J406318J308367J187761J289108
$$ 14015338 14742504 15356663 16161916 17358701 18765019 20073386 21261147 22550255
38076B2550255J522410J744632K037568K499696K991108L335197L636910M162184
$$ 22550255 24072665 25817297 27854865 30354561 33345669 36680866 40317776 44479960
38068D4479960M970036N866892O694459P500961Q455967R741802J1490972J3663635
$$ 44479960 49449996 55316888 62011347 69512308 77968275 87710077 99201049 112864684
38060A12864684J6004852J8311860K0760289K3741022K7240093L0478721L2193891
$$ 112864684 128869536 147181396 167941685 191682707 218922800 249401521 281595412
38053B81595412L1079230K5965873J6184544K497912j2302245k4453236l1495265
$$ 281595412 312674642 338640515 354825059 357322971 345020726 320567490 289072225
38046B89072225l3552064l2381735k9583361k5984407k2197909j8867236j6203088
$$ 289072225 255520161 223138426 193555065 167570658 145372749 126505513 110302425
38039A10302425j3864040j1597361r652428q322873p421629o540699n604634m819219
$$ 110302425 96438385 84841024 75188596 66865723 59444094 52903395 47298761 42479542
38031D2479542m209658l576292k891493k406331k258694k209143j935813j477691
$$ 42479542 38269884 34693592 31802099 29395768 27137074 24927931 22992118 21514427
38023B1514427j196141j280671j448432j275775p75555m31629n71631r10595r28628
$$ 21514427 20318286 19037615 17589183 16313408 15537853 15106224 14534593 13623998 12695370
38014A2695370n61556k24398j93196k84702k11193L3386K70114L95637L95639
$$ 12695370 12133814 11909416 11716220 11431518 11220325 11253711 11523825 11919462 12315101
38005A2315101K48134n7284m81297r43239j269844j210503p29336k29871j79426
$$ 12315101 12563235 12505951 12024654 11081415 9811571 8601068 7871732 7641861 7462435
37996G462435n00700o73663m76152k25130j82559j75068k8335N0102j42677l71508
$$ 7462435 6961735 6288072 5811920 5586790 5404231 5229163 5200828 5250930 5108253 4736745
37986D736745k88911M0001K74678K68678J11148j03252k70065k42086n5627L1356
$$ 4736745 4447834 4487835 4762513 5031191 5142339 5039087 4769022 4526936 4471309 4502665
37976D502665n0571l9567J34447Q7295l73188p56292n72455j48591j23533m06892
$$ 4502665 4452094 4412527 4546974 4634269 4261081 3504789 2932334 2783743 2660210 2253318
37966B253318l77228L1174K39353L9122r1746J29072L05444P2321k95717l59044
$$ 2253318 1876090 1907264 2146617 2185739 2093993 2223065 2528509 2600830 2305113 1946069
37956A946069j56044r768k4722r3888j47956j42750k0056J37084J37491o856o7677
$$ 1946069 1790025 1780257 1755535 1661647 1513691 1370941 1350885 1487969 1625460 1618604 1550927
37945A550927J2432M5881P590J23930M03036M99375K74067Q0437K07027M23941
$$ 1550927 1563359 1609240 1616830 1740760 2143796 2643171 2917238 2997675 3204702 3628643
37935C628643M22672L50480N00659P50207P43379M55148J67347J0500j03028j93123
$$ 3628643 4051315 4401795 4902454 5652661 6396040 6851188 7018535 7029035 6926007 6732884
37925F732884k12117k59863m69816p22145p63762n80622l82489k59207j29188
$$ 6732884 6520767 6260904 5791088 5068943 4305181 3724559 3342070 3082863 2953675
37916B953675q180m0519k22838l43025k72769j39531j26552k30410k93784k09635
$$ 2953675 2945495 2904976 2682138 2339113 2066344 1926813 1800261 1569851 1276067 1066432
37906A066432m0563N5787K5636J2356J55655L17024J92505k38841n88488n20773
$$ 1066432 1025869 1081656 1107292 1119648 1275303 1592327 1784832 1545991 957503 436730
37896D36730j61557J29319K24697K41805K18648O8868j60242k52299j18713N2903
$$ 436730 275173 404492 629189 870994 1089642 1158510 998268 745969 627256 680159
37886F80159M8602r2703j67021j11757p8031j55490j68168P1982L60695K49185
$$ 680159 728761 636058 469037 357280 279249 123759 -44409 27573 388268 637453
37876F37453k82352o13925k48824M47309O81758K74724k08418l18888j89402o7220
$$ 637453 355101 -258824 -507648 -60339 621419 896143 687725 368837 179435 112215
37866A12215O9281K24761K11081K8963j2794J50903J17436k97862n94313k76797
$$ 112215 181496 406257 617338 646301 633507 784410 901846 603984 9671 -267126
37856b67126L38571N43274K18512j38669k11464j49322j24414r9045n3164m3365
$$ -267126 71445 614719 833231 694562 483098 333776 209362 110317 57153 13788
37846A3788j4859J15096K13282R8820r0817n1400J96970L15561J39868j50014
$$ 13788 -1071 114025 327307 426127 335310 283910 480880 796441 936309 786295
37836G86295l39646l57024j71411J60608L66341K01950j66861l25291j42579J35507
$$ 786295 446649 89625 -81786 78822 445163 647113 480252 154961 12382 147889
37826A47889K81306K63686Q7505j99442l69408k32472L1189R5761q314K608J27889
$$ 147889 429195 692881 780386 580944 211536 -20936 10253 106014 97700 100308 228197
37815B28197J04954n1493l9641J48459J56666j05448k77140j65427m3449j00561
$$ 228197 333151 281658 242017 390476 547142 441694 164554 -873 -44322 -144883
37805a44883r2360J56197L56917K36108J3388M770Q8053q137j73413j41027k2285
$$ -144883 -237243 -81046 275871 511979 525367 530137 618190 610053 436640 295613 273328
37794B73328j16191l14630k12470K01007M49578K73248J997K2843K06103J65931
$$ 273328 157137 -157493 -369963 -168956 280622 553870 555867 578710 784813 950744
37784I50744r8287j88495N9816K76820Q8674k91665l50909o0522P7253j38915
$$ 950744 852457 663962 723778 1000598 1089272 797607 446698 386176 463429 324514
37774C24514k43953J02300M37940J74345l85761m30417R2326L83713N0662l42271
$$ 324514 80561 182861 620801 795146 409385 -21032 71294 455007 505669 163398
37764A63398k48630O3293J17801J2763N8605J33991l459j35604O9227L84411L13499
$$ 163398 -85232 -21939 95862 108625 167230 301221 297762 162158 231385 615796 929295
37753I29295r7391l11754j04689K04318L06227K24571O2412j54086l21188k87947
$$ 929295 831904 520150 415461 619779 926006 1150577 1212989 1058903 737715 449768
37743D49768r3027Q9112K10604K94018K11344j33229m70406m13507l5753J88764
$$ 449768 356741 445853 656457 950475 1161819 1028590 558184 144677 108924 297688
37733B97688N5888j38217j11421L2667Q3424N2747M7441M6579k5566j56112k76695
$$ 297688 353576 215359 103938 136605 220029 272776 320217 366796 341230 185118 -91577
37722i1577l23105k39441o0190M4710j3788n3499J09141K83873J40313k14445
$$ -91577 -414682 -654123 -714313 -669603 -683391 -736890 -627749 -343876 -203563 -418008
37712d18008l01820R454K66759J00188k41354k92365l6199J44892L2382k01390
$$ -418008 -719828 -710374 -443615 -343427 -584781 -877146 -913345 -768453 -736071 -937461
37702i37461k72019q2992K31430M32699L71217J27569p6448j24629p9891k3604
$$ -937461 -1209480 -1292472 -1061042 -628343 -257126 -129557 -206005 -330634 -410525 -434129
37692d34129K7443L3403n3979j49525j03942L2280L7190j08602j31428J00306
$$ -434129 -406686 -373283 -427262 -576787 -680729 -648449 -611259 -719861 -851289 -750983
37682g50983K98590J48308k03624l29366r9938J86957K44919J23526L9163O4855
$$ -750983 -452393 -304085 -507709 -837075 -937013 -750056 -505137 -381611 -342448 -277593
37672b77593J01924P4345L3349N6479J13046J05064L5523K6058J04847J04132
$$ -277593 -175669 -101324 -67975 -11496 101550 206614 242137 268195 373042 477174
37662D77174q6021k70636j78468J14863K59369J37900R162O1493J25504O912j56721
$$ 477174 391153 120517 -57951 56912 316281 454181 463343 524836 650340 657252 500531
37651E00531j24868L8193O4068r6357k06640q9137J59405L09995K29544k6006
$$ 500531 375663 413856 477924 381567 174927 85790 245195 555190 784734 758728
37641G58728k50170k54127q2004J0655j12248k60410j81215O7307J99397J10396
$$ 758728 508558 254431 172427 183082 70834 -189576 -370791 -303484 -104087 6309
37631F309l014N2507K16664K84644J46889j26899l52494l49011q0743K74946M58167
$$ 6309 3295 55802 272466 557110 703999 577100 224606 -124405 -205148 69798 527965
37620E27965L58430R1292j46310k49706k43211j97403j32778j0775J62529K64369
$$ 527965 886395 977687 831377 581671 338460 141057 8279 -2496 160033 424402
37610D24402J86493L1109K0611J62490J93228j9613k20039j30650Q4961M3759
$$ 424402 610895 642004 662615 825105 1018333 998720 778681 648031 732992 776751
37600G76751k40816l35909m2614K89945K84016O0525k6137M4200L407j95094k84625
$$ 776751 535935 200026 157412 447357 731373 791898 765761 809961 813368 618274 333649
37589C33649j32668M8721N8635M686O6120J66846J13058o6219j54495p8658P004
$$ 333649 200981 249702 308337 313023 379143 545989 659047 592828 438333 359675 366679
37578C66679k9360j34937j80871j03188O4963J87103R6553j68512k76805J0628
$$ 366679 337319 202382 21511 -81677 -16714 170389 266942 98430 -178375 -167747
37568a67747M12656M09258j3052k74212j5274L74622L26665j19625m54874m07321
$$ -167747 244909 654167 641115 366903 351629 726251 1052916 933291 478417 71096
37558G1096j30932J55128L19803K23416j23435l67721j88358J80275K27672n9190
$$ 71096 -59836 95292 415095 638511 515076 147355 -41003 139272 366944 307754
37548C07754j93946J511J39773k3191j75306l5652J37758K0532j89358j03977
$$ 307754 113808 115319 255092 231901 56595 20943 158701 179233 -10125 -114102
37538a14102K06150L38446J59307j03839k32382j55409J17622L92345L18870j29915
$$ -114102 92048 430494 589801 485962 253580 98171 215793 608138 927008 797093
37528G97093m32721j80786K59038K46006j45756k59118O6994K38253j05814m77757
$$ 797093 364372 183586 442624 688630 542874 283756 350750 589003 483189 5432
37518E432k82737K88578N59801K96777j00617k28708j29481q2068j95017l12103
$$ 5432 -277305 11273 571074 867851 767234 538526 409045 326977 131960 -180143
37508a80143k43883k0025J30887P2092n6424m2609R8813J88694J61441Q4497j9771
$$ -180143 -424026 -444051 -313164 -241072 -297496 -340105 -241292 -52598 108843 193340 173569
37497A73569j36985j28688P4566K25901O6453j76764n0383L46743L91877q2762
$$ 173569 36584 -92104 -17538 208363 274816 98052 47669 394412 786289 703527
37487G03527m18669j04680L87977K84274l27381o38384k89774K18021L19457N4214
$$ 703527 284858 180178 568155 852429 525048 -113336 -403110 -185089 134368 188582
37477A88582k08502k89665k17968k7551K10759L22278J97749m7838k06421k00879
$$ 188582 -19920 -309585 -527553 -555104 -344345 -22067 175682 127844 -78577 -279456
37467b79456j04212r095N3060J07261J81962K32670J49380q4346k80182k15545
$$ -279456 -383668 -392763 -339703 -232442 -50480 182190 331570 247224 -32958 -248503
37457b48503Q2671L35763L14030N6682k10361k88731j39376J06306K46220J82353
$$ -248503 -165832 169931 483961 540643 330282 41551 -97825 8481 254701 437054
37447D37054Q628j07371r8498j4898O6248P7632j8196j52988j68581j5939J32272
$$ 437054 445682 338311 239813 224915 291163 368795 350599 197611 29030 13091 145363
37436A45363R0568q2279j67132o8491J16838K53998K59561J11235q8117j47392
$$ 145363 235931 153652 -13480 -81971 34867 288865 548426 659661 571544 424152
37426D24152m5248k0313j96649k91716k2504L40208K75489j57956l18847O4398
$$ 424152 378904 358591 161942 -129774 -152278 187930 463419 305463 -13384 51014
37416E1014M62876L44335o9686k45868j57363j54919k71820k21945L918R0809
$$ 51014 513890 858225 788539 542671 385308 230389 -41431 -263376 -259458 -168649
37406a68649k4086l3113J69988K60851K2914k78964l12570j41385j119J02506
$$ -168649 -192735 -225848 -55860 204991 227905 -51059 -363629 -505014 -506133 -403627
37396d03627K56236L26295J42549j39231k09785o8231J8478k7098k0403R2106
$$ -403627 -147391 178904 321453 182222 -27563 -95794 -77316 -104414 -124817 -32711
37386c2711J19942r251j00603m1715m920j14525j78679r4K51364K63133M9727
$$ -32711 87231 77980 -22623 -64338 -69258 -183783 -362462 -362556 -111192 151941 201668
37375B01668r2733m2502J7682o6131j99655k14653q8585P0920J43724P6269n5865
$$ 201668 108935 66433 84115 17984 -181671 -396324 -484909 -413989 -270265 -193996 -249861
37364b49861q1334N6562J70898O6160j50813j95635j4972J58302J62319P1434
$$ -249861 -331195 -274633 -103735 -37575 -188388 -384023 -398995 -240693 -78374 -6940
37354f940k9229j61910k62933j50972J55679L32359J56364j64485k68244q8742
$$ -6940 -36169 -198079 -461012 -611984 -456305 -123946 32418 -132067 -400311 -489053
37344d89053J56579K80498K38264O4495j07762q7874J28450K82551J93000J1231
$$ -489053 -332474 -51976 186288 250783 143021 55147 183597 466148 659148 670379
37334F70379o0488j06882k77946m11667k41439J14853K56825Q3128q4799m193
$$ 670379 609891 503009 225063 -186604 -428043 -313190 -56365 26763 -58036 -62229
37324f2229J82339K22936P8269j15808k05354j01511J12313J86771K6785r3263
$$ -62229 120110 343046 421315 305507 100153 -1358 110955 297726 324511 231248
37314B31248P3881K68576P0157l54689m02743J2084K68701J4163k82406j22496
$$ 231248 305129 573705 643862 289173 -113570 -101486 167215 181378 -101028 -223524
37304b23524K26766K42521J2863j1879J67632J84897L6661O3883K45181J66390
$$ -223524 3242 245763 258626 246747 414379 599276 635937 699820 945001 1111391
37294A111391k07965l47719K4339M43430L68533m5822k31602k4624J92797Q7835
$$ 1111391 903426 555707 580046 1023476 1392009 1346187 1114585 1089961 1282758 1370593
37284A370593k06958l21365j11904J80754K07864o9682k97594j56910J90141K84734
$$ 1370593 1163635 842270 730366 911120 1118984 1049302 751708 594798 784939 1069673
37274A069673k260k93283k48010j2108Q0780K9675Q3945K51256K38448p0917l75765
$$ 1069673 1067413 774130 526120 514012 594792 624467 708412 959668 1198116 1127199 751434
37263G51434l46045n7610J46960J12680j7383r0759j17050j18678k7469J50378
$$ 751434 405389 347779 494739 607419 590036 499277 382227 263549 236080 386458
37253C86458K32089R1098j16448j47355k5705K713j60888l56125m18729l38257
$$ 386458 618547 709645 593197 445842 420137 422850 261962 -94163 -512892 -851149
37243h51149j52221R0969K42028J75637M4472J22845L36603K96277p4128l36212
$$ -851149 -1003370 -912401 -670373 -494736 -450264 -327419 9184 305461 231333 -104879
37233a04879j92704N6674M3328p4679J4689J55874L5014j49719J2611L13021J29948
$$ -104879 -297583 -240909 -197581 -272260 -257571 -101697 -66683 -216402 -203791 109230 239178
37222B39178m93360p35641j94023M87899N64026J85999j6554Q9719J39626k9712
$$ 239178 -254182 -989823 -1183846 -695947 -131921 54078 37524 127243 266869 237157
37212B37157k14052k62362k22782j24082L8935J54716J26482Q2505J76732K76769
$$ 237157 23105 -239257 -462039 -586121 -547186 -392470 -265988 -183483 -6751 270018
37202B70018J53042j10153k22377j46498j03140j39575o6818J28034J79742j3592
$$ 270018 423060 312907 90530 -55968 -159108 -298683 -365501 -237467 -57725 -71317
37192g1317j72229n2114J78758K16140Q3877N3670J88771K34691n476l80042n66386
$$ -71317 -243546 -295660 -116902 99238 183115 236785 425556 660247 654771 274729 -291657
37181b91657m40837j71631K1659R6498J40344J83465J73524J22778J37772K32257
$$ -291657 -732494 -904125 -882466 -785968 -645624 -462159 -288635 -165857 -28085 204172
37171B04172K29543j3963l46110m40839k02232R0571J22464o1122j23779R9621
$$ 204172 433715 419752 73642 -367197 -569429 -478858 -356394 -417516 -541295 -441674
37161d41674L51796K79690o3670k48126m4696K48040K32420j6315r6568Q7330
$$ -441674 -89878 189812 126142 -121984 -166680 81360 313780 297465 200897 288227
37151B88227J94646o081l01448l82423k40471l5142J72166L29307K72048l2884
$$ 288227 482873 476792 175344 -207079 -447550 -482692 -310526 18781 290829 257945
37141B57945k92695k22415M4951J56164M1042p3850p8359q3869j25117p2866R2994
$$ 257945 -34750 -257165 -212214 -56050 -15008 -88858 -167217 -251086 -376203 -449069 -356075
37130c56075J89327J09794o824L936J00771J29572M2941n7521m6934Q2835J80746
$$ -356075 -166748 -56954 -63778 -59842 40929 170501 213442 155921 108987 191822 372568
37119C72568Q1081j58322k67569j18341O8491L4842j33906j70800n3485J9116
$$ 372568 453649 295327 27758 -90583 -22092 12750 -121156 -291956 -345441 -326325
37109c26325P034O0746J76744J50634o5857k51101k32501o5115J49649L40597
$$ -326325 -319291 -258545 -81801 68833 2976 -248125 -480626 -545741 -396092 -55495
37099e5495L34112J975l74893k95987K31453N65312K90913j86007k64405m616
$$ -55495 278617 280592 -94301 -390288 -158835 406477 697390 511383 246978 242362
37089B42362J05287l1545q6533M0386R8854J9718L5234J75584J39140j64975l89417
$$ 242362 347649 316104 229571 269957 368811 388529 423763 599347 738487 573512 184095
37078A84095k85420o2554M5485J70170M20942M93148J33440k89038k36458J34765
$$ 184095 -101325 -163879 -118394 51776 472718 965866 1099306 810268 573810 708575
37068G08575J80863j91137l59816q394L59600K64338J5134J16670L78782K77130
$$ 708575 889438 698301 338485 330091 689691 954029 969163 1085833 1464615 1741745
37058A741745r1038j52899J40565K26917p2667k22897Q9457L73853J35417k99153
$$ 1741745 1650707 1497808 1638373 1865290 1792623 1569726 1659183 2033036 2168453 1869300
37048A869300l15127L2549K07976P8226k5055P000n4852k15234j76923P4180J48901
$$ 1869300 1554173 1586722 1794698 1872924 1847869 1854869 1800017 1584783 1407860 1482040 1630941
37037A630941j01434k97026j23774J88414K59425J02375k3341m6412p3623j28173
$$ 1630941 1529507 1232481 1108707 1297121 1556546 1658921 1635580 1589168 1515545 1387372
37027A387372j63513k05000k65536k50736j24610j7022q71M7289J73832J60147
$$ 1387372 1223859 1018859 753323 502587 377977 360955 360084 407373 581205 741352
37017G41352j27913m09129l42774p0552j8319k23302k77234J5574L26916L04835
$$ 741352 613439 204310 -138464 -209016 -227335 -450637 -727871 -712297 -385381 -80546
37007h0546M9078j33546j78610j89954j11785J80423N24105N47785J72748k33573
$$ -80546 -31468 -165014 -343624 -533578 -645363 -464940 59165 606950 779698 546125
36997E46125l27508j87160p8922m1605M0647J01454k8806k37829j92533J29060
$$ 546125 218617 31457 -47465 -89070 -48423 53031 24225 -213604 -406137 -277077
36987b77077L18486J27054j49636j39528M3396N6271p6774n4790J33866J92022
$$ -277077 41409 168463 18827 -120701 -77305 -21034 -97808 -152598 -18732 173290
36977A73290M3381n6741Q038M7527l3825o1745M3061R4692J140n9808m233k2946
$$ 173290 216671 159930 167968 215495 181670 119925 162986 257678 258818 199010 194777 171831
36965A71831j83554k14464M2781L02486K63365N6647o2345j55506l47197m23234
$$ 171831 -11723 -226187 -183406 119080 382445 439092 376747 221241 -125956 -549190
36955e49190j51836K11737K38753j727q7623M5701P4542p2252j01497O0726J22363
$$ -549190 -701026 -489289 -250536 -252263 -339886 -294185 -219643 -291895 -393392 -332666 -210303
36944b10303k553l170K31078L21540J9275l18430k59749L0119Q7839j10853j83386
$$ -210303 -212856 -216026 15052 336592 355867 37437 -222312 -192193 -104354 -215207 -398593
36933c98593k347J35951K8871j38701j30580J2169J32886K21475L26538L54656
$$ -398593 -400940 -264989 -236118 -374819 -505399 -493230 -360344 -138869 187669 542325
36923E42325J70578j46696l30255k40264l2515M6035m8228j40624p8818Q9729
$$ 542325 712903 566207 235952 -4312 -36827 9208 -39020 -179644 -258462 -168733
36913a68733J81322O7604j94278l88605l25571m8250J87815K10427J36756J68696
$$ -168733 12589 80193 -114085 -502690 -828261 -876511 -688696 -478269 -341513 -172817
36903a72817K71621K60466J52290J48461K36216J36751k13589m51803k90032M1283
$$ -172817 98804 359270 511560 660021 896237 1032988 819399 367596 77564 118847
36893A18847J36622k1716j61404j88202j94067j41795O0008K45938J62628p7480
$$ 118847 255469 233753 72349 -115853 -309920 -451715 -391707 -145769 16859 -60621
36883f0621j08891J11713K41336J04908q5849j44834j42017j12526N2633K67046
$$ -60621 -169512 -57799 183537 288445 202596 57762 -84255 -196781 -144148 122898
36873A22898K14507j25973l14363q0819K41678K32646l054j02827l2931L148N516
$$ 122898 337405 211432 -102931 -183750 57928 290574 287520 184693 151762 154910 160426
36862A60426Q7585J26330m0780k08069p8741J42233k0270m79298n74785n7777
$$ 160426 248011 374341 333561 125492 46751 188984 168714 -310584 -885369 -943146
36852i43146M71757M23717M5970m2141J93589K44846q4438m04672l68724j19268
$$ -943146 -471389 -47672 -1702 -43843 149746 394592 310154 -94518 -463242 -582510
36842e82510N5495J46850K53010K55475R672k72516k03159J95954M22156J50381
$$ -582510 -527015 -380165 -127155 128320 137992 -134524 -337683 -141729 280427 430808
36832D30808k97970l74795k7192K83152K27574j4062q9678N0225J65542Q6009
$$ 430808 132838 -241957 -269149 14003 241577 227515 137837 188062 353604 439613
36822D39613r8944j79212n9641J47424K43243J63370L7298k6341j23848l65556
$$ 439613 340669 161457 101816 249240 492483 655853 693151 666810 542962 177406
36812A77406n62184l68483J91456O05511M60308l9915l56293k80485o4694L7271
$$ 177406 -384778 -753261 -561805 43706 504014 464099 107806 -172679 -237373 -200102
36802b00102O1660J17545J36745P551j75956j92076p514J41819O2058j06969o2042
$$ -200102 -138442 -20897 115848 123399 -52557 -244633 -252147 -110328 -48270 -155239 -217281
36791b17281K09899L43812Q4456l04234l54225l9606J90589N4603j97629j97501
$$ -217281 -7382 336430 420886 116652 -237573 -277179 -86590 -31987 -229616 -427117
36781d27117L6594K15612J95172M1608j54731k88200j99953R9127K79022O5157
$$ -427117 -390523 -174911 20261 61869 -92862 -381062 -581015 -481888 -202866 -137709
36771a37709l06782l41680J8982L03645J86158q8893j24608P0429J83702P0560
$$ -137709 -444491 -786171 -767189 -463544 -277386 -366279 -490887 -420458 -236756 -166196
36761a66196j28299k36978j85456L4188L33265M74502K74615j10129k95333j35974
$$ -166196 -294495 -531473 -716929 -682741 -349476 125026 399641 289512 -5821 -141795
36751a41795R1418Q0980r5573j54219m5003K8068Q09M8767K00550J75163j55464
$$ -141795 -50377 30603 -64970 -219189 -264192 -236124 -235315 -186548 14002 189165 33701
36740C3701m13106j91309K78825L90816M3078k42721j56624j4158j07681j79057
$$ 33701 -379405 -570714 -291889 98927 142005 -100716 -257340 -271498 -379179 -558236
36730e58236N3652K90181J11321k63517k91628O438J25877k3508J6536L96365
$$ -558236 -504584 -214403 -103082 -366599 -658227 -651789 -525912 -549420 -532884 -136519
36720a36519O25995L43371j30435l09010j68654M3349K23075L20026K10940j2611
$$ -136519 489476 832847 702412 393402 224748 268097 491172 811198 1022138 1009527
36710A009527P767L34609N04927K30935r0203l2612J17714j11312m67715l46573
$$ 1009527 1017294 1351903 1856830 2087765 1997562 1964950 2082664 1971352 1503637 1157064
36700A157064J27509K19797k23229n27514k89266O1045Q2381n583J06342J91998
$$ 1157064 1284573 1504370 1281141 753627 464361 525406 607787 602204 708546 900544
36690I00544l9583l26152k68822j7532J7637j23245q6848J26753J87030L2603
$$ 900544 860961 534809 265987 248455 266092 142847 55999 182752 369782 402385
36680D02385o4111J066O3626P9674J62270K15708k205l78334m57308j03129K56522
$$ 402385 338274 339340 402966 482640 644910 860618 858413 480079 22771 -80358 176164
36669A76164K40662J4647n3985O0508J21526N1471n620M7012J33692J24391j9839
$$ 176164 416826 431473 377488 437996 559522 610993 605373 652385 786077 910468 890629
36658H90629j88074k03541n3489K6039j30070k98490j57208J60698J98080j00434
$$ 890629 702555 499014 445525 471564 341494 43004 -114204 46494 244574 144140
36648A44140k53171r57K67156J50513j25744j29526O0548O1639j11126r7352J45457
$$ 144140 -109031 -109988 157168 307681 181937 52411 112959 174598 63472 -33880 111577
36637A11577K69012J40495K2194N0900M302k34535l93225k50715l5702p3715k65249
$$ 111577 380589 521084 543278 594178 598480 363945 -29280 -279995 -315697 -389412 -654661
36626f54661k57293j4920J28492L124j21955O2268M24228N33222K38977j16422
$$ -654661 -911954 -926874 -798382 -795258 -917213 -854945 -430717 102505 341482 225060
36616B25060j56787M4808J41791N1073J4003J31666J89518O0085o3353m3925q2520
$$ 225060 68273 113081 254872 305945 319948 451614 641132 701217 637864 593939 511419
36605E11419l23066m78715k50580J13800J47530j04914j95415k9348M6369o6687
$$ 511419 188353 -290362 -540942 -427142 -279612 -384526 -579941 -609289 -562920 -629607
36595f29607l1374K64550M17503J56298j85157j83053O5442K05624J83066J54693
$$ -629607 -660981 -396431 21072 177370 -7787 -190840 -125398 80226 263292 417985
36585D17985R5863r4573k60010j52609J42897K89557J67400j8254p7756m6987
$$ 417985 513848 419275 159265 6656 149553 439110 606510 588256 510500 463513
36575D63513n5565j62015l13442l63796k01002O1984J59235L0507q2579k3354
$$ 463513 407948 245933 -67509 -431305 -632307 -570323 -411088 -380581 -463160 -486514
36565d86514M2655l2441p4999R2594K74486J89289n3706j40307o2560m7481r6511
$$ -486514 -443859 -476300 -551299 -458705 -184219 5070 -48636 -188943 -251503 -298984 -395495
36554c95495k9960Q3015N461j66755p2127K79721M22100J36729k02422k11725
$$ -395495 -425455 -342440 -336979 -503734 -575861 -296140 125960 262689 60267 -151458
36544a51458k2079N5301L3754Q4241J33793J964k24396k93697j69506j5938J08931
$$ -151458 -173537 -118236 -84482 -241 133552 135516 -88880 -382577 -552083 -568021 -459090
36533d59090K54779L39648K18231j4142q2083N4222J16255n9979k56737k04102
$$ -459090 -204311 135337 353568 339426 257343 311565 427820 367841 111104 -92998
36523i2998J7351J17817K3471p8333p6680p0377j19102r5738P9965K39628J85378
$$ -92998 -75647 42170 65641 -12692 -89372 -159749 -278851 -374589 -294624 -54996 130382
36512A30382m873r5718l8379L0533P9113J90297K77521J08879k85135n33055m19771
$$ 130382 125509 29791 -8588 21945 101058 291355 568876 677755 392620 -140435 -560206
36501e60206j86282j22046j29211K3773K47313K82139J54484J13421J97862K20383
$$ -560206 -746488 -868534 -997745 -973972 -726659 -444520 -290036 -176615 21247 241630
36491B41630J34713P2157L5159r5803k48005k03789O593J10675M1950K1526J16982
$$ 241630 376343 448500 483659 387856 139851 -63938 -57345 53330 95280 116806 233788
36480B33788J02251j08838k58806j58879K6153R8576J14346J43068O5221j46277
$$ 233788 336039 227201 -31605 -190484 -164331 -65755 48591 191659 256880 110603
36470A10603k49664j14491Q947j03556k52048j50589R7205K23658K55927L47558
$$ 110603 -139061 -253552 -244605 -348161 -600209 -750798 -653593 -429935 -174008 173550
36460A73550L70394J30480j73919j96908l2991n3882k38872k25831j1617J1813
$$ 173550 543944 674424 500505 303597 270606 216724 -22148 -247979 -259596 -247783
36450b47783j99097k06690J00493K32302l0416j47420K67533O31418K29098n34756
$$ -247783 -446880 -653570 -553077 -320775 -351191 -498611 -231078 400340 629438 94682
36440I4682o09162J13603O11194K71468k62990j94520K28725K47131j72457l87826
$$ 94682 -514480 -400877 210317 481785 218795 24275 253000 500131 327674 -60152
36430f0152j58506O8286k4529j64664m8337J47985J14365q3171j61306o4124M3265
$$ -60152 -218658 -150372 -174901 -339565 -387902 -239917 -125552 -208723 -370029 -434153 -390888
36419c90888P4549N7211j8101j44354j82087k2528J96467K45328J19994Q089n993
$$ -390888 -316339 -259128 -277229 -421583 -603670 -626198 -429731 -184403 -64409 -56320 -62313
36408f2313J379j6899m1905j05975k32465k89931j34976J19571K21082J49173
$$ -62313 -60934 -77833 -119738 -225713 -458178 -748109 -883085 -763514 -542432 -393259
36398c93259J05001J28815M4718j52348j94281K8798K40156J77918l5853j47037
$$ -393259 -288258 -159443 -114725 -267073 -461354 -432556 -192400 -14482 -50335 -197372
36388a97372j49931j59219j10955J02700L36455L44371J67871Q6185J93167K75599
$$ -197372 -347303 -506522 -617477 -514777 -178322 166049 333920 420105 613272 888871
36378H88871J43162j15762k56838j41404J35442L11716K12461l019J4270L07095
$$ 888871 1032033 916271 659433 518029 653471 965187 1177648 1174629 1188899 1495994
36368A495994M60779J50605l51668n09760k30032R3501J68210Q5221K1448O325
$$ 1495994 1956773 2107378 1755710 1245950 1015918 1109419 1277629 1362850 1384298 1390623
36358A390623L6884J17626J21786r7412l94969m33997j74110N3983N9477L4862
$$ 1390623 1427507 1545133 1666919 1569507 1174538 740541 566431 620414 679891 714753
36348G14753J40552K05588P3655p8686n9714j9593j61179l30113k64218p3140
$$ 714753 855305 1060893 1134548 1055862 996148 976555 815376 485263 221045 147905
36338A47905o2867j85945r4189K64347N02935L39851l5264k59642k16096l7198
$$ 147905 85038 -100907 -195096 69251 572186 912037 876773 617131 401035 363837
36328C63837J12025J45230Q6192N0076Q5140O0186j23711k73942j21334K23996
$$ 363837 475862 621092 707284 757360 842500 902686 778975 505033 383699 607695
36318F07695L43915Q4631k60278m14199m14789l25832n5266L04972L56906k8949
$$ 607695 951610 1036241 775963 361764 -53025 -378857 -434123 -129151 227755 198806
36308A98806l53436j43962L00033L39277j6434j69270O3790J84676j04718m02863
$$ 198806 -154630 -298592 1441 340718 324284 155014 218804 403480 298762 -104101
36298a04101l10776p6258q3181j45103J21492N16172M92437O3869j75460J1258
$$ -104101 -414877 -491135 -574316 -719419 -597927 -81755 410682 474551 299091 310349
36288C10349J62917p1883l40462j77164K19867K89135l1504k43827n8934K14887
$$ 310349 473266 401383 60921 -116243 103624 392759 361255 117428 58494 273381
36278B73381J65900j63477l92971k85904M9477L25121L15157K2005k91941l08745
$$ 273381 439281 275804 -117167 -403071 -353594 -28473 286684 308689 16748 -291997
36268b91997J3329L65583M22038J86651o8435j39560n8659K8317K4417p2298j77915
$$ -291997 -278668 86915 508953 695604 627169 487609 428950 457267 481684 409386 231471
36257B31471j64562J4245K18264K26899r765k89616l66047j90182P6847K39215
$$ 231471 66909 81154 299418 526317 516552 226936 -139111 -329293 -252446 -13231
36247a3231K24823J15472M8634O2989N3710o0729j62808o0217J97445K97672O5219
$$ -13231 211592 327064 375698 438687 492397 431668 268860 208643 406088 703760 768979
36236G68979k58414k98711k8024K20899J93184j6631j55809j22724k1180l473
$$ 768979 510565 211854 183830 404729 597913 581282 425473 302749 281569 278096
36226B78096j16860k52943k37292k8500J90456K09302N7398m5336N269Q7925P7053
$$ 278096 161236 -91707 -328999 -357499 -167043 42259 99657 54321 59590 147515 224568
36215B24568J6850L250J9881j5165j18387k22115k24526m3423K74697M89499L65090
$$ 224568 241418 244668 264549 249384 130997 -91118 -315644 -359067 -84370 405129 770219
36204G70219j5188k90094k48707n6696K6590l0458j15698j84319k11600j05488
$$ 770219 755031 464937 216230 159534 186124 155666 39968 -144351 -355951 -461439
36194d61439J27835K74186J85477L0569L6011J13770L5207j39908j57189l0668
$$ -461439 -333604 -59418 126059 156628 192639 306409 341616 201708 44519 13851
36184A3851k0957j39325r8113J38048J91086j08883l40926r3062L50531L71661
$$ 13851 -7106 -146431 -244544 -106496 84590 -24293 -365219 -458281 -107750 263911
36174B63911p9768m18869k64414R7537K27301J38806J31983K53253K48220p316
$$ 263911 184143 -234726 -499140 -401603 -174302 -35496 96487 349740 597960 590644
36164E90644l10752m24896l66372k82804j74440P5414M06930N19510K31856j97910
$$ 590644 279892 -145004 -511376 -794180 -968620 -893206 -486276 33234 265090 67180
36154F7180l09555r376K94032K21526q7012k06094k3636J70070J69099J03207
$$ 67180 -242375 -251751 42281 263807 176795 -29299 -52935 117135 286234 389441
36144C89441R8024J1346k41862l69528q8306L17688K82919j96984m92676k47841
$$ 389441 487465 498811 256949 -112579 -200885 116803 399722 202738 -289938 -537779
36134e37779J23887J31138n4876L139K18009J63980j22179j60204J49507L33396
$$ -537779 -413892 -282754 -337630 -334491 -116482 47498 -74681 -234885 -85378 248018
36124B48018J24621j20372m6615J32072L7483k62340m19231l27338j41320K4034
$$ 248018 372639 252267 205652 337724 375207 112867 -306364 -633702 -775022 -750988
36114g50988J13050M3349j15982q1285K41578M96086L31656p1581k68033j62860
$$ -750988 -637938 -594589 -710571 -791856 -550278 -54192 277464 205883 -62150 -225010
36104b25010j6096J4504k1530q6234j29705J2658L46489N04872K03032k56529
$$ -225010 -241106 -226602 -248132 -334366 -464071 -451413 -104924 399948 602980 346451
36094C46451l71507j70035n4717p1158O5205K88201K11237j08119j37372K15218
$$ 346451 -25056 -195091 -249808 -320966 -255761 32440 243677 135558 -1814 213404
36084B13404L42335r2118n52704m34455N0272K82832J42470j8844k9605j5886
$$ 213404 555739 463621 -89083 -523538 -473266 -190434 -47964 -66808 -96413 -112299
36074a12299j9646M8940J41223J06405l0943r0134J106J40632J88552O2676j76789
$$ -112299 -131945 -83005 58218 164623 133680 43546 44652 185284 373836 436512 259723
36063B59723k76840m7463K65648J85312k89455n66262k78241J83389K84028J05754
$$ 259723 -17117 -64580 201068 386380 96925 -469337 -747578 -564189 -280161 -174407
36053a74407N9257J60810J22800l5794j7888J86942K64311J03382o5561q8652
$$ -174407 -115150 45660 168460 132666 114778 301720 566031 669413 603852 515200
36043E15200o1391m7374J9617R6061J8538j89060k83546j61014j301K3292l3410
$$ 515200 453809 406435 426052 522113 540651 351591 68045 -92969 -94270 -70978 -104388
36032a04388l9747K5160R2550Q2970m4413k03840k00765J0034J77740P6757j22078
$$ -104388 -144135 -118975 -26425 56545 12132 -191708 -392473 -382439 -204699 -127942 -250020
36021b50020p9244J69532K33703k1663k19552L340M47429N67310J61934l62384
$$ -250020 -329264 -159732 73971 52308 -167244 -163904 283525 850835 1012769 650385
36011F50385m77022j59792J14100J8553j99829j35985J23660J47183r8921j51151
$$ 650385 173363 13571 127671 146224 -53605 -189590 -65930 81253 -17668 -168819
36001a68819J65412L68523O1766l98000m29015q5408J25782N3752j7781L4417
$$ -168819 -3407 365116 426882 28882 -400133 -485541 -359759 -306007 -323788 -289371
35991b89371N0588J7716J05357K54114J99635m7028j78476r8722k6297m0185K8795
$$ -289371 -238783 -221067 -115710 138404 338039 291011 112535 13813 -12484 -52669 -23874
35980b3874J64596Q8376k24292l81706j54213J56391J75067k7460j33092m7357
$$ -23874 140722 229098 4806 -376900 -531113 -374722 -199655 -227115 -360207 -407564
35970d07564Q0673J30789R2477N880l4401M9119J54177Q4170j29984k14350n8249
$$ -407564 -326891 -196102 -103625 -97745 -132146 -83027 71150 155320 25336 -189014 -247263
35959b47263J05573P0519k9449K7197J70378J50270o8141k43872j86863P373R8463
$$ -247263 -141690 -71171 -100620 -73423 96955 247225 179084 -64788 -251651 -244278 -145815
35948a45815R129q5648j5010J16830P6611r1612p1294K04537L46333P5461k86480
$$ -145815 -136686 -222334 -237344 -120514 -43903 -135515 -206809 -2272 344061 419522 133042
35937A33042k63950N3158J80660L799j13326L7768K26521K01137J1937j61109
$$ 133042 -130908 -77750 102910 106709 -6617 31151 257672 458809 470746 309637
35927C09637k04940p3744J40100J88626k212j34414j0688M2515k76864n49057
$$ 309637 104697 30953 171053 359679 357467 223053 212365 254880 -21984 -571041
35917e71041j89238M74125N41859m3662l72472j9778L53032K03855m3412R5623
$$ -571041 -760279 -286154 255705 212043 -160429 -180207 172825 376680 333268 428891
35907D28891K78990M9367k89470k57721n6540q0521j27572J04638K53129r3542
$$ 428891 707881 757248 467778 210057 153517 72996 -54576 50062 303191 209649
35897B09649m62161j60664M56045M48151j62026m16621kL24849O8912k41540q5714
$$ 209649 -252512 -413176 42869 491020 328994 -87627 -87629 237220 306132 64592 -21122
35886b1122J90199Q2101k04328j94929N1390J47745K2869j21267j97316j73906
$$ -21122 169077 251178 46850 -148079 -96689 51056 73925 -47342 -244658 -418564
35876d18564P0917M47438N07434K4516n34842n65249j45547J48195J01225L7202
$$ -418564 -347647 99791 607225 631741 96899 -468350 -613897 -465702 -364477 -327275
35866c27275J79632L24968K49710N5677n1814n3786k9123R511M1588k3106j77728
$$ -327275 -147643 177325 427035 482712 430898 377112 347989 357500 399088 375982 198254
35855A98254k32210n9035J80499K29648Q3313m5148o1743p3703j12878l0233K03741
$$ 198254 -33956 -92991 87508 317156 400469 355321 293578 219875 106997 76764 280505
35844B80505L17008Q3970k86922l90978j87472j9672p1631j35419k2241J13559
$$ 280505 597513 681483 394561 3583 -183889 -203561 -275192 -410611 -432852 -319293
35834c19293O6213n7939l4096R0852Q6509o7755j49000l6087J38152K06218J61465
$$ -319293 -253080 -311019 -345115 -254263 -167754 -235509 -384509 -420596 -282444 -76226 85239
35823H5239R1027M1729O682k2220k6843J4016N6502j2326k05995l04687q7756
$$ 85239 176266 217995 224677 202457 175614 189630 246132 233806 27811 -276876 -364632
35812c64632K81779L65117M3656k70683k06700N6964J25916l908l3930Q8673J07690
$$ -364632 -82853 282264 325920 55237 -151463 -94499 31417 27509 -6421 82252 189942
35801A89942q6204k89849l11614j75759K4125K12400K55847P4116j46878j32115
$$ 189942 103738 -186111 -497725 -673484 -649359 -436959 -181112 -106996 -253874 -385989
35791c85989N9367J03746l1259K1135L90941O02546J96841n11791p37076k34352
$$ -385989 -326622 -222876 -254135 -233000 157941 760487 957328 445537 -291539 -525891
35781e25891L93235M99517J64763o3635L6483J65975N2949j46897j44982J9232
$$ -525891 -132656 366861 531624 467989 504472 670447 723396 576499 431517 450749
35771D50749O2430q7471j85579n4726J39345J12230j64426m32562m37666j68180
$$ 450749 513179 425708 240129 185403 324748 436978 272552 -160010 -597676 -765856
35761g65856J64356L30930K77050J21902j7560j28633k04103j78185o9429m2006
$$ -765856 -601500 -270570 6480 128382 110822 -17811 -221914 -400099 -469528 -511534
35751e11534j51614j77226N4393L14922K61392k2768j50158m1736J4355p3517
$$ -511534 -663148 -840374 -785981 -471059 -209667 -232435 -382593 -424329 -409974 -483491
35741d83491n8465J22718J79029O213p7666J03938K36005M2677k41644k84557
$$ -483491 -541956 -419238 -240209 -233996 -311662 -207724 28281 70958 -170686 -455243
35731d55243j62794q3139L8058K97516M41001K34603q0254j55344r0480j57051
$$ -455243 -618037 -701176 -663118 -365602 75399 310002 229748 74404 -16076 -173127
35721a73127k46578j16131O5025j1642j68541K482L87493M75047J73394j05751
$$ -173127 -419705 -535836 -470811 -482453 -650994 -648512 -261019 214028 387422 281671
35711B81671j63390k04568k82214j61168J52390L07264J81118N5044P7528N1184
$$ 281671 118281 -86287 -368501 -529669 -377279 -70015 111103 166147 243675 294859
35701B94859r3641j13064O4365J34770o4503k51941j56092R3304K47942K72849
$$ 294859 201218 88154 152519 287289 222786 -29155 -185247 -91943 155999 428848
35691D28848K00161l480k23337j84950J35763L89359L15970M2504k08910l73489
$$ 428848 629009 625529 402192 217242 353005 742364 1058334 1100838 891928 518439
35681E18439l84443j49665J53646J64386j00649j94274M6551K05235j1915k62674
$$ 518439 133996 -15669 137977 302363 201714 7440 53991 259226 247311 -15363
35671a5363j47924J34116J84480R0442J80484L54491K28581j78942m36759l44825
$$ -15363 -163287 -29171 155309 245751 426235 780726 1009307 830365 393606 48781
35661D8781j34937j9095N7208J60806K15162J74300Q6528n7025k89003m57532
$$ 48781 -86156 -105251 -48043 112763 327925 502225 588753 531728 242725 -214807
35651b14807l23787N6201K90854J21640k39202l75881j63044J46834K82535K56520
$$ -214807 -538594 -482393 -191539 -69899 -309101 -684982 -848026 -701192 -418657 -162137
35641a62137K53390L09170K54443P806k42425k91509k19018k22824k53180j03102
$$ -162137 91253 400423 654866 662672 420247 128738 -90280 -313104 -566284 -669386
35631f69386J65985K29569L019j85903p1837J82815K74690J63958n356j67193
$$ -669386 -503401 -273832 -270813 -456716 -528553 -345738 -71048 92910 87554 -79639
35621g9639k92793k70845o3982J44130J69846R2941J11409K32082K88486J88422
$$ -79639 -372432 -643277 -707259 -563129 -393283 -300342 -188933 43149 331635 520057
35611E20057j7985k44380l94495l53906j06959J74105K74240J55855k3393p8371
$$ 520057 502072 257692 -136803 -490709 -597668 -423563 -149323 6532 -16861 -95232
35601i5232L7572J74925J11432j71969l86191k60812P2387K36973J26581k080
$$ -95232 -57660 117265 228697 56728 -329463 -590275 -517888 -280915 -154334 -156414
35591a56414L1625R5566L2621q6999j23471n7740O9372K00206J97700q360j88865
$$ -156414 -124789 -29223 3398 -83601 -207072 -264812 -195440 4766 202466 194106 5241
35580E241n1296K50620K42614j31290l56079j37413J38060O5164j16420R732K71152
$$ 5241 -46055 204565 447179 315889 -40190 -177603 -39543 25621 -90799 -81067 190085
35569A90085J89994j71808k67925N5278L08270J15495k46242l07976p3207Q3461
$$ 190085 380079 208271 -59654 -4376 303894 419389 173147 -134829 -208036 -124575
35559a24575O33j10734o9357R914j9972k9924J64062L75855K18203k47545m54628
$$ -124575 -123942 -234676 -304033 -294119 -314091 -344015 -179953 195902 414105 166560 -288068
35548b88068j46440J82203M5350k43715j09469K87557L21060j4639j22097J15789
$$ -288068 -434508 -252305 -206955 -450670 -560139 -272582 48478 33839 -88258 27531
35538B7531J57947j47577k45475R1931K93593K754k68461o5888J92646Q223k79643
$$ 27531 185478 37901 -207574 -115643 177950 180704 -87757 -153645 39001 47224 -232419
35527b32419j35888J88946J49811r9464o4175J33836M5647j68896j2204L57763
$$ -232419 -368307 -179361 -29550 -129014 -193189 -59353 -13706 -182602 -194806 162957
35517A62957L27819r6344l18813j99240j67360k81124r3106M07743O02317K36767
$$ 162957 490776 394432 75619 -123621 -290981 -572105 -665211 -257468 344849 581616
35507E81616j67940j85695n2876n9799m7930J21375J90739o015j75887n6405J56343
$$ 581616 413676 227981 175105 115306 67376 188751 379490 373475 197588 141183 297526
35496B97526J93983J17936L6566j56563m38700m58657m9332L90929L87448m53
$$ 297526 491509 609445 646011 489448 50748 -407909 -457241 -66312 321136 320683
35486C20683l59965m64615l51701r8102J93482L54429L21303K12449J17938Q151
$$ 320683 -39282 -503897 -855598 -953700 -760218 -405789 -84486 127963 245901 254052
35476B54052q0095m2108L2311p3476k71343j92640J89759L77169M6222m28383
$$ 254052 173957 131849 164160 90684 -180659 -373299 -183540 193629 239851 -188532
35466a88532m71548n1324L82723M82650K49258j07261l07782j80165J09257J87613
$$ -188532 -660080 -711404 -328681 153969 403227 295966 -11816 -191981 -82724 104889
35456A04889j6038j52824m917J71034R2712q3947p6578K3186n5307k55686k78437
$$ 104889 88851 -63973 -68890 102144 194856 110909 34331 57517 2210 -253476 -531913
35445e31913p4399J00370Q7958r527o3339o4932k4014Q6864K51895L87764M07086
$$ -531913 -606312 -505942 -417984 -427511 -490850 -555782 -579796 -492932 -241037 146727 553813
35434E53813K67045J9831j63554j45947l0200m5375j92160k25044o1201N6136
$$ 553813 820858 840689 677135 531188 500988 455613 263453 38409 -22792 33344
35424C3344n5261k19230j85531J145J30284J48270J35401J01151J2652p0913o4002
$$ 33344 -21917 -241147 -426678 -425533 -295249 -146979 -11578 89573 102225 31312 -32690
35413c2690K2410J31454K24900K25515N9434j62436k00594k0565J39877J31170
$$ -32690 -10280 121174 346074 571589 631023 468587 267993 247428 387305 518475
35403E18475P1796N5873k5387j99193k48088o1604J17847N4955j15454j45309
$$ 518475 590271 646144 620757 421564 173476 111872 229719 284674 169220 23911
35393B3911n7163q7M2542J10154O6476j34112k11672M5950L62260L41088P4570
$$ 23911 -33252 -33339 9203 119357 185833 51721 -159951 -114001 248259 589347 663917
35382F63917n3945k4974j42457m02940m33804j18118J99297K54330J81988J32255
$$ 663917 609972 584998 442541 39601 -394203 -512321 -313024 -58694 123294 255549
35372B55549j3578k94933m00859r0854L35846L53286r2584n12352n11155k38156
$$ 255549 241971 -52962 -453821 -544675 -208829 144457 51873 -460479 -971634 -1209790
35362a209790r7794j92169k38808j3457L13622M00801J95165j8294k7770N2385
$$ -1209790 -1307584 -1499753 -1738561 -1752018 -1438396 -1037595 -842430 -860724 -888494 -836109
35352h36109L2441l6998K2899K03878L06448K17061K6552j26473k02365k31092
$$ -836109 -803668 -840666 -817767 -613889 -307441 -90380 -63828 -190301 -392666 -623758
35342f23758k22086j40278L3931K16998K52168J15171J4175J08380K00728j797
$$ -623758 -845844 -986122 -952191 -735193 -483025 -367854 -353679 -245299 -44571 -46368
35332d6368l43241l35136P7646L23992M1115l40919k57966J24696K44941O7106
$$ -46368 -389609 -724745 -647099 -323107 -281992 -622911 -880877 -756181 -511240 -444134
35322d44134L7090K37027K60429k7052k45416j79375j06111j94579j35677K61515
$$ -444134 -407044 -170017 90412 63360 -182056 -361431 -467542 -662121 -797798 -536283
35312e36283N79119L61734j58842l98606k55515j20855j88427k39030j00626J01847
$$ -536283 42836 404570 245728 -152878 -408393 -529248 -717675 -956705 -1057331 -955484
35302i55484K18067K54589K13759M4320j65493k05635m5350J06428J13508O1844
$$ -955484 -737417 -482828 -269069 -224749 -390242 -595877 -641227 -534799 -421291 -359447
35292c59447L1915k6868r4410j6148K02897K84921O7728j97379j77461O7042J96533
$$ -359447 -327532 -354400 -448810 -464958 -262061 22860 90588 -106791 -284252 -217210 -20677
35281b0677P5655j14290j82274j06449N2334J93565J71728l7150k10831j45253
$$ -20677 54978 -59312 -241586 -348035 -295701 -102136 69592 32442 -178389 -323642
35271c23642K2803K1023r9716m6397J94383K97739J27871n7022n5071j2168q3400
$$ -323642 -300839 -279816 -379532 -425929 -231546 66193 194064 137042 81971 69803 -13597
35260a3597j35681k657K43177M56652N71636M44507p2315p00227q28075l45149
$$ -13597 -149278 -151935 91242 547894 1119530 1564037 1491722 791495 -36580 -381729
35250c81729P8235n7969l31112j30336L13800L45609K003j08915J11265J53603
$$ -381729 -303494 -361463 -692575 -822911 -509111 -163502 -161499 -270414 -159149 -5546
35240e546j09773j94726P7188K32949O479j82134R791K36751P9961k42583k82729
$$ -5546 -115319 -310045 -232857 92 6571 -175563 -165772 70979 150940 -91643 -374372
35229c74372q9088k8893j52182j87048r070K33703L50699K41605n0506k81735
$$ -374372 -463460 -492353 -644535 -831583 -840653 -606950 -256251 -14646 -65152 -346887
35219c46887k20430j559L8874o1212P2733M21312M43983m5452m56943k90792J06911
$$ -346887 -567317 -568876 -530002 -591214 -518481 -97169 346814 301362 -155581 -446373 -339462
35208c39462J64805j8712o947J42832O4077j63441j42560R2608J20353j23234
$$ -339462 -174657 -193369 -200316 -57484 6593 -156848 -299408 -206800 -86447 -209681
35198b09681k55041j17045K1082l774p460J46210L17689L47002K09343r0057m41517
$$ -209681 -464722 -581767 -560685 -564459 -571919 -425709 -108020 238982 448325 358268 -83249
35187h3249n08597r0564M26264M36775m0572l57714j51018K10803K51058K1995
$$ -83249 -591846 -682410 -256146 180629 140057 -217657 -368675 -157872 93186 115181
35177A15181j26454q0261J1760L5331J262m8020p7187p4553p7043r7125n5044
$$ 115181 -11273 -91534 -79774 -44443 -43181 -91201 -168388 -242941 -319984 -417109 -472153
35166d72153R3191K30165K34709J62512R0983n3535k67556k79204N0742L28080
$$ -472153 -378962 -148797 85912 248424 339407 285872 18316 -260888 -210146 117934
35156A17934J05084l58805l86402P9344L60419J03295j91652j5812L41851L07066
$$ 117934 223018 -135787 -522189 -442845 -82426 20869 -170783 -186595 155256 462322
35146D62322p1476k74283j45565l1266j38881k39004r3543J70687K74524J58827
$$ 462322 390846 116563 -29002 -60268 -199149 -438153 -531696 -361009 -86485 72342
35136G2342j2618j06015j30250j30373q6294L0510J48147J34817k0338j45395
$$ 72342 59724 -46291 -176541 -306914 -393208 -362698 -214551 -79734 -100072 -245467
35126b45467q1849J03223J87503N5463j81998l18014k48672n4832R2067J24071
$$ -245467 -327316 -224093 -36590 18873 -163125 -481139 -729811 -784643 -692576 -568505
35116e68505J40917K10635J98329k0506k55249k05449M7183J26973j0705o818
$$ -568505 -427588 -216953 -18624 -39130 -294379 -499828 -452645 -325672 -336377 -343195
35106c43195K03244J70126k70907n41254j65309M03462M38966M7355j13027N7782
$$ -343195 -139951 30175 -240732 -781986 -947295 -543833 -104867 -57512 -170539 -112757
35096a12757Q6930j06972r4707J87967K74840K4748j40005o4691j54278n17447
$$ -112757 -25827 -132799 -227506 -39539 235301 260049 120044 55353 -98925 -616372
35086f16372n78166j0571N86831N14196k9725l40331k09454K8018J48214J82037
$$ -616372 -1194538 -1205109 -618278 -104082 -133807 -474138 -683592 -655574 -507360 -325323
35076c25323J00588j36992l30330k43691K0635J75948J57753R3367K6005m2146
$$ -325323 -224735 -361727 -692057 -935748 -915113 -739165 -581412 -488045 -462040 -504186
35066e04186k360J72571K64458J19117o8167o7077K673o9385j61529m7962J33173
$$ -504186 -506546 -333975 -69517 49600 -18567 -85644 -82971 -152356 -313885 -361847 -228674
35055b28674P7816j35609j48586P6012K03103R5779J0107J24693K45849J41965
$$ -228674 -150858 -286467 -435053 -359041 -155938 -60159 -50052 74641 320490 462455
35045D62455r6904j99778n2574K07374L25057J39947k12881l58119j07421K35204
$$ 462455 365551 165773 113199 320573 645630 785577 572696 214577 107156 342360
35035C42360K24600j21687l56315k36530n454L7524o6547j27290j25851j26332
$$ 342360 566960 445273 88958 -147572 -153026 -115502 -182049 -309339 -435190 -561522
35025e61522o2029J41080L41136L21602J06683p1368r2665m0090J3080P8250Q3306
$$ -561522 -623551 -482471 -141335 180267 286950 215582 122917 82827 95907 174157 257463
35014B57463j13591m18288m50349k0299N17577O64093M07237J36597J1138j65960
$$ 257463 143872 -274416 -724765 -745064 -227487 436606 843843 980440 991578 825618
35004H25618m08538l78110J8752L09060J10526k28922j27118L13004M26318k1154
$$ 825618 417080 38970 57722 366782 477308 248386 121268 434272 860590 839436
34994H39436m92535m43909j348L19284K70923M0094q3691l6920j6182k01940m41219
$$ 839436 346901 -97008 -98356 220928 491851 531945 448254 411334 395152 193212 -248007
$$ [...]
##END NTUPLES=NMR SPECTRUM
##END=
