##TITLE=31Pdec_LR-733-CR4B
 CDCl3, 24 sc
 4.03.2021
##JCAMPDX= 6.0         $$ Bruker NMR JCAMP-DX V2.0
##DATA TYPE= NMR SPECTRUM
##DATA CLASS= NTUPLES
##ORIGIN= UXNMR, Bruker Analytische Messtechnik GmbH
##OWNER= root
$$ XWIN-NMR		Version 3.5
$$ Thu Mar  4 10:01:50 2021 Russian Standard Time (UT+4h)  she@DPX200
##.OBSERVE FREQUENCY= 81.013821
##.OBSERVE NUCLEUS= ^31P
##.ACQUISITION MODE= SIMULTANEOUS
##.ACQUISITION SCHEME= undefined
##.AVERAGES= 24
##.DIGITISER RES= 16
##SPECTROMETER/DATA SYSTEM= spect
##.PULSE SEQUENCE= zgpg30
##.SOLVENT NAME= CDCl3
##.SHIFT REFERENCE= (INTERNAL, CDCl3, 0, 248.564)
##AUDIT TRAIL= $$ (NUMBER, WHEN, WHO, WHERE, WHAT)
$$ ##TITLE= Audit trail, XWIN-NMR		Version 3.5
$$ ##JCAMPDX= 5.01
$$ ##ORIGIN= Bruker BioSpin GmbH
$$ ##OWNER= she
$$ F:/spectra/data/she/nmr/P31/1/pdata/1/auditp.txt
$$ ##AUDIT TRAIL=  $$ (NUMBER, WHEN, WHO, WHERE, WHAT)
(   1,<2021-03-04 10:00:46.14 +0400>,<she>,<DPX200>,
      <created by zg, POWCHK disabled, PULCHK disabled
       configuration hash MD5:
       00 E9 B6 7A A2 85 ED C7 34 08 36 98 17 FE 4E 26
       data hash MD5: 32K
       92 3B E5 D5 26 C8 5A A0 50 D7 84 03 B1 3B BD 96>)
(   2,<2021-03-04 10:00:48.40 +0400>,<she>,<DPX200>,
      <Start of raw data processing
       efp BC_mod = 2 LB = 1 FT_mod = 6 PKNL = 1 PHC0 = -3232.212 PHC1 = 684.8008 SI = 64K 
       data hash MD5: 64K
       84 18 EB C3 21 6D 99 B6 C8 6F 44 CD A8 88 62 CB>)
(   3,<2021-03-04 10:01:17.07 +0400>,<she>,<DPX200>,
      <pk PHC0 = -124.7468 PHC1 = 300.6 
       data hash MD5: 64K
       59 32 D8 E0 47 36 6E EB 76 E4 96 1A 2A 81 5C 7B>)
(   4,<2021-03-04 10:01:20.21 +0400>,<she>,<DPX200>,
      <abs ABSG = 5 
       data hash MD5: 64K
       04 14 BC 29 D4 7C AA 5D 01 D3 33 3B EA 19 18 A6>)
$$ ##END=
$$ 
$$ hash MD5
$$ E0 AA 42 B3 BC 5F D6 AD 63 EA C8 B4 78 BF 0E D6
##$RELAX= 
##$RELAX= 
##$RELAX= 
##$RELAX= 
##$RELAX= 
##$RELAX= 
##$RELAX= 
##$RELAX= 
$$ Bruker specific parameters
$$ --------------------------
##$DU= <F:/spectra>
##$EXPNO= 1
##$NAME= <P31>
##$PROCNO= 1
##$TYPE= <nmr>
##$USER= <she>
##$AMP= (0..31)
100 100 100 100 100 100 100 100 100 100 100 100 100 100 100 100 100 100 
100 100 100 100 100 100 100 100 100 100 100 100 100 100 
##$AQSEQ= 0
##$AQ_mod= 1
##$AUNM= <au_zg>
##$AUTOPOS= <>
##$BF1= 81.014009
##$BF2= 200.13
##$BF3= 200.13
##$BF4= 200.13
##$BF5= 200.13
##$BF6= 200.13
##$BF7= 200.13
##$BF8= 200.13
##$BYTORDA= 1
##$CFDGTYP= 0
##$CFRGTYP= 5
##$CHEMSTR= <none>
##$CNST= (0..31)
1 1 145 1 1 1 1 1 1 1 1 1 1 1 1 1 1 1 1 1 1 1 1 1 1 1 1 1 1 1 1 1 
##$CPDPRG= <waltz16>
##$CPDPRG1= <>
##$CPDPRG2= <waltz16>
##$CPDPRG3= <>
##$CPDPRG4= <mlev>
##$CPDPRG5= <mlev>
##$CPDPRG6= <mlev>
##$CPDPRG7= <mlev>
##$CPDPRG8= <mlev>
##$CPDPRGB= <>
##$CPDPRGT= <>
##$D= (0..31)
0 1 0 0 0 0 0 0 0 0 0 0.03 2e-05 3e-06 0 0 0 0 0 0 0 0 0 0 0 0 0 0 0 0 
0 0 
##$DATE= 1614837645
##$DBL= (0..7)
120 120 120 11 120 120 24 19 
##$DBP= (0..7)
150 150 150 150 150 150 150 150 
##$DBP07= 0
##$DBPNAM0= <>
##$DBPNAM1= <>
##$DBPNAM2= <>
$$ [...]
##$SUBNAM3= <"">
##$SUBNAM4= <"">
##$SUBNAM5= <"">
##$SUBNAM6= <"">
##$SUBNAM7= <"">
##$SUBNAM8= <"">
##$SUBNAM9= <"">
##$SW= 501.771253377433
##$SWIBOX= (0..15)
0 1 3 0 0 0 0 0 0 0 0 0 0 0 0 0 
##$SW_h= 40650.406504065
##$TD= 32768
##$TD0= 1
##$TE= 0
##$TE2= 300
##$TE3= 300
##$TEG= 300
##$TL= (0..7)
0 120 53 12 22 120 120 120 
##$TP= (0..7)
150 150 150 150 150 150 150 150 
##$TP07= 0
##$TPNAME0= <>
##$TPNAME1= <>
##$TPNAME2= <>
##$TPNAME3= <>
##$TPNAME4= <>
##$TPNAME5= <>
##$TPNAME6= <>
##$TPNAME7= <>
##$TPOAL= (0..7)
0.5 0.5 0.5 0.5 0.5 0.5 0.5 0.5 
##$TPOFFS= (0..7)
0 0 0 0 0 0 0 0 
##$TUNHIN= 0
##$TUNHOUT= 0
##$TUNXOUT= 0
##$USERA1= <user>
##$USERA2= <user>
##$USERA3= <user>
##$USERA4= <user>
##$USERA5= <user>
##$V9= 5
##$VALIST= <valist>
##$VCLIST= <CCCCCCCCCCCCCCC>
##$VD= 0
##$VDLIST= <DDDDDDDDDDDDDDD>
##$VPLIST= <PPPPPPPPPPPPPPP>
##$VTLIST= <TTTTTTTTTTTTTTT>
##$WBST= 1024
##$WBSW= 4
##$XGAIN= (0..3)
0 0 0 0 
##$XL= 0
##$YL= 0
##$YMAX_a= 33273
##$YMIN_a= -34168
##$ZGOPTNS= <>
##$ZL1= 120
##$ZL2= 120
##$ZL3= 120
##$ZL4= 120
##$ABSF1= 248.5645
##$ABSF2= -253.2056
##$ABSG= 5
##$ABSL= 3
##$ALPHA= 0
##$AQORDER= 0
##$ASSFAC= 0
##$ASSFACI= 0
##$ASSFACX= 0
##$ASSWID= 0
##$AUNMP= <proc_1d>
##$AZFE= 0.1
##$AZFW= 0.5
##$BCFW= 0
##$BC_mod= 2
##$BYTORDP= 0
##$COROFFS= 0
##$CY= -3
##$DATMOD= 1
##$DC= 0
##$DFILT= <>
##$DTYPP= 0
##$F1P= 0
##$F2P= 0
##$FCOR= 1
##$FTSIZE= 65536
##$FT_mod= 6
##$GAMMA= 0
##$GB= 0
##$INTBC= 1
##$INTSCL= 5.30512e-09
##$ISEN= 30
##$LB= 1
##$LEV0= 0
##$LPBIN= 0
##$MAXI= 10000
##$MC2= 0
##$MEAN= 0
##$ME_mod= 0
##$MI= 50
##$NCOEF= 0
##$NC_proc= -4
##$NLEV= 6
##$NOISF1= 182.463
##$NOISF2= 159.3651
##$NSP= 0
##$NTH_PI= 0
##$NZP= 0
##$OFFSET= 248.5645
##$PC= 4
##$PHC0= -3356.959
##$PHC1= 985.4008
##$PH_mod= 1
##$PKNL= yes
##$PPARMOD= 0
##$PSCAL= 0
##$PSIGN= 0
##$REVERSE= no
##$SF= 81.014009
##$SI= 65536
##$SIGF1= 159.3651
##$SIGF2= -187.1042
##$SINO= 113.3802
##$SIOLD= 16384
##$SREGLST= <1H.CDCl3>
##$SSB= 0
##$STSI= 65536
##$STSR= 0
##$SW_p= 40650.406504065
##$SYMM= 0
##$S_DEV= 0
##$TDeff= 32768
##$TDoff= 0
##$TI= <>
##$TILT= no
##$TM1= 0
##$TM2= 0
##$TOPLEV= 0
##$USERP1= <user>
##$USERP2= <user>
##$USERP3= <user>
##$USERP4= <user>
##$USERP5= <user>
##$WDW= 1
##$XDIM= 65536
##$YMAX_p= 510657046
##$YMIN_p= -4397726
$$ End of Bruker specific parameters
$$ ---------------------------------
##NTUPLES= NMR SPECTRUM
##VAR_NAME=  FREQUENCY,     SPECTRUM/REAL,   SPECTRUM/IMAG
##SYMBOL=    X,             R,               I
##VAR_TYPE=  INDEPENDENT,   DEPENDENT,       DEPENDENT
##VAR_FORM=  AFFN,          ASDF,            ASDF
##VAR_DIM=   65536,         65536,           65536
##UNITS=     HZ,            ARBITRARY UNITS, ARBITRARY UNITS
##FACTOR=    0.620285442955139, 1,           1
##FIRST=     20137.2065510759, 0,            0
##LAST=      -20513.1999529892, 0,           0
##MIN=       -20513.1999529892, -4397726,    0
##MAX=       20137.2065510759, 510657046,    0
$$ Real data points
##PAGE= N=1
##DATA TABLE= (X++(R..R)), XYDATA
$$ [...]
40972E49173n48599l64203q6005n0447j99940k60573k08196j72694k7382M10637
40962i58229Q43422P64974L04601J33118L79536L52225l41710j069246j043212
40953f34521l99341J25338J98591N5434n4421p7680J3002J93459K99676K32067
40943d8396J04512K3148m8290o8879J04995L71321L91668J23767p7173o4762j11060
40932G00851l00054k91955J3557K01894R8367J22109M16568L65613l61364r82194
40922a6608o68629J26087L62670P140j21943J65235K19498j89783m62887k21801
40912h01021J05745O4084j65074k10802r3319l2088l2523R1751M66315R54626
40902C47694J083296M28905o32629r91632j67984Q12139O62424l80643r50812
$$ y = [549173, 574, -363629, -449634, -500081, -700021, -960594, -1168790, -1341484, -1368866, -958229, -114807, 650167, 954768, 1087886, 1467422, 1819647, 1477937, 408691, -634521, -1033862, -908524, -709933, -654499, -708920, -786600, -773598, -580139, -280463, -48396, 56116, 79264, 30974, -37905, 67090, 438411, 830079, 953846, 876673, 811911, 700851, 400797, 108842, 122399, 324293, 422660, 544769, 961337, 1326950, 965586, -16608, -685237, -559150, -196480, -189340, -311283, -146048, 73450, -116333, -579220, -801021, -695276, -631192, -796266, -1007068, -1100387, -1132475, -1164998, -1073247, -606932, 347694, 1430990, 1859895, 1227266, 235634, 67650, 879789, 1542213, 1161570, 210758]
40893B10758n16434J19292K64917J47390O1224j80030n29753m39056J75709N68350
40883a17633L13495j0263J21677K86718O749k72643L277L72546Q1539n39807n42113
40872b96458N8649K94139j71693n45699k13285L77364N18162K07702j25225l14148
40862b10492m04725l01647O9643M59110N24482K70633J1802k6659R6351J64154
40852F52652J7220k81850m58753l20485m1291K3866j73916l08131j59191P7218
40842i72661R1831j27730l26761k62905J42403P26017J037708O40888l01171r59930
40832c12311o92059J55728O26597K90814l46722n94910l48332L8437K98507L87566
40822d96685K94575O2721p8003Q5664M01177M70103J71957j71869k50232j43896
$$ y = [210758, -305676, -186384, 78533, 225923, 287147, 107117, -422636, -861692, -685983, -117633, 195862, 185599, 307276, 593994, 600743, 328100, 331377, 703923, 785462, 245655, -296458, -237809, 56330, -115363, -661062, -874347, -496983, 21179, 228881, 103656, -210492, -615217, -916864, -847221, -388111, 136371, 407004, 418806, 392147, 488498, 652652, 669872, 388022, -70731, -391216, -432507, -408641, -582557, -890688, -1049879, -972661, -880830, -1008560, -1335321, -1598226, -1455823, -729806, 307902, 948790, 647619, -312311, -1004370, -848642, -222045, 68769, -277953, -872863, -1221195, -1182758, -884251, -496685, -202110, -139389, -217392, -131728, 269449, 739552, 911509, 739640, 489408, 345512]
40812C45512r5654j09182l3050P5736j793k12894j72507K77702O89672N00358
40802A263900j78237o11135l67509J19968J49935l20315o75216m79884M8361M57846
40792e92286O08244O19228N27224K57837j46535m73454n22785k81188M9591K07322
40782B53198J46060R7796J92739J56470k68947p17071n66109L9663K23331l11987
40772g54857p39153l61338L04185M06527R7514P9740L11122K34595j3864J76350
40762b59179N78719L13947n42467q39761j82257L85326P2082m70786l86957M3707
40752a287626J79204J70372L52119L24553k59366o99921k38077N18825M15600
40743e24317l98426p29014k28092K71407K57767J07963N4118j88682n01443k15223
$$ y = [345512, 249858, 140676, 107626, 183362, 181569, -31325, -203832, 73870, 763542, 1263900, 1085663, 474528, 107019, 226987, 376922, 56607, -618609, -1098493, -1050132, -592286, 15958, 635186, 1162410, 1420247, 1273712, 800258, 277473, -3715, 45876, 253198, 399258, 497054, 689793, 846263, 577316, -139755, -705864, -666201, -442870, -754857, -1494010, -1855348, -1551163, -1144636, -1047122, -967382, -656260, -421665, -435529, -259179, 319540, 633487, 91020, -748741, -930998, -545672, -473590, -944376, -1331333, -1287626, -1108422, -938050, -585931, -261378, -520744, -1220665, -1458742, -939917, -524317, -922743, -1651757, -1879849, -1608442, -1350675, -1242712, -1188594, -1377276, -1878719, -2093942]
40733b093942P01358J303322R93629L26362J5687l7588j93904l10439j73026q7287
40723D44172l58024o16925l27767L23799O35941L33310j61743l20558m4213L28360
40713B36352L59487l2884l85756j76639M48464P54877L33841m07739q12899o81317
40703c64213k49740J77059L65992K31053k1879o3372J18407K02359L7028j55705
40693B76989j64476m3074J06948K68314L41686J91679p7666k36165l16229m83728
40683a35722n62359k09527M20470P62357O45855M26500K71039k607k87666j79501
40673A148839K00224J95911k78014m90308j42998M4482m26949q84339n18915L37301
40663h14766P68968N36054K5768m88900p76013m03340N74717J191321P20817j85137
$$ y = [-2093942, -1392584, -89262, 904367, 1230729, 1246416, 1208828, 1014924, 704485, 531459, 444172, 86148, -530777, -858544, -534745, 101196, 434506, 272763, -47795, -92008, 236352, 595839, 562955, 177199, 560, 449024, 1203901, 1537742, 1130003, 317104, -364213, -613953, -436894, -70902, 160151, 138272, 74900, 193307, 395666, 432694, 276989, 112513, 69439, 176387, 444701, 786387, 978066, 900400, 664235, 348006, -135722, -698081, -907608, -487138, 275219, 921074, 1347574, 1618613, 1616006, 1328340, 1148839, 1349063, 1544974, 1266960, 776652, 633654, 678136, 251187, -633152, -1152067, -814766, -45798, 490256, 516024, 27124, -748889, -1152229, -577512, 613809, 1334626, 1149489]
40653A149489m16034n947J78864n0286j39917Q238m6889k53010r7803K88172J82869
40642G97746m23365o51123j23747M42865L67770j41299n59269o52320k79604N34133
40632f88213J082702N20328p23723j122230j61198Q01584N21820l33149l94009
40623d96088K56200M16803k15441o95760m23513Q3452K05481Q7817J50371L88505
40613b42173N19933M12927J23736j89498k74065n931L37672L45612M0861j62487
40603I06587r0451K458m6957l8465J47548K27825m2393l74224k80507J89433M30266
40592A031120P6172m79309n84282j90968J19141P401j22742J91049O03467L63224
40582A014273m68495r02941l95077L24337L23575j41932q6355O27337J059139
$$ y = [1149489, 733455, 727508, 906372, 856086, 716169, 724407, 677518, 424508, 326705, 614877, 797746, 374381, -276742, -400489, 42376, 410146, 268847, -290422, -942742, -1222346, -688213, 394489, 914817, 191094, -931136, -1092334, -290750, 231070, -102079, -496088, -239888, 176915, -38526, -734286, -1157799, -1074347, -868866, -781049, -630678, -242173, 277760, 690687, 814423, 624925, 350860, 344929, 682601, 1028213, 1069074, 906587, 816136, 818594, 771637, 733172, 880720, 1108545, 1066152, 691928, 411421, 600854, 1031120, 1107292, 627983, 43701, -147267, -28126, -20725, -143467, 47582, 651049, 1014273, 545778, -357163, -752240, -427903, -104328, -246260, -332615, 294722, 1353861]
40573A353861O04395j93002n31931l62321q0151J82921L98113K43004m20088r33386
40563B61415m90067O33759J231877P06746k16590n99956m65002l64964l34519
40554C62699j0224M61550M66775o5282m35075k28886L4307k35657o93301n47206
40544h90300J98405O91597M36510q9389k44255j15146j85078m42066l69156K04296
40534h04582P26307O15529M2761l00693j15507J86052J65152N88J10117L54413
40524I80137J72491m29798o40598K2019Q26889P20948j58307o39549j93633L70330
40514A030929J87538m34149o47463l75440k26072l79528l79917l2319K40701J31591
40504h84129p6547m9394R5270J55219K57865N04889N99317L07525k4576L5552
$$ y = [1353861, 1958256, 1765254, 1233323, 871002, 790851, 973772, 1371885, 1614889, 1194801, 261415, -228652, 405107, 1636984, 2343730, 2127140, 1527184, 1062182, 697218, 362699, 352475, 814025, 1280800, 1215518, 780443, 551557, 585864, 350207, -343094, -890300, -691895, -298, 436212, 346823, 102568, -12578, -197656, -639722, -1008878, -804582, -78275, 537254, 580015, 279322, 163815, 349867, 515019, 515607, 625724, 980137, 1152628, 722830, 82232, 104251, 931140, 1652088, 1493781, 854232, 660599, 1030929, 1218467, 784318, 136855, -238585, -464657, -844185, -1224102, -1256421, -1015720, -884129, -960676, -1010070, -914800, -759581, -501716, 3173, 602490, 910015, 885439, 920991]
40494I20991K40793K8204m76293n43815L137M59789L12498n3314j27757j05139
40484F59094l33276m79192n3095N60627N15683j30016m04321O5920M57685P3000
40474I32109n74363o25243j68149J22668J67931L79693O19394K80131n13726p67049
40464a46604m7942P49279O43590n7413l43492m4647P6890l23242o09446k17028
40454c20055M22267M99808l6373n26952n85860m53725l51273o6349N27828R80186
40444H9502P64252Q0182l46259k40155m5759j06890j25014K18291N63209L65577
40434A216936j66958l03074Q4949L14109k4140m38346l57909K985J21401L3845
40424D83798Q3323J55708n7021k43858J63651Q16620O52420m23641j074675l85773
$$ y = [920991, 1161784, 1189988, 713695, 169880, 173017, 632806, 945304, 891990, 764233, 659094, 325818, -153374, -206469, 354158, 869841, 739825, 335504, 401424, 859109, 932109, 357746, -267497, -435646, -312978, -145047, 234646, 854040, 1134171, 620445, -146604, -194546, 554733, 1198323, 1140910, 797418, 752771, 829661, 506419, -103027, -320055, 102212, 602020, 565647, 38695, -547165, -1000890, -1352163, -1418512, -890684, 89502, 853754, 933936, 587677, 347522, 301763, 194873, 69859, 288150, 851359, 1216936, 1049978, 746904, 831853, 1145962, 1121822, 683476, 325567, 328552, 449953, 483798, 567121, 722829, 665808, 421950, 585601, 1402221, 2054641, 1631000, 556325, 170552]
40414A70552O99689P21173j76216o13921j37482K82673l6770n13132m29920j4584
40404d7938J98776K53552L59411K85327j29871m32488k41368L2447j00955k97854
40394a20961n0070K25541j59348p55348m71182N83777J064791M23173l05119k18997
40384B16257J46907j3736l63992j69117L09634K81139j76576k89359N3177J59528
40374A53862k31592n16668k24259L01523N02410L30114P4181j11404k18776k04845
40364a45454m3931J77142L22457K75736j551l27418l53872j5838K31376l2283
40354H6364n25902n78040n0050N01313O12866M18683K52453J60706J9731j64793
40344G33331l01074l71345l82473k76592Q12L97518P17441O61480Q8654o15236
$$ y = [170552, 870241, 1591414, 1415198, 801277, 663795, 946468, 909698, 396566, -33354, -47938, 150838, 404390, 763801, 1049128, 919257, 486769, 245401, 277848, 176893, -120961, -171031, 54510, -104838, -860186, -1331368, -747591, 317200, 740373, 435254, 216257, 363164, 349428, -14564, -183681, 125953, 407092, 230516, -58843, -5666, 153862, -77730, -594398, -818657, -517134, -14724, 315390, 389571, 278167, 59391, -145454, -189385, -12243, 310214, 585950, 584399, 256981, -96891, -112729, 118647, 86364, -439538, -1017578, -1067628, -566315, 46551, 465234, 717687, 878393, 898124, 733331, 432257, 60912, -321561, -598153, -597341, -199823, 517618, 1179098, 1267752, 652516]
40334F52516p13271j1366O65712M00833n34503r28238k05194Q40744J092794L83441
40324A643468n49357r63105o76551o4566K49989k8961m40586k61310M36923P39877
40314H5821J91540m51889l08760K96047L55282k54954o32106k64397L02416M62674
40304b18326L88387L95707K09288m00956p78879j54510R36046J082206K6314q09043
40294F76234l62688M78809K86914o49573q03213J16190O72911m307q58328o17032
40284a064083K67381N08740L2827j72921J42090K10690k33740m30676P8432O35956
40274b5304N08901l7493k87250j25295L2370k9739j80219k76483k42745j122L70009
40263b94370N77440M35159Q1192k50184m48830m49600k34429J1173P6817R8986
$$ y = [652516, -60755, -72121, 593591, 994424, 459921, -468317, -673511, 167233, 1260027, 1643468, 1094111, 131006, -545545, -610111, -360122, -389083, -829669, -1090979, -654056, 85821, 277361, -174528, -483288, -187241, 168041, -86913, -719019, -983416, -681000, -218326, 170061, 565768, 775056, 374100, -404779, -559289, 376757, 1458963, 1485277, 676234, 313546, 792355, 1079269, 429696, -373517, -257327, 415584, 411277, -447051, -1064083, -796702, -287962, -255135, -428056, -285966, -75276, -309016, -739692, -661260, -25304, 483597, 446104, 158854, 33559, 65929, 36190, -144029, -420512, -663257, -664379, -294370, 283070, 718229, 799421, 549237, 100407, -349193, -583622, -572449, -495632, -396646]
40253c96646L38767N78763L22997k86169m42110J41020P05179N47572l668k61100
40243A244605k16651k29956k07553R3431L18707m3835o84509q08066l66572q4081
40233i84480k22298k18815K39177O41133N45829L01198L31006L13336k32025r25390
40223b11329q86767k4964P54790P62053L24446R1493P7916q2485k89144r9202
40213D16807L55855L56926k45564n98739r7632N76528M55854j65222k17455L46242
40203A183600M70775j78523o04987j63490L62605J46595k87558r0892L52095J26910
40193A317130n35187o17616n2349K28093j03619l77788k37900j38350k83555j97728
40183i98869K56137M46840N4456l12756j13746L02584M13373L28209L12134J91138
$$ y = [-396646, -57879, 520884, 843881, 557712, 115602, 256622, 961801, 1509373, 1505705, 1244605, 1027954, 797998, 590445, 683876, 1002583, 958748, 274239, -533827, -900399, -984480, -1206778, -1425593, -1186416, -545283, 546, 301744, 632750, 946086, 714061, -211329, -1098096, -1123060, -368270, 393783, 718229, 809722, 887638, 805153, 516009, 416807, 772662, 1129588, 884024, 285285, 187653, 764181, 1220035, 1054813, 837358, 1183600, 1654375, 1475852, 870865, 707375, 1069980, 1216575, 929017, 838125, 1190220, 1317130, 781943, 164327, 111978, 340071, 236452, -141336, -379236, -517586, -801141, -998869, -742732, -295892, -241436, -554192, -667938, -365354, 48019, 376228, 688362, 879500]
40173H79500j54021l28303r4328Q2360j71351l68954L8226N93537M48200k80156
40163F44710o68908l73533O02p4838l91014m91155k45965J88495N56653N92216
40153b62737K82889P172N5549J59332p3480m44717m44813j03959P6356r987L6849
40142g21546L15189M04310J22540j54801j75589j88491l42090l08450J03172M95764
40132d49992N00740L69710M47948M89480J03953m28434m69856j8578K65794M1044
40122H51809l08015l61248k39807k51987l61210l13892o0869K26433M23872N07554
40112A12640M24147J28340k50127m44192l24891o9857J4680j63365l72157l27403
40102a272185k9710K53973L29061K66843K22869J99626R5004r4326k23661j29185
$$ y = [879500, 725479, 397176, 302848, 385208, 213857, -155097, -116871, 476666, 924866, 644710, -24198, -397731, -397129, -471967, -862981, -1354136, -1600101, -1411606, -854953, -262737, 20152, 27324, 82873, 242205, 168725, -275992, -720805, -824764, -748408, -758395, -721546, -406357, -2047, 120493, -34308, -209897, -398388, -740478, -1048928, -945756, -449992, 50748, 420458, 868406, 1357886, 1461839, 1033405, 563549, 544971, 810765, 851809, 543794, 182546, -57261, -309248, -670458, -984350, -1045219, -818786, -394914, 112640, 536787, 665127, 415000, -29192, -354083, -423940, -409260, -572625, -944782, -1272185, -1301895, -1047922, -718861, -452018, -229149, -29523, 65481, -28845, -252506, -381691]
40092c81691K15454N94772O27651J45828m61036n48300j4755M85256L76903p9801
40082I60281k55766j18562j59240m39147m09734J18169M86707J31874m77393m64515
40072f27326J58741N23374J98048k62212k86943j59358m05400p54493m48349M83509
40062a580409J023706N45524k27768k28631L86721N02733j80235o01318J7046
40053c42631Q47484O35252l43924o35444J89803Q93300M73475l95073n46713o9421
40043G06108J33704n0591M0671M38644L72197l27633p62956l57982K19068J61057
40033E72287k12755j18470K95782J84490n53089j012748n93792K10145O34594
40024e93556O46617O72279P31566M19565l26471r28570q30957k28656J40726o8328
$$ y = [-381691, -166237, 428535, 1056186, 1202014, 740978, 192678, 177923, 663179, 1040082, 960281, 704515, 585953, 426713, -12434, -422168, -303999, 182708, 314582, -162811, -627326, -468585, 54789, 252837, -9375, -296318, -455676, -861076, -1615569, -2063918, -1580409, -556703, -11179, -238947, -467578, -80857, 421876, 241641, -359677, -342631, 504853, 1140105, 796181, 160737, 350540, 1243840, 1717315, 1322242, 775529, 706108, 839812, 789221, 829892, 1268536, 1640733, 1313100, 550144, 192162, 411230, 572287, 359532, 241062, 536844, 721334, 168245, -844503, -1438295, -1228150, -593556, 53061, 725340, 1456906, 1876471, 1550000, 621430, -209527, -438183, -297457, -365785]
40014c65785l53235p3421N54729O39204j05957p95811n23872L35189O48272J61389
40004A20702k14635J32676O23358M90514l7205k31124m1741J3792j35390o8931
39994F52016K12204J80006k53482m42071j5352M71343L49455k09430n51376m61731
39984f8418k12737K4860K98711N63394O80627O17506L60038j31590o11759o02535
39974I18097j56918n0906o09199r13458r7447J044087R81259k06094q49893k32343
39964a72815M31022J39784k65793K85654J087692P32816n31124j099442m19031
39955A88763L57806K31249l71287n24951q9829L57388L00115k61394p46478m36232
39945i94850N67210J098750L47051q06833q45383J96078Q07715L06074k97633
$$ y = [-365785, -719020, -792441, -237712, 401492, 295535, -500276, -1024148, -688959, -40687, 120702, -93933, 38743, 662101, 1152615, 1115410, 884286, 842545, 856337, 720947, 652016, 864220, 1044226, 790744, 348673, 333321, 804664, 1154119, 944689, 393313, -68418, -281155, -256295, 42416, 605810, 1286437, 1903943, 2263981, 2132391, 1520632, 918097, 761179, 710273, 101074, -812384, -909831, 134256, 1115515, 909421, 59528, -172815, 258207, 397991, 132198, 417852, 1505544, 2238360, 1707236, 607794, 188763, 546569, 777818, 406531, -118420, -208249, 149139, 449254, 187860, -558618, -994850, -427640, 671110, 1018161, 211328, -634055, -437977, 369738, 675812, 378179]
39936C78179r6207L82484L33287q29n7207n5097l63182n23781J4315P38985P27145
39925A478092P7272l35204k54636j80099k79356j95908P6075R3935j47038j13836
39915B19297K81035M12924l7656n13167m15200N1426K93147J67337j1721l4983
39905D12439M867m4695j97072l12254k00605J58165M99731N36142L02750N9867
39895A219335p8070j69794j91635p6646L5808n0166j84291p393M30752N85759
39885A513659J40920m96774o75514k83391J90146K88341O9345o4310J08327L67646
39875A158395L34722o7363n40915p62465o42443k58267K33733N77936N77386L64247
39865I74966K58320K91822J97256o7236k16688j97512l16693n72493m70792Q5584
$$ y = [378179, 281972, 664456, 997743, 996914, 939707, 884610, 521428, -2353, 11962, 750947, 1478092, 1555364, 1220160, 965524, 785425, 506069, 310161, 386236, 480171, 333133, 219297, 500332, 913256, 875600, 362433, -52767, -1341, 291806, 459143, 447422, 412439, 417306, 372611, 175539, -136715, -337320, -179155, 320576, 856718, 1159468, 1219335, 1141265, 971471, 779836, 703190, 738998, 688832, 504541, 497148, 927900, 1513659, 1654579, 1157805, 482291, 198900, 389046, 677387, 746732, 682422, 790749, 1158395, 1493117, 1425754, 884839, 122374, -520069, -778336, -544603, 33333, 610719, 974966, 1233286, 1525108, 1722364, 1655128, 1438440, 1240928, 924235, 351742, -119050, -33466]
39855c3466L76400n5653n11263j41561O28417O81890m4245m88581j41286K90873
39845E61525J59326j55034m4302K85552K06353l08446o28803l20162L06452N35324
39835E97785P4071m93311l05685N99793J136524N73694l95932o40927j93482L3584
39825I86114j87042k35471K7898J338l93732l98670K06027N42452N2927n51568
39815E0273m89021j25503j43543k93508M5993O56192Q27560N21958K62745J68620
39805A481766l1336k52901j64261J13332J65327Q012l8772k8710k26209m40776
39795E85472k83501M1792r69l00150k12266L12477N60658J65930l82974n61308
39785g4839m22768j55587K59194O24920M65187j76485m94125j0235O20725N29237
$$ y = [-33466, 342934, 287281, -223982, -365543, 262874, 944764, 900519, 411938, 270652, 561525, 720851, 565817, 521515, 807067, 1013420, 704974, 76171, -243991, 62461, 597785, 671856, 178545, -127140, 472653, 1609177, 2182871, 1786939, 1146012, 952530, 986114, 799072, 563601, 591499, 592837, 199105, -199565, 6462, 548914, 601841, 50273, -438748, -564251, -707794, -1001302, -955309, -299117, 528443, 1050401, 1313146, 1481766, 1450430, 1197529, 1033268, 1146600, 1311927, 1319939, 1281167, 1252457, 1026248, 585472, 301971, 343763, 342794, 42644, -169622, 142855, 703513, 869443, 486469, -74839, -497607, -653194, -394000, 230920, 696107, 519622, 25497, 15262, 635987, 1165224]
39775A165224n9370j77846M06708Q48965M59911l63559p56973n01648j03521K7444
39765I45335K0886J33172K71291J76288j07477k58843j50275M554M3888J06722
39755A185541L15328M66070L09446l0796k27214k35710k75833l56626j99515K62842
39745A213533O41061N56430J40450j68171j88046r9497n2065K6715J54374J08094
39735B332878k47028o00879m89077N8267M68369L35371r9636l54374l19668j96453
39725H87770m9910J96413M31224M08641J27213j57807k95237l26850k58294o0097
39715I03066J33423J50202O4263K7758p2240l70233n64578k64927K56162L23205
39705E86101p1719j94237K30058N06217O5842o17059p64134m11481j65131k06814
$$ y = [1165224, 1105854, 928008, 1334716, 2183681, 2643592, 2280033, 1523060, 1021412, 917891, 945335, 966221, 1099393, 1370684, 1546972, 1439495, 1180652, 1030377, 1034931, 1078819, 1185541, 1500869, 1966939, 2276385, 2245589, 2018375, 1782665, 1506832, 1150206, 950691, 1213533, 1854594, 2411024, 2551474, 2383303, 2195257, 2095760, 2043695, 2070410, 2224784, 2332878, 2085850, 1484971, 995894, 1054161, 1522530, 1857901, 1758265, 1403891, 1084223, 887770, 837860, 1034273, 1465497, 1874138, 2001351, 1843544, 1548307, 1221457, 963163, 903066, 1036489, 1186691, 1250954, 1278712, 1206472, 836239, 271661, 6734, 262896, 586101, 514382, 320145, 550203, 1056420, 1122262, 505203, -258931, -670412, -835543, -1042357]
39695a042357j75867J33146M76011N19792J98286k20142l03006R7439N39509N04096
39685G26907J85418J90522M42801K17604n31241q70882l75106J08685j23602m44248
39675d73142n8298N46331M65457m0983j22089R0851j11759m60574q9991P01127
39665D46930O68914k95788q58027l40966L21431K58534o2015M5267K67597P7720
39655E29597j99053l1904K89468J61474k92285m67660k11376J33017L08661K69161
39645D89100K7867k12307j26389K12089L05148M216k35825j79705k13505n03518
39635d32829n07411P1054N71334L90029M8441L23358Q49025O70048j29421n12033
39625A341595j49494J38906j82889n29902k47776L07198L64940q7648l77323j62085
$$ y = [-1042357, -1218224, -1085078, -609067, -89275, 109011, -111131, -414137, -316698, 222811, 726907, 912325, 1102847, 1545648, 1763252, 1232011, 361129, -13977, 94708, -28894, -473142, -531440, 14891, 480348, 439365, 317276, 408127, 296368, -164206, -254197, 446930, 1115844, 820056, -37971, -378937, -57506, 201028, 139013, 184280, 451877, 529597, 330544, 298640, 588108, 749582, 457297, -10363, -221739, -88722, 219939, 489100, 516967, 304660, 178271, 390360, 695508, 699724, 463899, 284194, 70689, -432829, -940240, -869186, -297852, 92177, 140618, 463976, 1313001, 1983049, 1853628, 1341595, 1192101, 1331007, 1148118, 618216, 370440, 677638, 1042578, 954930, 577607, 415522]
39615D15522J76416J55410j83563m00148k10510K36507N84802O24283L70925m9288
39605A720356m23552m83295j94828M3200j47618m97428l91786J23698K61565k91124
39595b80812p28174k64659O04969P64507Q8180m72248l46912j2796j5385j28940
39585g92270Q0254M42597M73780J28843k27263l93467m33266l38560l2107L22554
39575g68905M01894J62273j08528k19853k42770j87736R9329N34081O62868K57042
39565E89695k61164l83088k38989k52585k97880R3249P22797P60701J9671o10637
39555A41770m33340J03883K98804K88068M60769M60487j74602q45235n81802L10968
39545B9770N70547o5065n28161k56375Q074k53746l45763K79251Q12022L38352
$$ y = [415522, 591938, 747348, 563785, 163637, -46873, 189634, 774436, 1398719, 1769644, 1720356, 1296804, 813509, 618681, 661881, 514263, 16835, -374951, -251253, 10312, -280812, -1008986, -1273645, -668676, 95831, 184011, -288237, -635149, -647945, -663330, -792270, -712016, -269419, 204361, 333204, 105941, -287526, -720792, -1059352, -1091459, -768905, -367011, -204738, -313266, -533119, -775889, -963625, -864296, -330215, 332653, 589695, 328531, -54557, -293546, -546131, -844011, -750762, -27965, 732736, 752407, 141770, -291570, -187687, 111117, 399185, 859954, 1320441, 1145839, 300604, -281198, 29770, 600317, 535252, 7091, -249284, -241210, -494956, -840719, -561468, 250554, 588906]
39535E88906n43206n72516K23186O49785J88765m08292l91457O1549L67441K83087
39525D47248o2953l78808l37700R5084M48052K49216k93823n36680k80915K5841
39515f25438j2127k49297k96775k1844L41422M50403K39611O9851K91651O54633
39505H42090N61038O318l09970p9739Q3674l04447p08474m47347J29309K24346
39495c202r5682j56621O7810K2710k56911j47581L68477N95661L61739K92473
39485A048873N75276N22285j65920p02714m43406K4662j83310q39513r78445l18190
39475a460402M75111P68147N58051J72083j02743j17581J2179p6067n24930q93567
39465a189719n98472L14569J125887J186949N32830k29212n07797k31632J53266
$$ y = [588906, 45700, -526816, -303630, 346155, 534920, 126628, -264829, -203280, 164161, 447248, 384295, 5487, -332213, -237129, 210923, 460139, 166316, -370364, -651279, -625438, -637565, -886862, -1183637, -1205481, -864059, -413656, -174045, -104194, 187457, 842090, 1403128, 1409446, 1099476, 1019737, 1103411, 798964, 90490, -356857, -227548, -3202, -98884, -255505, -187695, -164985, -421896, -569477, -201000, 394661, 756400, 1048873, 1624149, 2146434, 1980514, 1277800, 834394, 859056, 675746, -163767, -1142212, -1460402, -985291, -217144, 340907, 512990, 410247, 292666, 304845, 228778, -296152, -1189719, -1788191, -1473622, -347735, 839214, 1372044, 1142832, 635035, 403403, 556669]
39456E56669K16640L4740K827K22744L66214J90457j10797j96305P476K78464
39446A569129L05550q2230o61220q47334l24849M16612O13316K56873K5104J51804
39436A422755R7288m02229p36226l92765J33236J12055k33890j46695L52540M72812
39426F78881m5671m94226k73845K87198N42914M18515K49269J03247k09214n74683
39416F82385n26429R8583P52191P04762n6650p03453m85588L56318Q53173M90822
39406B166114j65450k15435M28760R59270O97803j06253o35994m79860k2917J29721
39396B755759q7104k07024M6565L28013J44624m17282p59053n55244j61929j03985
39386I83340l69397m38257J8296O36607O90431l2160q19644p77468J6549N14884
$$ y = [556669, 773309, 808049, 810876, 1033620, 1399834, 1590291, 1479494, 1283189, 1290665, 1569129, 1874679, 1792449, 1131229, 283895, -40954, 375658, 988974, 1245847, 1270951, 1422755, 1520043, 1117814, 381588, -11177, 122059, 234114, 224, -146471, 206069, 678881, 633210, 138984, -134861, 152337, 695251, 1113766, 1363035, 1466282, 1257068, 682385, 155956, 254539, 1006730, 1711492, 1654842, 951389, 465801, 822119, 1675292, 2166114, 2000664, 1785229, 2213989, 3173259, 3871062, 3764809, 3128815, 2648955, 2626038, 2755759, 2668655, 2461631, 2508196, 2836209, 2980833, 2563551, 1804498, 1249254, 1087325, 983340, 613943, 175686, 193982, 830589, 1521020, 1488860, 669216, -108252, -91703, 423181]
39376D23181Q4251n83061m43447L86455Q34514M49829o9534n0390K63782L30444
39366A626024J25507j08094l59264n92492m72703J06630O02070M79498j2765k64920
39356A129491k10054k26985l63450k87910N6202L09139K33261j9127j75071q0986
39346C64510K13434L54621n1272p37309p76968J50737R70062N33427o08495q72726
39336d59979k59N49412j07981q89652m53730P28243J148544N12912m8679J36862
39326A115693M08549M2260n83104o64009j97464J46178Q9192K8966K55775M52757
39316A094793K33777j86929k76822q929O4079l31308o96672m62294J35948L74101
39306f0256R4829j31516M3665K29939L975l67036l48898L5787K97924K29854Q6166
$$ y = [423181, 507432, -75629, -519076, -132621, 701893, 1151722, 1082188, 1031798, 1295580, 1626024, 1751531, 1643437, 1284173, 691681, 218978, 325608, 927678, 1407176, 1394411, 1129491, 919437, 692452, 329002, 41092, 97294, 406433, 639694, 620567, 445496, 364510, 577944, 932565, 881293, 143984, -632984, -482247, 487815, 1021242, 412747, -459979, -460238, 89174, -18807, -908459, -1362189, -633946, 514598, 1027510, 978831, 1115693, 1524242, 1566502, 983398, 319389, 121925, 268103, 357295, 386261, 642036, 1094793, 1328570, 1141641, 864819, 855890, 919969, 588661, -108011, -570305, -434357, -60256, 34573, -96943, -53278, 176661, 180636, -186400, -535298, -499511, -201587, 28267, 114433]
39295A14433O6416O4740m027j1469J05195J53965m0562l49783m77992k83808J26953
39284e35939N24323O87957N19464J24651k54964m41420m15502k22162J01692M46961
39274E35061N94934M04322K7724j85945p7641J07412J4456l30916n15015l10384
39264B64008m3205j33793m22708l58693J41412M99704L26683j5752n7321J7648
39254B17983j98635m73720k42541L27224M10346j72067n37970n2957O54243O24176
39244E56082r378l21706l3231K25414M9958j92265j63329j33817l44054m09210
39234g75536M8741N90852M75523j79371m41722J42282Q93721R13218K15895m28660
39224A454943n27477k86161p2304Q3086K90877M43067L41402M6818j81167k53438
$$ y = [114433, 180849, 245589, 241562, 230093, 335288, 489253, 448691, 98908, -379084, -662892, -535939, -11616, 676341, 1195805, 1320456, 1065492, 624072, 208570, -13592, 88100, 535061, 1129995, 1534317, 1562041, 1376096, 1298455, 1405867, 1420323, 1089407, 574392, 264008, 220803, 87010, -335698, -694391, -552979, -53275, 273408, 257656, 200335, 217983, 19348, -454372, -696913, -369689, 40657, -131410, -669380, -722337, -68094, 556082, 546704, 224998, 191767, 417181, 467139, 274874, 111545, -22272, -366326, -775536, -726795, -135943, 339580, 160209, -281513, -139231, 754490, 1667708, 1883603, 1454943, 927466, 641305, 569001, 652087, 942964, 1386031, 1727433, 1774251, 1593084, 1339646]
39214A339646l00999l52811k50791J9392J93764J18156L8576K40874N68444O11776
39204B226027K86504j09633l82915o22811q36138p69231k89569L10623O18849
39195D31706N59816L62267J91601J0512k40597m74304m93046j81054L03454N76226
39185A046581M02103J264j89936n3887J22442J07508J3518L9584J57045J79307
39175A825529p33l05059m78374k61738K25521M18293Q435m19326n4553Q36453
39165A794448J047767J25523q81588q66414j25744L18022K25532Q4649N068l00284
39155A426979o30330m29784J72050M03719O5405j79313P2585M04089M33685L95112
39145B134197M59162K72152k86650n83977j30675N36248N75851O1095k37156l1036
$$ y = [1339646, 1038647, 685836, 435045, 454437, 648201, 766357, 804933, 1045807, 1614251, 2226027, 2512531, 2402898, 2019983, 1397172, 561034, -208197, -497766, -187143, 431706, 991522, 1353789, 1545390, 1555902, 1315305, 841001, 347955, 166901, 470355, 1046581, 1448684, 1449948, 1260012, 1206125, 1328567, 1436075, 1449593, 1489177, 1646222, 1825529, 1824796, 1519737, 1041363, 779625, 1005146, 1423439, 1431874, 1012548, 957995, 1794448, 2842215, 2967738, 2086150, 1219736, 1093992, 1412014, 1637546, 1722195, 1727263, 1426979, 796649, 366865, 538915, 942634, 1008039, 828726, 901311, 1305400, 1739085, 2134197, 2593359, 2865511, 2578861, 1994884, 1864209, 2400457, 2976308, 3037403, 2800247, 2769211]
39135B769211K29981J95535N4424O2700J29138L8193k05812l90332l19235r647
39125B554156K70264K60690P1489R2813M44035P60076O86541L35030N8744K9768
39115E563606K37774O34820J046042J195049J068715J033722J384402K006111
39107A4170241K617414L017871L012412K629457K612816L936229O232996P326951
39099D5556387N206784K87461m913541q128562q820314p745135n974693m346078
39091A1122309l133650k085842j094311n68063o84467p65796k26086K84826k30392
39082B618528j339599j581220o47277K09005K07207N6234L90255O02145J33405
39073F48683l08212L3301N21978J96847m94643m31234K56242M73104P8684k527
$$ y = [2769211, 2999192, 3194727, 3249151, 3311851, 3440989, 3479182, 3273370, 2883038, 2563803, 2554156, 2824420, 3085110, 3156599, 3249412, 3693447, 4453523, 5140064, 5475094, 5533838, 5563606, 5801380, 6436200, 7482242, 8677291, 9746006, 10779728, 12164130, 14170241, 16787655, 19805526, 22817938, 25447395, 28060211, 31996440, 38229436, 45556387, 50763171, 51050632, 46137091, 38008529, 29188215, 21443080, 15468387, 11122309, 7988659, 5902817, 4808506, 4240443, 3555976, 2790180, 2564094, 2848920, 2618528, 1278929, -302291, -949568, -740563, -533356, -477122, -86867, 515278, 648683, 340471, 373772, 895750, 1092597, 597954, 166720, 422962, 896066, 974750, 972223]
39063I72223M48287N73138P4097k11233J44220L45159j79867o62405k51647N00387
39053A752359M76015k67837o79520l34523J40164K07793R5500J73452L40776K95600
39043B199779J557l29281m89698m34675l37087m22730o02944m80010M4951M65460
39033c84678L49391K3426O0495L45430L19071k499n7456J88449Q6126n06067p51572
39022c29884j06196O70771N45730k41559n47555j4336N38492M68647J75967K50867
39012A410944M60858K12189l37914l42735N18083J429916J349287K54286q50408
39003D104506j101846o10718n6059J89337K26391J53237j07701m71654o01086
38994A724407l55625n2115n1674k88426m24099l08540p0369J30597K37478K50113
$$ y = [972223, 1420510, 1993648, 2067745, 1856512, 2000732, 2345891, 2166024, 1503619, 1251972, 1752359, 2228374, 1960537, 1281017, 946494, 1086658, 1294451, 1389951, 1563403, 1904179, 2199779, 2201336, 1872055, 1382357, 947682, 610595, 187865, -415079, -895089, -850138, -384678, -35287, -11861, 48634, 394064, 713135, 710636, 653180, 841629, 927755, 421688, -329884, -436080, 234691, 780421, 538862, -8693, -23029, 515463, 984110, 1160077, 1410944, 1871802, 2083991, 1746077, 1403342, 1921425, 3351341, 4700628, 4954914, 4104506, 3002660, 2391942, 2335883, 2525220, 2751611, 2904848, 2797147, 2325493, 1724407, 1368782, 1316667, 1264993, 976567, 552468, 243928, 173559, 304156, 541634, 791747]
38984G91747J88122N7185j77112m53325m83458m3738N61961O97031J95405m00889
38974I32929n86087m45477k23064J42477O13430O75158m456q41807r29008k13171
38964h79076M97433N88121J62462l44673n28436j42399N61250P96881J68533n93965
38954B86131n47414O7008K61465m1316M6890O95492Q95352J23155p06988o48346
38944D31429j00965L2286k26534k43959P2195L10781L28517K23751o9040m70541
38934B87920m80970P8567N22271K72062j32063Q3602N10242J78447o76122p86114
38924a42158J27879P93408K62100p32178r38844l00882K72459L25521K35365L45943
38914B48613M24984J23264m29414p31627n04561k410L18701L25445K41809K29539
$$ y = [791747, 979869, 1037054, 859942, 406617, -76841, -120579, 441382, 1138413, 1333818, 932929, 346842, -98635, -321699, -179222, 434208, 1109366, 1104910, 263103, -665905, -879076, -381643, 206478, 368940, 24267, -504169, -646568, -85318, 711563, 880096, 286131, -261283, -194275, 67190, 25874, 72764, 768256, 1663608, 1786763, 1079775, 431429, 330464, 362750, 136216, -107743, -35548, 275233, 603750, 827501, 758461, 287920, -193050, -114483, 407788, 679850, 547787, 631389, 1141631, 1320078, 643956, -142158, -14279, 779129, 1041229, 309051, -629793, -930675, -658216, -332695, -97330, 248613, 673597, 796861, 367447, -364180, -868741, -871151, -552450, -227005, 14804, 244343]
38904B44343K11802J36469Q0456R922j83471l11618n0986L67121K67641l58420
38894D13259o03464k3662N21755J82443m81107m27961J52648K91401l8321m3524
38884e6533K55653L8975n98724n19459M79538J066390M28900m34376l76900J35564
38874D19028M3078m72758m46739J65415N02494K50081k7167O6105K84491L32586
38864A116614J99941j04647n46980q19786o34955k00870O5547J48721K47505K02467
38854c26443k41073p36538o23137Q0751O37500O10480K89785J1640k57480m44125
38844i98640j72487N43767R73644N57531k50707n57642j84193K88809M45217M00014
38834A045313K68985q6567n84699p45550l55342J06506J40386j7324J52238N20502
$$ y = [244343, 456145, 592614, 673070, 682992, 499521, 187903, 136917, 504038, 771679, 413259, -190205, -213867, 307888, 490331, 9224, -418737, -266089, 25312, -13009, -56533, 199120, 238095, -360629, -880088, -400550, 665840, 1094740, 660364, 283464, 419028, 462106, -10652, -457391, -291976, 210518, 460599, 433432, 499537, 784028, 1116614, 1316555, 1211908, 664928, -154858, -789813, -990683, -925136, -776415, -528910, -326443, -567516, -1304054, -1927191, -1846440, -1208940, -598460, -308675, -297035, -554515, -998640, -1171127, -627360, 346284, 903815, 653108, 95466, -88727, 200082, 645299, 1045313, 1314298, 1227731, 643032, -102518, -457860, -351354, -210968, -228292, -76054, 444448]
38824D44448N31351K17131J59355L63726J18092o83019j045945l65876M73721
38815B12984M04035j77863k20825J00427k31270j050620r96139K44099J225371
38806d89801Q97964J05174N2842M36636K32218m69558o84026j71695L16564L08315
38796E34633J32361J22999J08964j13049l45753k47145K41599P70552P78199J9977
38786B003337r49528j178548m54077L74266N15853J91917L7312Q6489k0377k46999
38776C59645k96167k50253l62535m15464j4914N84599O72393J23524l82355k91689
38766b73216J70905M10469J67699k79528m25257p8764L19577J81795l36247m23407
38756e65974J61218O08550K86610k56119k42198L7212j55743n95616m60468J59798
$$ y = [444448, 975799, 1192930, 1352285, 1716011, 1834103, 1151084, 105139, -260737, 212984, 617019, 439156, 218331, 318758, 87488, -963132, -1959271, -1715172, -489801, 408163, 513337, 566179, 1002815, 1235033, 765475, 81449, -90246, 226318, 534633, 666994, 789993, 898957, 785908, 440155, 193010, 434609, 1205161, 1983360, 2003337, 1053809, -124739, -578816, -204550, 311303, 503220, 540532, 627021, 606644, 359645, 63478, -186775, -549310, -964774, -979688, -395089, 277304, 400828, 18473, -273216, -102311, 308158, 475857, 196329, -228928, -307692, 11885, 193680, -142567, -565974, -404756, 203794, 490404, 234285, -7913, 29299, -126444, -722060, -1182528, -1022730]
38746a022730L39578j24827m10680q0316K98088K45577J08258K86164N46404N39602
38736G25118L31777O1793l07573n95741m02507J89833N30362L10384n1982j98775
38726E92689l18506n20682m44016N4314M49583K96886r6467k24179j25952j10172
38716d46502j65774j06852N6370K52735M81097N40217J26591n04451n76961J02291
38706b41239O96912M95915r8748l32431k31185k27907j91424K51167P46356N52150
38696A419566k22346o21118k08578L42661K87232j96528m14932j49666J67214
38687D03505J14047j90643k70700Q4794N01384M61396P457k97012j76646j7312
38677F20270j90686m02882j55021L94074N60215J09281l70321k43590L12134N05079
$$ y = [-1022730, -683152, -807979, -1218659, -1298975, -1000887, -755310, -647052, -360888, 185516, 725118, 1056895, 1118688, 811115, 215374, -187133, 2700, 533062, 843446, 791464, 592689, 274183, -246499, -690515, -636201, -186618, 110268, 13801, -210378, -336330, -446502, -612276, -719128, -662758, -410023, 71074, 611291, 737882, 233431, -343530, -241239, 455673, 951588, 852840, 520409, 289224, 61317, -130107, 121060, 867416, 1419566, 1197220, 576102, 367524, 710185, 997417, 800889, 385957, 236291, 403505, 517552, 326909, 56209, 141003, 642387, 1103783, 1111240, 814228, 637582, 620270, 429584, 26702, -128319, 265755, 825970, 935251, 564930, 321340, 633474, 1138553]
38667A138553l6700o82356n25283L47672P96112J45066p41444n91035M13062Q79119
38657A142766K74732l97437l10430l1306l20130p18190l63223M62138P27887K41601
38647G08408k38068l07133l19063m68425l98184O8867N04550M43677n3794n30091
38637e89256n20945R2773Q05770Q11040K1081n94653k65036M11959L47230l53816
38627A66147n97423l2081N33175N01827J93959l9618l46854o50776m05778L97447
38617b79975Q68888M67739j53534j82511J91342L37945K47638K39826J55999k88769
38607A604588p24790n60605L5551L84112L48104L51901M67058L14165r1068k01178
38597A927838J62388M67624L08183j2495p2107Q90j31822l73999l53100l8686
$$ y = [1138553, 1101853, 419497, -105786, 241886, 1037998, 1183064, 441620, -149415, 263647, 1142766, 1417498, 1020061, 709631, 678325, 358195, -359995, -723218, -261080, 466807, 708408, 470340, 163207, -155856, -624281, -1022465, -953598, -449048, -5371, -59165, -589256, -1110201, -1017428, -211658, 599382, 620463, 25810, -239226, 172733, 519963, 166147, -431276, -463357, 69818, 571645, 765604, 725986, 379132, -271644, -677422, -279975, 588913, 1056652, 903118, 720607, 911949, 1249894, 1497532, 1737358, 1893357, 1604588, 879798, 319193, 354744, 738856, 1086960, 1438861, 1905919, 2220084, 2129016, 1927838, 2090226, 2557850, 2866033, 2853538, 2781431, 2782321, 2650499, 2276500, 1923400, 1884714]
38587A884714J99552R6908k31442n00259n27718l15564k5744J28165Q5834P276
38577H01722L8566R7227M7607o156J35101L39620K03933l11329o32460k81190
38567D32641L89584O00187J94153k12834j83270j7138j32459l88338m10760k05407
38557F6359p788J59381L22378K67590n8092j78181K35564O07979K00695n73333
38547A042552n71503K94310P83433J78165o36791n60030J56128N23174L12204
38538A521642L2186j00499k48034l06875m7517K81294K66758Q0712J59355L35747
38528A974769J30472k55875j90749K03914J49312m06782n96488j09837K40670
38519A139406o4667l45485L7179N06991L06538r8091J70353P28832M24274o83092
$$ y = [1884714, 2084266, 2181174, 1949732, 1449473, 921755, 606191, 580447, 708612, 794446, 801722, 840288, 937515, 985122, 978966, 1114067, 1453687, 1657620, 1346291, 713831, 432641, 822225, 1422412, 1616565, 1403731, 1220461, 1203323, 1070864, 682526, 271766, 66359, 58571, 217952, 540330, 807920, 749828, 571647, 807211, 1415190, 1615885, 1042552, 471049, 765359, 1548792, 1726957, 1090166, 530136, 686264, 1209438, 1521642, 1553828, 1453329, 1205295, 898420, 850903, 1132197, 1398955, 1479667, 1639022, 1974769, 2105241, 1849366, 1658617, 1862531, 2011843, 1605061, 1008573, 898736, 1139406, 1074739, 729254, 766433, 1273424, 1579962, 1481871, 1652224, 2381056, 2805330, 2122238]
38509B122238j192416m22445O11598P55832K45515O41J60466J50519k12511m86785
38499A732652l56574j8976J76681Q7697j75317k81135P9194O76196P23884j62439
38489B481863j191624j177465o2614R56311R41929K44428k47096k90460k35936
38480A419336k07078J844L16324K90197k17598o98167n87676J1426M50822L01068
38470A080498j91569m31885j54826L00184L98601J8135m56443o19860m55020j96062
38460g08247J6382J68624K02914N3144j75815k60820j15161J28644K81421K55658
38450a53256J20086P9861K80443N17569L45302l00577q01987n44439K28337O76718
38440D48057M34461n3915k87908k74810j88334L235K70026L27592P3196j48506
$$ y = [2122238, 929822, 507377, 1118975, 1874807, 2120322, 2120963, 2281429, 2431948, 2219437, 1732652, 1376078, 1357102, 1533783, 1621480, 1446163, 1165028, 1244222, 1920418, 2644302, 2481863, 1290239, 112774, 50160, 1006471, 1948400, 2192828, 1945732, 1655272, 1419336, 1212258, 1214102, 1530426, 1820623, 1603025, 904858, 317182, 328608, 779430, 1080498, 888929, 457044, 302218, 602402, 1001003, 1019138, 562695, -57165, -512185, -708247, -691865, -523241, -320327, -267183, -442998, -703818, -818979, -690335, -408914, -153256, -33170, 46691, 327134, 844703, 1190005, 889428, 87441, -456998, -228661, 448057, 882518, 828603, 540695, 265885, 77551, 80786, 350812, 678404, 751600, 603094]
38430F03094q1402m868k32915n17448m58955k18044k23170l77140k22811J94763
38420a538896L52256J75497J97361N85049P42992K81238k62319k24520J51977
38411D60635J58227k32196l99526j48694K2272j60877k75660J8761L15505R3086
38401a48467l76359l92421O8499L17681R7690L6281N78589J085373O77287l63877
38391A580276q63875l92042K04055J26298k99032l56565j00871q2923l21689l13613
38381h19981Q5792M67708N19841L06289m8819m05952m12291J30766P32859O88914
38371A245126R1527l06780k47357j82440k53723p343N57400O41404p6611o94347
38361G66856l71681L69880N01438N2071j49443R8359K12486o3579l07535j87458
$$ y = [603094, 521692, 516824, 283909, -233539, -692494, -910538, -1133708, -1510848, -1733659, -1538896, -1186640, -1011143, -813782, -228733, 514259, 795497, 533178, 308658, 460635, 618862, 386666, -12860, -161554, -139282, -300159, -575819, -557058, -241553, -148467, -524826, -917247, -848748, -531067, -433377, -397096, 181493, 1266866, 1944153, 1580276, 716401, 324359, 528414, 654712, 355680, -885, -101756, -184679, -506368, -819981, -734189, -266481, 253360, 559649, 510830, 104878, -307413, -176647, 556212, 1245126, 1336653, 1029873, 782516, 600076, 346353, 339010, 896410, 1537814, 1461203, 766856, 395175, 765055, 1266493, 1318564, 1169121, 1267480, 1479966, 1416387, 1108852, 921394]
38351I21394J32108L71136L78348R5470k52263k04297J93091J71617n43275r31741
38341C31588j27007R35921P28135l95627o48356K77618O88343k31244r72591k08250
38331C78530R51302P26843n30426j039881l58774K88487J51435j77850r6639J44579
38321D37606J79437J20684J36878J75006K57663M34532M41853N0261l52947k56158
38311A624815M2117j54820o86550o82000l0246L42778m6505m75727k16936L37740
38301E4666L69907j53140n81314m98783k6457N00229P55124N57564P6811k91294
38291G63313l77158l06715j27061K02611M46962K83737q5857j43964N7859k8139
38281F85588l62765k44233L67004M97205k59419q37122k76632O82284P26357R115
$$ y = [921394, 1053502, 1424638, 1802986, 1898456, 1646193, 1441896, 1634987, 1806604, 1263329, 331588, 204581, 1140502, 1868637, 1473010, 824654, 1102272, 1790615, 1559371, 586780, 378530, 1329832, 2056675, 1526249, 486368, 127594, 416081, 567516, 389666, 293027, 437606, 617043, 737727, 874605, 1049611, 1307274, 1741806, 2183659, 2233920, 1880973, 1624815, 1666932, 1512112, 825562, 143562, 113316, 456094, 409589, -66138, -283074, 54666, 424573, 271433, -309881, -808664, -835121, -334892, 420232, 977796, 1054607, 763313, 386155, 79440, -47621, 154990, 601952, 885689, 799832, 655868, 713727, 685588, 322823, 78590, 445594, 942799, 683380, -153742, -430374, 251910, 978267, 987382]
38271I87382k61619J26300K06590l40268o19358j09151M33348K36740l06177m18953
38261f5166j45064l4136j67057k06522n2051J74407M84826P99119O89465j2847
38251A464974o26223l71970M09588N93635j19540p43498m50477K62808M01072
38242H20369p2937l24079N0592N34605N56479K35087K9423N6916N6635j73743
38232A769347n11892n86414j03854P03074J035380L51730p50326j044065k60490
38223F02490M87107K88791k45974k4367P21281P60236j50885q05338l57159M55685
38213A731867M99703j34252m75286j53610K65966K48558q5266l01843j61007K43897
38203A678727N52619M01334j29749m68035k28297K27030K54474j76659m64286
$$ y = [987382, 725763, 852063, 1058653, 718385, 99027, -10124, 423224, 659964, 353787, -65166, -210230, -244366, -411423, -617945, -669996, -495589, -10763, 788356, 1477821, 1464974, 838751, 466781, 876369, 1470004, 1350464, 606966, 156489, 419297, 820369, 747432, 423353, 473945, 1008550, 1565029, 1800116, 1829539, 1886455, 1943090, 1769347, 1257455, 671041, 567187, 1270261, 2305641, 2657371, 1907045, 862980, 602490, 1089597, 1378388, 1132414, 1108047, 1829328, 2589564, 2438679, 1633341, 1276182, 1731867, 2231570, 2097318, 1622032, 1468422, 1734388, 1982946, 1897680, 1595837, 1434830, 1678727, 2231346, 2632680, 2502931, 2034896, 1806599, 2033629, 2288103, 2111444, 1647158]
38194A647158k20524K56275M48957K59249J2540r914J35496K19313J74479J30631
38184C053660J07115q3672m19529m20252K38986J010826R78296J18647n85710
38175C998367m92415q1132m9171l02918l76605k69579k18870j05759K15499L91896
38165B709313J16854j48546J63707O11658K51572q05745j348190p33439L09038
38156A126222Q51132Q92380Q43232O24236k1218p33741p83114n3094P07739P19159
38146D172933K4724n82809m46206K15671N95062L48107K7544K06006N63704M01581
38136E526317j97467m50983p1688L80203M46429L20840K30706L1374k16235p613
38126E991883P28213J164313O65868j74849l71335j9070k8750n58418p24429n6966
$$ y = [1647158, 1426634, 1682909, 2131866, 2391115, 2403655, 2393741, 2529237, 2748550, 2923029, 3053660, 3160775, 3077103, 2657574, 2237322, 2476308, 3487134, 4465430, 4584077, 3998367, 3505952, 3424820, 3375649, 3072731, 2696126, 2426547, 2207677, 2101918, 2317417, 2709313, 2826167, 2677621, 2841328, 3452986, 3704558, 2898813, 1550623, 817184, 1126222, 1977354, 2869734, 3712966, 4337202, 4315984, 3582243, 2799129, 2746035, 3453774, 4172933, 4197657, 3614848, 3168642, 3384313, 3979375, 4327482, 4355026, 4561032, 5124736, 5526317, 5328850, 4877867, 4806179, 5186382, 5632811, 5953651, 6184357, 6215731, 5999496, 5991883, 6720096, 7884409, 8550277, 8375428, 8004093, 7985023, 7956273, 7397855, 6673426, 6616460]
38116F616460O74244N81864o4295l55187j26867l6778l45462m40136J33442Q13920
38106G451205P73914J60389j10868K92275O98900N32644J49523J76470N36648
38097A0661100O72998M16654R3533l4686M3079K86170N39418M70530N1341j14245
38087A3085892M87888J397603J656620J105388N67515P26745J417721K073811
38079B2519183K308861K013674J438354J218536J773303K676045L166645L183091
38071D0297692L239201L478605L729347M342301N840560P679364Q618774Q632632
38063H5858476R174855J1081235J3518532J5661598J8022848K1173760K4511804
38056A99003108K7580070L1405704L6904613M2737269M6275138M5922989M0840003
$$ y = [6616460, 7290704, 7872568, 7808273, 7453086, 7326219, 7289441, 6943979, 6503843, 6637285, 7451205, 8225119, 8385508, 8274640, 8566915, 9265815, 9798459, 9947982, 10124452, 10661100, 11334098, 11750752, 11844285, 11809599, 11852678, 12138848, 12678266, 13148796, 13200137, 13085892, 13573780, 14971383, 16628003, 17733391, 18300906, 19027651, 20445372, 22519183, 24828044, 26841718, 28280072, 29498608, 31271911, 33947956, 37114601, 40297692, 43536893, 47015498, 50744845, 55087146, 60927706, 68607070, 77225844, 85858476, 95033331, 106114566, 119633098, 135294696, 153317544, 174491304, 199003108, 226583178, 257988882, 294893495, 337630764, 383905902, 429828891, 470668894]
38049D70668894K9384393J0603759j2369774l2760718m5207358m9324809m7957031
38042C23037356m3668334l7908271l1956183k6826524k2566169j8733189j5357627
38035A26021059j2774882j0942626r602575q722632q168017p375284o011216m577582
38027E7846245l725535l321332k811752k146807j647202j252574o32619J36156
38019D2444580O92255J060476J556594K131818K461247K616192K995327L615612
38011E9574101M151186M723551N951214Q030765J0372379J2310748J3485140J3204440
38003A31803524J0229990M019030m006728j1075947j5080516j5827842j4550245
37996H5511266j2618363j0713227q844735o914370n198447m168231l824558l534077
$$ y = [470668894, 500053287, 510657046, 498287272, 465526554, 420319196, 370994387, 323037356, 279369022, 241460751, 209504568, 182678044, 160111875, 141378686, 126021059, 113246177, 102303551, 92700976, 83978344, 75810327, 68435043, 62423827, 57846245, 54120710, 50799378, 47987626, 45840819, 44193617, 42941043, 42308424, 42444580, 43136835, 44197311, 45753905, 47885723, 50346970, 52963162, 55958489, 59574101, 63725287, 68448838, 74400052, 82430817, 92803196, 105113944, 118599084, 131803524, 142033514, 146052544, 142045816, 130969869, 115889353, 100061511, 85511266, 72892903, 62179676, 53334941, 46420571, 41222124, 37053893, 33229335, 29695258]
37988B9695258k800272j943333j602241j729686j642069j097237p03327r69090
37980A7208003j474576j466394r16584m11645k02391k6890J64945M2964l55095
37971A2562337m10405J19883N23179J16237o24732o80853k0747L48478p1878n23921
37961A1337578j65467O84431J048896O25253j6850l73485n14027o19254n50166
37952A1456909j28286M36142O73342L84874o3021l8625O74035J499929J608465
37943A6503764R57822N17659J129658K382285L115090K957163K753560L316513
37935C3633514M370573N151592N590192O305278P617679R141349J0302619J0705672
37927I2818468R902656P384679L180173j799324o306907r522497j1164732j1215929
$$ y = [29695258, 26894986, 24951653, 23349412, 21619726, 19977657, 18880420, 18177093, 17208003, 15733427, 14267033, 13350449, 12938804, 12736413, 12709523, 12874468, 12917432, 12562337, 12151932, 12271815, 12794994, 12911231, 12286499, 11605646, 11584899, 11933377, 11861499, 11337578, 11172111, 11856542, 12905438, 13530691, 13513841, 13140356, 12626329, 12007075, 11456909, 11328623, 11764765, 12438107, 12822981, 12759960, 12721335, 13395370, 14895299, 16503764, 17461586, 17979245, 19108903, 21491188, 24606278, 27563441, 30317001, 33633514, 38004087, 43155679, 48745871, 55051149, 62668828, 71810177, 82112796, 92818468, 102721124, 110105803, 113285976, 111486652, 105179745, 95657248, 84492516, 73276587]
37919G3276587r958152q150565o694881n942971n513774m877101l954159l051684
37911B5133300k380718j869226j452008j314563j629390k107325k126066j478732
37903A0775272p35677n33478o85454m81232J66674M89009q781p66306r59964o14732
37893F645331l49698l45493k62266m3566n3379l35558m23489j18779J29391n0146
37883D792348l44252k86416o731K3325k52303m56976m01026k59171j45865M3854
37873B706787K58210J53097l83991q25499n34963L01888P15299J79750n49373
37864B021205l53994O23852J009278Q9989j046739r15970L16139J067771M88020
37855C299551n43197p53740n1100O53083O71778J40829l36806l08793J17211L41157
$$ y = [73276587, 63318435, 55167870, 48472989, 42530018, 37016244, 32139143, 28184984, 25133300, 22752582, 20883356, 19431348, 18116785, 16487395, 14380070, 12254004, 10775272, 10039595, 9506117, 8820663, 8339431, 8506105, 8995114, 8986333, 8220027, 7260063, 6645331, 6295633, 5950140, 5687874, 5644308, 5590929, 5255371, 4831882, 4713103, 4842494, 4792348, 4448096, 4161680, 4154949, 4178274, 3925971, 3468995, 3067969, 2808798, 2662933, 2706787, 2964997, 3118094, 2734103, 1908604, 1373641, 1675529, 2390828, 2570578, 2021205, 1667211, 2291063, 3300341, 3390330, 2343591, 1427621, 1743760, 2811531, 3299551, 2756354, 2002614, 1951514, 2604597, 3276375, 3417204, 3080398, 2771605, 2888816, 3229973]
37845C229973o1526p28425q91937l76356K17074L65433J61779r5754k82625k44602
37835A293034J71690O25422M55526k96536o86128j57934N89593O22210O9701l11822
37825B374756l78504n23947o67424k80970N64245J014721N26519m22151r35302
37816A271943o42451J01635O66042O88543L46164Q6230L0759j14772m25769m59024
37806A549300M4969N68337M58318j29765n10816m64827l30845k62601o8430K19677
37796A073317K55596l6974l02454k88701j16962O5570K95850N47758O11544L47138
37786B451682j36935n73132o72625l10702K48127N16491L68087J70747J46306
37777B208046M4301k44387l21833k5420O4857m55020r52240o63233L3735K45314
$$ y = [3229973, 3168447, 2440022, 1548085, 1171729, 1388803, 1754236, 1916015, 1820261, 1537636, 1293034, 1464724, 2090146, 2545672, 2249136, 1563008, 1405074, 1994667, 2616877, 2686578, 2374756, 1996252, 1472305, 804881, 523911, 1088156, 2102877, 2629396, 2207245, 1271943, 629492, 731127, 1397169, 2085712, 2431876, 2518106, 2548865, 2434093, 2008324, 1549300, 1594269, 2162606, 2620924, 2491159, 1980343, 1515516, 1184671, 922070, 853640, 1073317, 1328913, 1291939, 989485, 700784, 583822, 649392, 945242, 1493000, 2104544, 2451682, 2314747, 1741615, 1068990, 758288, 1006415, 1522906, 1890993, 2061740, 2208046, 2252347, 2007960, 1686127, 1660707, 1725564, 1270544, 318304, -344929, -311194, -65880]
37767f5880N5437K38031P27619O59074p0694n57274l86347j54585j94475l63N91373
37756H41916Q09497K13144m36297l33947J63748K90642J11031J38326K66275M301
37746B068636n22368o47441j52162M53862O32351L61168k780j14465O4320K19266
37736B360387N4338k69991l30164o0707J94750K48208K16731R7309k53105o48617
37726A609139o74861l52046j00191N150K40325M51446J31328n50603p45656k70303
37716b56272K3730l25625n92336j21982N34436N41649Q2469j01683J09378K81399
37706A75163K05649n4883m48578p18795m35898K61971N98735L04687M0018J58104
37696H6173N1997n32998o71501J92127R45284M19467o03140n69889L40798O38416
$$ y = [-65880, -10443, 227588, 955207, 1614281, 1543587, 986313, 599966, 445381, 250906, 250543, 841916, 1651413, 1864557, 1428260, 1094313, 1258061, 1548703, 1659734, 1798060, 2064335, 2068636, 1546268, 898827, 746665, 1200527, 1832878, 2194046, 2191266, 2076801, 2141121, 2360387, 2414725, 2144734, 1814570, 1753863, 1948613, 2196821, 2413552, 2510861, 2257756, 1609139, 934278, 582232, 482041, 487191, 727516, 1178962, 1310290, 759687, 14031, -256272, -232542, -558167, -1150503, -1272485, -738049, -196400, -113931, -215614, -106236, 175163, 380812, 325929, -122649, -841444, -1277342, -1015371, -416636, -111949, -71931, 86173, 138170, -394828, -1066329, -874202, 71082, 490549, -112591, -682480, -341682, 296734]
37686B96734L3708l00246R1522K99940j60728n28857k16140L03589N09659N43811
37676H72992M62332n2149p47804p20585J42713P04037K11686n83436o71944k44254
37666f26412p3149j84998o1589L29294N58557M96553L59935K18909K0204q8156
37656I49148O9409L39942M10147J92055j70576m68184m73122j40071J47216m4444
37646H11520m72019m22721J74073M98476N2021n43930m95735k0999R7229k36810
37636e58895l74842P919M67393N01025K18513J08953L79904O91827N25061j89636
37626A777222q60032q25603j56986L95675L11974j30435l12483j3013M74755P27317
37616A388391N20284l7303n54852o84624m53990j40071J18261L30283L81976J56825
$$ y = [296734, 330442, 30196, 121718, 421658, 260930, -267927, -484067, -180478, 329181, 872992, 1335324, 1283175, 535371, -185214, -42501, 661536, 873222, 289786, -382158, -626412, -699561, -884559, -946148, -616854, -58297, 438256, 798191, 1017100, 1037304, 949148, 1018557, 1358499, 1768646, 1960701, 1790125, 1321941, 848819, 708748, 855964, 811520, 339501, -83220, 90853, 589329, 641350, 97420, -398315, -419314, -322085, -558895, -933737, -925818, -458425, 42600, 261113, 370066, 749970, 1441797, 1966858, 1777222, 917190, 91587, -65399, 330276, 642250, 511815, 199332, 186319, 661074, 1388391, 1908675, 1871372, 1316520, 631896, 177906, 37835, 156096, 486379, 868355, 1025180]
37606A025180j02770k6332K45104J65589l32689o06199k20712L83151N19540J72028
37596A221890j44509j76554j46957k77252m57667m30879j22782K51883L82824
37587I9997J92287p2844j57253q7555L536J53783M00169N17570K95496o5254k23680
37576A056252k15428k66247k78674m6251J90848N4423k16430n1717M34011N10614
37566A171401L904m07597k49302J66862M27095N12318L86404r5980n98686m80857
37556H35562J08787K31626l46544o71487j71666L47049O9542m61987l46139J65827
37546b39430K84960J11910K31440M32897J31501l24574j24130M48380L24044m91736
37536G85262p78323n2581O60710M66159j62839l91568k72077k48591k07764J60357
$$ y = [1025180, 922410, 896078, 1141182, 1306771, 974082, 367883, 147171, 530322, 1049862, 1221890, 1077381, 900827, 753870, 476618, 18951, -411928, -534710, -282827, 99997, 292284, 219440, 62187, -25368, -21832, 131951, 532120, 1049690, 1345186, 1279932, 1056252, 840824, 574577, 295903, 249652, 440500, 494923, 278493, 226776, 660787, 1171401, 1175305, 767708, 518406, 685268, 1112363, 1624681, 2011085, 1915105, 1316419, 835562, 944349, 1175975, 829431, 157944, -13722, 333327, 402869, -59118, -405257, -239430, 45530, 157440, 388880, 821777, 953278, 628704, 504574, 952954, 1276998, 785262, 6939, -45642, 615068, 1081227, 918388, 526820, 254743, 6152, -201612, -41255]
37526d1255N82540N52888J45188j53293j84797j71285k19499k40827k11908j32260
37516g4508J05232M45692M89363P381n18155l68450M06256R25175N57536l01810
37506A673712p63560n02632N205K00481O4843o7396o3331p8339j55777p2564K68095
37495E08737N34519L33242k13557n46999l63007K1099J20035p6800j40089J50382
37485C27562M41929K70684k48261n08612k48571N7178r2154m28905l04667K73274
37475d60543N87273K73568j43211o3522L17612L72080m2321m72340n29617k74750
37465d35771R280J30582O6061q6546j99085j93014j1203L69203P09162M98957
37455H57626l75778j086203o52925O23502J292179O32658l67520m59275J66442
$$ y = [-41255, 541285, 1094173, 1239361, 1086068, 901271, 729986, 510487, 269660, 57752, -74508, 30724, 476416, 965779, 973160, 455005, 86555, 492811, 1417986, 1975522, 1673712, 910152, 407520, 412725, 613206, 678049, 610653, 547322, 468983, 313206, 240642, 508737, 1043256, 1376498, 1162941, 615942, 252935, 274034, 394069, 317269, 177180, 327562, 769491, 1040175, 791914, 283302, 34731, 91909, -245, -429150, -733817, -460543, 126730, 400298, 257087, 193565, 511177, 883257, 840936, 368596, -161021, -435771, -426491, -295909, -229848, -316394, -515479, -708493, -719696, -350493, 358669, 857626, 481848, -604355, -1257280, -633778, 658401, 1291059, 923539, 464264, 630706]
37446F30706M15679l958l80728k70549k0945J4217j0879J08923K46881K26691
37436I56038Q3527q5223k28393k78084k37535k45000k97570j34045K76842M59285
37426B69842J19606k37360j7180M44387L55323k31720m85478j38892J55944l3742
37416B00730k99533j94176J11692L16382M47841M82973J54663m60364p49479l90587
37406c79858J37542K72052J02987R45L575K561Q0685K22268J25544k56419m30695
37395a18813q5581L46393L45789P6985n5105j55900m66187o33709j71627N81163
37385c36592P87152L23494j05993o7630J50636K48042L04229K90056p0882o54806
37375H67706q22225l33268K03318K18872j9654M767J83275J07282j17826r1189
$$ y = [630706, 1046385, 1042427, 661699, 391150, 370205, 384422, 373543, 482466, 729347, 956038, 1039565, 954342, 725949, 447865, 210330, -34670, -332240, -466285, -189443, 269842, 389448, 152088, 134908, 579295, 934618, 702898, 217420, 78528, 234472, 200730, -98803, -292979, -181287, 135095, 582936, 1065909, 1220572, 760208, 10729, -379858, -242316, 29736, 132723, 133668, 137243, 139804, 220489, 442757, 568301, 311882, -118813, -204394, 141999, 487788, 564773, 509668, 353768, -112419, -746128, -917755, -336592, 450560, 774054, 668061, 600431, 751067, 999109, 1303338, 1593394, 1522512, 867706, 45481, -287787, -84469, 134403, 114749, 119516, 302791, 410073, 292247, 201058]
37365B01058Q2992m8304m08377m03913J11834N74386N79073L72272K23675l9693
37355A245003m79662o34941k13937K79573K39159j08906j56693J0553j86070o88891
37345f94812p70234k08163L50022M18357K77831K41790R6116k64120l45348J86887
37335g11674Q00204P81829K25090k55928m11271l66487j39253K03396K49591j94432
37325A81065n39302j57183N50015O36671J7521m61531l18001M2144J52932M1730
37315A46061j63781m27485m76457l3394M98163L91818k02709l41034J59330K89015
37305a60473m78385j112455n08771P54632J225518O44738N4967N0064Q6427l05762
37295B50500o54044l67406K63908M88536J60078j64668p6700J99028K46641N2015
$$ y = [201058, 284050, 235746, -172631, -576544, -464710, 109676, 688749, 1061021, 1284696, 1245003, 765341, 130400, -83537, 196036, 435195, 326289, 169596, 180149, -5921, -694812, -1465046, -1673209, -1323187, -904830, -626999, -385209, -289093, -553213, -898561, -711674, 88530, 870359, 1095449, 839521, 428250, 61763, -77490, 125906, 375497, 181065, -358237, -515420, 34595, 671266, 688787, 227256, -90745, -48601, 104331, 146061, -17720, -445205, -921662, -955056, -456893, -65075, -267784, -608818, -449488, -160473, -638858, -1751313, -2260084, -1505452, -279934, 364804, 419771, 469835, 556262, 250500, -403544, -770950, -507042, -18506, 141572, -23096, -99796, 99232, 345873, 397888]
37285C97888p9839l8509k9039j59380k21957n7335J38743J36178N5475R8130J35060
37274C75415k937n8249K61489O00651L70304k15907l28995J69809M90189K28383
37264A890152K925L28115P47203P34300O47394R59597J219249P43434j32754n10621
37254F628994l20200k59944n41696o99170n71296m87659m53268j26114K90697
37245C460344J31760n38221q17207m02816j28844n27381q31658k23125P04730
37236H27582P36523j65609q69596p01282j35091J59498J40512P2176K5959j2275
37226G8397L9067J91944L14167L27222K32862l8025m68299p03230m10406J12695
37216c23606K25006r8335k12031J16471K82010j15518n14637k89561K11468L10791
$$ y = [397888, 318049, 279540, 250501, 91121, -130836, -188171, -49428, 86750, 142225, 240355, 375415, 372478, 314229, 575718, 1176369, 1546673, 1330766, 1001771, 1171580, 1661769, 1890152, 1893077, 2221192, 2968395, 3702695, 4350089, 5309686, 6528935, 7272369, 7139615, 6628994, 6308794, 6048850, 5507154, 4807984, 4236688, 3749029, 3295761, 3169647, 3460344, 3592104, 3053883, 2236676, 1833860, 1705016, 1177635, 345977, 122852, 827582, 1564105, 1398496, 528900, -172382, -307473, -147975, -7463, 64713, 90672, 78397, 117464, 309408, 623575, 950797, 1183659, 1145634, 677335, -25895, -436301, -323606, -98600, -196935, -408966, -292495, -10485, -126003, -640640, -930201, -718733, -407942]
37206d07942J79288M01208P04038K86766o30676q17289J32406J109558J119515
37197B076872N48726J68619j08967o02932q62697l84454K85962K91793j33446
37188A279476j27567K96966M07562J58243J53451L07806q0644q21091q27718L3045
37178G79529N10251l6824n69489j24633N93954M62044k20986l85105J691P2573
37168A083005l69090o31557l56135O6079K81490L42049K98511J35859O7581K64120
37158A181912M01677R7671l74410m51366j63557L5712J02947K96045M35812J50958
37148A713401k55988j32502L41886K87202m38124r29629o35359r1289J31454K61937
37138B52989N54142N64378k7030n65382k92308L79025L92733l51657q44104m53282
$$ y = [-407942, -228654, 172554, 876592, 1163358, 532682, -284607, -152201, 957357, 2076872, 2625598, 2794217, 2685250, 2082318, 1219621, 835167, 1121129, 1412922, 1279476, 1151909, 1448875, 1856437, 2014680, 2168131, 2475937, 2395293, 1574202, 746484, 779529, 1289780, 1252956, 683467, 558834, 1152788, 1614832, 1393846, 1008741, 1010432, 1083005, 713915, 82358, -273777, -207698, 73792, 415841, 714352, 850211, 917792, 1181912, 1583589, 1681260, 1306850, 855484, 691927, 727639, 830586, 1126631, 1562443, 1713401, 1457413, 1324911, 1666797, 1953999, 1515875, 586246, -49113, -140402, -8948, 252989, 807131, 1371509, 1344479, 779097, 486789, 865814, 1258547, 906890, 62786, -390496]
37128c90496K45544M14046Q7150j04486L1485P9752j63412k60528J83304P59485
37118H81844O83599q4392o95980n48454l6754J61187M8168K7461O4137j69604
37108C31212n31058n57031l18138l33432n55946k74958O78603J392739J033241
37099H65232j7650p16988o49568k31578P1556J78821J75312J24942R7718J01074
37089a129K7556j34392j65218Q4909L82552L49454l6278l75981k82639K19082
37079F7916O91287O60674J03570m45163m31922N8350L89416J49364l82786o07532
37069B53174k51718L92407P09227K85895n84173j023985n08300M35253Q52315
37060E60095N59706J90504J32396J20243k8238l7003J81382K19591o7222j52393
$$ y = [-390496, -144952, 269094, 356244, 251758, 283243, 362995, 199583, -60945, 122359, 881844, 1565443, 1481051, 785071, 236617, 199863, 361050, 409218, 436679, 500816, 331212, -199846, -756877, -1075015, -1408447, -1964393, -2239351, -1560748, -168009, 865232, 847582, 130594, -518974, -750552, -678996, -500175, -324863, -199921, -102203, -1129, 26427, -107965, -273183, -188274, 194278, 543732, 507454, 131473, -151166, 67916, 759203, 1419877, 1523447, 1078284, 646362, 704712, 1094128, 1243492, 860706, 253174, 1456, 393863, 1103090, 1388985, 804812, -219173, -727473, -292220, 560095, 1119801, 1310305, 1442701, 1562944, 1534706, 1497703, 1679085, 1898676, 1831454, 1679061]
37050A679061K96187P30870N25184k8285k08140K2636J17094j00439l10382l86782
37040B337004n02215n80151l03946K57333N90011M19587J9884k34333k37859m5052
37030A720263K25912L35693J17267k42446m12208l71708l45540l72843l20118
37021C34272k42282l05527l88535j92779K53471O06912P02712O26003L50564k03325
37011A541486p57815q42028m28361N6624L63526N52824N26828Q3208m83504n40262
37001G2526p0523K31573P5867K3681M33437P49797M38311p0408j15276Q0683j23737
36990A725931o12915p07542l08049L1386P5198J19748K44306J54742j37611k25610
36980C59584l4037N2782o2417j9564K24391J78344l13911o67666m22942P1076
$$ y = [1679061, 1975248, 2706118, 3231302, 3203017, 2994877, 3017513, 3134607, 3034168, 2723786, 2337004, 1834789, 1254638, 950692, 1208025, 1798036, 2217623, 2237507, 2003174, 1765315, 1720263, 1946175, 2281868, 2399135, 2156689, 1744481, 1372773, 1027233, 654390, 334272, 91990, -213537, -602072, -794851, -541380, 65532, 768244, 1394247, 1744811, 1541486, 783671, -58357, -486718, -430094, -66568, 486256, 1013084, 1096292, 612788, 72526, 2003, 233576, 309443, 333124, 766561, 1516358, 1954669, 1884261, 1768985, 1849668, 1725931, 1113016, 405474, 97425, 128811, 204009, 323757, 568063, 722805, 585194, 359584, 325547, 378329, 315912, 296348, 520739, 699083, 385172, -282494, -705436, -634360]
36970f34360K57852J29204l4697j55739j56376J89899P20683P52461N7737n70593
36960E56071m01092J11048P5025m13860n36932j29061K12635K49783L15903M27834
36950D67354J98571k63433l56443o2317l9394m06651m66431J4593L25592J13994
36940d74565O7457N86840Q48762J57173o84968n20334L23763N97911Q8442k76851
36930G13630o8409J64738P2268Q161J69074K03150n6288k58206j70009Q879R9710
36919H86698J06918o5640m06122m27171J87495P39564L41092n27641n47793K72961
36909E60361M45949n58360j271652n06767P16844P72145j17609m76323N1867M47376
36899F3831J58183k05687q3333K51627L22301N9811l50116o12464l47604M15288
$$ y = [-634360, -376508, -247304, -282001, -437740, -594116, -404217, 316466, 1068927, 1126664, 556071, 154979, 266027, 341052, -72808, -609740, -738801, -526166, -276383, 39520, 467354, 665925, 402492, 46049, -16268, -55662, -462313, -928744, -914151, -588559, -474565, -407108, 179732, 1028494, 1185667, 500699, -19635, 304128, 902039, 990481, 713630, 645221, 809959, 882227, 890388, 1059462, 1262612, 1206324, 948118, 778109, 786988, 886698, 993616, 927976, 521854, 94683, 282178, 1021742, 1362834, 835193, 287400, 560361, 1006310, 447950, -823702, -1330469, -613625, 158520, 40911, -435412, -383545, 63831, 222014, 16327, -67006, 184621, 506922, 566733, 216617, -395847, -743451, -328163]
36889c28163R04512M50046m87533q66900m82655j3920J91684M10230O19533L39541
36879G36375l69021p08248l13494K16524L46924L41832M98779M54589r2792o15791
36869D95677m53336J59760M61297K48966n4716j87653k48762k37901j0265L05823
36859D78890L56386R4694j36486j32149q6865k16434m00819l75511j23414R2984
36849d48724O8621p9932o4223J72472L41579K01756r1094k25615j68029o3556
36839c56745J25436M55899O05918K18101l64319l88262J34543L05659k58967p04238
36829b26975k37748N40248M93123l17301p69077l89611J00880O7359j54310n10
36819h93922M18287O13652M18428j4488n12513q19760o02790Q3592O10807M35651
$$ y = [-328163, 576349, 1026395, 538862, -328038, -810693, -824613, -632929, -222699, 396834, 736375, 367354, -340894, -654388, -437864, -90940, 250892, 749671, 1204260, 1111468, 495677, 42341, 202101, 663398, 912364, 857648, 669995, 421233, 183332, 173067, 478890, 835276, 929970, 793484, 661335, 574470, 358036, -42783, -418294, -541708, -448724, -380103, -460035, -524258, -351786, -10207, 191549, 100455, -125160, -293189, -356745, -231309, 224590, 830508, 1048609, 684290, 296028, 430571, 736230, 477263, -226975, -464723, 75525, 568648, 251347, -517730, -907341, -806461, -739102, -893412, -893922, -475635, 138017, 556445, 541957, 29444, -790316, -1393106, -1309514, -698707, -263056]
36809b63056k33874p16324o13823n8606N54381Q15697N31143j91j71170J79569
36799B3746M83042K58406j31800p1364K59276J49734m14578o23808j26640L53683
36789A59697J32439l61571k78075L14952N58784J27301l46028k85562M0717P6024
36779A38678j71655k87088j84948j83846l90470m69860j77470K18143L14656J82111
36769a011749K40738N59388O55225J82824m59948n60476k9301M58624L20274k52045
36759A03554o17093m53669Q38L24501L14605Q6762q3462m9410M4078o359j00027
36748d35682L5960L28068L56113L3828j46452J29897M20191J78308l50798m84316
36738F5117j35494J48271P9758q7237j50248j79272j13165J99790M85363K70628
$$ y = [-263056, -496930, -1213254, -1827077, -1885683, -1331302, -515605, 15538, 15347, -155823, 23746, 506788, 765194, 633394, 562030, 821306, 971040, 556462, -67346, -193986, 159697, 292136, -69435, -347510, -32558, 526226, 653527, 307499, 21937, 62654, 138678, -32977, -320065, -505013, -688859, -1079329, -1549189, -1726659, -1508516, -1193860, -1011749, -771011, -211623, 443602, 626426, 166478, -393998, -423299, 35325, 355599, 103554, -513539, -967208, -966370, -641869, -327264, -240502, -323964, -373374, -329296, -335655, -435682, -399722, -71654, 284459, 318287, 171835, 301732, 721923, 900231, 549433, 65117, -70377, 77894, 157652, 70415, -79833, -259105, -372270, -172480, 312883, 583511]
36728E83511k55494l77784k7594O7294k77391k39319N18959R34815J18659r88210
36718E7446q16569M51656J119674M76474l52123k97407K10372K76426k9687q3864
36708A012398J56093K64999J95459K43980L77179K54603j30759l65705j98288
36699A809959J85057M86854N74152M04003o700m46601o01909m17419j86059j45304
36689A656033j56679K211J55616j03681p01393r42846m06401L40336M31679o0529
36679B14346k49873J90731N66054L41619k4611J9209J27803k36798o78866m24212
36669a54598L23713O07960J84025k26508j60875O8119J97290M12866O91482O15394
36659B558868J47564j98501k42363l88755p15811o87790j61374K06645L6558j53150
$$ y = [583511, 328017, -49767, -77361, -10067, -287458, -526777, -7818, 926997, 1045656, 57446, -759123, -307467, 812207, 1288681, 936558, 639151, 849523, 1125949, 1096262, 1012398, 1168491, 1433490, 1628949, 1872929, 2250108, 2504711, 2373952, 2008247, 1809959, 1995016, 2481870, 3056022, 3460025, 3453325, 3006724, 2404815, 1987396, 1801337, 1656033, 1499354, 1501565, 1657181, 1553500, 852107, -90739, -497140, -156804, 274875, 214346, -35527, 155204, 721258, 1062877, 1038266, 1057475, 1185278, 948480, 269614, -154598, 169115, 777075, 961100, 734592, 573717, 641836, 839126, 1251992, 1943474, 2558868, 2706432, 2507931, 2265568, 1876813, 1161002, 473212, 311838, 518483, 555041, 401891]
36649D01891N5173K26939l9581l24203k04926n3976k30191k93634R4875L19399
36639d8234j21476m93899K4167P99028P17713J04199R9420N44314K33788q12804
36629A046216j151017k48811O70624O34200K21772J97139K67452L5922r4060R6381
36619A675818p6364q83121j222379k12700J115584J097214j53873r85414n83087
36610b28322K06800M11400J12743j32893j56021j10452j02008j25088p8395J47731
36600e4505L78890K24790k39809l12957L00505P98820L56014n60318q31205l08800
36590b48575J96502L16622L98237M45870O590p04882p44473R3518P98295O44173
36580A201877J94345J75508K69273j42688p46206p55576j72219K98559L32584
$$ y = [401891, 457064, 684003, 644422, 320219, 115293, 61317, -168874, -462508, -367633, -48234, -169710, -663609, -639442, 159586, 877299, 981498, 1080918, 1625232, 1859020, 1046216, -104801, -353612, 317012, 951212, 1172984, 1370123, 1637575, 1673497, 1579437, 1675818, 1599454, 716333, -506046, -718746, 396838, 1494052, 1340179, 354765, -228322, -21522, 389878, 502621, 369728, 213707, 103255, 1247, -123841, -202236, -54505, 324385, 549175, 309366, -3591, 296914, 1095734, 1451748, 891430, 60225, -248575, -52073, 264549, 662786, 1108656, 1115246, 410364, -334109, -240591, 557704, 1201877, 1396222, 1571730, 1841003, 1698315, 952109, 196533, 24314, 322873, 655457]
36571F55457K17630J74042J42224J44025K42610K19563j59009o34917p35928m76783
36561b11086k69459k21435p4087J92220K56596K0869k20885k57049j67466j3389
36551i65171K28696L80107K03139q5364J8103M63569N49786m0556o52564n43422
36541d43677Q0648M35839K55588o2701k10993k44726j51988J97054N37896K87327
36531F80267n26987r60919l27993O92644Q35749P824n56665q1915O42898N12125
36521I17028k12363l84511J70593L93120k60876q60179l86530O82853J014331
36512A073466K41983o92475r05372n13001j25698l3263j23986j91413r0841J58843
36502a201757L13512J55425j67144k83000o9096K59113M69718M69151K50668m460
$$ y = [655457, 873087, 1047129, 1189353, 1333378, 1575988, 1795551, 1636542, 1001625, 265697, -211086, -480545, -701980, -776067, -583847, -327251, -306382, -527267, -784316, -951782, -965171, -736475, -356368, -153229, -238593, -220490, 243079, 792865, 752309, 99745, -443677, -363029, 72810, 328398, 265697, 54704, -190022, -342010, -144956, 392940, 680267, 153280, -807639, -1135632, -442988, 392761, 400585, -156080, -237995, 404903, 917028, 704665, 320154, 490747, 883867, 622991, -237188, -623718, 59135, 1073466, 1315449, 622974, -282398, -795399, -921097, -954360, -1078346, -1269759, -1360600, -1201757, -888245, -732820, -899964, -1182964, -1252060, -992947, -523229, -54078, 196590, 192130]
36492A92130N5902M49789N99130R8407m99252l91689J48310J09627n67346p61194
36482e66186J3819P05266L44218m27986m27055K47381N85198L49379J73856K44501
36472A242391J04429k52410k49171J69415L57767J19634R955J76714k9690p75685
36462H73349j108015l70975N88765N73283k26285o47175l02468J38048K21482
36453b59991K16410K98707J92181j44653k81525q4097j9522l23276n03200j46742
36443a055708L32708L35560M0170O8929M42807N62050J78225k57206l31616k25219
36433I0700k91466m67241m01694L141M02770L40116k43401p76858n23524M88103
36423a379354J231640Q31163k28665o71423j57041L67810K08570j37088p2036
$$ y = [192130, 248032, 697821, 1296951, 1395358, 896106, 504417, 652727, 762354, 195008, -566186, -552367, 152899, 497117, 69131, -357924, -110543, 474655, 824034, 997890, 1242391, 1346820, 1094410, 845239, 1014654, 1372421, 1492055, 1502010, 1678724, 1649034, 873349, -234666, -605641, -16876, 556407, 330122, -317053, -619521, -481473, -259991, -43581, 255126, 447307, 302654, 21129, -62968, -82490, -405766, -908966, -1055708, -723000, -387440, -347270, -278341, 164466, 726516, 904741, 647535, 315919, 90700, -200766, -668007, -1069701, -1066560, -663790, -323674, -567075, -1343933, -1867457, -1379354, -147714, 683449, 454784, -216639, -373680, -5870, 202700, 65612, -6424]
36414f424J3985l85549p03745j37182P87025P83295j87550q04642m14216J23166
36404i31837J761l34281k06199J37361J70040N1461J09242R2591j95155k07266
36394a312282M41451R92624N61534l32991m64092J57304L36519l10584p34073
36385f64590j68138O55985O39434j16213n65935j47298O16841Q29445K38476m75243
36375H42764m65465K04255N97555K30902k13328m2913K27690k31290r50675p14174
36365e14679M28977J078049N75951j42037j92548L2641r0589k82753o4826K96238
36355A124424L47008K20529J36687j45593o65115p82996j53397N06276M26674
36346A014497o0294j99377j7983K7106J8639K40688L78728L4741l94043l11291
$$ y = [-6424, 7561, -377988, -1081733, -1218915, -431890, 351405, 163855, -640787, -1055003, -931837, -930076, -1264357, -1470556, -1333195, -1163155, -1111694, -1002452, -909861, -1105016, -1312282, -870831, 121793, 683327, 350336, -113756, 43548, 380067, 69483, -664590, -832728, -176743, 462691, 346478, -219457, -366755, 250086, 1079531, 1318007, 842764, 377299, 581554, 1179109, 1410011, 1196683, 1153770, 1381460, 1150170, 199495, -514679, -85702, 992347, 1568298, 1426261, 1233713, 1266354, 1175765, 893012, 828186, 1124424, 1471432, 1691961, 1828648, 1683055, 1017940, 234944, 81547, 587823, 1014497, 954203, 754826, 736843, 763949, 782588, 1023276, 1402004, 1436745, 1042702, 731411]
36336G31411L4648Q1122N4781M39768P74794K57379p02801q72653q2248N71211
36326A287412M63403J19744J242j18127k73223l1935M87053M61209k69265p40955
36316A386558l40091K57754K61274m6439k9884J80580R7468j99953l08983k15755
36306A042529j30242k1452J53248J78206p095q7745M5789N5582j32101p2984K79619
36295A303354K27098m65119q64629k39560O52760O92550J54838J21687O07152
36286B190131O25772n4183n90291n71247n59372q51389q72200k72715L62381M65411
36276a27702L17613L44757L19622n9004l94499j60536L48921L87499j18552m86005
36266C72114k76194J80022L34899Q9094k19787k35968R6038M67974M43758q3557
$$ y = [731411, 766059, 847181, 901962, 1341730, 2116524, 2373903, 1671102, 798449, 716201, 1287412, 1750815, 1870559, 1871801, 1753674, 1480451, 1448516, 1935569, 2396778, 2127513, 1386558, 1046467, 1304221, 1565495, 1519056, 1489172, 1669752, 1767220, 1567267, 1258284, 1042529, 912287, 890835, 1044083, 1222289, 1215194, 1127449, 1173238, 1228820, 1096719, 1023735, 1303354, 1530452, 1065333, 200704, -38856, 613904, 1306454, 1461292, 1582979, 2190131, 2815903, 2761720, 2171429, 1600182, 1040810, 189421, -682779, -955494, -593113, -127702, 189911, 534668, 854290, 795286, 400787, 240251, 589172, 976671, 858119, 372114, 95920, 275942, 610841, 699935, 480148, 244180, 340218, 808192, 1251950, 1168393]
36256A168393o66470p03103j10731N33511O15924J78787j42846R0591N47666N38135
36246B049857n2172n69485m74896p1560q779l13712m08580j8686M57277N74571
36236A163835L83249J66498K9485k9420K7744J08003l8557m20574o49150m47958
36226B93155o5400J11395R8451J29915J75734P2984l3692J22863L72773K52502
36216A530680k45606n73319m19714j20383m1111k5613J76836L45049J56942j43228
36206F40533m2930L71584M61221J1811m28845m02878j77205j70439k33927k2398
36196F527K67727J65521k28441l28958r982J96924R499j42587J03046L75292J91226
36185F05794j92025j77185J81296K76352l7826k33926j4809K45704K33698K44025
$$ y = [1168393, 501923, -201180, -311911, 221600, 837524, 1016311, 873465, 964056, 1511722, 2049857, 1997685, 1428200, 953304, 881744, 872965, 559253, 150673, 131987, 589264, 1163835, 1547084, 1713582, 1743067, 1713647, 1741391, 1849394, 1810837, 1390263, 741113, 293155, 227755, 339150, 437601, 567516, 743250, 816234, 782542, 905405, 1278178, 1530680, 1285074, 711755, 292041, 171658, 130547, 104934, 281770, 626819, 783761, 640533, 597603, 969187, 1430408, 1442219, 1013374, 610496, 433291, 262852, 28925, 6527, 274254, 439775, 211334, -117624, -127606, 69318, 78817, -63770, 39276, 414568, 605794, 413769, 236584, 417880, 694232, 656406, 422480, 407671, 653375, 887073, 1131098]
36175A131098N47238P20143K41456n46177p88592l57524p948j77454l57674l5095
36165C69471L86236K40329k41254k37579L01706M57037k75567j132695j094199
36156a226515k35779N11763O40093M62263L55176K50696m857k89784m25534m20756
36146c83234l09711k2875L98669O80874N84850J63216l20669n72125l80321J75354
36136A4028O20636N13505K1954k81413k32891k11145l65008l26802K4027J81676
36126d1433j06411k29958K92244P79618L31723n58451n40243M61948R54708J20171
36116A463916q66182n84747N05321Q16900k1856q09713o67005j23563r800k00207
36106d96936o2672M15930O49610L93318O2923N6587J80063j8590n28510p86004
$$ y = [1131098, 1678336, 2398479, 2639935, 2093758, 1305166, 947642, 939694, 762240, 404566, 369471, 755707, 996036, 754782, 517203, 818909, 1275946, 1000379, -132316, -1226515, -1462294, -950531, -310438, 151825, 507001, 757697, 752840, 463056, 37522, -383234, -692945, -715820, -317151, 363723, 948573, 1111789, 791120, 218995, -161326, 14028, 634664, 1148169, 1170123, 888710, 655819, 444674, 79666, -247136, -223109, -41433, -147844, -377802, -85558, 694060, 1025783, 467332, -72911, 389037, 1343745, 1463916, 597734, 12987, 518308, 1335208, 1313352, 503639, -163366, -286929, -296729, -496936, -559608, -143678, 505932, 899250, 962173, 1018760, 1198823, 1180233, 651723, -134281]
36096a34281l87048L12283N79646K57614m1121J49024M46884K48020k79314m41301
36086G10406j32179K7314k42462m29093j56129J54856N8921j10496J00540L32186
36076C13864J11n27631l55306M31554P43454J44793m85906l54303J16738J47655
36066A75023j88245l53953l30846l87920l25518J69699O97370N56585j34968n57542
36056f80315l82726o3348P0832J92470L47435K56463l0270l1142L22972M52382
36046D54753Q3725k51028j00301J87010J56811M8366K43542M29547Q1562n46039
36036G87948p05575k88146P3264J6783j18458J1966K21141J76303r2132k92615
36026b09521k17413J49699O34813Q89771O39705K3337m88459n90953m18681k78331
$$ y = [-134281, -521329, -209046, 370600, 628214, 587093, 736117, 1183001, 1431021, 1151707, 710406, 578227, 605541, 363079, -66014, -222143, -67287, -8366, -118862, -18322, 313864, 313975, -213656, -568962, -137408, 606046, 750839, 264933, -89370, 27368, 175023, -13222, -367175, -698021, -1085941, -1411459, -1241760, -544390, 12195, -122773, -680315, -1063041, -1126389, -1055557, -863087, -515652, -259189, -289459, -320601, 2371, 454753, 538478, 287450, 187149, 374159, 530970, 579336, 822878, 1252425, 1333987, 787948, 82373, -205773, -132509, -115726, -234184, -222218, -1077, 175226, 83094, -209521, -426934, -277235, 357578, 1247349, 1887054, 1910391, 1421932, 830979, 412298, 133967]
36016A33967k60907k03681K6497K79956K26570j93706n13552k11490N37337R56816
36006G77807O64936J54963o092j8124l84362r24396r22873k28647M12820L08111
35996a65857l25118o85968l39600L62067P17467M25723j21162l40466j73772l8879
35986f85565q1333N4937N06075P69240M38903r2815k32927j00286j77661l70153
35976B8415k05387K02857K56990o9157j45497K08580L77618m217m21972l05487
35966g7257J30609L25830J81506M599J20J59127L52597L14145j31466o71009p53926
35955a65125l70798o6804l7336J32594N57754O34953M5650m94142j86174O13690
35945F64262Q57600K38355n28452p30664l86294K1095J00723j32879k54605J18716
$$ y = [133967, -126940, -330621, -304124, -24168, 202402, 8696, -504856, -716346, -179009, 777807, 1442743, 1597706, 1591614, 1573490, 1189128, 264732, -658141, -886788, -473968, -165857, -490975, -1176943, -1516543, -1154476, -437009, -11286, -132448, -472914, -646686, -685565, -766898, -711961, -205886, 563354, 1002257, 909442, 676515, 576229, 398568, 28415, -176972, 25885, 282875, 213718, 68221, 276801, 654419, 650202, 228230, -77257, 53352, 379182, 560688, 565287, 565407, 724534, 1077131, 1391276, 1259810, 588801, -165125, -535923, -602727, -640063, -507469, 50285, 685238, 730888, 236746, 50572, 664262, 1521862, 1760217, 1231765, 501101, 114807, 135902, 236625, 103746, -150859, -32143]
35935c2143P09800P66295J03162n23526m70702j05664r8510l29714k40079J07306
35925a13775J62570j00035j50471J38529K69816m4385m65170n69309k99259J88690
35915i82799O53839P44826L24538j91810k86696n7476R176j48909j69196K7949
35905g6558J74783K19892K83169J51608l97814q50795m67821M03883N74336j85902
35895a71219o69465m3716Q83028R25818K16062k35894q9378J02820q8051m67949
35885C62056o13876l04312K78634N48122R4011n71891m82095L34707P19449J37140
35875E01945m33821q9811N46032M88615P2593J69723M87348J64039m72399m03692
35865A030572J33420k4039p72274p74314J05968L97494l73987o85599L62748J307580
$$ y = [-32143, 677657, 1443952, 1547114, 1023588, 552886, 447222, 348712, 18998, -221081, -113775, 48795, -51240, -201711, -63182, 206634, 162249, -302921, -872230, -1171489, -982799, -328960, 415866, 740404, 548594, 261898, 204422, 213598, 64689, -104507, -76558, 98225, 318117, 601286, 752894, 355080, -495715, -963536, -559653, 14683, -171219, -840684, -884400, -1372, 924446, 1140508, 904614, 815236, 918056, 830005, 362056, -251820, -556132, -277498, 270624, 364635, -207256, -689351, -354644, 364805, 501945, 68124, -21687, 524345, 1012960, 1085553, 1255276, 1742624, 1906663, 1434264, 1030572, 1163992, 1139953, 367679, -406635, -300667, 96827, -277160, -962759, -600011, 707569]
35855G07569O59686n88310n81418M32867P35534M029m93389k73223k02241n71305
35845a70201m61173M66552J108435N94468l72148o46011k01237K00262J97344
35836G16291l2913l07892m82959l37928R3488L93667L03662O5654k2496r889m3912
35825C34773j32486l02330n28124m44395K35950R41111P18817k75951p43094j33570
35815c29299M54421O555p73577o16961K82458O56788J63497k97846j59777J30029
35805d83712J44464J52000M18701O21443L55460k70834q12087r05653m43205L07954
35795i15469P67801N97980J01753k71465n30510p67218o11804J57179Q19753N31433
35785a20567k65573l78217K35174L79083l49307q03483j41450P88454P81384L7166
$$ y = [707569, 1367255, 778945, 197527, 630394, 1365928, 1369957, 876568, 603345, 401104, -170201, -631374, -164822, 943613, 1538081, 1165933, 519922, 318685, 518947, 716291, 683378, 375486, -107473, -445401, -351913, 41754, 345416, 411070, 388574, 378685, 334773, 202287, -100043, -628167, -1072562, -836612, 104499, 823316, 547365, -195729, -329299, 125122, 131677, -641900, -1258861, -976403, -319615, -156118, -453964, -613741, -483712, -339248, -187248, 231453, 852896, 1208356, 937522, 125435, -780218, -1223423, -915469, -147668, 450312, 552065, 280600, -249910, -1017128, -1628932, -1471753, -652000, -120567, -386140, -764357, -529183, -150100, -499407, -1302890, -1444340, -655886, 125498, 162664]
35775A62664l98161k44816k3499M4533J77926L34963K43851M620n1447J5105r8348
35764A67391k93471k04462R8556J38555k11593m92996k67160L59679Q59016P62053
35754I15568J13859m62721m05774J7269K0906m93800p00091j50212M30453K70836
35744d43707k12427j55926L07452L50081j14091l46521n5699K40669K01628J14204
35734a14337J80626J49420r5857k56897j83790j31781k28746k30857k6834J26582
35724h12471Q8484P8705K38199L91937M30698M85835N44276L35160j83715o15641
35714I81467o12598k58820J62249M59931N10559K89444O436j15506j95839m55378
35704G71945o83351m46062J75422N95736N18812J91537j51222m87069o07583k21224
$$ y = [162664, -235497, -480313, -503812, -459279, -281353, 53610, 297461, 302081, 250634, 265739, 167391, -126080, -330542, -231986, -93431, -305024, -798020, -1065180, -705501, 153515, 915568, 1029427, 566706, 160932, 178201, 199107, -294693, -994784, -1144996, -714543, -443707, -656134, -812060, -504608, -154527, -268618, -615139, -670838, -430169, -228541, -114337, 66289, 215709, 119852, -137045, -320835, -452616, -681362, -912219, -939053, -812471, -723987, -645282, -407083, -15146, 415552, 901387, 1445663, 1780823, 1597108, 981467, 368869, 110049, 272298, 732229, 1242788, 1532232, 1538668, 1423162, 1227323, 771945, 88594, -357468, -182046, 413690, 932502, 1124039, 972817, 485748, -121835, -343059]
35694c43059L86784N03118L5229k81151k0588K92096Q6139l70730n00868k88528
35684e01558r3602k4056J5410P707k4985R8896L39816L30357k0396k66224j23871
35673b62506N7937o1066k14083n7725J74154R0874j81460k75634j68784p960K53135
35662f53118N57865N31477R5389j74208J01060L82344M5999n36341n72211j23792
35652c45536R3868o5606r7619J32749K04637j3621j56241n5107P9830J87672L52118
35641C17144L06318k68815r46453q99051j31803M69536M48915K55363K21914L6951
35631a89981l97475n20998o7637L61296K83516J26261L37365M50520p7351o94160
35621c88644m73109L38631O08158P3761l03334N7936M61663J53940m29336m11640
$$ y = [-343059, 43725, 546843, 582072, 300921, 280333, 572429, 658568, 287838, -213030, -501558, -595160, -619216, -603806, -596099, -621084, -522188, -182372, 147985, 127589, -138635, -262506, -204569, -265635, -479718, -537443, -363289, -272415, -453875, -729509, -898293, -906253, -653118, -95253, 436224, 531613, 357405, 458465, 840809, 886808, 350467, -221744, -345536, -251668, -317274, -414893, -282144, -77507, -91128, -247369, -302476, -222646, -34974, 317144, 623462, 354647, -591806, -1490857, -1622660, -1153124, -704209, -448846, -226932, -189981, -587456, -1108454, -1176091, -814795, -531279, -405018, -67653, 382867, 305516, -388644, -861753, -523122, 85036, 158797, -144537, -86601, 375062, 529002, 99666, -311974]
35611c11974R6201K50603p9147j31067L44851M94081k61151j032625n95948O90771
35601e35405J219836M10387m93689l33852L09325K11823n21561p17464l2271N81810
35591I8939L83708j77216l01647R4687N51475P48795O29687K30690k62069n39474
35581A457575m78688k34370M4276L16233M54480L02185k9276k50452k81674k14240
35571A086049K015L62229M42282j22785q55616q85974k27176K18378N4455j36377
35561f2520J7292M2255l12464l94383K05077P23018L90146k32849j79916K55313
35551D50969L9743p48812r38758j41893O36811N45842k348j85409R9157M20787
35541A76089M90378K33603k82486o63506m32295K55690O57425M51851J08223l4054
$$ y = [-311974, -215773, 34830, -44317, -175384, 169467, 663548, 402397, -630228, -1226176, -535405, 684431, 1094818, 601129, 267277, 576602, 788425, 266864, -450600, -482871, 98939, 482647, 305431, 3784, 98471, 649946, 1398741, 2028428, 2259118, 1997049, 1457575, 978887, 744517, 788793, 1105026, 1559506, 1861691, 1832415, 1581963, 1300289, 1086049, 1088064, 1450293, 1892575, 1769790, 914174, 28200, -198976, 19402, 73857, -62520, -45228, -2973, -315437, -709820, -504743, 218275, 608421, 375572, 195656, 450969, 490712, -258100, -1196858, -1338751, -701940, -156098, -158446, -343855, -244698, 176089, 666467, 900070, 617584, -45922, -478217, -222527, 434898, 886749, 994972, 960918]
35531I60918l09130q46961r23835k6205R83986Q15418l48891r78591l34607N61718
35521d46180N24385j42666l43292P1543K47703j64889m40637L5127P82914R36059
35511A060067M39597l3197q7378N0502Q1433k2671k21430m53382m49234o883M82039
35500H39463L61635k69329n19016m984M96448K49502k49238j00242M53526L63365
35490A621130m91201j016926n47860K30283M14360Q5491j82994k85814l63262
35481e36793k07527L14545O66995L14492k97653l09497J87869L15622r2533k24983
35471A30537K38590M83770o2837o82492m97463J09725J92079j91906k09776K44097
35461b45676M47282J98649J04535L38151K36421m61297r80805o81706k482L72959
$$ y = [960918, 651788, -195173, -1119008, -1145213, -161227, 654191, 305300, -673291, -1007898, -446180, 78205, -64461, -407753, -336210, -88507, -253396, -694033, -658906, 124008, 1060067, 1499664, 1466467, 1379089, 1429591, 1511024, 1488353, 1266923, 813541, 364307, 357424, 839463, 1201098, 931769, 412753, 407769, 904217, 1153719, 904481, 804239, 1257765, 1621130, 1129929, 113003, -434857, -204574, 209786, 295277, 112283, -173531, -536793, -744320, -429775, 237220, 551712, 254059, -55438, 132431, 448053, 355520, 130537, 369127, 852897, 790060, 107568, -389895, -280170, -88091, -279997, -489773, -245676, 201606, 400255, 504790, 842941, 1079362, 618065, -362740, -1044446, -1046928, -673969]
35451f73969N00672O50423N57474J2130m49269l08176L6612n211j67619M1783
35441A94850K63262l5641l49424P7935O93894L78261n28844o31560J44199M30556
35431F37488j13104k21931M95646N97211n93040j410931m54710R15734O22741
35422D75104q37984j292589k76490O65828O84648M90011N28792K94687k46844
35413D85163l03689K15675L52584k20576n76941j52051L35431K26367k6456J25275
35403D60782L40331K01094O3483K88546M46694J00546l20081k27254J22908J05944
35393A582993k45724l82192p3765M06574O41555L09761n08433j083706p10216
35384f3153K05430N19357J6844l02049N6703K88280j53563m85627l5547M50828
$$ y = [-673969, -173297, 477126, 1034600, 1046730, 597461, 289285, 325897, 320686, 153067, 194850, 458112, 422471, 73047, 150982, 844876, 1223137, 694293, 62733, 206932, 637488, 524384, 302453, 798099, 1395310, 802270, -608661, -1063371, -147637, 475104, -362880, -1655469, -1931959, -1266131, -581483, -91472, 437320, 732007, 485163, 181474, 397149, 749733, 529157, -47784, -199835, 135596, 361963, 335507, 460782, 801113, 1002207, 1065690, 1354236, 1800930, 1901476, 1581395, 1354141, 1477049, 1582993, 1337269, 955077, 881312, 1287886, 1929441, 2239202, 1730769, 647063, -63153, 142277, 661634, 678478, 376429, 433132, 721412, 567849, 82222, 46675, 497503]
35374D97503J56038k46614J57535O47213j4012j213460j196036Q6299Q16363J81355
35364a27816n17494j99181K95227j85546j135876j243675l77265M16570M71521
35355b603535J40107N4390L89614Q08256Q22435L29842j55118j18618J76566R2989
35345f3072k79631k51616J66516J29179n20580o96332K53924J282447J034338
35336A055173j87883r30458o20821p769K07144J15347k7902k35614m10547k70893
35326a314223J33584L98764L91573L61141L43122N9728m15694n10485J2806N78048
35316C8364N47537Q0900j82649n2666N2890j96670n86199o86632l95269K7378
35306a353016L48597N65517O65975M38997j87644p42910n96568J53283O37616
$$ y = [497503, 653541, 406927, 564462, 1211675, 1197663, -15797, -1211833, -1125534, -309171, -127816, -645310, -844491, -549264, -734810, -1870686, -3114361, -3491626, -3075056, -2603535, -2463428, -2409038, -2019424, -1211168, -388733, -58891, -214009, -332627, -156061, -63072, -342703, -594319, -427803, -298624, -819204, -1515536, -1261612, 20835, 1055173, 867290, -63168, -683989, -691758, -484614, -369267, -397169, -632783, -1043330, -1314223, -1180639, -781875, -390302, -29161, 313961, 373689, -42005, -552490, -539684, 38364, 585901, 666801, 484152, 431486, 484376, 287706, -298493, -985125, -1380394, -1353016, -1004419, -438902, 227073, 666070, 478426, -264484, -861052, -707769, -70153]
35297g0153L17177l13980m99908k56732q9280n1202J76515M64936L28256j45196
35287a39567k75227J11425L47860J9516l41921j34291L65660N11362K65796M5077
35277G75690o4850k86348n56698n66656k95163j957K16661M02166L89775N78m79621
35266d66423n12516j9811N18656O72645M15288m6826m05198l19910K00656N90732
35256F27293L50802k53778o11244o66627p52319p25270j57611O36829P62404J27558
35246f61963l11840m0359K73914K9084l03202j34234J67889L8127k06009k3305
35236a171898K49149K3133l27571m2805O02136O70688J48442r6398J38852J65397
35226C59125j93156k74446P8663J26552l67202n65271q918M88403J89504l20487
$$ y = [-70153, 247024, -66956, -566864, -823596, -912876, -964078, -787563, -322627, 5629, -139567, -414794, -303369, 44491, 64007, -277914, -412205, -46545, 464817, 730613, 775690, 710840, 424492, -132206, -698862, -994025, -995982, -779321, -377155, 12620, 13198, -466423, -978939, -998750, -480094, 192551, 607839, 561013, 155815, -164095, 36561, 627293, 978095, 724317, 113073, -553554, -1305873, -2031143, -2188754, -1551925, -789521, -661963, -973803, -1014162, -740248, -711164, -1014366, -1148600, -980711, -942584, -1148593, -1171898, -922749, -899616, -1227187, -1269992, -667856, 2832, 151274, 54876, 193728, 359125, 165969, -108477, -29814, 96738, -270464, -835735, -844653, -356250, -166746, -487233]
35216d87233j67834L56222M11922N6741j1934K50376K77184J9882J6484L44964
35206A066774M06131r9948o82810p54050l15051K02703M15507K21664j51981l20144
35196a1205j69886k3474j60271l77525l06169M8450L76505M59387K44835j75705
35186i5058m15815m3605O81368Q32307M8705p88899p18009K305M63612M47153
35176D14064L06344N086o25733r91211l35609Q27135J126611K90599n14065n08410
35166e189k31061k54720k31342J25292K33119l10049p70837l37581N35049Q01020
35156d46299L50732o3476p2751L0751M6858Q4372J21093J5782j16239q2473k7508
35145a59158j66795l17658k17581n1639q5155o2318L40555P23628M42611k64650
$$ y = [-487233, -655067, -298845, 113077, 169818, 157884, 408260, 685444, 705326, 721810, 1066774, 1472905, 1372957, 690147, -63903, -378954, -176251, 239256, 460920, 308939, -11205, -181091, -204565, -364836, -742361, -1048530, -1000080, -623575, -164188, 80647, -95058, -510873, -554478, 126890, 959197, 1007902, 219003, -499006, -496701, -33089, 414064, 720408, 725494, 99761, -891450, -1227059, -399924, 726687, 1017286, 503221, -5189, -236250, -490970, -722312, -597020, -363901, -673950, -1444787, -1782368, -1247319, -446299, -95567, -159043, -231794, -201043, -154185, -69813, 51280, 67062, -49177, -131650, -159158, -325953, -643611, -861192, -912831, -997986, -1060304, -719749, 3879, 446490, 181840]
35135A81840n22044j80593K896k81179l43621K66747Q44801N32954l58100p95136
35125f51435m38877J18966L55638L41461K64581Q7420j35908j14365K10837M11787
$$ y = [181840, -340204, -520797, -517901, -799080, -1142701, -875954, -31153, 501801, 143701, -651435, -1090312, -971346, -615708, -274247, -9666, 77754, -58154, -172519, 38318, 450105]
$$ [...]
##END NTUPLES=NMR SPECTRUM
##END=
