##TITLE=31Pdec_LR-733-CR4A
 CDCl3, 24 sc
 3.03.2021
##JCAMPDX= 6.0         $$ Bruker NMR JCAMP-DX V2.0
##DATA TYPE= NMR SPECTRUM
##DATA CLASS= NTUPLES
##ORIGIN= UXNMR, Bruker Analytische Messtechnik GmbH
##OWNER= root
$$ XWIN-NMR		Version 3.5
$$ Wed Mar  3 13:30:44 2021 Russian Standard Time (UT+4h)  she@DPX200
##.OBSERVE FREQUENCY= 81.013821
##.OBSERVE NUCLEUS= ^31P
##.ACQUISITION MODE= SIMULTANEOUS
##.ACQUISITION SCHEME= undefined
##.AVERAGES= 24
##.DIGITISER RES= 16
##SPECTROMETER/DATA SYSTEM= spect
##.PULSE SEQUENCE= zgpg30
##.SOLVENT NAME= CDCl3
##.SHIFT REFERENCE= (INTERNAL, CDCl3, 0, 248.564)
##AUDIT TRAIL= $$ (NUMBER, WHEN, WHO, WHERE, WHAT)
$$ ##TITLE= Audit trail, XWIN-NMR		Version 3.5
$$ ##JCAMPDX= 5.01
$$ ##ORIGIN= Bruker BioSpin GmbH
$$ ##OWNER= she
$$ F:/spectra/data/she/nmr/P31/1/pdata/1/auditp.txt
$$ ##AUDIT TRAIL=  $$ (NUMBER, WHEN, WHO, WHERE, WHAT)
(   1,<2021-03-03 13:29:38.79 +0400>,<she>,<DPX200>,
      <created by zg, POWCHK disabled, PULCHK disabled
       configuration hash MD5:
       00 E9 B6 7A A2 85 ED C7 34 08 36 98 17 FE 4E 26
       data hash MD5: 32K
       BD 14 38 CA D9 FC ED A8 96 66 51 DE 95 D2 8C D7>)
(   2,<2021-03-03 13:29:40.76 +0400>,<she>,<DPX200>,
      <Start of raw data processing
       efp BC_mod = 2 LB = 1 FT_mod = 6 PKNL = 1 PHC0 = -3169.017 PHC1 = 427.001 SI = 64K 
       data hash MD5: 64K
       A8 C7 5C BA BF 12 F9 58 4C ED 8D 1D 25 C3 54 AD>)
(   3,<2021-03-03 13:30:10.89 +0400>,<she>,<DPX200>,
      <pk PHC0 = 47.98568 PHC1 = 0 
       data hash MD5: 64K
       73 75 6C 24 46 00 6D B9 17 F0 73 BB AE 35 67 AC>)
(   4,<2021-03-03 13:30:13.71 +0400>,<she>,<DPX200>,
      <abs ABSG = 5 
       data hash MD5: 64K
       2E A4 C2 0A E3 22 A8 8C 2C C9 10 29 5F ED 51 79>)
$$ ##END=
$$ 
$$ hash MD5
$$ 12 69 3E 6C DA 6D 19 AD 8E 07 77 9D 48 B4 BB 5E
##$RELAX= 
##$RELAX= 
##$RELAX= 
##$RELAX= 
##$RELAX= 
##$RELAX= 
##$RELAX= 
##$RELAX= 
$$ Bruker specific parameters
$$ --------------------------
##$DU= <F:/spectra>
##$EXPNO= 1
##$NAME= <P31>
##$PROCNO= 1
##$TYPE= <nmr>
##$USER= <she>
##$AMP= (0..31)
100 100 100 100 100 100 100 100 100 100 100 100 100 100 100 100 100 100 
100 100 100 100 100 100 100 100 100 100 100 100 100 100 
##$AQSEQ= 0
##$AQ_mod= 1
##$AUNM= <au_zg>
##$AUTOPOS= <>
##$BF1= 81.014009
##$BF2= 200.13
##$BF3= 200.13
##$BF4= 200.13
##$BF5= 200.13
##$BF6= 200.13
##$BF7= 200.13
##$BF8= 200.13
##$BYTORDA= 1
##$CFDGTYP= 0
##$CFRGTYP= 5
##$CHEMSTR= <none>
##$CNST= (0..31)
1 1 145 1 1 1 1 1 1 1 1 1 1 1 1 1 1 1 1 1 1 1 1 1 1 1 1 1 1 1 1 1 
##$CPDPRG= <waltz16>
##$CPDPRG1= <>
##$CPDPRG2= <waltz16>
##$CPDPRG3= <>
##$CPDPRG4= <mlev>
##$CPDPRG5= <mlev>
##$CPDPRG6= <mlev>
##$CPDPRG7= <mlev>
##$CPDPRG8= <mlev>
##$CPDPRGB= <>
##$CPDPRGT= <>
##$D= (0..31)
0 1 0 0 0 0 0 0 0 0 0 0.03 2e-05 3e-06 0 0 0 0 0 0 0 0 0 0 0 0 0 0 0 0 
0 0 
##$DATE= 1614763777
##$DBL= (0..7)
120 120 120 11 120 120 24 19 
##$DBP= (0..7)
150 150 150 150 150 150 150 150 
##$DBP07= 0
##$DBPNAM0= <>
##$DBPNAM1= <>
##$DBPNAM2= <>
$$ [...]
##$SUBNAM3= <"">
##$SUBNAM4= <"">
##$SUBNAM5= <"">
##$SUBNAM6= <"">
##$SUBNAM7= <"">
##$SUBNAM8= <"">
##$SUBNAM9= <"">
##$SW= 501.771253377433
##$SWIBOX= (0..15)
0 1 3 0 0 0 0 0 0 0 0 0 0 0 0 0 
##$SW_h= 40650.406504065
##$TD= 32768
##$TD0= 1
##$TE= 0
##$TE2= 300
##$TE3= 300
##$TEG= 300
##$TL= (0..7)
0 120 53 12 22 120 120 120 
##$TP= (0..7)
150 150 150 150 150 150 150 150 
##$TP07= 0
##$TPNAME0= <>
##$TPNAME1= <>
##$TPNAME2= <>
##$TPNAME3= <>
##$TPNAME4= <>
##$TPNAME5= <>
##$TPNAME6= <>
##$TPNAME7= <>
##$TPOAL= (0..7)
0.5 0.5 0.5 0.5 0.5 0.5 0.5 0.5 
##$TPOFFS= (0..7)
0 0 0 0 0 0 0 0 
##$TUNHIN= 0
##$TUNHOUT= 0
##$TUNXOUT= 0
##$USERA1= <user>
##$USERA2= <user>
##$USERA3= <user>
##$USERA4= <user>
##$USERA5= <user>
##$V9= 5
##$VALIST= <valist>
##$VCLIST= <CCCCCCCCCCCCCCC>
##$VD= 0
##$VDLIST= <DDDDDDDDDDDDDDD>
##$VPLIST= <PPPPPPPPPPPPPPP>
##$VTLIST= <TTTTTTTTTTTTTTT>
##$WBST= 1024
##$WBSW= 4
##$XGAIN= (0..3)
0 0 0 0 
##$XL= 0
##$YL= 0
##$YMAX_a= 19316
##$YMIN_a= -19564
##$ZGOPTNS= <>
##$ZL1= 120
##$ZL2= 120
##$ZL3= 120
##$ZL4= 120
##$ABSF1= 248.5645
##$ABSF2= -253.2056
##$ABSG= 5
##$ABSL= 3
##$ALPHA= 0
##$AQORDER= 0
##$ASSFAC= 0
##$ASSFACI= 0
##$ASSFACX= 0
##$ASSWID= 0
##$AUNMP= <proc_1d>
##$AZFE= 0.1
##$AZFW= 0.5
##$BCFW= 0
##$BC_mod= 2
##$BYTORDP= 0
##$COROFFS= 0
##$CY= -3
##$DATMOD= 1
##$DC= 0
##$DFILT= <>
##$DTYPP= 0
##$F1P= 0
##$F2P= 0
##$FCOR= 1
##$FTSIZE= 65536
##$FT_mod= 6
##$GAMMA= 0
##$GB= 0
##$INTBC= 1
##$INTSCL= 5.30512e-09
##$ISEN= 30
##$LB= 1
##$LEV0= 0
##$LPBIN= 0
##$MAXI= 10000
##$MC2= 0
##$MEAN= 0
##$ME_mod= 0
##$MI= 50
##$NCOEF= 0
##$NC_proc= -4
##$NLEV= 6
##$NOISF1= 182.463
##$NOISF2= 159.3651
##$NSP= 0
##$NTH_PI= 0
##$NZP= 0
##$OFFSET= 248.5645
##$PC= 4
##$PHC0= -3121.031
##$PHC1= 427.001
##$PH_mod= 1
##$PKNL= yes
##$PPARMOD= 0
##$PSCAL= 0
##$PSIGN= 0
##$REVERSE= no
##$SF= 81.014009
##$SI= 65536
##$SIGF1= 159.3651
##$SIGF2= -187.1042
##$SINO= 113.3802
##$SIOLD= 16384
##$SREGLST= <1H.CDCl3>
##$SSB= 0
##$STSI= 65536
##$STSR= 0
##$SW_p= 40650.406504065
##$SYMM= 0
##$S_DEV= 0
##$TDeff= 32768
##$TDoff= 0
##$TI= <>
##$TILT= no
##$TM1= 0
##$TM2= 0
##$TOPLEV= 0
##$USERP1= <user>
##$USERP2= <user>
##$USERP3= <user>
##$USERP4= <user>
##$USERP5= <user>
##$WDW= 1
##$XDIM= 65536
##$YMAX_p= 333585516
##$YMIN_p= -28024425
$$ End of Bruker specific parameters
$$ ---------------------------------
##NTUPLES= NMR SPECTRUM
##VAR_NAME=  FREQUENCY,     SPECTRUM/REAL,   SPECTRUM/IMAG
##SYMBOL=    X,             R,               I
##VAR_TYPE=  INDEPENDENT,   DEPENDENT,       DEPENDENT
##VAR_FORM=  AFFN,          ASDF,            ASDF
##VAR_DIM=   65536,         65536,           65536
##UNITS=     HZ,            ARBITRARY UNITS, ARBITRARY UNITS
##FACTOR=    0.620285442955139, 1,           1
##FIRST=     20137.2065510759, 0,            0
##LAST=      -20513.1999529892, 0,           0
##MIN=       -20513.1999529892, -28024425,   0
##MAX=       20137.2065510759, 333585516,    0
$$ Real data points
##PAGE= N=1
##DATA TABLE= (X++(R..R)), XYDATA
$$ [...]
40937B62387J23929l23283l88220j56315K17207N54931M95681L127k75532P4785
$$ 262387 386316 63033 -325187 -481502 -264295 290636 786317 789444 513912 588697
40927E88697L78470j22992q29122n67760M19336O97292r5225o75139k06583M31535
$$ 588697 967167 844175 15053 -552707 -133371 563921 468696 -206443 -413026 18509
40917A8509J87018n16679o05786j0909M65838M33795K09997J03902P2611k4332
$$ 18509 205527 -311152 -916938 -927847 -462009 -28214 181783 285685 358296 333964
40907C33964k15821l50489j36991M32976P44584K37721n75749n97339K07213O21805
$$ 333964 118143 -232346 -369337 63639 808223 1045944 470195 -127144 80069 701874
40897G01874O896p37625o54244j56216j00594l01300m7161N06519O10588K36603
$$ 701874 708770 -28855 -683099 -839315 -939909 -1241209 -1288370 -781851 -171263 65340
40887F5340L6270J63673J39351j54094k57036k050J74375l5193l44276l13872
$$ 65340 101610 265283 404634 250540 -6496 -8546 165829 130636 -213640 -527512
40877e27512J23063O36520P38453J66653p03057j066003o07521J09833M74151
$$ -527512 -404449 232071 970524 1137177 434120 -631883 -1239404 -1129571 -655420
40868f55420N42202N11950J38963o05526r06007j11091J020863J144711J98441
$$ -655420 -113218 398732 537695 -67831 -973838 -1084929 -64066 1080645 1279086
40859A279086o00799n41588j22944P1692J17984J39850m7665l37765k44466K16992
$$ 1279086 678287 136699 13755 85447 203431 343281 295616 -42149 -286615 -69623
40849f9623L78223L2124j32369K89997O11155J06397p53176r25709k73776L60050
$$ -69623 308600 340724 208355 498352 1109507 1215904 462728 -462981 -736757 -376707
40839c76707L73409R046k37872k29938q1080J33918L43169L68562P6951l76259
$$ -376707 -3298 5748 -232124 -462062 -543142 -409224 -66055 302507 379458 3199
40829C199n87962l00909K51917N38918L30199n9591k32000j80975j15979n7223
$$ 3199 -584763 -885672 -633755 -94837 235362 175771 -56229 -237204 -353183 -410406
40819d10406R5705K77852L44215K75959N4129l97027q40105o92859J59804R13759
$$ -410406 -314701 -36849 307366 583325 637454 240427 -599678 -1292537 -1132733 -218974
40809b18974Q20037K53866P4299K53465Q1108m55573n91372j43034J46463j11151
$$ -218974 601063 854929 929228 1182693 1263801 808228 216856 73822 220285 109134
40799A09134l58032j83105k1629k13787k72785K06641O75709M61821j30555l68024
$$ 109134 -248898 -432003 -453632 -667419 -940204 -733563 -57854 403967 273412 -94612
40789i4612k60953l36374n68971m14851J98027O78227O09254K04388j26514k09987
$$ -94612 -355565 -691939 -1260910 -1675761 -1477734 -799507 -190253 14135 -112379 -322366
40779c22366p3573J45669K18657K3508k70740l93183k55016P3502M56201O22887
$$ -322366 -395939 -250270 -31613 -8105 -278845 -672028 -927044 -853542 -397341 225546
40769B25546L27200k08970l67168O1694N14650M43814O5303j16496j30851l09761
$$ 225546 552746 343776 -23392 38302 552952 996766 1062069 945573 814722 504961
40759E04961n38528m03471M7714L27616K64225J70976K41689K89857J55378p7767
$$ 504961 -33567 -437038 -389324 -61708 202517 373493 615182 905039 1060417 982650
40749I82650l39276o42153q30548o44260j25247L54342N15589L51260m9736m80479
$$ 982650 643374 1221 -829327 -1473587 -1598834 -1244492 -728903 -377643 -427379 -907858
40739i07858n01974J29883Q79634Q38369q6348r02561p67682l9601L30096J03795
$$ -907858 -1409832 -1279949 -400315 438054 351706 -550855 -1318537 -1358138 -1028042 -924247
40729i24247r8201J64681N48137N02965N2078l05042k78455p8943l5435j61444
$$ -924247 -1022448 -857767 -309630 193335 245413 -59629 -338084 -417027 -452462 -613906
40719f13906k13446m9470K16983L79553L37666J48798k3293l7204O5576R1344
$$ -613906 -827352 -876822 -659839 -280286 57380 206178 182885 145681 211257 302601
40709C02601j7055n8538O9030P2089l16488p33132n22428K57484P43143M27177
$$ 302601 285546 227008 296038 368127 51639 -681493 -1203921 -946437 -203294 223883
40699B23883j46494k62949r8304k82301p43637p51924n3582P22822R15919N50077
$$ 223883 77389 -185560 -283864 -566165 -1309802 -2061726 -2115308 -1392486 -476567 73510
40689G3510O3200k10890j27879K53021N36416K68411m33035q86368o96010k14419
$$ 73510 136710 -74180 -202059 50962 587378 855789 422754 -463614 -1159624 -1374043
40679a374043P7782K10321L83479M31362J59034j03940O8335L84874J67790m97718
$$ -1374043 -1296261 -1085940 -702461 -271099 -112065 -216005 -147670 237204 404994 -92724
40669i2724p01074l4687P08298O11105j38328o67271o65389n36303n18803l85320
$$ -92724 -793798 -828485 -120187 490918 352590 -314681 -980070 -1516373 -2035176 -2420496
40659b420496l2576K67071L42121L29785K82831R0312p4099J77957O91701P25528
$$ -2420496 -2453072 -2186001 -1843880 -1514095 -1231264 -1140952 -1215051 -1037094 -345393 380135
40649C80135O0212m87568k31041K93493J66509m30115n11130J33869O55646M78632
$$ 380135 440347 -47221 -278262 15231 181740 -248375 -759505 -625636 30010 508642
40639E08642k0211l59397n79491o79118k90170N39948R69674M48370l66288m97845
$$ 508642 488431 129034 -450457 -1129575 -1419745 -879797 89877 538247 171959 -325886
40629c25886k9035J98909l2749j29820J73245L56713K4118m36961m84213k18615
$$ -325886 -354921 -156012 -188761 -318581 -145336 211377 235495 -201466 -685679 -904294
40619i04294j22402l02459m15533k15978J60889M32971M57755K90674J17110J16463
$$ -904294 -1026696 -1329155 -1744688 -1960666 -1799777 -1366806 -909051 -618377 -501267 -384804
40609c84804K75834L65042K03283r0642k38040j57816l7337m6941j44639k07080
$$ -384804 -108970 256072 459355 368713 130673 -27143 -64480 -111421 -256060 -463140
40599d63140j92774r1716J24565L66789L94053J15148j87096j73597P6465J83107
$$ -463140 -655914 -747630 -623065 -256276 137777 252925 65829 -107768 -31303 151804
40589A51804L0405j07268n2551N182j14175k29181n9681L33033N85422M32243
$$ 151804 182209 74941 22390 27572 -86603 -315784 -375465 -42432 542990 975233
40579I75233l6369m32013l80124O1500L49792Q3667m00571m50342l5999K72994
$$ 975233 938864 506851 126727 188227 538019 621686 221115 -229227 -265226 7768
40569G768K60214K92956M66793L23582k41410n96567l78677r6357j65339j81235
$$ 7768 267982 560938 1027731 1351313 1109903 513336 134659 38302 -127037 -308272
40559c08272J32047J54537m84053q64142j24890Q71482O96935l27923o17939J28642
$$ -308272 -176225 -21688 -505741 -1369883 -1494773 -623291 73644 -254279 -872218 -743576
40549g43576O24546K88865M7667M33960N87791j17024q85798q15845k37598R8807
$$ -743576 -119030 169835 217502 651462 1239253 1122229 236431 -579414 -817012 -718205
40539g18205J71223K34093J51295p9826k7271K90874J76811m42560n78578J67258
$$ -718205 -546982 -312889 -161594 -241420 -268691 22183 198994 -243566 -822144 -654886
40529f54886O93201J44041n90419l65682K78256J46059m75433l67231M38218P18337
$$ -654886 38315 182356 -408063 -773745 -495489 -349430 -824863 -1192094 -753876 -35539
40519c5539J42182k92254m607L72297K18597j95438l85718k87201N8222O38449
$$ -35539 106643 -185611 -190218 182079 400676 205238 -180480 -467681 -409459 228990
40509B28990J069971Q03947l0605o19629m97932o0891Q4360j88134n50993n67508
$$ 228990 1298961 2102908 2072303 1452674 954742 893851 978211 790077 239084 -328424
40499c28424n3913N80819N86251j52370p49450m42346L39567O65432M26402J93426
$$ -328424 -382337 198482 784733 632363 -117087 -559433 -219866 445566 871968 1065394
40489A065394J36369k9551k77107l22689k57586l19973k87007Q4130L38216k0735
$$ 1065394 1201763 1172212 895105 572416 314830 -5143 -292150 -208020 130196 109461
40479A09461m95005k79112L17654L20844k48111m45968m5401K52815K53455M76637
$$ 109461 -385544 -664656 -347002 -26158 -274269 -720237 -765638 -512823 -259368 217269
40469B17269P77736K78498r16087j410848n66950M69493N30776J2067j40380Q2097
$$ 217269 995005 1273503 357416 -1053432 -1620382 -1150889 -620113 -608046 -748426 -666329
40459f66329K13135L09971N07700L87608k24637n51804K7147P86625O39410j80861
$$ -666329 -453194 -143223 364477 752085 527448 -24356 2791 789416 1428826 1247965
40449A247965n42209k12650q6757o33002j140937p87349K40091J025841R80030
$$ 1247965 705756 493106 406349 -226653 -1367590 -2154939 -1914848 -889007 91023
40440I1023L76495m6232M4400J80058k10592q23111p56438J28841Q39677O03749
$$ 91023 467518 421286 465686 645744 435152 -387959 -1144397 -1015556 -175879 427870
40430D27870r3075l81766k95081m07502o45178l94490L31069P35982M19345q835
$$ 427870 334795 -46971 -342052 -749554 -1394732 -1789222 -1458153 -722171 -302826 -311661
40420c11661J61963O91606P12215n8164q59389q03101p59N79182L88839l2144
$$ -311661 -149698 541908 1254123 1195959 336570 -466531 -467290 111892 500731 468587
40410D68587K9103L42427J67607m57465o89799j82187L95540L84267j0537k30604
$$ 468587 497690 840117 1007724 550259 -139540 -321727 73813 458080 447543 216939
40400B16939j38101Q1468K64695J81388l72703j042482j021682j21052P77829
$$ 216939 78838 160306 425001 606389 233686 -808796 -1830478 -1951530 -1173701
40391a173701Q05066J79032k85787k96170j32653M6786K97374M56642K38160k29620
$$ -1173701 -368635 -189603 -475390 -771560 -904213 -857427 -560053 -103411 134749 -94871
40381i4871m12541l7921M90570M87499k02740q47350n28859O16617J257761M65034
$$ -94871 -507412 -545333 -54763 432736 229996 -617354 -1146213 -529596 728165 1193199
40371A193199r14654j268337l72773M76602M60194J50470J63088J63025j66842
$$ 1193199 278545 -989792 -1362565 -885963 -425769 -275299 -112211 50814 -116028
40362a16028l18235L9779K42290k21896o21400j47667N78495M29361l36294m81090
$$ -116028 -434263 -394484 -152194 -374090 -995490 -1143157 -564662 -135301 -471595 -952685
40352i52685J60711M47023j69012p79776m63714M05831Q39941N63518J20843J7130
$$ -952685 -791974 -344951 -513963 -1293739 -1757453 -1351622 -511681 51837 172680 189810
40342A89810J95981K58362k5033m37512n78605l91271j98664j50766j0590L17703
$$ 189810 385791 644153 619120 181608 -396997 -788268 -986932 -1137698 -1148288 -830585
40332h30585M92300K86400R111q739O5677k6021j35149p2215m6978k50367m06580
$$ -830585 -338285 -51885 -42774 -51513 14164 -11857 -147006 -219221 -266199 -516566 -923146
40321i23146k37580M4196J84138L33156N36089L62966l08121p41973l44315L41555
$$ -923146 -1160726 -1116530 -932392 -599236 -63147 299819 -8302 -750275 -1094590 -753035
40311g53035M52298Q1181j33520j39792k12099r9670M62472Q64837M40860k37959
$$ -753035 -300737 -219556 -353076 -492868 -704967 -804637 -342165 522672 963532 725573
40301G25573j63488L80923L08651l32725m87500n0674m789m75402m15101L72265
$$ 725573 562085 943008 1251659 918934 431434 380760 375971 -99431 -514532 -142267
40291a42267O44081j62568q65227n04833J03652r3589n85024l17364M58283O97751
$$ -142267 501814 339246 -525981 -1030814 -927162 -1020751 -1605775 -1923139 -1464856 -767105
40281g67105K46231k06466l51036l58530j76949K90841O63905N86588L66369L59496
$$ -767105 -520874 -727340 -1078376 -1436906 -1613855 -1323014 -659109 -72521 293848 653344
40271F53344K53823k10797m33205J17924P24541L49936o59168j057395o18881
$$ 653344 907167 696370 263165 381089 1105630 1455566 796398 -260997 -879878
40262h79878k36529k07736J35815Q79588J024881J11503q13025o28362K80237
$$ -879878 -1116407 -1324143 -1188328 -308740 716141 827644 14619 -613743 -333506
40253c33506O98242K84352k08530j42873K70703M49199K06263r6736p4069J04626
$$ -333506 364736 649088 440558 297685 568388 1017587 1223850 1127114 1053045 1157671
40243A157671j06756p15795q77548l7424R66692Q13305l95019j155386o63863
$$ 1157671 1050915 335120 -542428 -579852 386840 1200145 805126 -350260 -1014123
40234a014123J89689L70146J62921L14976O20191M07869j49623l23169q5455k7055
$$ -1014123 -824434 -454288 -291367 23609 643800 1051669 902046 578877 493422 466367
40224D66367k12764j64105R9665N3618k61752k12009K37402L62781q636j28167
$$ 466367 253603 89498 189163 242781 -18971 -230980 6422 369203 360567 232400
40214B32400K93415M54332j12779n57679r9318N24867J80518p59045r61359k22279
$$ 232400 525815 980147 867368 309689 210371 735238 915756 156711 -804648 -1026927
40204a026927L62452K28622J6632K38444M84800L42364P9369k9903j75767l60548
$$ -1026927 -664475 -435853 -419221 -180777 304023 646387 725756 695853 520086 159538
40194A59538j39333M64046O14294j06839q50027o34456K24820O24420K17822l35237
$$ 159538 20205 484251 1098545 991706 141679 -492777 -267957 356463 574285 239048
40184B39048m45607k03039L3418R2126M873r5305j03672j03604k09979k20498
$$ 239048 -206559 -409598 -376180 -284054 -279181 -374486 -478158 -581762 -791741 -1012239
40174a012239J48584O00798M69971j80921m34953R0763N59568K42745k97702k14991
$$ -1012239 -863655 -262857 207114 26193 -408760 -317997 241571 484316 186614 -28377
40164b8377J74268K8725m77371m63485J09387M15367J82077k7180K5621p9185
$$ -28377 145891 174616 -302755 -766240 -656853 -241486 -59409 -86589 -60968 -140153
40154a40153m36507n26930j69945J20665K0748j22694N8432M71167Q59166R66264
$$ -140153 -576660 -1103590 -1273535 -1152870 -1132122 -1254816 -1196384 -725217 133949 1100213
40144A100213M57591n67743j139581m82263N95310N92437l84182o72619K96554
$$ 1100213 1557804 990061 -149520 -631783 -36473 555964 171782 -500837 -204283
40135b04283J032531M02570n52265l98263L89406L88962m08246q07047m70483
$$ -204283 828248 1230818 678553 280290 669696 1058658 650412 -156635 -627118
40126f27118j88795k58018q0536M81794O72219J36491m00965k60941J99108K67672
$$ -627118 -815913 -1073931 -1154467 -672673 -454 136037 -264928 -525869 -326761 -59089
40116e9089m5492k03676m5880Q2206j1232n5397K00256M87949L20259k37245m81202
$$ -59089 -104581 -308257 -354137 -271931 -283163 -338560 -138304 349645 669904 432659 -48543
40105d8543k6993N06749L11692l53406n06948p185K11852k71987o07945j08010
$$ -48543 -75536 431213 742905 389499 -117449 -124634 87218 -184769 -792714 -900724
40095i00724N39894L97120j80842k13872K62068M12588J03229m8238N0354j29721
$$ -900724 -360830 36290 -144552 -358424 -96356 316232 419461 371223 421577 291856
40085B91856n43909m95370P3016L61472Q9336l2464L51493N14076p2235o74974
$$ 291856 -252053 -747423 -674407 -312935 -223599 -256063 95430 609506 537271 -137703
40075a37703l76677M77284Q07367L36757k50821m30197l31088k13409j14053n4074
$$ -137703 -514380 -37096 770271 1107028 856207 426010 94922 -118487 -232540 -286614
40065b86614j11021k16032j99665n7056N7649O0600j577l0229Q2760L17153L84766
$$ -286614 -397635 -613667 -813332 -870388 -812739 -752139 -753716 -783945 -701185 -384032 734
40054G34L8281m14804l63916J64459L79633j07257n73960k12052O20665R00312
$$ 734 39015 -375789 -739705 -575246 -195613 -302870 -876830 -1088882 -468217 432095
40044D32095L90784j78943k61626n4894Q9807J14363M989k72142m42523j23112
$$ 432095 822879 643936 382310 327416 417223 531586 536575 264433 -178090 -301202
40034c01202M74674O27749J22243l81999l21014m586R349j65043k4241M09744
$$ -301202 173472 801221 923464 541465 220451 215865 225214 60171 35930 445674
40024D45674N72818K00122l26307n50249m78355l79421k98769k8822M56073P56275
$$ 445674 1018492 1218614 892307 342058 -136297 -515718 -814487 -843309 -387236 369039
40014C69039M60658k18248n53039k43519J00491j64647o70558n35029K32753O66547
$$ 369039 829697 611449 58410 -185109 -84618 -249265 -919823 -1454852 -1222099 -555552
40004e55552L00102j95737j81085K5194l9187n5790L69512P34891L59895l63297
$$ -555552 -255450 -451187 -632272 -607078 -646265 -702055 -332543 402348 762243 398946
39994C98946m82117L368K08276j42597l68118p6020K73703K99102K53962L13040
$$ 398946 -83171 -79803 128473 -14124 -382242 -458262 -184559 114543 368505 681545
39984F81545J51674l42777o88258n73439l35629k68500j33967J99568L29913M7557
$$ 681545 833219 490442 -197816 -771255 -1106884 -1375384 -1509351 -1309783 -979870 -932313
39974i32313j68431N5880L23185J92132l8778O8676K94054K75510K55221N08654
$$ -932313 -1100744 -1044864 -721679 -529547 -568325 -499649 -205595 69915 325136 833790
39964H33790N76412m888o61459n15066J60696L30451j25232k98574J49293M68593
$$ 833790 1410202 1405314 743855 228789 389485 719936 594704 296130 445423 914016
39954I14016J66744k16082j43231L1712j87611n26270m24935N3548L99477L98322
$$ 914016 1080760 864678 721447 753159 565548 39278 -385657 -332109 67368 465690
39944D65690K07333l5288k55174l10063j56724K5983J14291K11468L43135K74066
$$ 465690 673023 637735 382561 72498 -84226 -58243 56048 267516 610651 884717
39934H84717j11199n00016m99080j11564L29162N13264L04651k03724o21275n27191
$$ 884717 773518 273502 -225578 -337142 -7980 505284 809935 606211 -15064 -542255
39924e42255n203L54120J83989k06352l29511j64724j1200L2709Q4686J58042
$$ -542255 -547458 -193338 -9349 -215701 -545212 -709936 -721136 -688427 -603741 -445699
39914d45699J93270K91198N46987P10191M00480k78000o91198m33142J09170K14608
$$ -445699 -252429 38769 585756 1295947 1696427 1418427 727229 294087 403257 617865
39904F17865k46573o47743m34942J53355M33883J81944j65113j98434m2325j5971
$$ 617865 371292 -276451 -711393 -558038 -124155 57789 -107324 -305758 -348083 -364054
39894c64054j25465j45052K5596L15448N82383N71379O4932o73116r37953m19221
$$ -364054 -489519 -634571 -608975 -293527 288856 860235 925167 252051 -685902 -1105123
39884a105123L10609N38124L18507J67125J69107K2505k34809k25215R3175L56064
$$ -1105123 -794514 -256390 62117 229242 398349 420854 186045 -39170 54005 410069
39874D10069L77973K71378O4265k33826l14859K1595K85009j03003p20491n90823
$$ 410069 788042 1059420 1123685 889859 575000 596595 881604 778601 58110 -532713
39864e32713K51057O83848K22503k72241o4851L29319J84031j94343j46280J34614
$$ -532713 -281656 402192 624695 352454 287603 616922 800953 606610 460330 594944
39854E94944N7185k05903l3078M47153M67329j22534n88469m10410O7890K75697
$$ 594944 652129 446226 413148 860301 1327630 1205096 616627 206217 274107 549804
39844E49804J44581l2475q6351r3603k05091m42454n75520l10383K50288N51818
$$ 549804 694385 661910 575559 481956 276865 -165589 -741109 -1051492 -801204 -249386
39834b49386K59282k32752l04941O4471L83409M00706L08429K40750O1067k56072
$$ -249386 9896 -222856 -527797 -463326 -79917 320789 629218 869968 931035 674963
39824F74963m36410k84233J7904J65218J13868N6347J13673J81395Q2168j68653
$$ 674963 238553 -45680 -27776 137442 251310 307657 421330 602725 684893 516240
39814E16240l06167j18248K14130K70751m0070k96801j31206K31752L00183N4429
$$ 516240 210073 91825 305955 576706 536636 239835 108629 340381 640564 694993
39804F94993m5713J55660J60118m32059j113925r62337M9527Q17898N07117l26468
$$ 694993 649280 804940 965058 532999 -580926 -1543263 -1493736 -675838 -168721 -495189
39794d95189n76377j47977J59232J26353L58565Q85844P65022k84775r97914l33717
$$ -495189 -1071566 -1219543 -1060311 -933958 -575393 310451 1075473 790698 -207216 -540933
39784e40933P89239Q03867j40270n95244j93164K5598l79626n65270o0951L77225
$$ -540933 248306 1052173 911903 316659 123495 149093 -230533 -795803 -856754 -479529
39774d79529J46357k29923j63099O0935P9003J84410N53429O46396J13468m95477
$$ -479529 -333172 -563095 -726194 -665259 -586256 -401846 151583 797979 911447 415970
39764D15970n94799l73147j52036K12908O64116N93921j11800n90990l30698j6813
$$ 415970 -178829 -551976 -704012 -491104 173012 766933 655133 64143 -266555 -283368
39754b83368k20021l03411K80392O67399n6291j034105p69484M88854J132212
$$ -283368 -503389 -806800 -526408 140991 84700 -949405 -1718889 -1230035 -97823
39745i7823O59540J32073K19276L61613R2674j92326j74257j84000m29292n67199
$$ -97823 561717 693790 913066 1274679 1367353 1175027 1000770 816770 387478 -179721
39735a79721l93682j74490m6694J65145L75251K48952o1761K3733N46317Q49236
$$ -179721 -573403 -747893 -794587 -629442 -254191 -5239 -67000 -43267 503050 1352286
39725A352286N66631M8788l50628o66338q29702n57660O183K42655n1905l34796
$$ 1352286 1918917 1967705 1617077 950739 121037 -436623 -430440 -187785 -239690 -574486
39715e74486j53730K35983L50060R7341k77820m70110k45412K97642O32230M22169
$$ -574486 -728216 -492233 -142173 -44832 -322652 -792762 -1038174 -740532 -108302 313867
39705C13867Q2042J45231L18982l0430o44656o37035K0507L77987O3319j70988
$$ 313867 395909 541140 860122 829692 185036 -451999 -431492 -53505 9814 -161174
39695a61174J52855M02979L6428l40973M0457P75942Q48528J16094n95585o78624
$$ -161174 -8319 394660 431088 90115 130572 906514 1755042 1871136 1275551 596927
39685E96927l28396k2366L7822n6107j01989M1624K91629L99888K58243J2390
$$ 596927 268531 246165 283987 227880 125891 167515 459144 859032 1117275 1129665
39675A129665j67194k47355k62866k89987m30812n88464m20795J37649N40587
$$ 1129665 962471 715116 452250 162263 -268549 -857013 -1277808 -1140159 -599572
39666e99572L22787j01351m828M51349M27975j84948n16609r8783M18597L58744
$$ -599572 -276785 -378136 -382964 68385 496360 311412 -205197 -303980 114617 473361
39656D73361Q972m2602J13701N1359j63006j62986n930p5886l85614m77515m2208
$$ 473361 482333 439731 553432 604791 441785 278799 272869 196983 -188631 -666146 -708354
39645g08354O48910R74155N68718k36682o63712l62127J31250J40143j85862j99851
$$ -708354 -59444 914711 1483429 1246747 583035 220908 352158 492301 306439 106588
39635A06588J48158K94989R9489M3743K64761K55342j68557m29953j47620K13816
$$ 106588 254746 549735 649224 692967 957728 1213070 1044513 614560 466940 680756
39625F80756J48209j07295j34296o9316j84253k66138m8495J80926M3902k17427
$$ 680756 828965 721670 587374 518058 333805 67667 19172 200098 244000 26573
39615B6573j29483J94335K52179j5339j83907m5574J69170K56329K95096L77736
$$ 26573 -102910 91425 343604 328265 144358 98784 267954 524283 819379 1197115
39605A197115L79159J08434l98272p77067o18846J2434M92132L49281j02081k62395
$$ 1197115 1576274 1684708 1286436 509369 -109477 -97043 395089 744370 642289 379894
39595C79894j69531k92648n42757l37180K78000N09129J09498j51594J89842M10245
$$ 379894 210363 -82285 -625042 -962222 -684222 -175093 -65595 -217189 -27347 382898
39585C82898k22836j121027j133924k04433O12196N85705L4724l05749o8172N59231
$$ 382898 160062 -960965 -2094889 -2299322 -1687126 -1101421 -1066697 -1372446 -1440618 -881387
39575h81387J021422Q48947J90287k97848k96467k06014m07941o01414l23667
$$ -881387 140035 988982 1179269 881421 584954 378940 -29001 -630415 -954082
39566i54082K43970N09626K75488j39102l95016l86710j76617L1446L9813l7695
$$ -954082 -710112 -200486 75002 -64100 -459116 -845826 -1022443 -990997 -951184 -988879
39556i88879J04437M15236M74085J77235p3115o2356o0285j83016j32108J07640
$$ -988879 -884442 -469206 4879 182114 108999 46643 -13642 -196658 -328766 -221126
39546b21126O0073l22895l43169K70802P06687L21683k55393j85513J59242o1848
$$ -221126 -161053 -483948 -827117 -556315 150372 472055 216662 31149 190391 128543
39536A28543n83606m73761J80127L43057k41224o31030k03442M66740O15991L48739
$$ 128543 -455063 -928824 -748697 -405640 -646864 -1277894 -1481336 -1014596 -398605 -49866
39526d9866K31586L99834N05875K72419j69048l96009j55818K31621J97279k23077
$$ -49866 181720 581554 1087429 1359848 1190800 794791 638973 870594 1067873 844796
39516H44796l52940K1770J91360k93528p23300l51669K68000J63147l75564k93288
$$ 844796 491856 513626 704986 411458 -311842 -663511 -395511 -232364 -607928 -901216
39506i01216L62472N14285m5300l02107J92309N97878L21024l7920O7194J19951
$$ -901216 -538744 -24459 -69759 -371866 -179557 418321 739345 701425 768619 888570
39496H88570l68922p61975k82224O33613R74960O18439J85816j28400n68435r05122
$$ 888570 519648 -242327 -524551 109062 1084022 1702461 1888277 1759877 1191442 286320
39486B86320n73663K37231N79178R0713m11811j07742O24875P35166l9635q09590
$$ 286320 -287343 -50112 529066 619779 207968 100226 725101 1460267 1420632 611042
39476F11042o81226J35945O27009K14117n92949q45260k50181N50077P34013J83268
$$ 611042 -70184 65761 692770 906887 313938 -531322 -781503 -231426 502587 685855
39466F85855m37837m47323P7823M14777J25555l72298m25530q9947L9945j75918
$$ 685855 248018 -199305 -121482 293295 418850 46552 -378978 -468925 -428980 -604898
39456f04898k70356p5734j4651k13714j43809L65053N65155k8734o40296l51597
$$ -604898 -875254 -950988 -965639 -1179353 -1323162 -958109 -392954 -421688 -1061984 -1413581
39446a413581L78382M24108k03739n04942k14348m8327k18786p3018N10675O91777
$$ -1413581 -1035199 -611091 -814830 -1319772 -1534120 -1582447 -1801233 -1874251 -1363576 -671799
39436f71799J36728k89547K8803M20451J57196k71308j08327K74993Q9787l72524
$$ -671799 -535071 -824618 -795815 -375364 -218168 -489476 -597803 -322810 -233023 -605547
39426f05547k17916M16502N22719l6408k52368K97457O58553M2592q25226p84999
$$ -605547 -823463 -406961 115758 79350 -173018 124439 782992 825584 358 -784641
39416g84641k3595K67331k32952n33668L3216P12717M92902k81058l78314M38158
$$ -784641 -808236 -540905 -773857 -1307525 -1274309 -561592 -68690 -349748 -728062 -289904
39406b89904R95149M16713o05568q27990j46924M70277M18195K1375k34637k76667
$$ -289904 705245 1121958 516390 -311600 -458524 11753 429948 451323 216686 -59981
39396e9981j58373J38713M36340M36518K30218K01577K93222J564o58194q94497
$$ -59981 -218354 -79641 356699 793217 1023435 1225012 1518234 1519798 861604 -32893
39386c2893k99665L79339K70247l26134m41601O2243L65191J9062m15050k85636
$$ -32893 -332558 46781 317028 -9106 -450707 -388464 -23273 -4211 -419261 -704897
39376g04897K29838M95151L04193J5522r277J96926L20898J38260k15260l64870
$$ -704897 -475059 20092 324285 339807 330530 527456 848354 986614 771354 406484
39366D06484j83466j8059j66742k90201J57815R19947J021020J50673o93379n06182
$$ 406484 223018 204959 38217 -251984 -94169 825778 1846798 1997471 1304092 797910
39356G97910L05724N79268J15263k24189m8208K8350l53891n66814j19867L73225
$$ 797910 1103634 1682902 1798165 1573976 1525768 1554118 1200227 633413 513546 886771
39346H86771J61600l96557m77047j52636r8152l11532k37002N0023l1702l00217
$$ 886771 1048371 651814 174767 22131 -76021 -387553 -624555 -574532 -606234 -906451
39336i06451O5935R40386J077965J5700j034997q98755l0961M23691L02862J98770
$$ -906451 -840516 99870 1177835 1193535 158538 -740217 -771178 -347487 -44625 154145
39326A54145K15761j1239m27003n99192m46654k10922P2601M47831O53870M75061
$$ 154145 369906 358667 -68336 -667528 -1114182 -1325104 -1252503 -804672 -150802 324259
39316C24259J98324J61116J76156l8614k66457k35630j94973l61756l01983L13896
$$ 324259 522583 683699 859855 821241 554784 319154 124181 -237575 -539558 -225662
39306b25662Q21136M10742m87831p41981k28343Q6306k65103o43447m22244J97238
$$ -225662 595474 1006216 518385 -223596 -451939 -365633 -630736 -1274183 -1696427 -1499189
39296a499189O95051Q35801O16794K03963n1321l1931j10334m46617m52818K64405
$$ -1499189 -804138 31663 648457 852420 801099 769168 658834 212217 -240601 23804
39286B3804R23051N76730l14055n54596j27302j9178l45906k47840L21401L95783
$$ 23804 946855 1523585 1209530 654934 527632 508454 162548 -85292 236109 631892
39276F31892j63840l41736R9193J22396n13407n30867N66965J275240M67186o35111
$$ 631892 468052 126316 225509 347905 -165502 -696369 -129404 1145836 1613022 977911
39266I77911m58364L58803K45935n62102o27000N2016J31004o08746r30503l78454
$$ 977911 519547 878350 1124285 562183 -64817 -12801 118203 -490543 -1421046 -1799500
39256a799500L9355k14550k84644M23492J097334Q57016J42413j16235R8442J69965
$$ -1799500 -1760145 -1974695 -2259339 -1835847 -738513 118503 260916 144681 243123 413088
39246D13088m4024j78493r4483O24l0003j65362l62085m49686j57328M17267O56708
$$ 413088 369064 190571 96088 96712 66709 -98653 -460738 -910424 -1067752 -650485 6223
39235F223J61176n76405p06372j48905L08952J24265k67283j36329M49290P22041
$$ 6223 167399 -409006 -1115378 -1264283 -955331 -831066 -1098349 -1234678 -785388 -63347
39225f3347L39847j53201k01822m0689j56875l78817j96938K27438K03672l18814
$$ -63347 276500 123299 -78523 -119212 -276087 -654904 -851842 -624404 -420732 -739546
39215g39546n74951j90639K65603K94710K05859L27059K86388j95455n03141k4834
$$ -739546 -1314497 -1505136 -1239533 -944823 -738964 -411905 -125517 -320972 -824113 -848947
39205h48947O80611O35539J6716j27387L90997N97292m1065p56329o66879j6154
$$ -848947 -168336 467203 483919 356532 747529 1344821 1303756 547427 -119452 -135606
39195a35606L41758J56509j00076m8858J54501J38773j84678m68422k80042L04901
$$ -135606 206152 362661 262585 213727 368228 507001 322323 -146099 -426141 -121240
39185a21240O21874K11573m78608o37320k19989O3064q8001j30497L08020O79728
$$ -121240 500634 712207 233599 -403721 -623710 -560646 -648647 -779144 -471124 208604
39175B08604L38245l67295n17351O3270O02665N06912O1822j94458k69657m77571
$$ 208604 546849 179554 -337797 -274527 328138 835050 896872 702414 432757 -44814
39165d4814p20677n48347Q8819O16827N63215J71262j081J35378K04483M6502
$$ -44814 -765491 -1313838 -1225019 -608192 -44977 126285 125204 260582 465065 511567
39155E11567o5924L1379R1270o6155j59997Q7256L72526J94239l06102m42115
$$ 511567 445643 477022 568292 502137 342140 429396 801922 996161 690059 247944
39145B47944p237L46201O1025m33780l09047L97385P34132J56114o80390p87788
$$ 247944 240707 586908 647933 214153 -94894 302491 1036623 1192737 512347 -275441
39135b75441j09050N59669O65915L87014J10883j7392K1760K01275L09198J68022
$$ -275441 -384491 175178 841093 1228107 1338990 1321598 1343358 1544633 1853831 2021853
39125B021853L3011K67725O25846N30873J15975J19788N89113P57138N42055Q46242
$$ 2021853 2054864 2322589 2948435 3479308 3595283 3715071 4304184 5061322 5603377 6449619
39115F449619J768124K174498K168643L950073P957384R873866N027557m509522
$$ 6449619 8217743 10392241 12560884 16510957 24468341 34342207 39369764 34860242
39107C4860242j0928650r746391m626805j618091j754348k011651j083428n01703
$$ 34860242 23931592 14185201 9558396 7940305 6185957 4174306 3090878 2589175
39099B589175r50525j042470j02792N79601P7178o71114n96256j35356j59560
$$ 2589175 1638650 596180 493388 1072989 1150167 479053 -117203 -252559 -412119
39090d12119m78231l88415J02266M40226L93111J56709k4029K5015L13051N17790
$$ -412119 -890350 -1278765 -1176499 -736273 -343162 -186453 -210482 -185467 127584 645374
39080F45374K84507k44921o04288o38969m93662j53054L68575N96634J64493l45964
$$ 645374 929881 684960 80672 -558297 -1051959 -1205013 -836438 -239804 -75311 -421275
39070d21275o7543P17225Q49326P2683n67109l52541J64047K53781M1019p1168
$$ -421275 -488818 228407 1077733 1150416 583307 230766 394813 648594 689613 618445
39060F18445j14075j51910K9410L21197J78870l82749n34375L9622M45705m3705
$$ 618445 504370 352460 381870 703067 881937 499188 -35187 4435 450140 406435
39050D06435p46634n89036L06292R64431R42135M83955j81675p89820p67397K8701
$$ 406435 -340199 -929235 -622943 341488 1283623 1767578 1585903 796083 28686 57387
39040E7387P23712N28377k0068L8101M27737J67440n89048p24070q9668K82296
$$ 57387 781099 1309476 1289408 1327509 1755246 1922686 1333638 609568 519900 802196
39030H02196N7082P8488N78862N80893j84312m28612N11314J216421M58709m22956
$$ 802196 859278 937766 1516628 2097521 1913209 1484597 1995911 3212332 3671041 3248085
39020C248085N25907K406109K371770r2584k208676j807972p0802P13541L16480
$$ 3248085 3773992 6180101 8551871 8459287 6250611 4442639 4371837 5085378 5401858
39011E401858k3159k5141l56626q76169p05038P7597L63294k07262p03814m53996
$$ 5401858 5378699 5353558 4996932 4120763 3415725 3493322 3856616 3649354 2945540 2491544
39001B491544M117k8953l56540m36611k74392j96490k41079k54375k12734j01232
$$ 2491544 2495661 2466708 2110168 1673557 1399165 1202675 961596 707221 494487 393255
38991C93255J54844L84346K33761k19238m03445q1744K69156K15157l8127j66497
$$ 393255 548099 932445 1166206 946968 543523 461779 730935 946092 907965 741468
38981G41468k74191m56863l75263J53165O08728M55939j5539k00675j63002l38947
$$ 741468 467277 10414 -364849 -211684 397044 852983 837444 636769 473767 134820
38971A34820n36774j49685O53472Q76790J13538p37116o45484J59111N54127O6291
$$ 134820 -401954 -551639 101833 978623 1092161 355045 -290439 -131328 422799 489090
38961D89090n49121m04750K91898N52162K5417m82788j83354N34979P12302K36791
$$ 489090 -60031 -464781 -172883 379279 404696 -78092 -261446 273533 985835 1222626
38951A222626j41215o5936P5066Q9468K42129L69238j29335r71015q99998L27169
$$ 1222626 1081411 1015475 1090541 1180009 1422138 1791376 1662041 691026 -208972 118197
38941A18197J109381K73340r56726p50154M64031P49103k11672p75235j60228
$$ 118197 1227578 1500918 544192 -205962 258069 1007172 795500 20265 -139963
38932a39963M21043J5124m85617R478R41806J075056L59790l09542n34577n57246
$$ -139963 281080 296204 -189413 -179935 761871 1836927 2196717 1887175 1352598 795352
38922G95352m40324q9710J95034N0201k62739k29013M6489N6966j59345n3900
$$ 795352 355028 265318 460352 510553 247814 18801 65290 122256 -37089 -90989
38912i0989M31587O27094J17350o01748p93380m44734j65946k74470l85811l3011
$$ -90989 340598 967692 1085042 483294 -310086 -754820 -920766 -1195236 -1581047 -1614058
38902a614058N83894P91842L53954j90972k79423o7958p0559l17116l77018j10529
$$ -1614058 -1030164 -238322 115632 -75340 -354763 -422721 -493280 -810396 -1187414 -1297943
38892a297943J52955K16154K63301L78908L07419q2234m78477n09564j60447L38892
$$ -1297943 -1144988 -928834 -665533 -286625 20794 -61440 -539917 -1049481 -1209928 -871036
38882h71036P34572P49134K43870m36216o47186k12085L07422L34749j9618k26920
$$ -871036 -136464 612670 856540 420324 -226862 -438947 -131525 203224 183606 -43314
38872d3314m8633K93055M57990K59400k49377p42380q02057l35843K53336M57242
$$ -43314 -91947 201108 659098 918498 669121 -73259 -875316 -1211159 -957823 -500581
38862e00581J97763j01337J7944N01656P54467L18387m44975p00767k68219J06061
$$ -500581 -302818 -404155 -386211 115445 869912 1188299 743324 42557 -225662 -119601
38852a19601r2291l26782L8517N52598L83593j70951o8762O45850P06436l46284
$$ -119601 -211892 -538674 -500157 52441 436034 265083 196321 842171 1548607 1202323
38842A202323j242410p92362L69491P67023J35576m95985m19628N538J76988N3718
$$ 1202323 -40087 -832449 -462958 304065 439641 -56344 -475972 -470434 -293446 -239728
38832b39728m9361j8014l8467k49537m19664j31647N60631R24263M49959k58276
$$ -239728 -289089 -307103 -345570 -595107 -1014771 -1146418 -585787 338476 788435 530159
38822E30159k15230M09622M45265m20435j027469n06175M03700O10625L22877
$$ 530159 314929 724551 1169816 749381 -278088 -784263 -380563 230062 552939
38813E52939L74710O19450K79270m87379p08738k32016K4931l64011o64982k68798
$$ 552939 927649 1547099 1826369 1338990 630252 398236 423167 59156 -605826 -874624
38803h74624L41786M57201J83282j0816j58389m87102o72002j94150O83413J018074
$$ -874624 -532838 -75637 107645 96829 -61560 -548662 -1220664 -1414814 -731401 286673
38793B86673L89296n23551p91602l01732L09606N35928M41278K91344J44828l8699
$$ 286673 675969 152418 -639184 -940916 -631310 -95382 345896 637240 782068 743369
38783G43369j74874j90664k04527l00737k70081R6616N47398N81458J19521m01793
$$ 743369 568495 377831 173304 -127433 -397514 -300898 246500 827958 947479 545686
38773E45686o26693n93869m18758r5669K65892M23661L74597L55548L53382Q0119
$$ 545686 -81007 -674876 -1093634 -1189303 -923411 -499750 -125153 230395 583777 663896
38763F63896l98031n47438j66769K33086K19003Q0852K15320L61106O0286m81156
$$ 663896 265865 -281573 -448342 -215256 3747 84599 299919 661025 721311 240155
38753B40155o64135m16882k02467k12074j52283J66159N38567P14315O44347L70435
$$ 240155 -423980 -840862 -1043329 -1255403 -1407686 -1241527 -702960 11355 655702 1026137
38743A026137M079k13195j44935l224o5775k45924k50863n8963P9889K5544j52280
$$ 1026137 1030216 817021 672086 668862 603087 357163 106300 47337 127226 152770 490
38732D90l28093l28970n056M31473M41331r4959n03736j83422M71279O04618J05350
$$ 490 -327603 -656573 -661629 -230156 211175 116216 -387520 -570942 -99663 504955 610305
38721F10305l88962n03169m03859j72590K91987P02195N17491j54703n14141j85121
$$ 610305 221343 -281826 -685685 -858275 -566288 135907 653398 498695 -15446 -200567
38711b00567K67513K35432j21482l07038k02666K0541K52911L59578J47488k62236
$$ -200567 66946 302378 180896 -126142 -328808 -308267 -55356 304222 451710 189474
38701A89474m13409j46757J47368J55165M8203o075j87747n01404m94758o798
$$ 189474 -223935 -370692 -223324 -68159 -19956 -26031 -213778 -715182 -1209940 -1216738
38691a216738L65238J71465n1922L65189R74462P74584j82699p82310m76289O6013
$$ -1216738 -851500 -680035 -731957 -366768 607694 1382278 1199579 417269 -59020 6993
38681F993J64266M5812J23388J70901j41484m61470k15080M46779P85775M36287
$$ 6993 171259 217071 340459 511360 369876 -91594 -306674 140105 925880 1362167
38671A362167k29736o05882l90231K26364O25924K51132o55195j097321n23177
$$ 1362167 1132431 526549 136318 362682 988606 1239738 584543 -512778 -1035955
38662a035955L48961M50315j64423m68441K4436O79789P73517L68692q4806l78972
$$ -1035955 -686994 -236679 -401102 -869543 -845107 -165318 608199 976891 892085 513113
38652E13113m35775j26956L81858N48247J23927m42397o11710l93486o6795K78159
$$ 513113 77338 -49618 332240 880487 1004414 562017 -49693 -443179 -509974 -231815
38642b31815N19791L19793l03102o50028k26072M15881M19202r0209k66367R3802
$$ -231815 287976 607769 304667 -345361 -571433 -155552 263650 173441 -92926 876
38632H76L43149J44607n1079J14365L33901K49934j3818k55305n28486p34471
$$ 876 344025 488632 437553 551918 885819 1135753 1121935 866630 338144 -396327
38622c96327m66542L06604R04940P61690J86223j57706j70017k04539l38380l23336
$$ -396327 -862869 -556265 348675 1110365 1296588 1138882 968865 764326 425946 102610
38612A02610j35866m6901j37562j65688J3350K11373K05126N6151m544P7608Q4056
$$ 102610 -33256 -80157 -217719 -383407 -370057 -158684 46442 102593 98049 175657 259713
38601B59713j65039m63222l86181R7423M54451L00340N999J25474M42034K75866
$$ 259713 94674 -368548 -754729 -657306 -202855 97485 103484 228958 670992 946858
38591I46858k98759m00820K33887O47709O9042p92869p19475J79448O00553l6444
$$ 946858 648099 247279 481166 1128875 1197917 405048 -314427 -134979 465574 429130
38581D29130p73146n28600M10221Q84514M52982j69519k33288O4563L0490m19060
$$ 429130 -344016 -872616 -462395 422119 875101 705582 472294 536857 567347 148287
38571A48287o13483j22843N83426P71724M00409O514j51568k95483n14359n31863
$$ 148287 -465196 -588039 -4613 767111 1167520 1174034 1022466 726983 212624 -319239
38561c19239k40614J7420l8392j95575r4235K52471N11044M25917M3250k93605
$$ -319239 -559853 -542433 -580825 -776400 -870635 -618164 -107120 318797 362047 68442
38551F8442j73841L90941P70608M16969k88381m43854O5960L57006j21122p46475
$$ 68442 -105399 285542 1056150 1473119 1184738 740884 806844 1163850 1042728 296253
38541B96253o83364q3752K87483K14204J35784K96495M28240K75854m1118k66316
$$ 296253 -387111 -470863 -183380 30824 166608 463103 891343 1167197 1126079 859763
38531H59763l02279k11733j03176l6215K0403Q3258M9469j21951k10505k6090
$$ 859763 557484 345751 242575 206360 226763 310021 359490 237539 27034 944
38521I44J96939J35141M531K40657N84315K95213n62832r58734m05136K72333
$$ 944 197883 333024 337555 578212 1162527 1457740 894908 -63826 -468962 -196629
38511a96629K59059l7364R9703L70769R7958l79716j54507O42201Q60239K8160
$$ -196629 62430 25066 124769 495538 593496 213780 59273 701474 1561713 1589873
38501A589873r60565j086878l69232M51349P78971M96067q6474m38725l21940
$$ 1589873 629308 -457570 -826802 -375453 403518 899585 813111 374386 52446
38492E2446j00696j91044l50050m7357N80853Q17952M26906m0307j15046L4276
$$ 52446 -48250 -239294 -589344 -636701 -55848 762104 1189010 1148703 1033657 1067933
38482A067933J15211J79993K83190J76410k72727o98675o43558j53916K98363
$$ 1067933 1183144 1363137 1646327 1822737 1550010 851335 207777 53861 352224
38473C52224L67651J24092j17182j37893k4381l0522j93571k35929k643K11952
$$ 352224 719875 843967 726785 588892 564511 533989 340418 104489 101846 313798
38463C13798O8883k55377l06411o1888M4893j57288k86309j5673L68423L10763
$$ 313798 382681 127304 -179107 -240995 -196102 -353390 -639699 -655372 -286949 23814
38453B3814k44589o89111m23387L96605R49258O85630Q480k80458r0380p9806
$$ 23814 -220775 -909886 -1333273 -936668 12590 698220 706700 426242 335862 256056
38443B56056n13260p42925k27037N18276O27970J75907N972M16085P57122M39035
$$ 256056 -257204 -1000129 -1227166 -708890 -80920 94987 100959 517044 1274166 1713201
38433A713201k75306p11638n97884j90677J42595K48519K16428K09087K47391
$$ 1713201 1437895 726257 128373 -62304 80291 328810 545238 754325 1001716
38424A001716J96860J606k01978k90116l02962k85970j77075K7833K07146L11789
$$ 1001716 1198576 1200182 998204 708088 405126 119156 -57919 -30086 177060 488849
38414D88849L82924L10272p1392n50693o50354l30855r0642j59757j66924R7810
$$ 488849 871773 1182045 1110653 559960 -90394 -421249 -511891 -671648 -838572 -740762
38404g40762K29382n3923l45291k42412P51Q3069K64729O82414P39792N5948n93734
$$ -740762 -511380 -565303 -910594 -1153006 -1152255 -1069186 -804457 -122043 617749 673697 79963
38393G9963l23183L75759L59187l10197n28324l1372K59840q9962l44541K5152
$$ 79963 -243220 132539 491726 181529 -346795 -378167 -118327 -208289 -552830 -527678
38383e27678M50505L21715m3954j33913j18917l04197l83193O377M88269M72585
$$ -527678 -77173 244542 200588 66675 -52242 -356439 -739632 -733255 -244986 227599
38373B27599J26747O7135K83651J51127m58860q09506l51561L90686N11061M0080
$$ 227599 354346 421481 705132 856259 397399 -412107 -763668 -372982 138079 178159
38363A78159r9269M52138P99983J08259r44812r55672J23145P98444J92745p06176
$$ 178159 78890 531028 1331011 1439270 494458 -461214 -338069 460375 653120 -53056
38353e3056n89787K95281P20576K85528l39176n93376m99454j64495L29876O45825
$$ -53056 -642843 -347562 373014 658542 319366 -274010 -773464 -937959 -608083 37742
38343C7742N08054J83079O1989M0981q3299l4932L63653N19425o6798o98192l86954
$$ 37742 545796 728875 790864 831845 748546 713614 1077267 1596692 1529894 831702 444748
38332D44748M52880N19137k95925p46102k85043J51786j55831n58743k73854L12863
$$ 444748 897628 1416765 1120840 374738 89695 241481 85650 -473093 -746947 -434084
38322d34084M16352J19571J5883J49583J25805p0002q0496J49829K62822K9009
$$ -434084 -17732 101839 117722 267305 393110 323108 242612 392441 655263 684272
38312F84272l43825m74985k36474J15379K65399K76034M39099O20847K71524n73403
$$ 684272 340447 -134538 -371012 -255633 9766 285800 724899 1345746 1617270 1043867
38302A043867r34826k04117P42323O58944k46051o81749k32477K54507K23837
$$ 1043867 109041 -95076 647247 1306191 1060140 378391 145914 400421 624258
38293F24258J06727K14842J13731m16781p68189m44512J10899K02600j37529l41419
$$ 624258 730985 945827 1059558 642777 -125412 -569924 -459025 -256425 -393954 -735373
38283g35373r0841M24216P42239M90544j86171o02101l21885K10028L36316J63758
$$ -735373 -826214 -401998 340241 830785 644614 42513 -279372 -69344 266972 430730
38273D30730J63296J65827k64065p16741l71265N31592Q77503M08361N608O7654
$$ 430730 594026 759853 495788 -220953 -592218 -60626 816877 1225238 1230846 1298500
38263A298500o5512o89623j039020n85249J06631M25945N65915P22891N13457
$$ 1298500 1232988 543365 -495655 -1080904 -974273 -548328 17587 740478 1253935
38254A253935j02221l18747K87475Q91383N84562l41238j012562j138955q46426
$$ 1253935 1151714 832967 1120442 2011825 2596387 2255149 1242587 103632 -742794
38245g42794j23263P62908J005611K87439n09895m41556J92794M69927K22162
$$ -742794 -866057 -103149 902462 1189901 680006 238450 431244 901171 1123333
38236A123333o8100k70661n60905o94750k78834L66919M67008q2063n41803l57556
$$ 1123333 1055233 784572 223667 -471083 -749917 -382998 84010 1947 -539856 -897412
38226h97412K16958O25512O74149N25810L47453J64390m5985k49543l76413m12784
$$ -897412 -680454 -54942 619207 1145017 1492470 1656860 1610875 1361332 984919 572135
38216E72135l78418k23849M9675J69980j18660m63452j92974N37399O69754j43008
$$ 572135 193717 -30132 19543 189523 70863 -392589 -585563 -48164 621590 478582
38206D78582p31919j15281Q49959P65531p6454l22142O0980j25623r23701q97891
$$ 478582 -253337 -368618 481341 1246872 1170418 848276 909256 783633 -140068 -1037959
38196a037959L85779J391744R11372j94030m98849l3989K21978m4432l60220l66324
$$ -1037959 -652180 739564 1650936 1456906 958057 924068 1146046 1101614 741394 375070
38186C75070r9676K10355K34130j06140k72889K21488Q23284N55172l90086q15555
$$ 375070 275394 485749 719879 613739 340850 562338 1385622 1940794 1550708 735153
38176G35153l45981J88539L34679N45067Q28252M22289o33408j098666m17866
$$ 735153 389172 577711 912390 1457457 2285709 2707998 2074590 975924 558058
38167E58058L77728L94633J25731J50282j3759p23870j131804m66691N78572Q61849
$$ 558058 935786 1330419 1456150 1606432 1592673 868803 -263001 -729692 -151120 710729
38157G10729L99748k1675j23295j23694q1758j1450j00483k72014j40300K32247
$$ 710729 1110477 1088802 965507 841813 760055 748605 648122 376108 235808 468055
38147D68055K86170n3687k26546o8648J3941M1666M36368Q70273N20834l43356
$$ 468055 754225 700538 473992 405344 419285 460951 897319 1767592 2288426 1945070
38137A945070n58200o0020K3028m45740k93820N99804P48985l28292j060272m35132
$$ 1945070 1386870 1326850 1349878 904138 610318 1210122 1959107 1630815 570543 135411
38127A35411L78554K46008p7655K98688O52605J90856l28924p8078K64210p7846
$$ 135411 513965 759973 682318 981006 1633611 1824467 1495543 1417465 1681675 1603829
38117A603829m44122r7267K96306m710l69992p1848L39518K40803J26335L62758
$$ 1603829 1159707 1062440 1358746 1354036 984044 912196 1251714 1492517 1618852 1981610
38107A981610K48260m60654o77183J13893P48069M11172j3466J25913k9207q01630
$$ 1981610 2229870 1769216 1092033 1205926 1953995 2365167 2351701 2477614 2448407 1646777
38097A646777p99839N72772J562198Q23587l37610l57536M5875k83617o25442
$$ 1646777 846938 1419710 2981908 3805495 3467885 3110349 3156224 2872607 2247165
38088B247165k4917O82194N41696K83320N70194N27755j67378j12617J016807
$$ 2247165 2222248 2904442 3446138 3729458 4299652 4827407 4660029 4547412 5564219
38079E564219J192678l46541j208351J4504R88229j31601j143603J45967J719099
$$ 5564219 6756897 6410356 5202005 5216509 6204738 6073137 4929534 5075501 6794600
38070F794600J064559j55963O02234J925544J437047O12677J747674L088863K220353
$$ 6794600 7859159 7703196 8305430 10230974 11668021 12280698 14028372 17117235 19337588
38061A9337588J328054L372824N999259N642590M789467P917341J3039900J5880319
$$ 19337588 20665642 24038466 30037725 35680315 40469782 48387123 61427023 77307342
38053G7307342J9978209L1454520M3338625L7639991Q458880k6265688m3182039
$$ 77307342 97285551 128740071 172078696 209718687 218177567 191911879 148729840
38046A48729840l7781131k4023469j4970525j1429968p797889j908006K908548
$$ 148729840 110948709 86925240 71954715 60524747 52726858 50818852 53727400
38039E3727400K620445k476057p650012q767107o461561m013240k636860j409691
$$ 53727400 56347845 53871788 46221776 37454669 30993108 26979868 24343008 22933317
38031B2933317l33607l6431M39846J994806K877753J438402k43808M54803K238170
$$ 22933317 22599710 22563279 23003125 24997931 27875684 29314086 29070278 29525081 31763251
38022C1763251L317349N983300J1432586J3644567O853866l527034o968759k750937
$$ 31763251 35080600 41063900 52496486 66141053 72994919 69467885 62499126 59748189
38014E9748189J576934M428042J0308903J7476382K1060738K8232629N0022668
$$ 59748189 61325123 65753165 76062068 93538450 114599188 142831817 192854485
38007A92854485P2913772O1797468O019791n5978070p7670542n7675466l1864947
$$ 192854485 265768257 327565725 333585516 277607446 199936904 142261438 110396491
38000A10396491k2716876k1036004j4339778p075453o362327p719053n096101
$$ 110396491 87679615 66643611 52303833 45228380 38866053 31147000 26050899
37993B6050899j867108k719358m445311k736242k37519p99313k262285j255759
$$ 26050899 24183791 21464433 17019122 14282880 14045361 13246048 10983763 9728004
37985I728004M19733j14508j202367k99755J005340L18695r59892o30932J10994
$$ 9728004 10147737 10033229 8830862 8531107 9536447 9855142 8895250 8264318 8375312
37976H375312n48231j161974K49525K193901K031003K73222n84983N8648Q56116
$$ 8375312 7827081 6665107 6914632 9108533 11139536 11412758 10827775 10886423 11742539
37967A1742539J116408J408710K337538L774363M495494K651453j776388n480916
$$ 11742539 12858947 14267657 16605195 20379558 24875052 27526505 25750117 20269201
37959B0269201n221289k274088o27972j208732j368219M8940J057372M51730l32031
$$ 20269201 15047912 12773824 12145852 10937120 9568901 9617841 10675213 11126943 10794912
37950A0794912j22254M40291R09812J599066J850087P74895l10515O19436K716269
$$ 10794912 10672658 11112949 12022761 13621827 15471914 16246809 15936294 16555730 19271999
37941A9271999L594683L555897M625866O369824P109505Q170963J1916050J7017439
$$ 19271999 22866682 26422579 31048445 37418269 44527774 52698737 64614787 81632226
37933H1632226K1470826K7862680L7161224L8942661J9822131j5476770m2959160
$$ 81632226 103103052 130965732 168126956 207069617 226891748 211414978 168455818
37926A68455818m5515793l1280123j9245336j5545032j3253738q572585n235888
$$ 168455818 122940025 91659902 72414566 56869534 43615796 35043211 29807323
37919B9807323n119648m961039l056837j665706j868497j917019j287760j408551
$$ 29807323 24687675 19726636 16669799 15004093 13135596 11218577 9930817 8522266
37911H522266k050702j431323L0266J69077q43360q09670L23428M70071n84392
$$ 8522266 6471564 5040241 5070507 5239584 4396224 3586554 3909982 4380053 3795661
37902C795661r10143j01246K92222o7780k5066L19647j98534j036830n53512P63959
$$ 3795661 2885518 2784272 3076494 3008714 2983648 3303295 3104761 2067931 1514419 2278378
37892B278378Q27962l95061q61766n4927M30876j7787k76929J5692m5696m66009
$$ 2278378 3106340 2711279 1849513 1794586 2225462 2207675 1930746 1946438 1900742 1434733
37882A434733k50763M11004L24449l43732l02233L44827K80885m29934m49942
$$ 1434733 1183970 1594974 1919423 1575691 1273458 1618285 1899170 1469236 1019294
37873A019294K17035K67730k91028j65602N67991M56999n33296q20546n9505L49572
$$ 1019294 1236329 1504059 1213031 1047429 1615420 2072419 1539123 718577 659072 1008644
37863A008644n5842j18008M93073N97939j38001m71467J27318N72601K18671j62643
$$ 1008644 952802 834794 1327867 1925806 1787805 1316338 1443656 2016257 2234928 2072285
37853B072285q6645j53085n42104n05984P8728L44565P1714K4977L05372J02712
$$ 2072285 1985640 1832555 1290451 784467 863195 1207760 1279474 1304451 1609823 1712535
37843A712535n63505o45142O411K96525j24785l26345K2328O7092m08650m08881
$$ 1712535 1149030 503888 510299 806824 682039 355694 378022 445114 36464 -372417
37833c72417L68926P88699J88727n45797n77631l10060k49323p4768M04173O33208
$$ -372417 -3491 785208 973935 428138 -149493 -459553 -708876 -783644 -379471 253737
37823B53737L54407J07340J25754r5954o22470o77383J0420O03306M75307R7138
$$ 253737 608144 715484 841238 745284 122814 -554569 -544149 59157 534464 631602
37813F31602O6637K05010J14331j68341m26162m92958j48694N07971P65567K33886
$$ 631602 698239 903249 1017580 849239 423077 -69881 -218575 289396 1054963 1288849
37803A288849l06417m3551M23007J34781l55373Q4940Q70867M43444q93650j181468
$$ 1288849 982432 938881 1361888 1496669 1141296 1226236 2097103 2540547 1646897 465429
37793D65429k166Q54448L61247l84360m34374m04134p17091n50464L60142P95407
$$ 465429 463263 1317711 1678958 1294598 860224 456090 -261001 -811465 -451323 344084
37783C44084J42248l77437J53910O87313J08956p47420n58254L12159O72630M69939
$$ 344084 486332 108895 262805 950118 1059074 311654 -246600 65559 738189 1208128
37773A208128L55952K09728l82482q96017n77871J42345K64061j84665l39966
$$ 1208128 1564080 1773808 1391326 495309 -82562 59783 323844 139179 -200787
37764b00787M9020M25848M27559J89574j27789m09628m39660k28756j44766k97239
$$ -200787 -151767 274081 701640 891214 763425 353797 -85863 -314619 -459385 -756624
37754g56624k89552L3994K33698Q2600k490J98975K44751o2779j58653K57292
$$ -756624 -1046176 -1012182 -778484 -695884 -698374 -499399 -254648 -317427 -476080 -218788
37744b18788N25509R6647m90766m85855n9685K18524L44123N12617M62813K8825
$$ -218788 306721 403368 -87398 -573253 -632938 -414414 -70291 442326 905139 933964
37734I33964k56488M5451M40682K87524j30799j80518k454j33600m24780k99978
$$ 933964 677476 722927 1163609 1451133 1320334 1139816 1137362 1003762 578982 279004
37724B79004J63115L10185n6781m68609n19814k16476K57216O01079M47352j48804
$$ 279004 442119 752304 695523 226914 -292900 -509376 -252160 348919 796271 647467
37714F47467n25690k22255L20419L79196l7133l49103l03375j28466p258N4282
$$ 647467 121777 -100478 219941 599137 562004 212901 -90474 -218940 -226198 -171916
37704a71916k530j59145j36951J88074L88643J4892o29591p75607k14878M40215
$$ -171916 -174446 -333591 -470542 -282468 106175 121067 -508524 -1284131 -1499009 -1058794
37694a058794N74827K59354p037L1880J73179J36033k4898l1585J41777J87174
$$ -1058794 -483967 -224613 -231650 -199770 -26591 109442 84544 52959 194736 381910
37684C81910k2991j81154p7167k0125l08207o29386n32637j77832Q224R9529L53632
$$ 381910 358919 177765 100598 80473 -227734 -857120 -1389757 -1567589 -1559365 -1459836 -1106204
37673a106204M46473o3038p16373o25099J20181N62243L94222K47731L73121K28250
$$ -1106204 -659731 -722769 -1439142 -2064241 -1944060 -1381817 -987595 -739864 -366743 -138493
37663a38493l40530o65958m12481j01279o5210P7841M63439N52356J73283n1030
$$ -138493 -479023 -1144981 -1557462 -1658741 -1723951 -1646110 -1182671 -630315 -457032 -508062
37653e08062J34480R9469m12508o17077m5868M97121K44033k29376j5701O08125
$$ -508062 -373582 -274113 -686621 -1303698 -1349566 -852445 -608412 -837788 -853489 -245364
37643b45364P30716K53051k05536l54763l14360j03977J82407J65475j89825l03588
$$ -245364 485352 738403 532867 178104 -136256 -240233 -57826 107649 -82176 -385764
37633c85764K9775J16222m21101p24389J5650J085354J191844L39311l87961m92950
$$ -385764 -355989 -239767 -660868 -1385257 -1369607 -284253 907591 1246902 858941 365991
37623C65991l45644j04629M23356R30363P42356p3527o35886m46140L6740J43622
$$ 365991 20347 -84282 339074 1269437 2011793 1938266 1302380 856240 892980 1036602
37613A036602k25527o43248o07123k3365N25345L26555l83600m80533M41145J241633
$$ 1036602 811075 167827 -439296 -462661 62684 389239 5639 -474894 -33749 1207884
37603A207884P79262l81296q10720k96978O7730k99018p18901m57790K42389O55769
$$ 1207884 1987146 1605850 795130 498152 565882 266864 -452037 -909827 -667438 -11669
37593a1669N02680R4963j36843j06125j28779m07191n25434L8265Q64325Q75276
$$ -11669 491011 585974 449131 343006 214227 -192964 -718398 -680133 184192 1059468
37583A059468m6426o92613l27436J97365m4458m77726j25357N98548N91819n3149
$$ 1059468 1013042 320429 -7007 190358 145900 -331826 -457183 141365 733184 680035
37573F80035l31664r1842n7120l28005l09785k7342r3904l80063j22326N54114
$$ 680035 348371 256529 199409 -128596 -438381 -465723 -559627 -939690 -1062016 -507902
37563e07902O32493n7397m69012n6101M27803K93379j06932k68268l11748l46416
$$ -507902 124591 67194 -401818 -457919 -30116 263263 156331 -111937 -423685 -770101
37553g70101o5474M76072O20609J78924j52314N2269K85953J30264j6682J51562
$$ -770101 -835575 -359503 261106 440030 287716 339985 625938 756202 739520 891082
37543H91082J53869l36082p16146m31446M5899N1181j71474r1676N0266j95069
$$ 891082 1044951 708869 -7277 -438723 -392824 -341643 -513117 -604793 -554527 -749596
37533g49596m23487K4285P69341Q30652J86050k02176P2461L48523J16124k15323
$$ -749596 -1173083 -1148798 -379457 451195 637245 435069 507530 856053 972177 756854
37523G56854j52127P5180N2754o1843Q4218K92263O3304n47244q83532n57993
$$ 756854 604727 679907 732661 670818 755036 1047299 1110603 563359 -320173 -878166
37513h78166M8571L19928J51213o2914j6651J91882K89341J44426j56140l62913
$$ -878166 -829595 -509667 -358454 -421368 -438019 -246137 43204 187630 31490 -331423
37503c31423k01107L19133P24261N12021j62312n79340l71992M6057J83762J35944
$$ -331423 -532530 -213397 510864 1022885 860573 281233 -90759 -44702 139060 275004
37493B75004J65963J02527k62094n31429j86703M73133O31575J55487k61040k23279
$$ 275004 440967 543494 281400 -250029 -436732 36401 667976 823463 562423 339144
37483C39144j30887l20978m56211j74865K37411L17810J51707J38430L10809L44793
$$ 339144 208257 -112721 -568932 -743797 -506386 -188576 -36869 101561 412370 757163
37473G57163J02218j95463k70122m6049L07448M69060K48175j41326k92078j47542
$$ 757163 859381 663918 393796 347747 655195 1124255 1372430 1231104 939026 791484
37463G91484n0545j55472j58072J62943M57044J93752n97376j244735j066466
$$ 791484 740939 585467 427395 590338 1047382 1241134 643758 -600977 -1667443
37454a667443j4007J194655J585811Q26506l37578q18893m03991J27430J54863
$$ -1667443 -1681450 -486795 1099016 1925522 1587944 769051 365060 492490 647353
37445F47353m3422K2757J74449p6876o05974p56693k99310K49222L60418J13195
$$ 647353 603931 626688 801137 724261 118287 -638406 -937716 -688494 -328076 -214881
37435b14881r3189j03215m3315j3318N14p080n6642n6716J25703L98637M06846
$$ -214881 -308070 -411285 -454600 -467918 -467404 -474484 -531126 -587842 -462139 -63502 343344
37424C43344p3293p49150j009403n62620K46504Q10776Q21917M17791l6960k08011
$$ 343344 270051 -479099 -1488502 -2051122 -1804618 -993842 -171925 245866 208906 895
37414H95l1988J47006r8511o32175p28882k9075P82721P75847O6607l48814n2100
$$ 895 -31093 115913 17402 -614773 -1343655 -1372730 -590009 185838 252445 -96369 -148469
37403a48469K59318m7176n39242m40915J55454M83973K57139o7234j12110k3485
$$ -148469 110849 63673 -475569 -916484 -761030 -277057 -19918 -87152 -199262 -222747
37393b22747J5481J26518L46012L73263N6764k29923j07849J68860O6413l60865
$$ -222747 -207266 -80748 265264 638527 695291 465368 357519 526379 592792 231927
37383B31927m69826M4365O70012P22231J48920n11790p36359l96872K19779N74130
$$ 231927 -237899 -193534 476478 1198709 1347629 835839 99480 -297392 -77613 496517
37373D96517K90122l75908p12978m11621M6861J19392m4777M291K12760J88906
$$ 496517 786639 410731 -302247 -713868 -667007 -547615 -592392 -588101 -375341 -186435
37363a86435l7941o7845J42244K38311J46398J56680K93650K46174R526n8620
$$ -186435 -224376 -292221 -149977 88334 234732 391412 685062 931236 940762 882142
37353H82142N8681l5969l66262m51206j86962q8949l44609m27497o6406K21338
$$ 882142 940823 904854 538592 87386 -99576 -188525 -533134 -960631 -1027037 -805699
37343h05699Q7716J8925L81988O02791J16952n48631n73048j54717l6786j77838
$$ -805699 -717983 -699058 -317070 285721 402673 -145958 -719006 -873723 -910509 -1088347
37333a088347L1139N11349N54166M9940l35295k38169J8716J68954L09667L76307
$$ -1088347 -1057208 -545859 8307 58247 -277048 -515217 -496501 -327547 -17880 358427
37323C58427P6643m80817p24408l61799K79574P08280O67346J71558m19234n36450
$$ 358427 435070 -45747 -770155 -1131954 -852380 -144100 523246 694804 275570 -260880
37313b60880p3754L27898J56547j78635m2221L69348M31606J58437L689l9735
$$ -260880 -334634 -6736 149811 -28824 -71045 298303 729909 888346 892035 852300
37303H52300k20931k86669K8160J66311m17587r69684l84040Q09218R97284R129
$$ 852300 631369 344700 372860 539171 121584 -848100 -1232140 -422922 574362 583491
37293E83491o21436j66891K75907j47958o36871k67581M65523O63341M37750L18932
$$ 583491 -37945 -204836 71071 -76887 -713758 -981339 -515816 147525 585275 904207
37283I04207K08294j33102l73746k28687l7863m9650N2304L20403K21327k41502
$$ 904207 1112501 979399 605653 376966 339103 289453 341757 662160 883487 641985
37273F41985k13757M72549O98162r4696p63453l01532N09359O41054O85471J471609
$$ 641985 428228 900777 1598939 1504243 740790 439258 948617 1589671 2275142 3746751
37263C746751J988165P78271j329711k086299j091334q7031p6106k60459n2356
$$ 3746751 5734916 6513187 5183476 3097177 2005843 1918812 1842706 1582247 1529891
37254A529891p0468n65428o78978m3869M22586J29272j77131J33768M05461l9137
$$ 1529891 1459423 893995 215017 171148 593734 723006 545875 679643 1085104 1045967
37244A045967n85077l69670K45794L49276m5743k45435r4586K4237L5462J28643
$$ 1045967 460890 91220 337014 686290 640547 395112 300526 324763 360225 488868
37234D88868J67021n7482k44899l8087J97791j30308p29982o87990J16419P08806
$$ 488868 655889 598407 353508 315421 513212 382904 -347078 -1035068 -918649 -209843
37224b09843L80452l46887n19139j4452M69398M14019p228l38874l66931j61705
$$ -209843 170609 -176278 -695417 -709869 -240471 173548 166320 -172554 -539485 -701190
37214g01190J18888L14116L04862J26058m5936j17097j68292k12085o1572L09201
$$ -701190 -582302 -268186 36676 162734 116798 -299 -168591 -380676 -442248 -133047
37204a33047M83459J04500m48775m40544J32434M64122J57526j63966J06877N49596
$$ -133047 350412 454912 6137 -434407 -301973 162149 319675 155709 262586 812182
37194H12182L94566k51200o21793m62674k02931r1065N4113K16608O9938l36926
$$ 812182 1206748 955548 333755 -128919 -331850 -422915 -368802 -152194 -82256 -419182
37184d19182m39924J3391N15698M95871P4165j96184o9710K08393L13070J94840
$$ -419182 -859106 -845715 -330017 165854 240019 43835 -25875 182518 495588 690428
37174F90428M9677M4029J10789O9342p6879j46406j18734j91984l87066m16720
$$ 690428 740105 784134 894923 964265 887386 740980 622246 430262 43196 -373524
37164c73524j30803K43877M94591O49392O24237K04556l10739j36518P94894J354543
$$ -373524 -504327 -260450 234141 883533 1507770 1712326 1401587 1265069 2059963 3414506
37154C414506O83885m82652q58714m33772k20428n76636r16519q63294n61422
$$ 3414506 4098391 3615739 2757025 2323253 2102825 1526189 609670 -253624 -815046
37145h15046N477Q59753J309480O16892o18105j008765l83186R6781n0657q442
$$ -815046 -809569 50184 1359664 1976556 1358451 349686 -33500 63281 12624 4182
37135D182N54873O75386j57549q60680l98361N58755P15060J4242o29499p40625
$$ 4182 559055 1234441 1076892 216212 -182149 376606 1091666 1105908 476409 -264216
37125b64216m43289J35923O95427N97400k24438p81138l16389N28895P10487K84941
$$ -264216 -707505 -571582 123845 721245 496807 -284331 -600720 -71825 638662 923603
37115I23603l0879j34909k93387k32347L16690O60364L1800r17814q69952J11882
$$ 923603 892724 757815 464428 232081 548771 1209135 1240935 323121 -546831 -434949
37105d34949O56223J80004m46703m70225j78066M2822L43848O62488M36387l59424
$$ -434949 221274 401278 -45425 -515650 -693716 -650894 -307046 355442 791829 432405
37095D32405q23940l99762K54039K94588p3468q9875L36825N98144L21765k14608
$$ 432405 -391535 -791297 -537258 -242670 -316138 -406013 -69188 528956 850721 636113
37085F36113m93620k48124L37303P27995N27147k9056l15330j25363R5809o0257
$$ 636113 142493 -105631 231672 959667 1486814 1457758 1142428 1017065 1112874 1052617
37075A052617l83318l30067L13083J135348J354453N19007q06297j362720o46608
$$ 1052617 669299 339232 652315 1787663 3142116 3661123 2854826 1492106 845498
37066H45498L07456K41359n64624p61194J6337P00296N21460O917j64144j86372
$$ 845498 1152954 1394313 829689 68495 84832 785128 1306588 1313505 1149361 962989
37056I62989l63886l15828K08342N28433J8049p11022o24344J52451N93683L60782
$$ 962989 599103 283275 491617 1020050 1038099 327077 -297267 -144816 448867 809649
37046H09649R2301J75374K33293j3279k43333j83235p5122j71721k92133j89750
$$ 809649 901950 1077324 1310617 1297338 1054005 870770 795648 623927 331794 142044
37036A42044N8076K85414M79702N57697K87821k83308o63894m96673n3566J61025
$$ 142044 200120 485534 965236 1522933 1810754 1527446 863552 366879 313313 474338
37026D74338R3993Q9643K75972L70510J34429k45714l61192o8979L18167L47806
$$ 474338 568331 657974 933946 1304456 1438885 1193171 831979 763000 1081167 1428973
37016A428973n4506m27314k56002L69874P68572M61200k21354n58257l51556q9283
$$ 1428973 1374467 947153 691151 1061025 1829597 2290797 2069443 1511186 1159630 1070347
37006A070347j81947m20092l98074j48857J4544R0751L38543O51468N14779j96840
$$ 1070347 888400 468308 70234 -78623 -64079 26672 365215 1016683 1531462 1334622
36996A334622q12491o34551J33816O26554L64657k90202o88344n68199j50814
$$ 1334622 522131 -112420 21396 647950 1012607 722405 34061 -534138 -684952
36987f84952J72857J71471n0442j74061n3733J03880Q6124L6961K06563M57793
$$ -684952 -512095 -340624 -391066 -565127 -618860 -514980 -428856 -391895 -185332 272461
36977B72461L84412o8385m47507l72370j3354J71198K2919j53520P332M46314
$$ 272461 656873 588488 140981 -231389 -244743 -73545 -50626 -204146 -196814 249500
36967B49500O81541L90080r9963j81330J53184K28559l10917q83312p65972j27030
$$ 249500 931041 1321121 1221158 1039828 1193012 1421571 1110654 227342 -538630 -665660
36957f65660K83847K07257K9757K5327O8338O1769Q4106J13904R4602J84517M27269
$$ -665660 -381813 -174556 -144799 -119472 -51134 10635 94741 208645 303247 487764 915033
36946I15033L67166l20682r91278o97312L28886Q36456L49251k18951p6042L37444
$$ 915033 1282199 961517 -29761 -727073 -398187 438269 787520 568569 492527 829971
36936H29971K97807m8435j81602j22234j09266J4900L52753M37951n2267n53565
$$ 829971 1127778 1079343 897741 775507 666241 681141 1033894 1471845 1419578 866013
36926H66013l90820J09623J32140l09897m49862j1510M55475M70751J50720j87761
$$ 866013 475193 584816 716956 407059 -42803 -54313 401162 871913 1022633 834872
36916H34872l59301k28506J82059M99979L73317j2309k06930j71689k18663l90077
$$ 834872 475571 247065 429124 929103 1302420 1290111 1083181 911492 692829 302752
36906C02752l97344j36525J72524L30137K92259O5068k17280k83348j02804k0213
$$ 302752 -94592 -231117 -58593 271544 563803 628871 411591 128243 25439 5226
36896E226j93404k65827L368K34600P6859j21337N1407K37179p6063n08184k96085
$$ 5226 -188178 -454005 -450637 -216037 -139178 -260515 -209108 28071 -47992 -556176 -852261
36885h52261M04683P00541L14892j76172l82361m37231l46645L7006L76829J49257
$$ -852261 -447578 252963 567855 391683 9322 -427909 -774554 -737548 -360719 -211462
36875b11462l73665m01017P9066L04821R8328O5553K85002P5892n64218o13242
$$ -211462 -585127 -986144 -907078 -602257 -503929 -438376 -153374 -77482 -641700 -1254942
36865a254942K75801R73673N73571k31814m04277j65251k47143m13734j3626N75783
$$ -1254942 -979141 -5468 568103 336289 -67988 -233239 -480382 -894116 -907742 -331959
36855c31959M02243m30135q30597l83717J65573K03157L6818J20412K99252K45303
$$ -331959 70284 -359851 -1190448 -1574165 -1408592 -1205435 -1168617 -1048205 -748953 -503650
36845e03650Q4042J34827L35096L25744J6290k42623j47322P0471p6901n24614
$$ -503650 -419608 -284781 50315 376059 392349 149726 2404 72875 -4026 -528640
36835e28640n46951J90113Q91572O22723k51183n34771k1519K79081q3888k58006
$$ -528640 -1075591 -885478 6094 628817 377634 -157137 -178656 100425 16537 -241469
36825b41469L23112Q13720L28788n41991o88910k02108L1597j15561q4413J21491
$$ -241469 81643 895363 1224151 682160 -6750 -208858 -177261 -292822 -377235 -255744
36815b55744n721l59467l28743N3538J82474O2231K76254P20786N62292k81800
$$ -255744 -261465 -620932 -949675 -896137 -713663 -651432 -375178 345608 907900 626100
36805F26100p65871k78968M13804L71176k25277o14807n88218l68645N3649O67346
$$ 626100 -139771 -418739 -4935 366241 140964 -473843 -1062061 -1430706 -1377057 -709711
36795g09711R06426K31410q56037j167446l51114N67941N19692j90990l57187
$$ -709711 196715 428125 -427912 -1595358 -1946472 -1378531 -858839 -1049829 -1407016
36786a407016L88363J013556N74019l59287n01300K15841N21996k36600j068403
$$ -1407016 -1018653 -5097 568922 209635 -291665 -75824 446172 209572 -858831
36777h58831q29826J23731O13801L39799l7906r7960K7403K79427O64777P76259
$$ -858831 -1688657 -1564926 -951125 -611326 -649232 -747192 -719789 -440362 224415 1000674
36767A000674K41044m60950n39371j43740q5317l94390l01661K57546L72498k63607
$$ 1000674 1241718 780768 241397 97657 12340 -382050 -683711 -426165 -53667 -317274
36757c17274p14782l14420K81363K88337O2841K73158O08203L63885k25440l30915
$$ -317274 -1032056 -1346476 -1065113 -776776 -713935 -440777 167426 531311 305871 -25044
36747b5044P3640J92281k60158o22235l42420K45391M78537K14733j60197k89810
$$ -25044 48596 240877 -19281 -641516 -983936 -738545 -260008 -45275 -205472 -495282
36737d95282j75010n5629r0974j66980o1738K08832L70923K62230K6621j25773
$$ -495282 -670292 -725921 -816895 -983875 -1045613 -836781 -465858 -203628 -177007 -302780
36727c02780j35123l007K52027M57373L81708P7387j45936j73220j88575k51111
$$ -302780 -437903 -440910 -188883 268490 650198 727585 581649 408429 219854 -31257
36717c1257j70575N0187Q9091j56610l34392k06951l1979n4637m9498K31132N32700
$$ -31257 -201832 -151645 -62554 -219164 -553556 -760507 -792486 -847123 -896621 -665489 -132789
36706a32789M85356K17967J12061J75790J36821j6005n3679L4790L0498j26141
$$ -132789 352567 570534 682595 858385 995206 979201 925522 960312 990810 864669
36696H64669k88307l77496l94027k59644K6740J96194L1404k15491j14838K75442
$$ 864669 576362 198866 -195161 -454805 -428065 -231871 -200467 -415958 -530796 -255354
36686b55354M40370J46373k20262j90070J79492M10830K01005k30872l94685j01942
$$ -255354 185016 331389 111127 -78943 100549 511379 712384 481512 86827 -15115
36676a5115K72281K18485k40741n39980k95929K21514N08465M62961L44400K87788
$$ -15115 257166 475651 234910 -305070 -600999 -379485 128980 591941 936341 1224129
36666A224129J84333m865j01359N4151L51495M65613J69254l77004p05147n35203
$$ 1224129 1408462 1403597 1302238 1356389 1707884 2173497 2342751 1965747 1260600 725397
36656G25397j27091N0258p8882j97710j28699J66J04110K38380L11924J54738
$$ 725397 598306 648564 569682 371972 243273 243439 347549 585929 897853 1052591
36646A052591o9258k1672J56736l7462n28846n51725J66614Q23770O60767J3211
$$ 1052591 983333 961661 1118397 1080935 552089 364 166978 990748 1651515 1664726
36636A664726l76199m72948o05395n51484O1225P56511O32427k70637r26655p08045
$$ 1664726 1288527 815579 210184 -341300 -280075 476436 1108863 838226 -88429 -796474
36626g96474l2574M42050N22530K74571j69934m50015k60212R9234R2180j23694
$$ -796474 -829048 -386998 135532 410103 240169 -209846 -470058 -370824 -278644 -402338
36616d02338P4414N74390N42783j28470m82438q9660J54648l75828p34485J18117
$$ -402338 -327924 246466 789249 660779 178341 88681 243329 -132499 -866984 -748867
36606g48867J356909J314351N2069p08841k44785K19140l14796j001264o44539
$$ -748867 608042 1922393 1974462 1265621 1020836 1239976 925180 -76084 -720623
36597g20623L50758P21953L02097l3644K9026l8160l74479l94618J48010P39664
$$ -720623 -369865 352088 654185 620541 649567 611407 236928 -157690 -9680 729984
36587G29984R73042R53088O28470k98478j413226j558699m12476P69702P56484
$$ 729984 1703026 2656114 3284584 2986106 1572880 14181 -398295 371407 1127891
36578A127891o0421n10276l64983j90907q1678K38773M11258j46964r33036p72399
$$ 1127891 1067470 557194 192211 1304 -80374 158399 569657 422693 -510343 -1282742
36568a282742L41177J072278P00363N4258K5015K56266L77n96675q27340m48096
$$ -1282742 -941565 130713 831076 885334 910349 1166615 1166992 570317 -257023 -705119
36558g05119K38287Q33088R22063K52367p43399j144867o42221J13359N06134
$$ -705119 -466832 366256 1288319 1540686 797287 -347580 -989801 -876442 -370308
36549c70308N77626M03318j99046q92346p81125J94991Q17706L09948m78671m81935
$$ -370308 207318 610636 411590 -480756 -1261881 -1066890 -249184 60764 -417907 -899842
36539h99842m612J51983J57689M73756N96972m4542o61155j80490P76030P13310
$$ -899842 -904454 -752471 -594782 -121026 475946 431404 -229751 -410241 365789 1079099
36529A079099k70664o40724L6544N35160J38245l82523l63839k23453k96949j71052
$$ 1079099 808435 167711 204255 739415 877660 495137 131298 -92155 -389104 -560156
36519e60156K10126J48243m34699n50410J76738O65834J01826o70884m99714L09525
$$ -560156 -350030 -201787 -636486 -1186896 -1010158 -344324 -242498 -913382 -1413096 -1103571
36509a103571O52034K96686j15401j77694L0026L08795L19435k29421q76879o83054
$$ -1103571 -451537 -154851 -270252 -447946 -417920 -109125 210310 -19111 -895990 -1579044
36499a579044K87305P74851K74596n2850O14465J160553L48317r12778r07610
$$ -1579044 -1291739 -516888 -242292 -295142 319323 1479876 1828193 915415 7805
36490G805P4280K79126n53004q77697n4845O72557L94374r1122Q8324M05481R7070
$$ 7805 82085 361211 -191793 -1069490 -1124335 -451778 -57404 -148526 -60202 345279 442349
36479D42349m14405l61593K141l9229l90984m51992k19897j32824j36334J73633
$$ 442349 27944 -333649 -331508 -370737 -761721 -1213713 -1433610 -1566434 -1702768 -1529135
36469a529135O49691O87179K04379k00429j56582K9146n742j16738J8324L25460
$$ -1529135 -879444 -192265 12114 -188315 -344897 -315751 -321493 -438231 -419907 -94447
36459i4447L86954k0540o11817q47987m99175P6279L15727J19432n1111J74463
$$ -94447 292507 271967 -339850 -1187837 -1687012 -1610733 -1295006 -1175574 -1226685 -1052222
36449a052222N47403N32737L1168m83872n30654j31276K69884K88697k7013k67848
$$ -1052222 -504819 27918 59086 -424786 -955440 -1086716 -816832 -528135 -555148 -822996
36439h22996j18759K55668L74439K6284m34983m92698q2227L39057L30210l9666
$$ -822996 -941755 -686087 -311648 -285364 -720347 -1213045 -1295272 -956215 -626005 -665671
36429f65671k96345j23739K62950L86941J19437j55613p7359J87829K14163m1965
$$ -665671 -962016 -1085755 -822805 -435864 -316427 -472040 -549399 -361570 -147407 -189372
36419a89372k12147j16942J686j4734R4658N21018Q55194N10470l97117j036365
$$ -189372 -401519 -518461 -516775 -531509 -436851 84167 939361 1449831 1052714 16349
36409A6349q26978q4031M53622M60570J75888p3304k04789k82711l25349k82307
$$ 16349 -810629 -894660 -441038 19532 195420 122116 -82673 -365384 -690733 -973040
36399i73040j21456Q3915J56370m69j88158o9333L39635N49135K10179l41633
$$ -973040 -1094496 -1010581 -854211 -854680 -1042838 -1112171 -772536 -223401 -13222 -354855
36389c54855m99463k11246M5145O8463J79160N33978P44441M83576J9939k29835
$$ -354855 -854318 -1065564 -1020419 -951956 -772796 -238818 505623 989199 1009138 779303
36379G79303k86804l23886j84862K58603N74837K60089l93314o00242k22468Q3043
$$ 779303 492499 168613 -16249 242354 817191 1077280 683966 83724 -138744 -55701
36369e5701o5051k49365m1819L01968L10120Q595k14837j55176J00725L47628
$$ -55701 -120752 -370117 -411936 -109968 200152 208747 -6090 -161266 -60541 287087
36359B87087L24467j05730o40247p21470k37620L03509M93106M93611N28468L80371
$$ 287087 611554 505824 -134423 -855893 -1093513 -790004 -296898 196713 725181 1105552
36349A105552j58315p11936p39329l19405j2287l6991m9774K51674O66177P24910
$$ 1105552 947237 235301 -504028 -823433 -835720 -872711 -922485 -670811 -4634 720276
36339G20276K35132m28595n80718M6143Q32606Q73079J04540o14685o80244m11204
$$ 720276 955408 526813 -53905 -7762 824844 1697923 1802463 1187778 507534 96330
36329I6330k77165j52664J40798K16343k09054n58797j90263M48467M35668j04523
$$ 96330 -180835 -333499 -192701 23642 -185412 -744209 -934472 -486005 -50337 -154860
36319a54860j85011L96879P31443L04716k45431k71409n0265m8704r5764P2878
$$ -154860 -339871 57008 788451 1093167 847736 576327 526062 477358 381594 454472
36309D54472J45486j78007m72997k02075L54660M91978J16532k74212m20337m46100
$$ 454472 599958 421951 -51046 -253121 101539 593517 710049 435837 15500 -430600
36299d30600l42530J9734M04057L64533n2225k97294j05340J76456J60849r0286
$$ -430600 -773130 -753396 -349339 15194 -37031 -334325 -439665 -263209 -102360 -192646
36289a92646k83497k48022N4715N52165R51645Q95889L83397j78518m42051m34222
$$ -192646 -476143 -724165 -669450 -117285 834360 1730249 2113646 1935128 1493077 1058855
36279A058855l42263k37081j25226o0732p2232j15567j49604j16088J11869N09431
$$ 1058855 716592 479511 354285 293553 221321 105754 -43850 -159938 -48069 461362
36269D61362O85469K82362l73221n08037K5163M42247J58547l02775j46936L43220
$$ 461362 1146831 1429193 1055972 547935 573098 1015345 1173892 871117 724181 1067401
36259A067401J67017p42774j184023l65525Q53731J064030J72153o04945m40617
$$ 1067401 1234418 491644 -692379 -1057904 -204173 859857 1032010 427065 -13552
36250a3552J93656M36077J53139k16402m30898n33350m30925L6827O20218P58972
$$ -13552 180104 616181 769320 552918 122020 -411330 -842255 -805428 -185210 573762
36240E73762L26580j20223j01114J01431q4367n53994n83508P4199P01676N79409
$$ 573762 900342 780119 679005 780436 696069 142075 -441433 -367234 334442 913851
36230I13851J4716j67550N9122r6878q09018j026245O4363J552367J745488M54893
$$ 913851 928567 761017 820139 723261 -85757 -1112002 -1047639 504728 2250216 2705109
36220B705109o98786n29619J60905k9227r38582j152550j81281Q58653R19554
$$ 2705109 2006323 1476704 1637609 1608382 669800 -482750 -664031 194622 1114176
36211A114176L30194o5993k02020m56242o60379l83332J02637J01484l30714m21533
$$ 1114176 1444370 1378377 1176357 720115 59736 -323596 -220959 -119475 -450189 -871722
36201h71722R730K25707j40625l98559L6746N98919M72470o1089j02667M02186
$$ -871722 -861992 -636285 -776910 -1175469 -1138723 -539804 -67334 -128423 -231090 171096
36191A71096O55521L30054m7653r6645r1788k70862l92719k70542j08259l9483
$$ 171096 826617 1156671 1109018 1012373 920585 649723 257004 -13538 -121797 -161280
36181a61280P2919J53324j06241n05663l14362N79682J207526P78752k03938p25798
$$ -161280 -88361 64963 -41278 -546941 -861303 -281621 925905 1704657 1500719 774921
36171G74921o17598m17206l15929m6913M03984O94311O37786L13209j54729n03742
$$ 774921 157323 -259883 -575812 -622725 -218741 475570 1113356 1426565 1271836 768094
36161G68094l65938J34073K58093l01409p85179m85012R0100Q7920k10183M5315
$$ 768094 402156 536229 794322 492913 -292266 -777278 -687178 -599258 -809441 -764126
36151g64126O44025O10857n2808l54641n8049K8565k86594j56820N99986Q70282
$$ -764126 -120101 490756 437948 83307 25258 53823 -232771 -389591 210395 1080677
36141A080677M8086q62656q24241k56662J820J08596M89743O89079J91512l81753
$$ 1080677 1128763 266107 -558134 -814796 -812976 -704380 -214637 474442 665954 284201
36131B84201j85944L52912K54385k97029l06915K60531M46793m2763m39640k81599
$$ 284201 98257 451169 705554 408525 101610 362141 808934 766171 326531 44932
36121D4932k2878m3057n8644J54340K89877J14282j13308j09766O0510K49423
$$ 44932 22054 -21003 -79647 74693 364570 478852 365544 255778 316288 565711
36111E65711L87909L27048J204k65046j25552J87561J89952o5415j68695j48173
$$ 565711 953620 1280668 1281872 1016826 891274 1078835 1268787 1203372 1034677 886504
36101H86504l01241l78947J04723P56432N76730m22089r52745k75386O94992P65260
$$ 886504 585263 206316 311039 1067471 1644201 1222112 269367 -6019 688973 1454233
36091A454233J30972j64670J20269K33500l10228j038634j166063m86132M66586
$$ 1454233 1585205 1420535 1540804 1774304 1464076 425442 -740621 -1226753 -760167
36082g60167R44559O80381J16513j51692q7876q3749k21326j87120L4616K4631
$$ -760167 184392 864773 981286 829594 741718 657969 436643 249523 284139 308770
36072C08770k67925k33739M27072R98834O57455k70117o89611k72472J39207j70382
$$ 308770 40845 -192894 234178 1233012 1890467 1620350 930739 658267 797474 627092
36062F27092p31857n94799K61162Q43443N05152j95615l49405L0374K06800k9209
$$ 627092 -104765 -699564 -438402 405041 910193 714578 365173 395547 602347 573138
36052E73138j39361N0176l7047n67157o78306J86230J093701Q30007k29326o67531
$$ 573138 433777 483953 446906 -120251 -798557 -612327 481374 1311381 1082055 414524
36042D14524j62974K41316j1963k42604O2910L61232J26755k41041k54115j99342
$$ 414524 251550 492866 480903 238299 301209 662441 789196 548155 294040 94698
36032I4698m48843o39608k83234L73238P64561P89284N96062J30044m92878o98704
$$ 94698 -354145 -993753 -1276987 -903749 -139188 650096 1246158 1376202 883324 184620
36022A84620k31500K44128K3003n58731o44665j24430L67720M83717M59170N00462
$$ 184620 -46880 197248 220251 -338480 -983145 -1107575 -739855 -256138 203032 703494
36012G03494N15753M04169J21397m08362r90201j009913j58842Q72623J041447
$$ 703494 1219247 1623416 1744813 1336451 346250 -663663 -822505 50118 1091565
36003A091565K26968o81760r22467n61618p5082K56723M24754N14160N66143M77556
$$ 1091565 1318533 636773 -285694 -847312 -922394 -665671 -240917 273243 839386 1316942
35993A316942J19039l40271m92017k66030r2659k11583k55205O9505L50306J00823
$$ 1316942 1435981 1095710 603693 337663 245004 33421 -221784 -152279 198027 298850
35983B98850l64127l75574K8074K15029r249k11543j32888L335K8365O1611J31052
$$ 298850 -65277 -440851 -412777 -197748 -206997 -418540 -551428 -548093 -519728 -458117 -327065
35972c27065J01097M1421J51702K74560L1636m57991n50432K4371O87835O95088
$$ -327065 -225968 -184547 -32845 241715 273351 -184640 -735072 -710701 -22866 672222
35962F72222j987p65824r41833m14147L35667O81158M67075R8769n6873r9043
$$ 672222 670235 -95589 -1037422 -1451569 -1115902 -434744 32331 131100 74227 -24816
35952b4816k40641l82556l53584k20818o544M72871J040063R66634J3927q46686
$$ -24816 -265457 -648013 -1001597 -1222415 -1228959 -756088 283975 1250609 1264536 417850
35942D17850o14697K47411N00617o300l24726j21995j02183n54464p63809k88242
$$ 417850 -196847 50564 551181 544881 220155 98160 -4023 -558487 -1322296 -1610538
35932a610538L02001M74676M95503N79074L08947l88470o60358K913P28392M73933
$$ -1610538 -1308537 -833861 -338358 240716 549663 161193 -499165 -496252 232140 706073
35922G06073l57820n59655P6100O40188N38053O5063l38692n46214m84288j51705
$$ 706073 348253 -211402 -135302 504886 1042939 1108002 769310 223096 -261192 -412897
35912d12897J22768O5565j1202K86913N89670K31206n18571o29552J35162P59499
$$ -412897 -290129 -224564 -235766 51147 640817 872023 353452 -276100 -140938 618561
35902F18561M39872k88732m49519l7354J61061j67289m85140k72491K74933N74126
$$ 618561 1058433 769701 320182 282828 443889 276600 -208540 -481031 -206098 368028
35892C68028L58092j41684n40446o25164l87992N1036M51142N17868J63601l14590
$$ 368028 726120 584436 43990 -581174 -969166 -918130 -466988 50880 214481 -100109
35882a00109m94446k73805R9757L84825M75776K47511l15389p95595o50281j4200
$$ -100109 -594555 -868360 -768603 -383778 91998 339509 24120 -771475 -1421756 -1435956
35872a435956L34009Q6075r9014L43466R13414P95648J12117l69049m49213n42934
$$ -1435956 -1101947 -1015872 -1114886 -771420 141994 937642 1049759 680710 231497 -311437
35862c11437o89541m74738M8862K93478J44360J62971N41618P06145L05800k04059
$$ -311437 -1000978 -1475716 -1426854 -1133376 -989016 -826045 -284427 421718 727518 523459
35852E23459l83770m41302n62756l91170K10556N98639K89720j57008j1936M14379
$$ 523459 139689 -301613 -864369 -1255539 -1044983 -446344 -156624 -313632 -325568 88811
35842H8811L38653j61488l81348k45045k52372l31035J06517Q96187J055838K84665
$$ 88811 427464 265976 -115372 -360417 -612789 -943824 -837307 58880 1114718 1399383
35832A399383m93425n19688k11321k33280l99301k17320J18411R2629j83882j76270
$$ 1399383 905958 386270 174949 -58331 -457632 -674952 -556541 -463912 -647794 -824064
35822h24064J41734K52793p2558m59441m56265j8934M93385N80368L6626o62915
$$ -824064 -682330 -429537 -502095 -961536 -1417801 -1436735 -943350 -362982 -326356 -989271
35812i89271p17404q420O36845N47259J04712K8694K51643K31633J0606P5588
$$ -989271 -1706675 -1715095 -1078250 -530991 -426279 -397585 -145942 85691 96297 171885
35802A71885L48184K53215k08695l95784j63973j21427m55754m70405J78203O53383
$$ 171885 520069 773284 564589 168805 4832 -116595 -572349 -1042754 -864551 -211168
35792b11168J31513q04027q83969M3992Q35275O34461j35912n34594k53152K77194
$$ -211168 -79655 -883682 -1767651 -1723659 -888384 -253923 -389835 -924429 -1177581 -900387
35782i00387N52114M50982J78164j9386n8432n297Q2461J92045K27284M2429k82475
$$ -900387 -348273 102709 280873 261487 203055 197758 280219 472264 699548 741977 459502
35771D59502l97230j04467L18726M32507J58565k11275m19209m13684k05268J43476
$$ 459502 62272 -42195 276531 709038 867603 656328 237119 -176565 -381833 -238357
35761b38357L67122J54448l76243n91620l3802Q53708J037470J13386j048062
$$ -238357 128765 283213 -93030 -684650 -718452 135256 1172726 1286112 238050
35752B38050j233779l45785N46002O36224K70176J28665J77360K5702j74389j7430
$$ 238050 -995729 -1341514 -795512 -159288 110888 239553 416913 442615 268226 250796
35742B50796K48408L1917m64793m12628K27341M91614l1306m60013n1420N36374
$$ 250796 499204 531121 66328 -346300 -118959 372655 341349 -118664 -170084 366290
35732C66290K87613n15967o97892O4910Q48824P97134P0254n87361o64443j84161
$$ 366290 653903 137936 -559956 -495046 353778 1150912 1221166 633805 -30638 -214799
35722b14799L96674N40100J58453k66058l07854j27928r3375j59617m3701K17945
$$ -214799 181875 721975 880428 614370 306516 178588 85213 -74404 -118105 99840
35712I9840L34373K33808P8499n9656j96995k57077j82040o5385J5929M4508j58397
$$ 99840 434213 668021 746520 686864 489869 232792 50752 -14633 1296 45804 -112593
35701a12593p18449j135182o36575N57548J153138N19174l47008l38513J59156
$$ -112593 -831042 -1966224 -2602799 -2045251 -892113 -372939 -719947 -1058460 -899304
35692h99304J83931j05582P9934N73923N55718P1823j29888l2409k22911n26651
$$ -899304 -715373 -820955 -741021 -167098 388620 460443 330555 298146 75235 -451416
35682d51416k27033M40238N16282L4130n2614K92725J10677o03043o73604J18229
$$ -451416 -678449 -238211 278071 312201 259587 552312 662989 59946 -613658 -495429
35672d95429N29139Q1289j05511M71414O17907k82502q44887k3807Q86435L69041
$$ -495429 33710 114999 9488 480902 1098809 816307 -28580 -52387 834048 1203089
35662A203089p34229p51169R633J48931j72225J72019P62553K18306j049380j166822
$$ 1203089 468860 -282309 -272676 -123745 -295970 -123951 638602 856908 -192472 -1359294
35652a359294Q1568Q64069L48977j73237J92630N23316Q1669k65596J96680N94172
$$ -1359294 -1277726 -413657 -64680 -237917 -45287 478029 559698 294102 490782 1084954
35642A084954R8487m85442j85630L58756J13734m16259j36664N33299K85045p44023
$$ 1084954 1183441 697999 512369 871125 984859 568600 431936 965235 1250280 506257
35632E06257j032876r5696P74959N45092j53661k80219M1432N1863k56549k43847
$$ 506257 -526619 -622315 152644 697736 544075 263856 305288 357151 100602 -143245
35622a43245J69066L01815j63150n67191j93641O20942Q68170K48413m46549m82387
$$ -143245 25821 327636 164486 -402705 -596346 24596 892766 1141179 694630 212243
35612B12243j09613M8736j2769O0870J40060j57942n79812m69132J09394L81716
$$ 212243 102630 151366 138597 199467 339527 181585 -398227 -867359 -757965 -376249
35602c76249J38900O1806M64696O66135J48073n06412n35542j70197j01429l21489
$$ -376249 -237349 -175543 289153 955288 1103361 596949 61407 -108790 -210219 -531708
35592e31708l25714p2895Q8142J74198M41875O92819M91096k0506k52431o6165
$$ -531708 -857422 -930317 -842175 -667977 -226102 466717 957813 937307 684876 618711
35582F18711J40627J84334K21314J61771k63387p78999p01985L539N51584M72251
$$ 618711 759338 943672 1164986 1326757 1063370 284371 -417614 -414075 137509 609760
35572F09760J88026J22919J7432l49819m96736l6894M26173J04386o22388o54330
$$ 609760 797786 920705 938137 588318 91582 54688 480861 585247 -37141 -691471
35562f91471J23143O19708K21998l02433r4211M44014L80260k06067l78220J45437
$$ -691471 -568328 51380 273378 -29055 -123266 320748 701008 494941 116721 262158
35552B62158N87404L53702j47469k77723r0506K272k1802N2854J26065k9231k35956
$$ 262158 849562 1203264 1055795 778072 687566 689838 668036 720890 846955 817724 581768
35541E81768j52640P5302j3864m06051n67477k61155J35596K72287K74792L34442
$$ 581768 429128 504430 490566 84515 -482962 -744117 -608521 -336234 -61442 273000
35531B73000L06174K4597l14821m03337k26557J1575J77175K30384J47669j8726
$$ 273000 579174 603771 288950 -114387 -340944 -329369 -152194 78190 225859 207133
35521B07133j52462k14457k03175k1882L11080M07307m6520n97913m28784L96474
$$ 207133 54671 -159786 -362961 -384843 -73763 333544 287024 -310889 -739673 -343199
35511c43199Q14033K65603m10425k12105N12710O19622j23962p90928o79158j14925
$$ -343199 470834 736437 326012 113907 626617 1246239 1122277 331349 -347809 -462734
35501d62734K61824L33564L44654L68768K65987k6232l52961m50047k20468M9952
$$ -462734 -200910 132654 477308 846076 1112063 1085831 732870 282823 62355 112307
35491A12307m2380m08190m55447L4762M23550P8685o16611p40414j18368N24772
$$ 112307 69927 -338263 -793710 -758948 -335398 -256713 -873324 -1613738 -1732106 -1207334
35481a207334O11930K65775j58035m39758l63158J41204O22705M90045j19830
$$ -1207334 -595404 -329629 -487664 -927422 -1290580 -1149376 -526671 -36626 -156456
35472a56456m46265j82443J91292K78567K55052K71921J41521m2884K31062R17844
$$ -156456 -602721 -785164 -593872 -315305 -60253 211668 353189 310305 541367 1459211
35462A459211J075965J90760q39360q80878k02046M2253l73274n37529J9473O15809
$$ 1459211 2535176 2725936 1886576 1005698 803652 845905 472631 -64898 -45425 570384
35452E70384N65503J47508l9575j3038j30398l50827l78672k68590k96318l54418
$$ 570384 1135887 1283395 1243820 1230782 1100384 749557 370885 102295 -194023 -548441
35442e48441o5706M64270N78075l394o30256n13490K01308O37987L73477j09527
$$ -548441 -614147 -149877 428198 424804 -205452 -718942 -517634 120353 493830 384303
35432C84303k29893l4439J39308K38069L09620J41630l64563p32286m56239J39692
$$ 384303 154410 119971 259279 497348 806968 948598 584035 -148251 -604490 -464798
35422d64798K77745q9171k28773J41043M02959J35077j49122R2352M46768K03464
$$ -464798 -187053 -276224 -504997 -363954 39005 174082 24960 117312 564080 767544
35412G67544m42527o48354j96476K54263K09181k9756L3965L30674L67932o3548
$$ 767544 325017 -323337 -519813 -265550 -56369 -86125 -52160 278514 646446 582898
35402E82898n60133n08644J97532R21320R27563K34535m48450o22919m45987k27826
$$ 582898 22765 -485879 -288347 632973 1560536 1795071 1346621 723702 277715 49889
35392D9889k0538R5663r2110m06235k52908M20294P66518K52310l98554k84247
$$ 49889 29351 125014 32904 -373331 -626239 -205945 560573 812883 414329 130082
35382A30082K19123J20573m66493n11434J33530M40480n9381n00304j58201L85132
$$ 130082 349205 469778 3285 -508149 -374619 65861 6480 -493824 -652025 -266893
35372b66893K89021j94495k82825L1134J49732j5145j442K50612K32882k29810
$$ -266893 22128 -172367 -455192 -424058 -274326 -289471 -290913 -40301 192581 -37229
35362c7229n73110k79004L49254N61680J47388l01110j88209K73395L60781r5317
$$ -37229 -610339 -889343 -540089 21591 168979 -132131 -320340 -46945 313836 218519
35352B18519l99819l71O22499N87741j23217o73720n61626j42137R5686J36591
$$ 218519 -181300 -181671 440828 1028569 905352 231632 -329994 -472131 -376445 -239854
35342b39854J52714J63170J80628K39230J66231j89742m87401k81047J06050p8908
$$ -239854 -87140 76030 256658 495888 662119 472377 -15024 -296071 -190021 -268929
35332b68929o74484o04169L99947J139584P00301j27212j25296M60713M73961
$$ -268929 -943413 -1547582 -1147635 -8051 692250 565038 439742 900455 1374416
35323A374416k45655p64157o44920m25388m65390m06322j9206K97613K08657l8804
$$ 1374416 1128761 364604 -280316 -705704 -1171094 -1577416 -1596622 -1299009 -1090352 -1129156
35313a129156r9874j2236O8365J67155K90226K75560L3757k93710m74244l09261
$$ -1129156 -1229030 -1241266 -1172901 -1005746 -715520 -439960 -406203 -699913 -1174157 -1483418
35303a483418K41072Q06438P60811M0272n16764k15344M29356M14786k05695m30651
$$ -1483418 -1242346 -435908 324903 365175 -151589 -366933 62423 477209 271514 -159137
35293a59137Q2846N26843K67440k63292l86247j19407J32769J98750M3966l56937
$$ -159137 -76291 450552 717992 454700 68453 -50954 81815 280565 324531 -32406
35283c2406o78883l84475L99053P72352K94851l23372l18830o347p8046l43722
$$ -32406 -711289 -1095764 -696711 75641 370492 47120 -271710 -278057 -356103 -699825
35273f99825j12740M93005O30761J12879k63176K1624M25426K42795l20069n22037
$$ -699825 -812565 -319560 311201 424080 160904 182528 607954 850749 530680 8643
35263H643k03252O8944p6426k68114J121N47184O85901K08052k87465k56166o034
$$ 8643 -194609 -125665 -202091 -470205 -469084 78100 764001 972053 684588 428422 422388
35252D22388j67829o15018n82275R8176N79277J55613o98646r37235k74108N69545
$$ 422388 254559 -360459 -942734 -844558 -265281 -109668 -808314 -1745549 -2019657 -1450112
35242a450112P92355K91535l98754o42647k41522L55526M93499R9875k06193L2822
$$ -1450112 -657757 -366222 -764976 -1407623 -1649145 -1293619 -800120 -700245 -906438 -873616
35232h73616M93497O08756L64292J14408q7053l92196n81718k55115L89495O13472
$$ -873616 -380119 228637 592929 707337 620284 228088 -353630 -608745 -219250 394222
35222C94222J52069l85720m01443j04940m9242k47519k47854Q6568L73759L17331
$$ 394222 546291 160571 -240872 -345812 -395054 -642573 -890427 -803859 -430100 -112769
35212a12769J03436K5933J3328j84493m70485m12791J26791O60087O21404R6971
$$ -112769 -9333 16600 29928 -154565 -625050 -1037841 -911050 -250963 370441 467412
35202D67412l22012l63303l28273m13266k71292L55107R39117P28855j10171n87878
$$ 467412 145400 -217903 -546176 -959442 -1230734 -875627 63490 792345 682174 94296
35192I4296k49427K24278J27295j84954L3416N78851N15037l11900q81934m42676
$$ 94296 -155131 69147 196442 11488 44904 623755 1138792 826892 -55042 -497718
35182d97718M12382O52505K27303j16845o1894L3238m0248o3368J3040q5083l54606
$$ -497718 -85336 567169 794472 677627 615733 648971 608723 545355 558395 473312 118706
35171A18706m05410j44198L9896l0391p6392k4915j87651m82428k96317M14296
$$ 118706 -286704 -430902 -391006 -421397 -497789 -522704 -710355 -1192783 -1489100 -1074804
35161a074804P51266K46300k64497J0386M38706N3828o81114n74366K56830N56734
$$ -1074804 -323538 -77238 -341735 -331349 107357 161185 -519929 -1094295 -837465 -280731
35151b80731K2766k94108J45922N55255K97179j07967n8351J32719k022k07647
$$ -280731 -257965 -552073 -406151 149104 446283 338316 279965 412684 410662 203015
35141B03015o9010K48124L88637L39790J59500j87364m17569j13769L97330K49692
$$ 203015 134005 382129 770766 1110556 1270056 1082692 665123 551354 948684 1198376
35131A198376n37856q62566k27847M59556L93339M1329M1540N4000l16891n06342
$$ 1198376 660520 -202046 -429893 29663 423002 464331 505871 559871 242980 -263362
35121b63362k4714M16529M0352n41553l10986M07310N37228L8788k67072k12387
$$ -263362 -288076 128453 168805 -372748 -683734 -276424 260804 299592 32520 -179867
35111a79867k49519k73499J42250O16510M31538j01630j04256K80858J86450k90765
$$ -179867 -429386 -702885 -560635 55875 487413 385783 281527 562385 748835 458070
35101D58070k31988L47956M72453j8663k69976j30463l90703j011949q78829J45801
$$ 458070 226082 574038 1046491 1027828 757852 627389 236686 -775263 -1654092 -1508291
35091a508291O57279k7844o84946k24862N99234O85309M08162N97123Q32922K76514
$$ -1508291 -851012 -878856 -1563802 -1788664 -1189430 -504121 -95959 501164 1334086 1610600
35081A610600o19563p52152k01758O251l27425l91650J20041N08227K38397l00523
$$ 1610600 991037 238885 37127 43378 -284047 -675697 -555656 -47429 190968 -109555
35071a09555m51072j00953L32818L82818j7608l79849j82093L20018L00286l70039
$$ -109555 -560627 -661580 -328762 54056 36448 -343401 -525494 -205476 94810 -275229
$$ [...]
##END NTUPLES=NMR SPECTRUM
##END=
