##TITLE=31Pdec_LR-733-CR4A-C2
 CDCl3
  24 sc
 29.11.2023
##JCAMPDX= 6.0         $$ Bruker NMR JCAMP-DX V2.0
##DATA TYPE= NMR SPECTRUM
##DATA CLASS= NTUPLES
##ORIGIN= UXNMR, Bruker Analytische Messtechnik GmbH
##OWNER= root
$$ XWIN-NMR		Version 3.5
$$ Wed Nov 29 14:37:36 2023 Russian Standard Time (UT+4h)  she@DPX200
##.OBSERVE FREQUENCY= 81.013821
##.OBSERVE NUCLEUS= ^31P
##.ACQUISITION MODE= SIMULTANEOUS
##.ACQUISITION SCHEME= undefined
##.AVERAGES= 24
##.DIGITISER RES= 16
##SPECTROMETER/DATA SYSTEM= spect
##.PULSE SEQUENCE= zgpg30
##.SOLVENT NAME= CDCl3
##.SHIFT REFERENCE= (INTERNAL, CDCl3, 0, 248.564)
##AUDIT TRAIL= $$ (NUMBER, WHEN, WHO, WHERE, WHAT)
$$ ##TITLE= Audit trail, XWIN-NMR		Version 3.5
$$ ##JCAMPDX= 5.01
$$ ##ORIGIN= Bruker BioSpin GmbH
$$ ##OWNER= she
$$ F:/spectra/data/she/nmr/P31/1/pdata/1/auditp.txt
$$ ##AUDIT TRAIL=  $$ (NUMBER, WHEN, WHO, WHERE, WHAT)
(   1,<2023-11-29 14:36:26.18 +0400>,<she>,<DPX200>,
      <created by zg, POWCHK disabled, PULCHK disabled
       configuration hash MD5:
       00 E9 B6 7A A2 85 ED C7 34 08 36 98 17 FE 4E 26
       data hash MD5: 32K
       A6 27 0D 6E BB 79 09 AC 76 D8 63 CA 73 3C 92 4C>)
(   2,<2023-11-29 14:36:28.50 +0400>,<she>,<DPX200>,
      <Start of raw data processing
       efp BC_mod = 2 LB = 10 FT_mod = 6 PKNL = 1 PHC0 = -11677.52 PHC1 = -67.90641 SI = 64K 
       data hash MD5: 64K
       99 E6 6C E9 F2 ED 53 7C 7A CF 41 5A 34 11 9D 3C>)
(   3,<2023-11-29 14:36:42.79 +0400>,<she>,<DPX200>,
      <pk PHC0 = 20.18356 PHC1 = 0 
       data hash MD5: 64K
       18 7C 2D 1F 45 91 9F 2E 9E 44 01 F0 6E E9 B0 60>)
(   4,<2023-11-29 14:36:46.26 +0400>,<she>,<DPX200>,
      <abs ABSG = 5 
       data hash MD5: 64K
       80 98 73 35 11 41 33 0C 28 1D 26 66 F1 0D 2A 18>)
(   5,<2023-11-29 14:37:00.00 +0400>,<she>,<DPX200>,
      <pk PHC0 = -7.205487 PHC1 = 0 
       data hash MD5: 64K
       8D 83 2F 71 53 82 4A 7F D6 81 BD 06 65 72 DE CD>)
(   6,<2023-11-29 14:37:03.71 +0400>,<she>,<DPX200>,
      <abs ABSG = 5 
       data hash MD5: 64K
       46 2F 27 97 28 F8 5B D2 B3 7C D5 40 0D 27 71 85>)
$$ ##END=
$$ 
$$ hash MD5
$$ EB 30 B8 7D A4 9A 0F 95 DA F1 86 1D 53 B6 7A 6B
##$RELAX= 
##$RELAX= 
##$RELAX= 
##$RELAX= 
##$RELAX= 
##$RELAX= 
##$RELAX= 
##$RELAX= 
##$RELAX= 
$$ Bruker specific parameters
$$ --------------------------
##$DU= <F:/spectra>
##$EXPNO= 1
##$NAME= <P31>
##$PROCNO= 1
##$TYPE= <nmr>
##$USER= <she>
##$AMP= (0..31)
100 100 100 100 100 100 100 100 100 100 100 100 100 100 100 100 100 100 
100 100 100 100 100 100 100 100 100 100 100 100 100 100 
##$AQSEQ= 0
##$AQ_mod= 1
##$AUNM= <au_zg>
##$AUTOPOS= <>
##$BF1= 81.014009
##$BF2= 200.13
##$BF3= 200.13
##$BF4= 200.13
##$BF5= 200.13
##$BF6= 200.13
##$BF7= 200.13
##$BF8= 200.13
##$BYTORDA= 1
##$CFDGTYP= 0
##$CFRGTYP= 5
##$CHEMSTR= <none>
##$CNST= (0..31)
1 1 145 1 1 1 1 1 1 1 1 1 1 1 1 1 1 1 1 1 1 1 1 1 1 1 1 1 1 1 1 1 
##$CPDPRG= <waltz16>
##$CPDPRG1= <>
##$CPDPRG2= <waltz16>
##$CPDPRG3= <>
##$CPDPRG4= <mlev>
##$CPDPRG5= <mlev>
$$ [...]
##$SUBNAM3= <"">
##$SUBNAM4= <"">
##$SUBNAM5= <"">
##$SUBNAM6= <"">
##$SUBNAM7= <"">
##$SUBNAM8= <"">
##$SUBNAM9= <"">
##$SW= 501.771253377433
##$SWIBOX= (0..15)
0 1 3 0 0 0 0 0 0 0 0 0 0 0 0 0 
##$SW_h= 40650.406504065
##$TD= 32768
##$TD0= 1
##$TE= 0
##$TE2= 300
##$TE3= 300
##$TEG= 300
##$TL= (0..7)
0 120 53 12 22 120 120 120 
##$TP= (0..7)
150 150 150 150 150 150 150 150 
##$TP07= 0
##$TPNAME0= <>
##$TPNAME1= <>
##$TPNAME2= <>
##$TPNAME3= <>
##$TPNAME4= <>
##$TPNAME5= <>
##$TPNAME6= <>
##$TPNAME7= <>
##$TPOAL= (0..7)
0.5 0.5 0.5 0.5 0.5 0.5 0.5 0.5 
##$TPOFFS= (0..7)
0 0 0 0 0 0 0 0 
##$TUNHIN= 0
##$TUNHOUT= 0
##$TUNXOUT= 0
##$USERA1= <user>
##$USERA2= <user>
##$USERA3= <user>
##$USERA4= <user>
##$USERA5= <user>
##$V9= 5
##$VALIST= <valist>
##$VCLIST= <CCCCCCCCCCCCCCC>
##$VD= 0
##$VDLIST= <DDDDDDDDDDDDDDD>
##$VPLIST= <PPPPPPPPPPPPPPP>
##$VTLIST= <TTTTTTTTTTTTTTT>
##$WBST= 1024
##$WBSW= 4
##$XGAIN= (0..3)
0 0 0 0 
##$XL= 0
##$YL= 0
##$YMAX_a= 4692
##$YMIN_a= -1971
##$ZGOPTNS= <>
##$ZL1= 120
##$ZL2= 120
##$ZL3= 120
##$ZL4= 120
##$ABSF1= 248.5645
##$ABSF2= -253.2056
##$ABSG= 5
##$ABSL= 3
##$ALPHA= 0
##$AQORDER= 0
##$ASSFAC= 0
##$ASSFACI= 0
##$ASSFACX= 0
##$ASSWID= 0
##$AUNMP= <proc_1d>
##$AZFE= 0.1
##$AZFW= 0.5
##$BCFW= 0
##$BC_mod= 2
##$BYTORDP= 0
##$COROFFS= 0
##$CY= -3
##$DATMOD= 1
##$DC= 0
##$DFILT= <>
##$DTYPP= 0
##$F1P= 0
##$F2P= 0
##$FCOR= 1
##$FTSIZE= 65536
##$FT_mod= 6
##$GAMMA= 0
##$GB= 0
##$INTBC= 1
##$INTSCL= 6.047779e-11
##$ISEN= 30
##$LB= 10
##$LEV0= 0
##$LPBIN= 0
##$MAXI= 10000
##$MC2= 0
##$MEAN= 0
##$ME_mod= 0
##$MI= 50
##$NCOEF= 0
##$NC_proc= -9
##$NLEV= 6
##$NOISF1= 182.463
##$NOISF2= 159.3651
##$NSP= 0
##$NTH_PI= 0
##$NZP= 0
##$OFFSET= 248.5645
##$PC= 4
##$PHC0= -11664.54
##$PHC1= -67.90641
##$PH_mod= 1
##$PKNL= yes
##$PPARMOD= 0
##$PSCAL= 0
##$PSIGN= 0
##$REVERSE= no
##$SF= 81.0140089999694
##$SI= 65536
##$SIGF1= 159.3651
##$SIGF2= -187.1042
##$SINO= 113.3802
##$SIOLD= 16384
##$SREGLST= <1H.CDCl3>
##$SSB= 0
##$STSI= 65536
##$STSR= 0
##$SW_p= 40650.406504065
##$SYMM= 0
##$S_DEV= 0
##$TDeff= 32768
##$TDoff= 0
##$TI= <>
##$TILT= no
##$TM1= 0
##$TM2= 0
##$TOPLEV= 0
##$USERP1= <user>
##$USERP2= <user>
##$USERP3= <user>
##$USERP4= <user>
##$USERP5= <user>
##$WDW= 1
##$XDIM= 65536
##$YMAX_p= 460227749
##$YMIN_p= -68995205
$$ End of Bruker specific parameters
$$ ---------------------------------
##NTUPLES= NMR SPECTRUM
##VAR_NAME=  FREQUENCY,     SPECTRUM/REAL,   SPECTRUM/IMAG
##SYMBOL=    X,             R,               I
##VAR_TYPE=  INDEPENDENT,   DEPENDENT,       DEPENDENT
##VAR_FORM=  AFFN,          ASDF,            ASDF
##VAR_DIM=   65536,         65536,           65536
##UNITS=     HZ,            ARBITRARY UNITS, ARBITRARY UNITS
##FACTOR=    0.620285442955139, 1,           1
##FIRST=     20137.2065510682, 0,            0
##LAST=      -20513.1999529968, 0,           0
##MIN=       -20513.1999529968, -68995205,   0
##MAX=       20137.2065510682, 460227749,    0
$$ Real data points
##PAGE= N=1
##DATA TABLE= (X++(R..R)), XYDATA
$$ [...]
41933C316734r6527j32186j68591k03173k34686k62960k88395l11683l33463l53227
$$ 3316734 3220207 3088021 2919430 2716257 2481571 2218611 1930216 1618533 1285070 931843
41923I31843l67568l68874l46541k91487k02009q7189L4761J42758K20235K60125
$$ 931843 564275 195401 -151140 -442627 -644636 -731825 -697064 -554306 -334071 -73946
41913g3946K65174K44461K08753J67519J28428R7806P9939P5112P8417Q1362P5781
$$ -73946 191228 435689 644442 811961 940389 1038195 1118134 1193246 1271663 1353025 1428806
41902A428806N7424K6986j1243n1632q9300j21514j48113j70456j89688k05509
$$ 1428806 1486230 1513216 1501973 1450341 1361041 1239527 1091414 920958 731270 525761
41892E25761k16208k19328k12565j95153j69286j40370j14895r6957q5794p5894
$$ 525761 309553 90225 -122340 -317493 -486779 -627149 -742044 -839001 -924795 -1000689
41882a000689n9805l2418N173M5002P6109R1005R0153Q1165P3687P4092Q3643
$$ -1000689 -1060494 -1092912 -1087739 -1042737 -966628 -875623 -785470 -704305 -630618 -556526 -472883
41871d72883J00414J22602J49881J81889K15712K45329K63757K65912K50255K19051
$$ -472883 -372469 -249867 -99986 81903 297615 542944 806701 1072613 1322868 1541919
41861A541919J78042J35335R8677P1899N2875L5108J2199j7723n0775q0125j00763
$$ 1541919 1719961 1855296 1953973 2025872 2078747 2113855 2126054 2108331 2057556 1977431 1876668
41850A876668j12680j20625j31644j52821j89970k46153l19621m02343m80680
$$ 1876668 1763988 1643363 1511719 1358898 1168928 922775 603154 200811 -279869
41841b79869n38532n62205n45481m92466m15666l29836k45767j68651j01079m6538
$$ -279869 -818401 -1380606 -1926087 -2418553 -2834219 -3164055 -3409822 -3578473 -3679552 -3726090
41831c726090r462P766P508l218j5153j9687j0824J3642N1478R6092J38069J67889
$$ -3726090 -3735552 -3727786 -3720278 -3723496 -3738649 -3758336 -3769160 -3755518 -3704040 -3607948 -3469879 -3301990
41819c301990J78620J67705J37938R7818O0265L8844M3009P5491J33197K09563
$$ -3301990 -3123370 -2955665 -2817727 -2719909 -2659644 -2620800 -2577791 -2502300 -2369103 -2159540
41809b159540K95726L80721M52851N02680N25402N20427M89087M33311L56923
$$ -2159540 -1863814 -1483093 -1030242 -527562 -2160 518267 1007354 1440665 1797588
41800A797588K67844J78229J01048M4896J0513q685k2280l7122n3209o3447n7611
$$ 1797588 2065432 2243661 2344709 2389605 2400118 2391433 2369153 2332031 2278822 2215375 2157764
41789B157764k7926K7431J04565J95901K91103L76765M37338M58843M33625L63026
$$ 2157764 2129838 2157269 2261834 2457735 2748838 3125603 3562941 4021784 4455409 4818435
41779D818435K56654J29409j946j21548k16262k76667k97572k78584k24989j48460
$$ 4818435 5075089 5204498 5202552 5081004 4864742 4588075 4290503 4011919 3786930 3638470
41769C638470o6471Q52L6599L3674j643n2044r7033j22305j25549j15816j07548
$$ 3638470 3571999 3572851 3609450 3643124 3641481 3589437 3492404 3370099 3244550 3128734 3021186
41758C021186j13382j39571j85351k44912l10064l72246m23563m57352m69264
$$ 3021186 2907804 2768233 2582882 2337970 2027906 1655660 1232097 774745 305481
41749C05481m59223m32960m01072l75282l64213l71049l93570m25125m55847m74233
$$ 305481 -153742 -586702 -987774 -1363056 -1727269 -2098318 -2491888 -2917013 -3372860 -3847093
41739c847093m69245m32359l59163k50717j14408L6563J85789L17525M20122M87769
$$ -3847093 -4316338 -4748697 -5107860 -5358577 -5472985 -5436422 -5250633 -4933108 -4512986 -4025217
41729d025217N20553N23738N06389M78803M48681M17748L81639L33865K71083
$$ -4025217 -3504664 -2980926 -2474537 -1995734 -1547053 -1129305 -747666 -413801 -142718
41720a42718J95685J14244L4124l8913j01000j49329j81452j95390j90933j71480
$$ -142718 52967 167211 201335 162422 61422 -87907 -269359 -464749 -655682 -827162
41710h27162j45023j22814j15825j30812j68097k21973k83022l40676l84937m07473
$$ -827162 -972185 -1094999 -1210824 -1341636 -1509733 -1731706 -2014728 -2355404 -2740341 -3147814
41700c147814m03026l71386l18378k54404j90612j34717q8529m8118o190M4285
$$ -3147814 -3550840 -3922226 -4240604 -4495008 -4685620 -4820337 -4908866 -4956984 -4963174 -4918889
41690d918889J06789J79836K57985L34308M02378M56841M92881N05941M92417
$$ -4918889 -4812100 -4632264 -4374279 -4039971 -3637593 -3180752 -2687871 -2181930 -1689513
41681a689513M51276L85778L03991K16996J34810O2026l777o8979j37651k06303
$$ -1689513 -1238237 -852459 -548468 -331472 -196662 -134636 -138413 -207392 -345043 -551346
41671e51346k63236k93026k83366k30937j44077m1174N5417J28013J70360J88121
$$ -551346 -814582 -1107608 -1390974 -1621911 -1765988 -1807162 -1751745 -1623732 -1453372 -1265251
41661a265251J92819J94114J95614J95797J91567J81607J68149J56631J53207
$$ -1265251 -1072432 -878318 -682704 -486907 -295340 -113733 54416 211047 364254
41652C64254J61516J81043K08230K38463K66755K87498K95567K89470K73888K58330
$$ 364254 525770 706813 915043 1153506 1420261 1707759 2003326 2292796 2566684 2825014
41642B825014K51663K56075K64909K66362K50782K16802J72546J31908J08830
$$ 2825014 3076677 3332752 3597661 3864023 4114805 4331607 4504153 4636061 4744891
41633D744891J12408J43824J95399K52194K96063L10453K84015K12755J01519
$$ 4744891 4857299 5001123 5196522 5448716 5744779 6055232 6339247 6552002 6653521
41624F653521l5871j79862l12019m21716n07886n74693o24946o56520o64143o44897
$$ 6653521 6617650 6437788 6125769 5704053 5196167 4621474 3996528 3340008 2675865 2030968
41614B030968o02950n49711m98702m58834m30995m09875l88550l61987l28090
$$ 2030968 1428018 878307 379605 -79229 -510224 -920099 -1308649 -1670636 -1998726
41605a998726k87296k41816j94708j48852j06261o7701l2213L258M3142R0945
$$ -1998726 -2286022 -2527838 -2722546 -2871398 -2977659 -3045360 -3077573 -3074315 -3031173 -2940228
41595b940228J46386K03796K52997K82661K84856K58601K10616J53211J00605
$$ -2940228 -2793842 -2590046 -2337049 -2054388 -1769532 -1510931 -1300315 -1147104 -1046499
41586a046499O5000N3235O4801R2120J22702J42107J37128R9745L1028n7606j47724
$$ -1046499 -981499 -928264 -863463 -771343 -648641 -506534 -369406 -269661 -238633 -296239 -443963
41575d43963k20553k63759k75448k64003k43477k26256k16901k10901j98433j70009
$$ -443963 -664516 -928275 -1203723 -1467726 -1711203 -1937459 -2154360 -2365261 -2563694 -2733703
41565b733703j21115n4593J9601Q7587J36823J61043J62669J51764J41817J43514
$$ -2733703 -2854818 -2909411 -2889810 -2802223 -2665400 -2504357 -2341688 -2189924 -2048107 -1904593
41555a904593J59660J84580K08601K24054K28360K23306K12687K00524J90090
$$ -1904593 -1744933 -1560353 -1351752 -1127698 -899338 -676032 -463345 -262821 -72731
41546g2731J82963J78378J73577J65161J50250J26551R2043M5832j0057o9992
$$ -72731 110232 288610 462187 627348 777598 904149 996192 1042024 1031967 961975
41536I61975j26865j75486k14310k44300k66699k81278k85269k73180k38785j79365
$$ 961975 835110 659624 445314 201014 -65685 -346963 -632232 -905412 -1144197 -1323562
41526a323562r9373j0028P5151J45322J94538K21241K27229K17593K00973J88601
$$ -1323562 -1422935 -1432963 -1357812 -1212490 -1017952 -796711 -569482 -351889 -150916 37685
41516C7685J91223K15013K58629L13343L66424M05977M24504M19518L92137L46134
$$ 37685 228908 443921 702550 1015893 1382317 1788294 2212798 2632316 3024453 3370587
41506C370587K88420K28897J77351J38788J11404Q9332O7486M4587K3280R019
$$ 3370587 3659007 3887904 4065255 4204043 4315447 4404779 4472265 4516852 4540132 4549151
41496D549151Q573K7488O6575J19351J72643K10864K22329K04318J63740J12616
$$ 4549151 4557724 4585212 4651787 4771138 4943781 5154645 5376974 5581292 5745032 5857648
41486E857648O1577J5950k3773n9134r1682j22275j50518j73791j87423j87167
$$ 5857648 5919225 5935175 5911402 5852268 5760586 5638311 5487793 5314002 5126579 4939412
41476D939412j72562j47777j18334q6533n0100n543M6981J01465J47583J74274
$$ 4939412 4766850 4619073 4500739 4414206 4364106 4358563 4405544 4507009 4654592 4828866
41466D828866J73583J43629Q9327K0090n3942j24339j84107k26467k45194k36903
$$ 4828866 5002449 5146078 5235405 5255495 5201553 5077214 4893107 4666640 4421446 4184543
41456D184543k03813j54995j04819o8491n6459p0725j05207j49593j93520k28438
$$ 4184543 3980730 3825735 3720916 3652425 3595966 3525241 3420034 3270441 3076921 2848483
41446B848483k47064k42873k11618j53898p5651J4623J09415K03125K90306L64254
$$ 2848483 2601419 2358546 2146928 1993030 1917379 1932002 2041417 2244542 2534848 2899102
41436B899102M18040M46831M49315M27710L87122L34543K77277K21066J68973
$$ 2899102 3317142 3763973 4213288 4640998 5028120 5362663 5639940 5861006 6029979
41427F029979J21448P7089L3501j2018o1772j16809j76178k36597k93027l40258
$$ 6029979 6151427 6228516 6262017 6249999 6188227 6071418 5895240 5658643 5365616 5025358
41417E025358l74946l96926m08643m12757m09723l97769l75698l46100l15793
$$ 5025358 4650412 4253486 3844843 3432086 3022363 2624594 2248896 1902796 1587003
41408A587003k92838k82636k85961k99650l18638l37214l48900l45755l19109
$$ 1587003 1294165 1011529 725568 425918 107280 -229934 -578834 -924589 -1243698
41399a243698k62601j75882o6400N2239J64376K56806L21717L56789L62917L41818
$$ -1243698 -1506299 -1682181 -1748581 -1696342 -1531966 -1275160 -953443 -596654 -233737 108081
41389A08081K96075K31215J56883Q4973K5911j4136l4089l7082k8656j4256K734
$$ 108081 404156 635371 792254 877227 903138 889002 854913 817831 789175 774919 777653
41378G77653K1542M3274P0376J06447J55242K17759K88526L53971L95285L95597
$$ 777653 799195 842469 912845 1019292 1174534 1392293 1680819 2034790 2430075 2825672
41368B825672L47933K59491J49675M3316l7216p7593p3615l0366L9994J20708
$$ 2825672 3173605 3433096 3582771 3626087 3588871 3511278 3437663 3407297 3447291 3567999
41358C567999J93120K40252K50917K22526J61107P8854r151q8330j48197j85303
$$ 3567999 3761119 4001371 4252288 4474814 4635921 4714775 4705624 4617294 4469097 4283794
41348D283794k03447k10280k12346k12071k08484k00167j87592j73028j58396
$$ 4283794 4080347 3870067 3657721 3445650 3237166 3036999 2849407 2676379 2517983
41339B517983j42791j21673q8844m0822J8880P8941J24278J42471J28205Q3528
$$ 2517983 2375192 2253519 2164675 2123853 2142733 2221674 2345952 2488423 2616628 2700156
41329B700156J5741o4222j42540k04224k36738k33850j97456j36416o3556P940
$$ 2700156 2715897 2651675 2509135 2304911 2068173 1834323 1636867 1500451 1436895 1444835
41319A444835O7945J12238J43668J70337K00563K37029K73874K99054L00544K72207
$$ 1444835 1512780 1625018 1768686 1939023 2139586 2376615 2650489 2949543 3250087 3522294
41309C522294K15513J36455M0751o8431j88270l12385m29897n29334o04112o54476
$$ 3522294 3737807 3874262 3915013 3846582 3658312 3345927 2916030 2386696 1782584 1128108
41299A128108o84301o95718o86219o50508n85456m94237l86640k76103j76440
$$ 1128108 443807 -251911 -938130 -1588638 -2174094 -2668331 -3054971 -3331074 -3507514
41290c507514r9868n4959m3110n5812p6630q8225p9443m7498M620P1630J47262
$$ -3507514 -3607382 -3662341 -3705451 -3761263 -3837893 -3926118 -4005561 -4053059 -4048439 -3976809 -3829547
41279c829547K24175K94396L50774L88592M06663M08193M01127L96571M04194
$$ -3829547 -3605372 -3310976 -2960202 -2571610 -2164947 -1756754 -1355627 -959056 -554862
41270e54862M26483M56024M78653M80666M55020M02902L31273K49488J67055R2474
$$ -554862 -128379 327645 806298 1286964 1741984 2144886 2476159 2725647 2892702 2985176
41260B985176L2331r349l0924l2315j4893J6838N3211Q0277Q5371O4812K7938
$$ 2985176 3017507 3008158 2977234 2944919 2930026 2946864 3000075 3080352 3165723 3230535 3258473
41249C258473o341j9044q52M3958J01090J53873J89276J99321J80086J32325O4065
$$ 3258473 3252132 3233088 3232236 3276194 3377284 3531157 3720433 3919754 4099840 4232165 4296230
41238D296230q572o5579r0768p8340l4974K2732P3867J00051R1286M8727j6300
$$ 4296230 4287658 4222079 4131311 4052971 4017997 4040729 4114596 4214647 4305933 4354660 4338360
41227D338360q6193j42538j72032j71096j46882j13638q6274p4845q2358j05602
$$ 4338360 4252167 4109629 3937597 3766501 3619619 3505981 3419707 3344862 3262504 3156902
41217C156902j37184j67709j88287j93577j84302j67323j52391j47049j52866
$$ 3156902 3019718 2852009 2663722 2470145 2285843 2118520 1966129 1819080 1666214
41208A666214j65377j77383j82941j79469j67506j49582j29647j13213j07299
$$ 1666214 1500837 1323454 1140513 961044 793538 643956 514309 401096 293797
41199B93797j19091j52950k06830k70717l29135l67322l77417l60943l26480k84851
$$ 293797 174706 21756 -185074 -455791 -784926 -1152248 -1529665 -1890608 -2217088 -2501939
41189b501939k44938k11668j85955j65500j45721j20893q5853l8126K0585Q4637
$$ -2501939 -2746877 -2958545 -3144500 -3310000 -3455721 -3576614 -3662467 -3700593 -3680008 -3595371
41179c595371J46405J98980K38244K63569K77132K82618K84222K86337K93125
$$ -3595371 -3448966 -3249986 -3011742 -2748173 -2471041 -2188423 -1904201 -1617864 -1324739
41170a324739L07420L29332L55703L80918L98586M03236L91462L62017L15328
$$ -1324739 -1017319 -687987 -332284 48634 447220 850456 1241918 1603935 1919263
41161A919263K53353J80146J01943K5813m2148r7440j36617j57600j61161j51547
$$ 1919263 2172616 2352762 2454705 2480518 2438370 2340930 2204313 2046713 1885552 1734005
41151A734005j34697j15589r7055q0213o4660m8204k7670j583K7239N1686O3466
$$ 1734005 1599308 1483719 1386664 1306451 1241791 1193587 1165917 1164334 1191573 1243259 1306725
41140A306725N7230L3209k786m1553p3680r2710r7357r1563q2062p4828p2948
$$ 1306725 1363955 1397164 1394378 1352825 1279145 1186435 1089078 997515 915453 840625 767677
41129G67677p6831q5324r6028j04950j06638r5199o5602j5515N2231J28103J97816
$$ 767677 690846 605522 509494 404544 297906 202707 137105 121590 173821 301924 499740
41118D99740K47935K71688K70762K51860K20966J79782J27259O4663p38n7434
$$ 499740 747675 1019363 1290125 1541985 1762951 1942733 2069992 2134655 2133917 2076483
41108B076483r5627j11983j09721r5415p6114n7730m3695l3992k6159j8000r385
$$ 2076483 1980856 1868873 1759152 1663737 1587623 1529893 1486198 1452206 1426047 1408047 1398662
41097A398662j632L896N805J742j1102l3514o2060q9430j07373j10247r7036p0790
$$ 1398662 1397030 1400926 1406731 1408473 1397371 1363857 1301797 1212367 1104994 994747 897711 826921
41085H26921l6026M059M8631R8015J51342K04277K47825K69155K55272J98468
$$ 826921 790895 794954 843585 941600 1092942 1297219 1545044 1814199 2069471 2267939
41075B267939J00469k7153j66111k95911l98249m60841m79752m59243m09295l42577
$$ 2267939 2368408 2341255 2175144 1879233 1480984 1020143 540391 81148 -328147 -670724
41065f70724k72060k08906j60216j27533j07185r2411p6592n6661l5146j8731
$$ -670724 -942784 -1151690 -1311906 -1439439 -1546624 -1639035 -1715627 -1772288 -1807434 -1826165
41055a826165j3566k1111l8334o1493q9006j20972j57266j96886k37853k76033
$$ -1826165 -1839731 -1860842 -1899176 -1960669 -2049675 -2170647 -2327913 -2524799 -2762652 -3038685
41045c038685l04022l13000k97491k59090k05808j47903r3474m5777k660M1579
$$ -3038685 -3342707 -3655707 -3953198 -4212288 -4418096 -4565999 -4659473 -4705250 -4707910 -4666331
41035d666331R1833J47561K01602K43763K66388K68021K53609K32254K13662K04376
$$ -4666331 -4574498 -4426937 -4225335 -3981572 -3715184 -3447163 -3193554 -2961300 -2747638 -2543262
41025b543262K05536K13890K24914K34836K39777K34189K11600J67609J02382
$$ -2543262 -2337726 -2123836 -1898922 -1664086 -1424309 -1190120 -978520 -810911 -708529
41016g08529K0776o8921j56187k29399k77804k94144k76440k27944j55472o7594
$$ -708529 -687753 -756674 -912861 -1142260 -1420064 -1714208 -1990648 -2218592 -2374064 -2441658
41006b441658K6324J16174J91359K42238K62555K51627K14848J62279J06282N9446
$$ -2441658 -2415334 -2299160 -2107801 -1865563 -1603008 -1351381 -1136533 -974254 -867972 -808526
40996h08526L2955L4796O7289J24915J94579K59124L02890L16532K98950K55953
$$ -808526 -775571 -740775 -673486 -548571 -353992 -94868 208022 524554 823504 1079457
40986A079457J96697J30008O2472j259n6931r9480j22796j20711q9410l0603M6496
$$ 1079457 1276154 1406162 1468634 1467375 1410444 1310964 1188168 1067457 978047 947444 993940
40975I93940J26221J90336K22558K11963J54985N6273p1748k10896l40679m42665
$$ 993940 1120161 1310497 1533055 1745018 1900003 1956276 1884528 1673632 1332953 890288
40965H90288n04626n22677m99960m42924l58387k54013j40971l5103M6240R0865
$$ 890288 385662 -137015 -636975 -1079899 -1438286 -1692299 -1833270 -1868373 -1822133 -1731268
40955a731268R7751P8077N0048L0592K9101M6071P5733J09941J41703J67782J89664
$$ -1731268 -1633517 -1555440 -1505392 -1474800 -1445699 -1399628 -1323895 -1213954 -1072251 -904469 -714805
40944g14805K11973K38973K70899L02315L23197L22388K92084K31455J47848N5026
$$ -714805 -502832 -263859 7040 309355 632552 954940 1247024 1478479 1626327 1681353
40934A681353l0792r5791j32397j40540j25910r6665o0385k2078J6868N8603J07245
$$ 1681353 1650561 1554770 1422373 1281833 1155923 1059258 998873 976795 993663 1052266 1159511
40923A159511J66211K35876L12310L87159M48450M82946M79843M34745L51897
$$ 1159511 1325722 1561598 1873908 2261067 2709517 3192463 3672306 4107051 4458948
40914D458948K43477J25910J4589q0793j58014k20544k73660l20981l63362m00359
$$ 4458948 4702425 4828335 4842924 4762131 4604117 4383573 4109913 3788932 3425570 3025211
40904C025211m32238m60122m83477m97451m93514m63925m06851l28102k38438
$$ 3025211 2592973 2132851 1649374 1151923 658409 194484 -212367 -540469 -778907
40895g78907j48405o3954J4781R1067J67688K44738L20175L90998M52978M99877
$$ -778907 -927312 -991266 -976485 -885418 -717730 -472992 -152817 238181 691159 1191036
40885A191036N24926N24362M99596M55431L96317L24704K43005J56642P4765P967
$$ 1191036 1715962 2240324 2739920 3195351 3591668 3916372 4159377 4316019 4390784 4398751
40875D398751l5224n0840m0419j1034K5233N2961N7023K7572l5799j23203k17991
$$ 4398751 4363527 4312687 4272268 4261234 4286467 4339428 4396451 4424023 4388224 4265021 4047030
40864D047030l03346l68700m12366m39130m55122m63977m66403m61714m48857
$$ 4047030 3743684 3374984 2962618 2523488 2068366 1604389 1137986 676272 227415
40855B27415m26139l91084l41699k78945k08763j42127r2146o8929p4736j02391
$$ 227415 -198724 -589808 -931507 -1210452 -1419215 -1561342 -1653488 -1722417 -1797153 -1899544
40845a899544j38222j67902j82075j79337j65943j52768j50408j63842j88999
$$ -1899544 -2037766 -2205668 -2387743 -2567080 -2733023 -2885791 -3036199 -3200041 -3389040
40836c389040k13730k23724k10194j74505j26640p9134m0767j3767M974K0630
$$ -3389040 -3602770 -3826494 -4036688 -4211193 -4337833 -4416967 -4457734 -4471501 -4466527 -4445897
40826d445897L7698N9206Q7461J24854J73506K34049L04416L79123M49278N04170
$$ -4445897 -4408199 -4348993 -4261532 -4136678 -3963172 -3729123 -3424707 -3045584 -2596306 -2092136
40816b092136N35021N39215N21347M89440M49234M01580L44900K79912K12247
$$ -2092136 -1557115 -1017900 -496553 -7113 442121 843701 1188601 1468513 1680760
40807A680760J51117J05370P9391P0656O9931O4200M1726k665o4469j30641j85049
$$ 1680760 1831877 1937247 2016638 2087294 2157225 2221425 2263151 2260486 2196017 2065376 1880327
40796A880327k15827k20834k08393j92910j87476j96980k15282k28052k19687
$$ 1880327 1664500 1443666 1235273 1042363 854887 657907 442625 214573 -5114
40787e114j80210j08512j1183J00877K15662L21702M08416M66102M86510M64399
$$ -5114 -185324 -293836 -305019 -204142 11520 333222 741638 1207740 1694250 2158649
40777B158649L99543K98102J72613M0354q0079j73725k34072k64729k76053k78298
$$ 2158649 2558192 2856294 3028907 3069261 2989182 2815457 2581385 2316656 2040603 1762305
40767A762305k75555k64392k37749j91347j28503o0230o32L9430N6411N3854L9275
$$ 1762305 1486750 1222358 984609 793262 664759 604529 603897 643327 699738 753592 792867
40756G92867K0885N727r92L722J9880M3999O9783R0575J02433J05626J03674J01070
$$ 792867 813752 819479 818487 822209 842089 886088 955871 1046446 1148879 1254505 1358179 1459249
40744A459249J01562J07275J18093J31624J44730J55823J65437J73983J79009
$$ 1459249 1560811 1668086 1786179 1917803 2062533 2218356 2383793 2557776 2736785
40735B736785J75337J58180J26408Q3197L4202j4924o0507j01867j41255j82294
$$ 2736785 2912122 3070302 3196710 3279907 3314109 3299185 3238678 3136811 2995556 2813262
40725B813262k27551k76586l25611l68430l97681m06216l89215l46867k85743
$$ 2813262 2585711 2309125 1983514 1615084 1217403 811187 421972 75105 -210638
40716b10638k16888j51470r6879n5729k7055p778O536K0753L8272N9038P8970
$$ -210638 -427526 -578996 -675875 -731604 -758659 -766437 -759901 -739148 -700876 -641838 -562868
40705e62868R1808R2451P9603N6088K6782l954l3694o1604q7169j09204j26127
$$ -562868 -471060 -378609 -299006 -242918 -216136 -220090 -253784 -315388 -402557 -511761 -637888
40694f37888j37400j44711j51064j58096j64215j65693j59910j47552j32248j18531
$$ -637888 -775288 -919999 -1071063 -1229159 -1393374 -1559067 -1718977 -1866529 -1998777 -2117308
40684b117308j10075j08722j13916j22222j27444j22145j00854o3668j7614K5975
$$ -2117308 -2227383 -2336105 -2450021 -2572243 -2699687 -2821832 -2922686 -2986354 -3003968 -2977993
40674b977993N6744O9438O4311M4611J4017k4032o5157j02478j26554j28044j02344
$$ -2977993 -2921249 -2851811 -2787500 -2742889 -2728872 -2752904 -2818061 -2920539 -3047093 -3175137 -3277481
40663c277481n3112Q464O8578J16451J46782J58551J52848J32500J03054P2690
$$ -3277481 -3330593 -3322129 -3253551 -3137100 -2990318 -2831767 -2678919 -2546419 -2443365 -2370675
40653b370675M9816M0283M6583O9236J08189J62793K30737L06945L83279M49461
$$ -2370675 -2320859 -2280576 -2233993 -2164757 -2056568 -1893775 -1663038 -1356093 -972814 -523353
40643e23353M95510N14566N04148M65145M00417L14944K17123J18809L2523l3253
$$ -523353 -27843 486723 990871 1456016 1856433 2171377 2388500 2507309 2539832 2506579
40633B506579p8244j11342j46931j97342k65221l40453m04197m38311m35016m01111
$$ 2506579 2428335 2316993 2170062 1972720 1707499 1367046 962849 524538 89522 -311589
40623c11589l53770l10157k77508k50368k16349j65596r6926j7292O3425J37589
$$ -311589 -665359 -975516 -1253024 -1503392 -1719741 -1885337 -1982263 -1999555 -1936130 -1798541
40613a798541K01748K55671L00668L39049L74432M11594M54967N06112N61995
$$ -1798541 -1596793 -1341122 -1040454 -701405 -326973 84621 539588 1045700 1607695
40604A607695O15459O57741O80736O77397O41250N67949M59281L26215J87336
$$ 1607695 2223154 2880895 3561631 4239028 4880278 5448227 5907508 6233723 6421059
40595F421059O2718l2969r4445j25376j34279j29082j13951r0405o1153l2609
$$ 6421059 6483777 6450808 6356363 6230987 6096708 5967626 5853675 5763270 5702117 5669508
40585E669508j3536j1386k9242o4987j12411j63513k11263k51663k84021l09414
$$ 5669508 5655972 5644586 5615344 5550357 5437946 5274433 5063170 4811507 4527486 4218072
40575D218072l28238l38244l34214l09629k59481j82734q3301L0251J45835K49477
$$ 4218072 3889834 3551590 3217376 2907747 2648266 2465532 2382231 2412482 2558317 2807794
40565B807794L27226L67142L61307L08063K13651R1658m0423j66131k73997l58981
$$ 2807794 3135020 3502162 3863469 4171532 4385183 4476841 4436418 4270287 3996290 3637309
40555C637309m21024m61741m81192m77223m48212l96712l30362k58584j87597
$$ 3637309 3216285 2754544 2273352 1796129 1347917 951205 620843 362259 174662
40546A74662j17560m3929L8263J29894K25491L13749L79911M08970L89633L18655
$$ 174662 57102 13173 51436 181330 406821 720570 1100481 1509451 1899084 2217739
40536B217739K03833O3370p9140k01923k91171l43883l67283l75607l85226m09208
$$ 2217739 2421572 2484942 2405802 2203879 1912708 1568825 1201542 825935 440709 31501
40526C1501m53034n13172n79419o39692o84555p09161p12429o94867o56737n97333
$$ 31501 -421533 -934705 -1514124 -2153816 -2838371 -3547532 -4259961 -4954828 -5611565 -6208898
40516f208898n15778m12871k92945j64087l6094Q2611J87245K77012L54165M22817
$$ -6208898 -6724676 -7137547 -7430492 -7594579 -7630673 -7548062 -7360817 -7083805 -6729640 -6306823
40506f306823M87941N54079O23117O91625P49598P82484P76482P24234O27217
$$ -6306823 -5818882 -5264803 -4641686 -3950061 -3200463 -2417979 -1641497 -917263 -290046
40497b90046M93878L35798J65181n708j64981l02640m11932m89016n31524n38002
$$ -290046 203832 539630 704811 699103 534122 231482 -180450 -669466 -1200990 -1738992
40487a738992n08943m48101l62764k63206j61589o9873L585N7312R7373J34374
$$ -1738992 -2247935 -2696036 -3058800 -3322006 -3483595 -3553468 -3549883 -3492571 -3395198 -3260824
40477c260824J78323K34351L01487L74702M48103N16892N77144O24672O54582
$$ -3260824 -3082501 -2848150 -2546663 -2171961 -1723858 -1206966 -629822 -5150 649432
40468F49432O61749O41481N89888N04327L84712K35773O9386r5023k33937l26679
$$ 649432 1311181 1952662 2542550 3046877 3431589 3667362 3736748 3641725 3407788 3081109
40458C081109l62443l43502k83586k03025j22869n9335j9934k975q45n091j0487
$$ 3081109 2718666 2375164 2091578 1888553 1765684 1706349 1686415 1683440 1682595 1677504 1667017
40447A667017j6105k3547l3813m5349n4901o0374o2836o5812p3019q7013j09322
$$ 1667017 1650912 1627365 1593552 1548203 1493302 1432928 1370092 1304280 1231261 1144248 1034926
40436A034926j40629j79960k23365k63332k89427k90511k58660j93370j03126
$$ 1034926 894297 714337 490972 227640 -61787 -352298 -610958 -804328 -907454
40427i07454k000R7112J88066K72053L53655M35796N16835N90410O46990O76190
$$ -907454 -909454 -812342 -624276 -352223 1432 437228 954063 1544473 2191463 2867653
40417B867653O69415O22278N35648M14922K68170J04812o4235k25427l62274m57576
$$ 2867653 3537068 4159346 4694994 5109916 5378086 5482898 5418663 5193236 4830962 4373386
40407D373386m98293m80920m14410l18743k19625j41513j01261j04206j43736
$$ 4373386 3875093 3394173 2979763 2661020 2441395 2299882 2198621 2094415 1950679
40398A950679k04539k68300l19484l48694l52611l31695k87752k22991j40467
$$ 1950679 1746140 1477840 1158356 809662 457051 125356 -162396 -385387 -525854
40389e25854m5132N5449J51419K32619K91774L27123L42307L43549L36091L21893
$$ -525854 -570986 -515537 -364118 -131499 160275 487398 829705 1173254 1509345 1831238
40379A831238K99046K62412K05893J26587K9123p3357j63690k28572k64623k78445
$$ 1831238 2130284 2392696 2598589 2725176 2754299 2680942 2517252 2288680 2024057 1745612
40369A745612k80844k79602k75626k64308k40152k01143j50484r5403m4292m151
$$ 1745612 1464768 1185166 909540 645232 405080 203937 53453 -41950 -86242 -90393
40359i0393K0032K4444O179l4772r2454j54324k05163k33786k37999k24476k04326
$$ -90393 -70361 -45917 -39738 -74510 -166964 -321288 -526451 -760237 -998236 -1222712 -1427038
40348a427038j87789j81198j86279k00304k16347k24714k16335j86627j37181
$$ -1427038 -1614827 -1796025 -1982304 -2182608 -2398955 -2623669 -2840004 -3026631 -3163812
40339c163812p4271n715O1567J22491J73781K13665K41458K56834K59194K47400
$$ -3163812 -3238083 -3243798 -3182231 -3059740 -2885959 -2672294 -2430836 -2174002 -1914808 -1667408
40329a667408K20531J79437J28166P3845K4767j1789l0535k8054l116M1871R9625
$$ -1667408 -1446877 -1267440 -1139274 -1065429 -1040662 -1052451 -1082986 -1111040 -1114156 -1072285 -972660
40318i72660J58909K08180K40302K55566K61014K66242K78181K98245L23174L47851
$$ -972660 -813751 -605571 -365269 -109703 151311 417553 695734 993979 1317153 1665004
40308A665004L67079L75144L64973L29187K63429J69996N9440n1021j41904j97268
$$ 1665004 2032083 2407227 2772200 3101387 3364816 3534812 3594252 3543231 3401327 3204059
40298C204059k09936j84162j34437q0660m1250k6940l7933o5741r8432j26084
$$ 3204059 2994123 2809961 2675524 2594864 2553614 2526674 2488741 2423000 2324568 2198484
40288B198484j43683j50923j50472j46193j41541j37563j30906j13695p7162j8083
$$ 2198484 2054801 1903878 1753406 1607213 1465672 1328109 1197203 1083508 1006346 988263
40278I88263N6223J29070J82283K05573K00809J78785J52141J29896J16115J11285
$$ 988263 1044486 1173556 1355839 1561412 1762221 1941006 2093147 2223043 2339158 2450443
40268B450443J13597J18777J19279J04716O4783o197j05901k24239l46599m57148
$$ 2450443 2564040 2682817 2802096 2906812 2971595 2965398 2859497 2635258 2288659 1831511
40258A831511n40175n80843n67690m96878l75133k19081n1437J03838K26217L02635
$$ 1831511 1291336 710493 142803 -354075 -729208 -948289 -999726 -895888 -669671 -367036
40248c67036L29608L12062K59451J81983Q9162r789j05321j87741k48271k80959
$$ -367036 -37428 274634 534085 716068 805230 795441 690120 502379 254108 -26851
40238b6851k84757k64411k29179j90272j58658j43277j48745j73203k08643k44553
$$ -26851 -311608 -576019 -805198 -995470 -1154128 -1297405 -1446150 -1619353 -1827996 -2072549
40228b072549k72354k87546k89176k78536k58145k30683j98043j61556j23643
$$ -2072549 -2344903 -2632449 -2921625 -3200161 -3458306 -3688989 -3887032 -4048588 -4172231
40219d172231q9126o4265n3650n7325p0450q5822r7309j01729r8394q7788p1377
$$ -4172231 -4261357 -4325622 -4379272 -4436597 -4507047 -4592869 -4690178 -4791907 -4890301 -4978089 -5049466
40208e049466n2383l5592k5121k1845k2881k3716k0728j1733N556L4908Q0129
$$ -5049466 -5101849 -5137441 -5162562 -5184407 -5207288 -5231004 -5251732 -5263465 -5257909 -5223001 -5142872
40197e142872J40850K09076K70605L11594L25396L14541K87148K51723K14162
$$ -5142872 -5002022 -4792946 -4522341 -4210747 -3885351 -3570810 -3283662 -3031939 -2817777
40188b817777J77471J42803J10983Q4147O6494O2849P5244R9933J27275J45220
$$ -2817777 -2640306 -2497503 -2386520 -2302373 -2235879 -2173030 -2097786 -1997853 -1870578 -1725358
40178a725358J44619J23188Q5827M1629m9l2086n0605n5306m9315l7940k6715
$$ -1725358 -1580739 -1457551 -1371724 -1330095 -1330144 -1362230 -1412835 -1468141 -1517456 -1555396 -1582111
40167a582111j9964k0441k8975m3610n9260o9407o9195n7670l7347j1626J8083
$$ -1582111 -1602075 -1622516 -1651491 -1695101 -1754361 -1823768 -1892963 -1950633 -1987980 -1999606 -1981523
40156a981523N3353R6932J49084K04771K54190K86688K95580K80860K48629K08112
$$ -1981523 -1928170 -1831238 -1682154 -1477383 -1223193 -936505 -640925 -360065 -111436 96676
40146I6676J67977J33587J06163Q4177O6348N4534N4466P3141J13820J71940K35247
$$ 96676 264653 398240 504403 588580 654928 709462 763928 837069 950889 1122829 1358076
40135A358076K88934L22957L37027L39979L44050L57768L81953M10920M36931
$$ 1358076 1647010 1969967 2306994 2646973 2991023 3348791 3730744 4141664 4578595
40126D578595M54014M58836M49248M22909L77164L10041K21376J13845o107j27754
$$ 4578595 5032609 5491445 5940693 6363602 6740766 7050807 7272183 7386028 7379921 7252167
40116G252167k37083l19830l65889l72650l45274k93992k30562j65759j07915
$$ 7252167 7015084 6695254 6329365 5956715 5611441 5317449 5086887 4921128 4813213
40107D813213o1503k6040L237L2019O2325Q9853J05526J00614P2110K4809l1090
$$ 4813213 4751710 4725670 4728907 4760926 4823251 4913104 5018630 5119244 5191354 5216163 5185073
40096E185073q4819j29226j62228j85559k02119k13593k19623k18776k10179j94328
$$ 5185073 5100254 4971028 4808800 4623241 4421122 4207529 3987906 3769130 3558951 3364623
40086C364623j72700j47409j22035j02714r6878j08750j34264j59948j67802j43560
$$ 3364623 3191923 3044514 2922479 2819765 2722887 2614137 2479873 2319925 2152123 2008563
40076B008563q3292M906J04170J94750K60296K92895K95381K79716K61135K50095
$$ 2008563 1925271 1930177 2034347 2229097 2489393 2782288 3077669 3357385 3618520 3868615
40066C868615K46403K39787K16974J70402J02297K1965o0295j37561k06309k63238
$$ 3868615 4115018 4354805 4571779 4742181 4844478 4866443 4806148 4668587 4462278 4199040
40056D199040l02159l13977k90700k31187j44486m8259L6686R2393J08006Q1767
$$ 4199040 3896881 3582904 3292204 3061017 2916531 2868272 2904958 2997351 3105357 3187124
40046C187124K0902o0595j46137k21436k77910l13154l28498l25990l07212k74294
$$ 3187124 3208026 3147431 3001294 2779858 2501948 2188794 1860296 1534306 1227094 952800
40036I52800k31009j82171j32007q3743m1053r722K899q650m3138r0279j33874
$$ 952800 721791 539620 407613 323870 282817 273095 275994 267344 224206 133927 53
40025E3j59471j61131j41973j08966o7443j9616L3393Q9442J45112J96579K40289
$$ 53 -159418 -320549 -462522 -571488 -638931 -658547 -625154 -535712 -390600 -194021 46268
40014D6268K72773K89965K87207K60556K08919J35424M7163m5766j31709j99903
$$ 46268 319041 609006 896213 1156769 1365688 1501112 1548275 1502509 1370800 1170897
40004A170897k43921k64186k67041k60934k52223k42931k30859k11576j81462
$$ 1170897 926976 662790 395749 134815 -117408 -360339 -591198 -802774 -984236
39995i84236j40326r1627m0137J1284O2959J16766J72784K26857K71328K98718
$$ -984236 -1124562 -1216189 -1256326 -1245042 -1182083 -1065317 -892533 -665676 -394348 -95630
39985i5630L05492K93045K65732K28504J86205J44310J09432Q8348Q5693J01489
$$ -95630 209862 502907 768639 997143 1183348 1327658 1437090 1525438 1611131 1712620
39975A712620J30237J62835J90477K07943K14279K11108K00653J84701J64452
$$ 1712620 1842857 2005692 2196169 2404112 2618391 2829499 3030152 3214853 3379305
39966C379305J40626J13846Q5508N8786L8665L0106L4868M8886O2086O0952L2840
$$ 3379305 3519931 3633777 3719285 3778071 3816736 3846842 3881710 3930596 3992682 4053634 4086474
39955D086474k9349j23150k35193l44334m29160m76355m85024m64598m27670l82502
$$ 4086474 4057125 3933975 3698782 3354448 2925288 2448933 1963909 1499311 1071641 689139
39945F89139l29700k64980j85419r4193n35Q3848J48815J88385K02168J95534
$$ 689139 359439 94459 -90960 -185153 -185688 -101840 46975 235360 437528 633062
39935F33062J77530J56989J39374J26402J17840J13166J12356J16044J25113J38844
$$ 633062 810592 967581 1106955 1233357 1351197 1464363 1576719 1692763 1817876 1956720
39925A956720J52603J57671J44677J08531N1235j9497r4335j66341k32523k92490
$$ 1956720 2109323 2266994 2411671 2520202 2571437 2551940 2457605 2291264 2058741 1766251
39915A766251l45590l89081m19024m32864m30708m13608l80710l28912k56380
$$ 1766251 1420661 1031580 612556 179692 -251016 -664624 -1045334 -1374246 -1630626
39906a630626j66867p0706J9085R2599J46566J83586K08555K24968K33211K31330
$$ -1630626 -1797493 -1868199 -1849114 -1756515 -1609949 -1426363 -1217808 -992840 -759629 -528299
39896e28299K17745J94201J66821J44185J33735J39135J59631J90323K22191K43058
$$ -528299 -310554 -116353 50468 194653 328388 467523 627154 817477 1039668 1282726
39886A282726K41574K13524J66142J16366Q3793Q2889J18640J85776K69907L50289
$$ 1282726 1524300 1737824 1903966 2020332 2104125 2187014 2305654 2491430 2761337 3111626
39876C111626M05234M19406L89260L23203K36667J45588O1674r255o6243j10780
$$ 3111626 3516860 3936266 4325526 4648729 4885396 5030984 5092658 5083403 5017160 4906380
39866D906380j44687j69585j87530k01111k12299k21239k26268k24939k14999
$$ 4906380 4761693 4592108 4404578 4203467 3991168 3769929 3543661 3318722 3103723
39857C103723j95386j67712j38078j17292j18233j50520k14855l00448l88106
$$ 3103723 2908337 2740625 2602547 2485255 2367022 2216502 2001647 1701199 1313093
39848A313093m58218m98837n08722m94150m63184m21718l73001l19794k67246
$$ 1313093 854875 356038 -152684 -646834 -1110018 -1531736 -1904737 -2224531 -2491777
39839b491777k24165k00439k01064k20504k42403k45949k15249j46351m8585N9701
$$ -2491777 -2715942 -2916381 -3117445 -3337949 -3580352 -3826301 -4041550 -4187901 -4236486 -4176785
39829d176785J58413K32691K76987K94974K95911K89321K80536K69444K52816
$$ -4176785 -4018372 -3785681 -3508694 -3213720 -2917809 -2628488 -2347952 -2078508 -1825692
39820a825692K27969J94427J52439J00810L7733l4988j08142j66523j96128j92114
$$ -1825692 -1597723 -1403296 -1250857 -1150047 -1112314 -1147302 -1255444 -1421967 -1618095 -1810209
39810a810209j61356j17694p4193l8335j2463L174Q480L860q911k6970m7575o8878
$$ -1810209 -1971565 -2089259 -2163452 -2201787 -2214250 -2211076 -2202596 -2198736 -2207647 -2234617 -2282192 -2351070
39798b351070q9740j09480j28492j48754j72428j98581k20891k29263k14421j71589
$$ -2351070 -2440810 -2550290 -2678782 -2827536 -2999964 -3198545 -3419436 -3648699 -3863120 -4034709
39788d034709j00759n166J08914K30894L46027M39026M99249N23654N15628M81591
$$ -4034709 -4135468 -4140634 -4031720 -3800826 -3454799 -3015773 -2516524 -1992870 -1477242 -995651
39778i95651M28742L65391L01657K47494K07973J79716J52258J14069N9049j0421
$$ -995651 -566909 -201518 100139 347633 555606 735322 887580 1001649 1060698 1050277
39768A050277q4833j52111k03198k35746k53221k59495k53244k27183j73190q9186
$$ 1050277 965444 813333 610135 374389 121168 -138327 -391571 -618754 -791944 -881130
39758h81130J7667J33569K44131L39317M14387M67980N00630N14965N15500N05808
$$ -881130 -863463 -729894 -485763 -146446 267941 735921 1236551 1751516 2267016 2772824
39748B772824M85112M48437L91158L13692K22035J24889L1188n0111j10094j41905
$$ 2772824 3257936 3706373 4097531 4411223 4633258 4758147 4789335 4739224 4629130 4487225
39738D487225j43930j21201q3666m2612p571J5309K3677J8486K394k2520n5907
$$ 4487225 4343295 4222094 4138428 4095816 4088245 4103554 4127231 4145717 4148111 4125591 4069684
39727D069684r8020j47535k00914k53739l01832l40654l64416l67009l44373k95932
$$ 4069684 3971664 3824129 3623215 3369476 3067644 2726990 2362574 1995565 1651192 1355260
39717A355260k24176j33940l2716O8560J56269K17629K46119K45690K30121K16552
$$ 1355260 1131084 997144 964428 1032988 1189257 1406886 1653005 1898695 2128816 2345368
39707B345368K16856K32516K55464K72558K70341K38735J74060Q0651l0283j44490
$$ 2345368 2562224 2794740 3050204 3322762 3593103 3831838 4005898 4086549 4056266 3911776
39697C911776k49176l35788m00576m43354m65605m69024m55214m26501l86491
$$ 3911776 3662600 3326812 2926236 2482882 2017277 1548253 1093039 666538 280047
39688B80047l38813k84190k18463j34600k8674R4634K22133L38222M31822M98484
$$ 280047 -58766 -342956 -561419 -696019 -724693 -630059 -407926 -69704 362118 860602
39678H60602N37294N46966N25427M73056L96238L08077K25432J63841J32694J32470
$$ 860602 1397896 1944862 2470289 2943345 3339583 3647660 3873092 4036933 4169627 4302097
39668D302097J55006J87067K16262K36392K48639K57580K65345K68764K61643
$$ 4302097 4457103 4644170 4860432 5096824 5345463 5603043 5868388 6137152 6398795
39659F398795K39416K02268J54732J03163N3471J0091k4315m9794p0368r3756
$$ 6398795 6638211 6840479 6995211 7098374 7151845 7161936 7137621 7087827 7017459 6923703
39649F923703j27844j74939k28043k72877k95397k89767k61001k20629j79177
$$ 6923703 6795859 6620920 6392877 6120000 5824603 5534836 5273835 5053206 4874029
39640D874029j41415j07299p6349n0797l4865l1689m1534o2989r5715j41576k02800
$$ 4874029 4732614 4625315 4548966 4498169 4463304 4431615 4390081 4327092 4231377 4089801 3887001
39629C887001k78755l64133m49814n25650n83511o19216o32545o25312n99335
$$ 3887001 3608246 3244113 2794299 2268649 1685138 1065922 433377 -191935 -791270
39620g91270n56197m98898m33062l65749l02938k47799k00400j58153j16978p3717
$$ -791270 -1347467 -1846365 -2279427 -2645176 -2948114 -3195913 -3396313 -3554466 -3671444 -3745161
39610c745161k8621J4425N0672P7806R7278J13367J31281J54907J85065K19753
$$ -3745161 -3773782 -3759357 -3708685 -3630879 -3533601 -3420234 -3288953 -3134046 -2948981 -2729228
39600b729228K57289K99801L52947M20777M99678N76742O34285O57561O40975
$$ -2729228 -2471939 -2172138 -1819191 -1398414 -898736 -321994 312291 969852 1610827
39591A610827N89817N17968M43597L84399L52554L50196L67964L88572L93938
$$ 1610827 2200644 2718612 3162209 3546608 3899162 4249358 4617322 5005894 5399832
39582E399832L71385L16253K31736J27780J9047p8749j53028j96924k09544j94820
$$ 5399832 5771217 6087470 6319206 6446986 6466033 6387284 6234256 6037332 5827788 5632968
39572E632968j59351j09393m8527K1672R8200J73969K39062K84993L08478L12008
$$ 5632968 5473617 5364224 5315697 5337369 5435569 5609538 5848600 6133593 6442071 6754079
39562F754079L01266K81069K52483K13112J60163R3213J4151p4640j70946k71367
$$ 6754079 7055345 7336414 7588897 7802009 7962172 8055385 8069536 7994896 7823950 7552583
39552G552583l69831m57735n25517n65138n73210n53587n17123m77905m48231
$$ 7552583 7182752 6725017 6199500 5634362 5061152 4507565 3990442 3512537 3064306
39543C064306m35272m40118m58105m79841m93149m85429m45692l66442k46045
$$ 3064306 2629034 2188916 1730811 1250970 757821 272392 -173300 -539742 -785787
39534g85787r1000Q3706K57458M09367N23980N94777O23528O16003N77343N10725
$$ -785787 -876787 -793081 -535623 -126256 397724 992501 1616029 2232032 2809375 3320100
39524C320100M19619L10507J93103P8384k3465j04057j57205j79474j71182j37476
$$ 3320100 3739719 4050226 4243329 4321713 4298248 4194191 4036986 3857512 3686330 3548854
39514C548854q8487l7302M580L2270M9854O8011R7959J45009K05135K65836L10160
$$ 3548854 3460367 3423065 3427645 3459915 3509769 3577780 3675739 3820748 4025883 4291719 4601879
39503D601879L21776K89721K12443J00312k4941j35098k03606k13755j63298o3446
$$ 4601879 4923655 5213376 5425819 5526131 5501190 5366092 5162486 4948731 4785433 4721987
39493D721987O6623K06114L36146M39741N01027N06797M50584L36490J79903M641
$$ 4721987 4788610 4994724 5330870 5770611 6271638 6778435 7229019 7565509 7745412 7750053
39483G750053j62170k95828l79560m08751l92269l49364l02729k71202k65858
$$ 7750053 7587883 7292055 6912495 6503744 6111475 5762111 5459382 5188180 4922322
39474D922322k90327l42539m15274m96233n70162o23236o46603o36236n90001
$$ 4922322 4631995 4289456 3874182 3377949 2807787 2184551 1537948 901712 311711
39465C11711n05677l82112k22920m0127J44701L03713M10541M49748M22982L48137
$$ 311711 -193966 -576078 -798998 -839125 -694424 -390711 19830 469578 892560 1240697
39455A240697K52103J61052R2475N1528L2689K5906K3633K4031K8618L7566M7468
$$ 1240697 1492800 1653852 1746327 1797855 1830544 1856450 1880083 1904114 1932732 1970298 2017766
39444B017766N2782M8310L0301l094n0396j04967j55201j87858j92740j65958
$$ 2017766 2070548 2118858 2149159 2146065 2095669 1990702 1835501 1647643 1454903 1288945
39434A288945j10667l5866M5704J20421J77520K12700K29355K35864K40047K44529
$$ 1288945 1178278 1142412 1188116 1308537 1486057 1698757 1928112 2163976 2404023 2648552
39424B648552K46203K39624K21222J91411J54215J16119Q5121O9704P6828J09125
$$ 2648552 2894755 3134379 3355601 3547012 3701227 3817346 3902467 3972171 4048999 4158124
39414D158124J62697K26961K87164L28758L41897L24023K79475K17165J48174
$$ 4158124 4320821 4547782 4834946 5163704 5505601 5829624 6109099 6326264 6474438
39405F474438Q4418L7449J6173K3948N7194J06816J61561K11000K46641K61715
$$ 6474438 6558856 6596305 6612478 6636426 6693620 6800436 6961997 7172997 7419638 7681353
39395G681353K51326K13976J53464P8682N3p5488j47304k19688k97867l84656
$$ 7681353 7932679 8146655 8300119 8378801 8378854 8303366 8156062 7936374 7638507 7253851
39385G253851m79419n78682o76937p66884q39312q83373q87955q44316p49333
$$ 7253851 6774432 6195750 5518813 4751929 3912617 3029244 2141289 1296973 547640
39376E47640o08300m36070k55224r0648L8300J24408J74273K03808K29871K61966
$$ 547640 -60660 -496730 -751954 -842602 -804302 -679894 -505621 -301813 -71942 190024
39366A90024K97948L26292L34436L18350K86495K55144K38969K44312K69009L06599
$$ 190024 487972 814264 1148700 1467050 1753545 2008689 2247658 2491970 2760979 3067578
39356C067578L50331L94756M35485M68734M91522N02727N04007M99020M90237
$$ 3067578 3417909 3812665 4248150 4716884 5208406 5711133 6215140 6714160 7204397
39347G204397M75370M46844L95611L17228K16380J07507J1340n1465o7557l5993
$$ 7204397 7679767 8126611 8522222 8839450 9055830 9163337 9174677 9123212 9055655 9019662
39337I019662L1252J13854J90417K44800K68726K60530K22286J57806P2244k7862
$$ 9019662 9050914 9164768 9355185 9599985 9868711 10129241 10351527 10509333 10581577 10553715
39327A0553715j35112k41840l40208m22436m82215n16896n28478n22314n04660
$$ 10553715 10418603 10176763 9836555 9414119 8931904 8415008 7886530 7364216 6859556
39318F859556m80900m55094m30268m08589l91186l77752l66410l54350l39025
$$ 6859556 6378656 5923562 5493294 5084705 4693519 4315767 3949357 3595007 3255982
39309C255982l19286k95917k71937k52287k41984k42670k49898k54414k47676
$$ 3255982 2936696 2640779 2368842 2116555 1874571 1631901 1382003 1127589 879913
39300H79913k27688k00536j76509j63896j64773j74491j83817j81764j58143j05973
$$ 879913 652225 451689 275180 111284 -53489 -227980 -411797 -593561 -751704 -857677
39290h57677k3835Q2397J99734L11004L99828M55389M74838M62993M30279L89685
$$ -857677 -881512 -799115 -599381 -288377 111451 566840 1041678 1504671 1934950 2324635
39280B324635L52588L24479L03217K81677K53091K15244J71116J26847Q8780O0638
$$ 2324635 2677223 3001702 3304919 3586596 3839687 4054931 4226047 4352894 4441674 4502312
39270D502312M1783K7650J2243r360m0146q1377j32081j87914k41109k82309l03086
$$ 4502312 4544095 4571745 4583988 4574628 4534482 4453105 4321024 4133110 3892001 3609692 3306606
39259C306606k97570k62871j98969j08694J987J23448K42388L43630M14263M48527
$$ 3306606 3009036 2746165 2547196 2438502 2440489 2563937 2806325 3149955 3564218 4012745
39249D012745M50417M31837M07123L87316L77377L76887L82676L91275M00362
$$ 4012745 4463162 4894999 5302122 5689438 6066815 6443702 6826378 7217653 7618015
39240G618015M08756M15089M16375M08050L85952L48484K97240K36289J71235
$$ 7618015 8026771 8441860 8858235 9266285 9652237 10000721 10297961 10534250 10705485
39231A0705485J08470N3850J1080j8976l7338m5240m3162l1045r175K1004N6530
$$ 10705485 10813955 10867805 10878885 10859909 10822571 10777331 10734169 10703124 10693949 10714953 10771483
39220A0771483R3236J26366J51496J65612J67901J59299J40576J10487O6224N936
$$ 10771483 10864719 10991085 11142581 11308193 11476094 11635393 11775969 11886456 11952680 11958616
39210A1958616o8990j54010k43056l29506m05843m63171m92078m84756m37336
$$ 11958616 11889626 11735616 11492560 11163054 10757211 10294040 9801962 9317206 8879870
39201H879870l51514k34856r9560M0468J73312K92102L95939M88296N73550O53219
$$ 8879870 8528356 8293500 8193940 8234408 8407720 8699822 9095761 9584057 10157607 10810826
39191A0810826P23936P78429Q09040Q11218P84678P32300O58916N71333M78496
$$ 10810826 11534762 12313191 13122231 13933449 14718127 15450427 16109343 16680676 17159172
39182A7159172L90145L13863K52212K01883J55623J06592N2774j399m7616p8387
$$ 17159172 17549317 17863180 18115392 18317275 18472898 18579490 18632264 18630865 18583249 18504862
39172A8504862r0393q4955o6362l9331o461L3112Q2567J44055K15725K91419L62968
$$ 18504862 18414469 18329514 18263152 18223821 18217360 18250472 18333039 18477094 18692819 18984238 19347206
39161A9347206M23095M67189M93551N03112M99690M90829M87495N01317N40607
$$ 19347206 19770301 20237490 20731041 21234153 21733843 22224672 22712167 23213484 23754091
39152B3754091O08433P04193Q26117R71410J133893J302492J463109J603142J715693
$$ 23754091 24362524 25066717 25892834 26864244 27998137 29300629 30763738 32366880 34082573
39143C4082573J801547J868792J931171K005579K108673K252688K442039K672902
$$ 34082573 35884120 37752912 39684083 41689662 43798335 46051023 48493062 51165964
39135E1165964K936684L225435L535826L869740M232661M632310N078635N583608
$$ 51165964 54102648 57328083 60863909 64733649 68966310 73598620 78677255 84260863
39127H4260863O159416O815642P558109Q390554R317362J0344093J1475000J2709752
$$ 84260863 90420279 97235921 104794030 113184584 122501946 132846039 144321039 157030791
39119A57030791J4042278J5461969J6954880J8502188K0075229K1628104K3088503
$$ 157030791 171073069 186535038 203489918 221992106 242067335 263695439 286783942
39112B86783942K4347030K5246293K5574429K5070315K3449972K0463313J5982945
$$ 286783942 311130972 336377265 361951694 387022009 410471981 430935294 446918239
39105D46918239J0103972L205538m080795j1010361j6919973k1386124k4280164
$$ 446918239 457022211 460227749 456146954 445136593 428216620 406830496 382550332
39098C82550332k5720218k5971110k5347508k4147417k2617070k0938719j9233084
$$ 382550332 356830114 330859004 305511496 281364079 258747009 237808290 218575206
39091B18575206j7570086j5983105j4484073j3077367j1769704j0573424r502798
$$ 218575206 201005120 185022015 170537942 157460575 145690871 135117447 125614649
39084A25614649q566475p761028p069473o465647n921770n415672m934958m477410
$$ 125614649 117048174 109287146 102217673 95752026 89830256 84414584 79479626 75002216
39076G5002216m048225l655904l308715l012643k770112k579018k432365k319070
$$ 75002216 70953991 67298087 63989372 60976729 58206617 55627599 53195234 50876164
39068E0876164k225567k137817k044054j937795j819276j693823j568377j448634
$$ 50876164 48650597 46512780 44468726 42530931 40711655 39017832 37449455 36000821
39060C6000821j337452j233805j132589j026897r12608p91812o71811n60188m60132
$$ 36000821 34663369 33429564 32296975 31270078 30357470 29565658 28893847 28333659 27873527
39051B7873527l69845k86106k08316j39073q0974l3122R255N2296J00994J58200
$$ 27873527 27503682 27217576 27009260 26870187 26789213 26756091 26765346 26817642 26918636 27076836
39041B7076836K24380K97137L70902M38035M91617N28815N52896N72038N95654
$$ 27076836 27301216 27598353 27969255 28407290 28898907 29427722 29980618 30552656 31148310
39032C1148310O31412O85405P64194Q75225J024904J216748J451258J726658K039522
$$ 31148310 31779722 32465127 33229321 34104546 35129450 36346198 37797456 39524114 41563636
39023D1563636K385930K763485L172535L615242M093413M606225N147829N704803
$$ 41563636 43949566 46713051 49885586 53500828 57594241 62200466 67348295 73053098
39015G3053098O254792O767291P204918P523315P670511P588668P220690O522600
$$ 73053098 79307890 86075181 93280099 100803414 108473925 116062593 123283283 129805883
39007A29805883N479829M120854K518728P76929r91964k681299m195076n450660
$$ 129805883 135285712 139406566 141925294 142702223 141710259 139028960 134833884 129383224
38999A29383224o387809o980927p244372p225197o987708o597815o112616n576490
$$ 129383224 122995415 116014488 108770116 101544919 94557211 87959396 81846780 76270290
38991G6270290n022384m475283l954797l475542l046166k668581k338236k045585
$$ 76270290 71247906 66772623 62817826 59342284 56296118 53627537 51289301 49243716
38983D9243716j778879j527579j284899j048274q17992n95644l84124j89263k0743
$$ 49243716 47464837 45937258 44652359 43604085 42786093 42190449 41806325 41617062 41596319
38974D1596319J10053J95289K35198K37950K14306J70792J05808J0401j27384
$$ 41596319 41706372 41901661 42136859 42374809 42589115 42759907 42865715 42876116 42748732
38965D2748732l16749n59169q45732j157192j466000j740009j948186k068317
$$ 42748732 42431983 41872814 41027082 39869890 38403890 36663881 34715695 32647378
38957C2647378k094374k039772j934042j813668j710412j641352j604484j581902
$$ 32647378 30553004 28513232 26579190 24765522 23055110 21413758 19809274 18227372
38949A8227372j549205j486356j385222j251549j102324r60024q45174p69175
$$ 18227372 16678167 15191811 13806589 12555040 11452716 10492692 9647518 8878343
38941H878343p30039p13132o96803o60511n92055m91116l68158k39819j22859
$$ 8878343 8148304 7435172 6738369 6077858 5485803 4994687 4626529 4386710 4263851
38932D263851k8635M0172Q8908J25844J55460J75016J77578J59093J23539Q1635
$$ 4263851 4235216 4275388 4364296 4490140 4645600 4820616 4998194 5157287 5280826 5362461
38922E362461M4124J4944j0589m1664q5086j40319j99024k48713k78316k82764
$$ 5362461 5406585 5421529 5410940 5369276 5284190 5143871 4944847 4696134 4417818 4135054
38912D135054k64006k27943j79935j22894n9375N266O2363J02530J18702J07515
$$ 4135054 3871048 3643105 3463170 3340276 3280901 3286167 3348530 3451060 3569762 3677277
38902C677277O9425Q607o7044j46487k17083k67236k89340k81276k45017j83221
$$ 3677277 3746702 3755309 3688265 3541778 3324695 3057459 2768119 2486843 2241826 2058605
38892B058605r7161J1583J37182K67494L86675M80748N41910N68649N62942N28382
$$ 2058605 1961444 1973027 2110209 2377703 2764378 3245126 3787036 4355685 4918627 5447009
38882E447009M71369M03382L40259K97002K81296K90617L14871L42195L63519
$$ 5447009 5918378 6321760 6662019 6959021 7240317 7530934 7845805 8188000 8551519
38873H551519L73818L70999L54655L25632K85508K35521J75711J05248K3540o8966
$$ 8551519 8925337 9296336 9650991 9976623 10262131 10497652 10673363 10778611 10802151 10733185
38863A0733185j70011k74010l70541m45736m87656m92637m67469m25392l79020
$$ 10733185 10563174 10289164 9918623 9472887 8985231 8492594 8025125 7599733 7220713
38854G220713l35206k94737k55997k19408j89358j71995j70201j79471j88407
$$ 7220713 6885507 6590770 6334773 6115365 5926007 5754012 5583811 5404340 5215933
38845E215933j84222j59706j16772o4693j5041K3404M7941O3011P8096J02268
$$ 5215933 5031711 4872005 4755233 4690540 4675499 4698903 4746844 4809855 4887951 4990219
38835D990219J37890J78299K11795K29032K28224K15226J99679J90346J91959
$$ 4990219 5128109 5306408 5518203 5747235 5975459 6190685 6390364 6580710 6772669
38826F772669K04530K24933K49148K73587K95145L10837L17730L12643K91573
$$ 6772669 6977199 7202132 7451280 7724867 8020012 8330849 8648579 8961222 9252795
38817I252795K49926J84461R6104q422j17510k17592k96470l45557l60715l42356
$$ 9252795 9502721 9687182 9783286 9774864 9657354 9439762 9143292 8797735 8437020 8094664
38807H094664k95504k29200j54214p9809j2220M3495Q0485R0088O5974R066p0961
$$ 8094664 7799160 7569960 7415746 7335937 7323717 7367212 7447697 7537785 7603759 7612825 7541864
38796G541864j58935k39901l04128l49078l77647l93887l99108l91094l66739
$$ 7541864 7382929 7143028 6838900 6489822 6112175 5718288 5319180 4928086 4561347
38787D561347l25351k69891k05540j37660p1264j1764L4712O2697O9508N6124
$$ 4561347 4235996 3966105 3760565 3622905 3551641 3539877 3574589 3637286 3706794 3762918
38777C762918K6184j5735o5400j19917j78989k45582l23957m14333n06790n79467
$$ 3762918 3789102 3773367 3707967 3588050 3409061 3163479 2839522 2425189 1918399 1338932
38767A338932o04422n59679m40763k64571o3028J29272K86486L97182M63660M96937
$$ 1338932 734510 174831 -265932 -530503 -593531 -464259 -177773 219409 683069 1180006
38757A180006N09731N09913M97243M65011M05891L18569K11344J00455L827o6490
$$ 1180006 1689737 2199650 2696893 3161904 3567795 3886364 4097708 4198163 4201990 4135500
38747D135500j09132j32871j51198j75001k07053k40870k64412k66725k43877
$$ 4135500 4026368 3893497 3742299 3567298 3360245 3119375 2854963 2588238 2344361
38738B344361k00724j47584r4286m5964l505L2266N6686O1554L9813q789p5345
$$ 2344361 2143637 1996053 1901767 1855803 1852298 1884564 1941250 2002804 2042617 2033828 1958483
38727A958483j44516k00680k34162k44225k37799k25577k18251k24351k48746
$$ 1958483 1813967 1613287 1379125 1134900 897101 671524 453273 228922 -19824
38718a9824k90902l43872l95853m33958m47712m30801l81894l05382k10921j10555
$$ -19824 -310726 -654598 -1050451 -1484409 -1932121 -2362922 -2744816 -3050198 -3261119 -3371674
38708c371674j5020O8135J33983J79529K04293K10875K04019J88773J69640J50952
$$ -3371674 -3386694 -3318559 -3184576 -3005047 -2800754 -2589879 -2385860 -2197087 -2027447 -1876495
38698a876495J37077J31709J37006J53460J80227K15082K53762K89454L13340
$$ -1876495 -1739418 -1607709 -1470703 -1317243 -1137016 -921934 -668172 -378718 -65378
38689f5378L16710K94181K46422J80545J07860M0296j2834m6719o1566o1597n3097
$$ -65378 251332 545513 791935 972480 1080340 1120636 1107802 1061083 999517 937920 884823
38678H84823m2391l4768l4370m4179o5604r7660j36054j72668j96422j96530j67583
$$ 884823 842432 807664 773294 729115 663511 565851 429797 257129 60707 -135823 -303406
38667c03406j13618m7798J3039N5834P5947P6332O3018M1095J3968j5102m2179
$$ -303406 -417024 -464822 -451783 -395949 -320002 -243670 -180652 -139557 -125589 -140691 -182870
38656a82870o4165q1432r8741j22677j56477j95536k27517k38254k19957j75836
$$ -182870 -247035 -328467 -427208 -549885 -706362 -901898 -1129415 -1367669 -1587626 -1763462
38646a763462j17956o0785j5523J2162K2129J9179J1581Q160J5116L4904O7446
$$ -1763462 -1881418 -1942203 -1957726 -1945564 -1923435 -1904256 -1892675 -1884515 -1869399 -1834495 -1767049
38635a767049J11746J65991K26533K87216L39959L76435L90195L78511L43121
$$ -1767049 -1655303 -1489312 -1262779 -975563 -635604 -259169 131026 509537 852658
38626H52658K89676K26545J63664J10962P5524N8092N1636M4299K5841o472m6578
$$ 852658 1142334 1368879 1532543 1643505 1719029 1777121 1828757 1873056 1898897 1892425 1845847
38615A845847q3843j09676j22009j24993j24939j25757j26378j20554r8565n0569
$$ 1845847 1762004 1652328 1530319 1405326 1280387 1154630 1028252 907698 809133 758564
38605G58564K8806J36412K59517L78967M75168N33782N48577N20796M56529L64164
$$ 758564 787370 923782 1183299 1562266 2037434 2571216 3119793 3640589 4097118 4461282
38595D461282K52647J29896J233j30689k63037l88795m95844n71231o07612o06583
$$ 4461282 4713929 4843825 4845058 4714369 4451332 4062537 3566693 2995462 2387850 1781267
38585A781267n76846n30013m77639m30136l95726l78585l77296l85110l91873
$$ 1781267 1204421 674408 196769 -233367 -629093 -1007678 -1384974 -1770084 -2161957
38576b161957l86646l60330l08192k31666j38057l7725O0000J49609K29194K97640
$$ -2161957 -2548603 -2908933 -3217125 -3448791 -3586848 -3624573 -3564573 -3414964 -3185770 -2888130
38566b888130L51695L85569L93744L74731L32423K73948K06412J35691O7761R886
$$ -2888130 -2536435 -2150866 -1757122 -1382391 -1049968 -776020 -569608 -433917 -366156 -356270
38556c56270l0206m6698l7654n734M2046R5565J44206J79996J99834K05516K02051
$$ -356270 -386476 -433174 -470828 -476562 -434516 -338951 -194745 -14749 185085 390601 592652
38545E92652J95311J89863J87692J88287J89969J91225J91081J88563J82357J71054
$$ 592652 787963 977826 1165518 1353805 1543774 1734999 1926080 2114643 2297000 2468054
38535B468054J53420J28141R3498M7874q710p3107j38846j97661k41926k66805
$$ 2468054 2621474 2749615 2843113 2890987 2882277 2809170 2670324 2472663 2230737 1963932
38525A963932k71327k58082k31712j96475j53774j01056l3326N3396J58882K77904
$$ 1963932 1692605 1434523 1202811 1006336 852562 751506 718180 771576 930458 1208362
38515A208362M02045N21981O28347P11150P59508P63646P19121O31044N14785
$$ 1208362 1610407 2132388 2760735 3471885 4231393 4995039 5714160 6345204 6859989
38506F859989L91700K81855J98494J46688J24749J25319J35895J41130J27727
$$ 6859989 7251689 7533544 7732038 7878726 8003475 8128794 8264689 8405819 8533546
38497H533546Q9408K8738m4672j17756j77866k16488k31864k29137k17536k05998
$$ 8533546 8622954 8651692 8607020 8489264 8311398 8094910 7863046 7633909 7416373 7210375
38487G210375j99629j98790k00844k02785k02519j98240j87766j69793j46340
$$ 7210375 7010746 6811956 6611112 6408327 6205808 6007568 5819802 5650009 5503669
38478E503669j23883j11557j17384j44417j88518k39211k84055l14521l29124
$$ 5503669 5379786 5268229 5150845 5006428 4817910 4578699 4294644 3980123 3650999
38469C650999l31493l25553l12662k93041k69483k49569k44398k64456l14967
$$ 3650999 3319506 2993953 2681291 2388250 2118767 1869198 1624800 1360344 1045377
38460A045377l93166m88750n86827o71386p27978p46102p21872o60110n73352
$$ 1045377 652211 163461 -423366 -1094752 -1822730 -2568832 -3290704 -3950814 -4524166
38451d524166m76967l82860k96146k16889j44483q0186k6015J7794N3557Q4260
$$ -4524166 -5001133 -5383993 -5680139 -5897028 -6041511 -6121697 -6147712 -6129918 -6076361 -5992101
38441e992101J10910J31334J41199J36700J17406Q7781N6459L3484K6825L9262
$$ -5992101 -5881191 -5749857 -5608658 -5471958 -5354552 -5266771 -5210312 -5176828 -5150003 -5110741
38431e110741O6673R8867J23073J28670J10455O8981R211o0588j29262j83893
$$ -5110741 -5044068 -4945201 -4822128 -4693458 -4583003 -4514022 -4504811 -4565399 -4694661 -4878554
38421d878554k12736k08825j71988j07901k5423O5655J55328K34106K95301L37922
$$ -4878554 -5091290 -5300115 -5472103 -5580004 -5605427 -5539772 -5384444 -5150338 -4855037 -4517115
38411d517115L67026L89978M11289M30457M44224M50444M49897M45419M40047
$$ -4517115 -4150089 -3760111 -3348822 -2918365 -2474141 -2023697 -1573800 -1128381 -688334
38402f88334M35795M33058M30228M23656M08248L78640L30840K64071J82066R2603
$$ -688334 -252539 180519 610747 1034403 1442651 1821291 2152131 2416202 2598268 2690871
38392B690871M808p4551j43437k04182k61037l17734l76387m37299m98187n52728
$$ 2690871 2695679 2621128 2477691 2273509 2012472 1694738 1318351 881052 382865 -169863
38382a69863n90213n98397n68924n01887m06158k95165j81214p2179K7683J14160
$$ -169863 -760076 -1358473 -1927397 -2429284 -2835442 -3130607 -3311821 -3384000 -3356317 -3242157
38372c242157J80015K15263K10945J63888P9503k8376j39665k31347k81963k77095
$$ -3242157 -3062142 -2846879 -2635934 -2472046 -2392543 -2420919 -2560584 -2791931 -3073894 -3350989
38362c350989k14198j04448K9518J59265K58050L08451L07729K68362K12701J64322
$$ -3350989 -3565187 -3669635 -3640117 -3480852 -3222802 -2914351 -2606622 -2338260 -2125559 -1961237
38352a961237J40474J48482J85659K41163K99503L45446L68339L63185L28386
$$ -1961237 -1820763 -1672281 -1486622 -1245459 -945956 -600510 -232171 131014 459400
38343D59400K63814J71858N9921n9455j72258k67885l41916l95606m33218m58735
$$ 459400 723214 895072 954993 895538 723280 455395 113479 -282127 -715345 -1174080
38333a174080m73519m75808m62079m29353l77343l09827k34877j63346j05941
$$ -1174080 -1647599 -2123407 -2585486 -3014839 -3392182 -3702009 -3936886 -4100232 -4206173
38324d206173o9816n6102n9231o8531p1789n9519k8048J9803P6076J30042J70938
$$ -4206173 -4275989 -4332091 -4391322 -4459853 -4531642 -4591161 -4619209 -4599406 -4523330 -4393288 -4222350
38313d222350J90723J86439J61494J25587R2864P8072R1575J35630K04074K85349
$$ -4222350 -4031627 -3845188 -3683694 -3558107 -3465243 -3387171 -3295596 -3159966 -2955892 -2670543
38303b670543L66433M35303M81709M97834M80319M33066L68272L03182K53476
$$ -2670543 -2304110 -1868807 -1387098 -889264 -408945 24121 392393 695575 949051
38294I49051K27066K22198K30176K40053K42786K33789K13731J87412J61338J41125
$$ 949051 1176117 1398315 1628491 1868544 2111330 2345119 2558850 2746262 2907600 3048725
38284C048725J29255J23272J15390R5408N6833K564n4525r7099j11540r3973n1466
$$ 3048725 3177980 3301252 3416642 3512050 3568883 3571447 3516922 3419823 3308283 3214310 3162844
38273C162844J598N0078Q4412J03603J13685J22884J36436J53279J65834J62852
$$ 3162844 3164442 3214520 3298932 3402535 3516220 3639104 3775540 3928819 4094653 4257505
38263D257505J34253P5755q898j09110k10970l01175l69338m08325m13819l84862
$$ 4257505 4391758 4467513 4458615 4349505 4138535 3837360 3468022 3059697 2645878 2261016
38253B261016l25492k45334j57182p2629R85O0121J02527J25509J26369J04080
$$ 2261016 1935524 1690190 1533008 1460379 1461364 1521485 1624012 1749521 1875890 1979970
38243A979970O0808K457o2125j23508j74643k12500k37199k49715k50606k41191
$$ 1979970 2040778 2043235 1981110 1857602 1682959 1470459 1233260 983545 732939 491748
38233D91748k25797k12181k08673k19829k44252k76019l07667l31615l40211l26934
$$ 491748 265951 53770 -154903 -374732 -618984 -895003 -1202670 -1534285 -1874496 -2201430
38223b201430k89506k31918j62626r0289k0919M2017R6753J43602J85508K26716
$$ -2201430 -2490936 -2722854 -2885480 -2975769 -2996688 -2954671 -2857918 -2714316 -2528808 -2302092
38213b302092K69887L14093L55083L87018M04168M02286L79988L39883K88388
$$ -2302092 -2032205 -1718112 -1363029 -976011 -571843 -169557 210431 550314 838702
38204H38702K33748J82823J38431R8381N6902Q032n0362j13976j72945k15691
$$ 838702 1072450 1255273 1393704 1492085 1548987 1557019 1506657 1392681 1219736 1004045
38194A004045k33162k20757j77978j08182j9506P4710J58147K15985K39044K25515
$$ 1004045 770883 550126 372148 263966 244460 319170 477317 693302 932346 1157861
38184A157861J80325J13402L7740l2149q1483r7168p1264m866R0939J99241L04323
$$ 1157861 1338186 1451588 1489328 1457179 1375696 1278528 1207264 1202398 1293337 1492578 1796901
38173A796901L96408M70976N24859N53804N53729N23572M66437L88271K96091
$$ 1796901 2193309 2664285 3189144 3742948 4296677 4820249 5286686 5674957 5971048
38164E971048J97367J00134J1751o3698j27207j83201k34780k79560l10221l20147
$$ 5971048 6168415 6268549 6280300 6216602 6089395 5906194 5671414 5391854 5081633 4761486
38154D761486l09977k89661k74218k76405l01340l45654m00112m53117m93761
$$ 4761486 4451509 4161848 3887630 3611225 3309885 2964231 2564119 2111002 1617241
38145A617241n14074n10217m82077m31542l60744k71588j66883n2218O2879J65703
$$ 1617241 1103167 592950 110873 -320669 -681413 -953001 -1119884 -1172102 -1109223 -943520
38135i43520K43439K87294K95292K72015K25634J64495R5747K6262l5571p9841
$$ -943520 -700081 -412787 -117495 154520 380154 544649 640396 666658 631087 551246
38125E51246r7907q6726n1715n715L5679N9963O1712M3523J4297j3756k8548k1534
$$ 551246 453339 366613 314898 309183 344862 404825 466537 510060 524357 510601 482053 460519
38113D60519R672O1023J24753J93463K62724L30573L95392M54395N03639N38917
$$ 460519 470191 531214 655967 849430 1112154 1442727 1838119 2292514 2796153 3335070
38103C335070N56916N56292N38040N04685M59285M05456L47902K91454K38482
$$ 3335070 3891986 4448278 4986318 5491003 5950288 6355744 6703646 6995100 7233582
38094G233582J87050J32154O9364j644p5559j42377j90496k10646j98409j54168
$$ 7233582 7420632 7552786 7622150 7620506 7544947 7402570 7212074 7001428 6803019 6648851
38084F648851q2093R593J07690J95260K56034K79403K62752K10839J34067M6643
$$ 6648851 6566758 6576351 6684041 6879301 7135335 7414738 7677490 7888329 8022396 8069039
38074H069039l6174j02005j45055j67116j74904j75214j71032j61088j42702j15656
$$ 8069039 8032865 7930860 7785805 7618689 7443785 7268571 7097539 6936451 6793749 6678093
38064F678093q4227n6113l8950l6729m8264o8341r0198j07855j17689j19394j15917
$$ 6678093 6593866 6537753 6498803 6462074 6413810 6345469 6255271 6147416 6029727 5910333 5794416
38053E794416j11662j09745j10451j12044j13014j13815j17251j27418j47605
$$ 5794416 5682754 5573009 5462558 5350514 5237500 5123685 5006434 4879016 4731411
38044D731411j78042k15092k52743k85051l07459l16371l08855k84028k45635
$$ 4731411 4553369 4338277 4085534 3800483 3493024 3176653 2867798 2583770 2338135
38035B338135k03097j68744j52160j55082j70517j86173j89469j71103j26508
$$ 2338135 2135038 1966294 1814134 1659052 1488535 1302362 1112893 941790 815282
38026H15282n5947L6442J44479K61776L82227M98814O02034O79625P18819P11038
$$ 815282 759335 795777 940256 1202032 1584259 2083073 2685107 3364732 4083551 4794589
38016D794589O56972N68528M65352L67831K91077K42775K24008K30750K55077
$$ 4794589 5451561 6020089 6485441 6853272 7144349 7387124 7611132 7841882 8096959
38007H096959K86296L11854L18206K93042K29890J33039J8479r1176j75082k20920
$$ 8096959 8383255 8695109 9013315 9306357 9536247 9669286 9687765 9596589 9421507 9200587
37997I200587k26936j99789j50680r2053l6080N825K4538J6936j0278m0857n5198
$$ 9200587 8973651 8773862 8623182 8531129 8495049 8500874 8525412 8542348 8532070 8491213 8436015
37986H436015l9467P920P5960J45944J98452K19484K04173J57484R2021K3818
$$ 8436015 8396548 8404468 8480428 8626372 8824824 9044308 9248481 9405965 9497986 9521804
37976I521804l2808o9778q7436r3195r7147j06922j24299j44878j60602j63790
$$ 9521804 9488996 9419218 9331782 9238587 9141440 9034518 8910219 8765341 8604739 8440949
37966H440949j50770j23355q7726n1926k3516q192r317k7704o0654j00365j33428
$$ 8440949 8290179 8166824 8079098 8027172 8003656 7995464 7986147 7958443 7897789 7797424 7663996
37955G663996j44127j21234o4265J5539R9964J71028K16935K35508K34545K28743
$$ 7663996 7519869 7398635 7334370 7349909 7449873 7620901 7837836 8073344 8307889 8536632
37945H536632K33763K60003L08739L71768M34085M78697M92058M68043M08950
$$ 8536632 8770395 9030398 9339137 9710905 10144990 10623687 11115745 11583788 11992738
37936A1992738L23690K24668J24732L5028l5930q2409j01723r5108o8445l1442
$$ 11992738 12316428 12541096 12665828 12700856 12664926 12582517 12480794 12385686 12317241 12285799
37926A2285799M961L1895M4907M4071L1620Q615k6648p6742j41036k12749k79573
$$ 12285799 12290760 12322655 12367562 12411633 12443253 12451868 12425220 12348478 12207442 11994693 11715120
37915A1715120l27490l45572l29711k84126k20278j53296r6387n5106k4371Q754
$$ 11715120 11387630 11042058 10712347 10428221 10207943 10054647 9958260 9903154 9878783 9887537
37905I887537N6900J23739K01019K73300L26492L54220L59182L50350L38475L31582
$$ 9887537 9944437 10068176 10269195 10542495 10868987 11223207 11582389 11932739 12271214 12602796
37895A2602796L32094L36814L39449L33543L13922K76967K21553J50880P2999
$$ 12602796 12934890 13271704 13611153 13944696 14258618 14535585 14757138 14908018 14981017
37886A4981017j981o6723j19691j63913k03122k39032k71797l02118l32192l64076
$$ 14981017 14979036 14912313 14792622 14628709 14425587 14186555 13914758 13612640 13280448 12916372
37876A2916372l96972m26027m43927m44325m24635l86535l34295k72335k03397
$$ 12916372 12519400 12093373 11649446 11205121 10780486 10393951 10059656 9787321 9583924
37867I583924j28017m5209M6021J44774K46151L39825M11009M45407M36525L90505
$$ 9583924 9455907 9410698 9456719 9601493 9847644 10187469 10598478 11043885 11480410 11870915
37857A1870915L24154K56944K02494J64827J40327J22570J06523R0087P3173N6098
$$ 11870915 12195069 12452013 12654507 12819334 12959661 13082231 13188754 13278841 13352014 13408112
37847A3408112L9213K3631J1260K839m379j6542l9925p6653j22710j69622k08771
$$ 13408112 13447325 13470956 13482216 13485055 13480676 13464134 13424209 13347556 13224846 13055224 12846453
37836A2846453k35074k47135k43931k21990j77155j10440l2396L9211Q7752J05670
$$ 12846453 12611379 12364244 12120313 11898323 11721168 11610728 11578332 11617543 11705295 11810965
37826A1810965R6258O9113L4065j787l3576n7527p1602p7173p9557q6254j03598
$$ 11810965 11907223 11976336 12010401 12008614 11975038 11917511 11845909 11768736 11689179 11602925 11499327
37815A1499327j33647j72942k14064k49368k74407k88707k93943k91721k82647
$$ 11499327 11365680 11192738 10978674 10729306 10454899 10166192 9872249 9580528 9297881
37806I297881k66382k41901k08204j65709j17390o8291k3994J0547L1727L8773
$$ 9297881 9031499 8789598 8581394 8415685 8298295 8230004 8206010 8216557 8248284 8287057
37796H287057L5661L1084L4967N3516Q6156J25408J58535J70355J47923Q6400
$$ 8287057 8322718 8353802 8388769 8442285 8528441 8653849 8812384 8982739 9130662 9217062
37786I217062p526j17928k26306l17772l82955m16510m15456l79381l11840k21240
$$ 9217062 9209536 9091608 8865302 8547530 8164575 7748065 7332609 6953228 6641388 6420148
37776F420148j20151k2922N7987J15690J51275J73505J95520K29294K80043L43505
$$ 6420148 6299997 6277075 6335062 6450752 6602027 6775532 6971052 7200346 7480389 7823894
37766G823894M07764M58679M85689M84784M57774M09158L43203K63380J74163
$$ 7823894 8231658 8690337 9176026 9660810 10118584 10527742 10870945 11134325 11308488
37757A1308488Q2920q83o9513j21189j61502k01175k51639l20277m07109n04297
$$ 11308488 11391408 11390525 11321012 11199823 11038321 10837146 10585507 10265230 9858121 9353824
37747I353824n99103o78844p34975p64301p67578p47239p05982o47052n75747
$$ 9353824 8754721 8075877 7340902 6576601 5809023 5061784 4355802 3708750 3133003
37738C133003n00353m30401l72339l25571k82382k32462j69246r3963j4841N7618
$$ 3133003 2632650 2202249 1829910 1504339 1221957 989495 820249 726286 711445 769063
37728G69063J15778J56674J79980J85278J72159J43007J04845O7458L8870K1803
$$ 769063 884841 1041515 1221495 1406773 1578932 1721939 1826784 1894242 1933112 1954915
37718A954915J3426P649k197k1379n2446r4046j40440j82688k11537k20569k07641
$$ 1954915 1968341 1975990 1973793 1952414 1899968 1805922 1665482 1482794 1271257 1050688 843047
37707H43047j74536j26034o9419j3645L2873O4897Q1255Q3431P3343N2085J9900
$$ 843047 668511 542477 473058 459413 492286 557183 638438 721869 795212 847297 867197
37696H67197k3300p6828j37559j98664k50378k82975k90324k71872k32294j79280
$$ 867197 843897 767069 629510 430846 180468 -102507 -392831 -664703 -896997 -1076277
37686a076277j20803o3108j0305L4611O8515Q7872Q9813P3645M1457k894n5304
$$ -1076277 -1197080 -1260188 -1270493 -1235882 -1167367 -1079495 -989682 -916037 -874580 -877474 -932778
37675i32778j11590j65915k09432k31796k25304j88609j27156n0159L3696J19470
$$ -932778 -1044368 -1210283 -1419715 -1651511 -1876815 -2065424 -2192580 -2242739 -2209043 -2089573
37665b089573K06515K96343L89332M82674N70460O44615O95667P14455O95924
$$ -2089573 -1883058 -1586715 -1197383 -714709 -144249 500366 1196033 1910488 2606412
37656B606412O42934N65924M77417L85471K91519J93671R1931r114j01708j78954
$$ 2606412 3249346 3815270 4292687 4678158 4969677 5163348 5255279 5246165 5144457 4965503
37646D965503k38221k81573l13331l37101l54314l64048l63074l46421l09990
$$ 4965503 4727282 4445709 4132378 3795277 3440963 3076915 2713841 2367420 2057430
37637B057430k54811j89435j27151p8950m7457k6288m797K5936O9754J25545J89164
$$ 2057430 1802619 1613184 1486033 1407083 1359626 1333338 1328541 1354477 1424231 1549776 1738940
37626A738940K55062L16651L65812L93059L89833L52350K84366J96224J00674
$$ 1738940 1994002 2310653 2676465 3069524 3459357 3811707 4096073 4292297 4392971
37617D392971Q364p4434j45925k07914k64164l17783l68382m11024m38130m43430
$$ 4392971 4401335 4326901 4180976 3973062 3708898 3391115 3022733 2611709 2173579 1730149
37607A730149m25477l88569l40960k91839k49013k17636j99582j92905j91914
$$ 1730149 1304672 916103 575143 283304 34291 -183345 -382927 -575832 -767746
37598g67746j88099j71756j34302p1654J2169J03767J83675K33225K41446K08732
$$ -767746 -955845 -1127601 -1261903 -1333557 -1321388 -1217621 -1033946 -800721 -559275 -350543
37588c50543J46180P1109O06n3904q8103j02194r7479p5468l9404M322M6956P9871
$$ -350543 -204363 -133254 -132648 -186552 -274655 -376849 -474328 -549796 -589200 -584878 -537922 -458051
37576d58051R6944R5388P5049L7563j3289p0118j21340j53232j54269j19419n2156
$$ -458051 -361107 -265719 -190670 -153107 -166396 -236514 -357854 -511086 -665355 -784774 -836930
37565h36930L6464J31038K16029K79201L12909L13761K82572K25318J53328Q0487
$$ -836930 -800466 -669428 -453399 -174198 138711 452472 735044 960362 1113690 1194177
37555A194177J8266k8153o0482q5541j13164j53682k13972k93083l80960m62151
$$ 1194177 1212443 1184290 1123808 1038267 925103 771421 557449 264366 -116594 -578745
37545e78745n22139n51699n47187n08212m35757l32354k03922o1524P9150K01341
$$ -578745 -1100884 -1652583 -2199770 -2707982 -3143739 -3476093 -3680015 -3741539 -3662389 -3461048
37535c461048K92212L46363L66161L59606L37066L07549K75290K38629J92677
$$ -3461048 -3168836 -2822473 -2456312 -2096706 -1759640 -1452091 -1176801 -938172 -745495
37526g45495J34755O8727N253m2016o1471m6709L289Q5591J93813L16812M37745
$$ -745495 -610740 -542013 -536760 -578776 -640247 -686956 -683667 -598076 -404263 -87451 350294
37515C50294N36595N96430O09867N81731N26974M65762M17507L94827L99004M19329
$$ 350294 886889 1483319 2093186 2674917 3201891 3667653 4085160 4479987 4878991 5298320
37505E298320M37674M36281M04902L44243K65067J83859J16792P3842N5169N1413
$$ 5298320 5735994 6172275 6577177 6921420 7186487 7370346 7487138 7560980 7616149 7667562
37495G667562M8101L2351j723n2031j12276j77028k43822l10905l73440m22310
$$ 7667562 7715663 7748014 7746291 7694260 7581984 7404956 7161134 6850229 6476789 6054479
37485F054479m46926m40136m01805l38811k61711j80467j02257l2534K2354N4256
$$ 6054479 5607553 5167417 4765612 4426801 4165090 3984623 3882366 3849832 3872186 3926442
37475C926442N5729K4446l3506j03824j67906k09177k19165k00175j62574j18101
$$ 3926442 3982171 4006617 3973111 3869287 3701381 3492204 3273039 3072864 2910290 2792189
37465B792189p3872l1083J1639N4287R4560J29747J58279J79030J89432J84953
$$ 2792189 2718317 2687234 2698873 2753160 2847720 2977467 3135746 3314776 3504208 3689161
37455C689161J60968J15791N2565k1398r7393j68170k28657k74616l01506l05497
$$ 3689161 3850129 3965920 4018485 3997087 3899694 3731524 3502867 3228251 2926745 2621248
37445B621248k85638k44310j84868j08952j6984Q7857J95546K89070L49486L63776
$$ 2621248 2335610 2091300 1906432 1797480 1780496 1868353 2063899 2352969 2702455 3066231
37435C066231L30984K62958J79053R7876L0910j8766n3285p5295q4904p9567n6540
$$ 3066231 3397215 3660173 3839226 3937102 3968012 3949246 3895961 3820666 3735762 3656195 3599655
37424C599655j6344L4847Q6276J27327J53354J68308J81805K02698K33838K71535
$$ 3599655 3583311 3618158 3704434 3831761 3985115 4153423 4335228 4537926 4771764 5043299
37414E043299L09212L41772L67534L87168M01222M08289M04937L87531L55109
$$ 5043299 5352511 5694283 6061817 6448985 6850207 7258496 7663433 8050964 8406073
37405H406073L11577K65287K25463J97386J79665J65556J47434J21478Q9693N8246
$$ 8406073 8717650 8982937 9208400 9405786 9585451 9751007 9898441 10019919 10109612 10167858
37395A0167858L3321J7362P964k67j2959l4030o4650j02582j42416j77423k02413
$$ 10167858 10201179 10218541 10226505 10226238 10213279 10179249 10114599 10012017 9869601 9692178 9489765
37384I489765k15364k16829k08337j91500j68145j40663j12116q6312o7931o2443
$$ 9489765 9274401 9057572 8849235 8657735 8489590 8348927 8236811 8150499 8082568 8020125
37374H020125p5475j11135j69037k41303l12512l64583l84875l72210l36901k94922
$$ 8020125 7944650 7833515 7664478 7423175 7110663 6746080 6361205 5988995 5652094 5357172
37364E357172k60129k38569k26893k14840j90342j44981p7345P262J00060J92825
$$ 5357172 5097043 4858474 4631581 4416741 4226399 4081418 4004073 4011335 4111395 4304220
37354D304220K80207L59695M30182M90647N39510N74600N93158N91810N66368
$$ 4304220 4584427 4944122 5374304 5864951 6404461 6979061 7572219 8164029 8730397
37345H730397N12097M25228L05896J60863L571j49204k82401l86446m58135m98885
$$ 8730397 9242494 9667722 9973618 10134481 10138052 9988848 9706447 9320001 8861866 8362981
37335H362981n11504m97144m54105l79570k73525j42464l70J33641K40214L05336
$$ 8362981 7851477 7354333 6900228 6520658 6247133 6104669 6104299 6237940 6478154 6783490
37325F783490L24625L04432K58948K04778J55661J19587R8481Q9893Q9852R5878
$$ 6783490 7108115 7412547 7671495 7876273 8031934 8151521 8250002 8339895 8429747 8525625
37315H525625J08427J29563J60164J98503K41625K87825L37381L90976M48022
$$ 8525625 8634052 8763615 8923779 9122282 9363907 9651732 9989113 10380089 10828111
37306A0828111N06855N66357O26809O88645P50387Q07826Q55662Q90458R12903
$$ 10828111 11334966 11901323 12528132 13216777 13967164 14774990 15630652 16521110 17434013
37297A7434013R27761R41456R58669R80040J002558J022607J039524J057378J083952
$$ 17434013 18361774 19303230 20261899 21241939 22244497 23267104 24306628 25364006 26447958
37288B6447958J128247J198063J298568J431458J594563J782291J987300K202948
$$ 26447958 27576205 28774268 30072836 31504294 33098857 34881148 36868448 39071396
37280C9071396K425034K651728K881982L113726L342356L558917L747728L884851
$$ 39071396 41496430 44148158 47030140 50143866 53486222 57045139 60792867 64677718
37272F4677718L939189L875836L659980L261094K659514J856283Q82314j99851
$$ 64677718 68616907 72492743 76152723 79413817 82073331 83929614 84811928 84612077
37264H4612077j305594k346027l246195l956405m454741m743683m844918m793900
$$ 84612077 83306483 80960456 77714261 73757856 69303115 64559432 59714514 54920614
37256E4920614m633186m404351m140875l864666l586609l309249l030393k747578
$$ 54920614 50287428 45883077 41742202 37877536 34290927 30981678 27951285 25203707
37248B5203707k462470k182806j919780j682289j472020j283476j108919r44544
$$ 25203707 22741237 20558431 18638651 16956362 15484342 14200866 13091947 12147403
37240A2147403p93017o61012n54487m75729m23200l92549l77421l70600l66145
$$ 12147403 11354386 10693374 10138887 9663158 9239958 8847409 8469988 8099388 7733243
37231G733243l61425l57230l55628l57102l58858l55425l41093l12462k69004
$$ 7733243 7371818 7014588 6658960 6301858 5943000 5587575 5246482 4934020 4665016
37222D665016k11363j39367n2122M9535J60250K69574L64448M33504M70739M76565
$$ 4665016 4453653 4314286 4262164 4311699 4471949 4741523 5105971 5539475 6010214 6486779
37212F486779M56215M17288L67925L15465K64830K17301J71153J24339P7102L2558
$$ 6486779 6942994 7360282 7728207 8043672 8308502 8525803 8696956 8821295 8898397 8930955
37202H930955m865l1513m5954m9641m6614m1940l9117l8024l4977k5049m965K5242
$$ 8930955 8926090 8894577 8848623 8798982 8752368 8710428 8671311 8633287 8598310 8573261 8568296 8593538
37190H593538O2443J01976J39608J73076K02690K31040K62500L02879L58557M34225
$$ 8593538 8655981 8757957 8897565 9070641 9273331 9504371 9766871 10069750 10428307 10862532
37180A0862532N29852O39152P50977Q53237R37277J001247J051470J100655J162906
$$ 10862532 11392384 12031536 12782513 13635750 14573027 15574274 16625744 17726399 18889305
37171A8889305J247548J355438J479684J609513J734251J845636J938594K010840
$$ 18889305 20136853 21492291 22971975 24581488 26315739 28161375 30099969 32110809
37163C2110809K060889K084017K067441J987869J814772J520246J092409N46218
$$ 32110809 34171698 36255715 38323156 40311025 42125797 43646043 44738452 45284670
37155D5284670p4472p06201j283147j754502k094638k303434k399468k410425
$$ 45284670 45210198 44503997 43220850 41466348 39371710 37068276 34668808 32258383
37147C2258383k363815k279990k169502k035627j880268j708961j531861j360588
$$ 32258383 29894568 27614578 25445076 23409449 21529181 19820220 18288359 16927771
37139A6927771j203642j063791r39453q29142p35096o61939o10516n72032n28211
$$ 16927771 15724129 14660338 13720885 12891743 12156647 11494708 10884192 10312160 9783949
37130I783949m58431l49112j99791k3429J57743L18126M34264M88951M73957L91541
$$ 9783949 9325518 8976406 8776615 8753186 8910929 9229055 9663319 10152270 10626227 11017768
37120A1017768K54518Q3760r7251k69250m22008n54438o70287p72619q60520r29129
$$ 11017768 11272286 11356046 11258795 10989545 10567537 10013099 9342812 8570193 7709673 6780544
37110F780544r71628r81519r54344q88766p86695o52378m91197l09583j16662
$$ 6780544 5808916 4827397 3873053 2984287 2197592 1545214 1054017 744434 627772
37101F27772P3857K43668L72976M45830M55350M06110L12510J93841O8439n0259
$$ 627772 701629 945297 1318273 1764103 2219453 2625563 2938073 3131914 3200353 3150094
37091C150094j54488k40284l04827l45005l58222l44728l09794k63669k18669
$$ 3150094 2995606 2755322 2450495 2105490 1747268 1402540 1092746 829077 610408
37082F10408j84678j65291j56750j50528j38648j18855r6288q0004p6630q5918
$$ 610408 425730 260439 103689 -46839 -185487 -304342 -400630 -480634 -557264 -643182
37072f43182j01740j17461j31009j45491j65002j89468k12807k25556k19455j90392
$$ -643182 -744922 -862383 -993392 -1138883 -1303885 -1493353 -1706160 -1931716 -2151171 -2341563
37062b341563j38592o7626J6235J04875J90603K69200L40988M08471M72001N26871
$$ -2341563 -2480155 -2547781 -2531546 -2426671 -2236068 -1966868 -1625880 -1217409 -745408 -218537
37052b18537N64049N74260N53237N05171M41656L75960L15878K60316K02093J34713
$$ -218537 345512 919772 1473009 1978180 2419836 2795796 3111674 3371990 3574083 3708796
37042C708796N7806k2018r4315j48917j78768j81221j58426j16772o5235j2765
$$ 3708796 3766602 3744584 3650269 3501352 3322584 3141363 2982937 2866165 2800930 2788165
37032B788165L4001P1710R9721J19127J32061J41172J48653J55095J59203J58999
$$ 2788165 2822166 2893876 2993597 3112724 3244785 3385957 3534610 3689705 3848908 4007907
37022D007907J53555J44050J33597J26209J25231J31112J39642J42489J31041
$$ 4007907 4161462 4305512 4439109 4565318 4690549 4821661 4961303 5103792 5234833
37013E234833J01528N7358O407m4990r6648j54126k23750l06952l97981m86113
$$ 5234833 5336361 5393719 5400126 5355136 5258488 5104362 4880612 4573660 4175679 3689566
37003C689566n60120o12047o38539o40011o18794n77700n19843m49587l72838
$$ 3689566 3129446 2517399 1878860 1238849 620055 42355 -477488 -927075 -1299913
36994a299913k95635k21800j52214q6766k7229K1966N6071P3871Q0181Q4682R7118
$$ -1299913 -1595548 -1817348 -1969562 -2056328 -2083557 -2061591 -2005520 -1931649 -1851468 -1766786 -1669668
36983a669668J21636J54700J88742K18915K47386K81366L26691L81716M35735
$$ -1669668 -1548032 -1393332 -1204590 -985675 -738289 -456923 -130232 251484 687219
36974F87219M72606M77475M43129L72920K79098J77715Q2622R29o8343j31711
$$ 687219 1159825 1637300 2080429 2453349 2732447 2910162 2992784 2993713 2925370 2793659
36964B793659j95771k61950l24793l74627m02445m04118l82284l45788l06851
$$ 2793659 2597888 2335938 2011145 1636518 1234073 829955 447671 101883 -204968
36955b04968k76860k62578k64446k77370k92970l02377k98870k79470k44833j97855
$$ -204968 -481828 -744406 -1008852 -1286222 -1579192 -1881569 -2180439 -2459909 -2704742 -2902597
36945b902597j42567q4188k9258J5725M7390O8509Q8672J21407J78530K64262
$$ -2902597 -3045164 -3129352 -3158610 -3142885 -3095495 -3026986 -2938314 -2816907 -2638377 -2374115
36935b374115L72296M87282N89602O60955O89029O70165O09192N16086M01405
$$ -2374115 -2001819 -1514537 -924935 -263980 425049 1095214 1704406 2220492 2621897
36926B621897K73697J40131P983j15407k23468l09895l67159l87217l65359l04214
$$ 2621897 2895594 3035725 3043708 2928301 2704833 2394938 2027779 1640562 1275203 970989
36916I70989k14119j10052q128P6430J30392J43926J12583L9517o2710j72883
$$ 970989 756870 646818 638690 715120 845512 989438 1102021 1141538 1078828 905945
36906I05945k66406l23711l36861l10113k55138j85185j11554m2495J6588O2273
$$ 905945 639539 315828 -21033 -331146 -586284 -771469 -883023 -925518 -908930 -846657
36896h46657R2313J05896J05054R5477Q4743P8101P4788O8283N1083K0741j7617
$$ -846657 -754344 -648448 -543394 -447917 -363174 -285073 -210285 -142002 -90919 -70178 -87795
36885h7795n4422q1725r7458j05241j10833j18314j28091j37392j42468j40809
$$ -87795 -142217 -223942 -321400 -426641 -537474 -655788 -783879 -921271 -1063739 -1204548
36875a204548j31731j15507r2455o2691k5673K0569P8905J50230K30184L08897
$$ -1204548 -1336279 -1451786 -1544241 -1606932 -1632605 -1612036 -1533131 -1382901 -1152717 -843820
36865h43820L74348M16580M30040M13922L71645L09926K37316J62784R4989M2310
$$ -843820 -469472 -52892 377148 791070 1162715 1472641 1709957 1872741 1967730 2010040
36855B010040J2722J2372M2583R6735J60116K14620K46194K49673K27812J86760
$$ 2010040 2022762 2035134 2077717 2174452 2334568 2549188 2795382 3045055 3272867 3459627
36845C459627J32584P0746O671n4619j09528j56280j94847k27179k57783k93278
$$ 3459627 3592211 3662957 3669628 3615009 3505481 3349201 3154354 2927175 2669392 2376114
36835B376114l39803l99061m65290n25601n64048n67486n30189m55215l52431
$$ 2376114 2036311 1637250 1171960 646359 82311 -485175 -1015364 -1470579 -1823010
36826a823010k34452j12609N269J14749K13456K99487L69774M18345M36241M14751
$$ -1823010 -2057462 -2170071 -2164802 -2050053 -1836597 -1537110 -1167336 -748991 -312750 102001
36816A02001L51366K54406J42857M1047k9095n4913l6291J5979Q5565J56071K13799
$$ 102001 453367 707773 850630 891677 862582 807669 771378 787357 872922 1028993 1242792
36805A242792K48548K55006K34981J97253J53198J10851P2485L7142M890k1490
$$ 1242792 1491340 1746346 1981327 2178580 2331778 2442629 2515114 2552256 2557146 2535656
36795B535656l8411m4468m1634l4072k6031k0859k1511l1343n3290q7293j27970
$$ 2535656 2497245 2452777 2411143 2377071 2351040 2330181 2308670 2277327 2224037 2136744 2008774
36784B008774j64984j86900j86456j64185j28350r1456o5310n6943o6806q9305
$$ 2008774 1843790 1656890 1470434 1306249 1177899 1086443 1021133 964190 897384 808079
36774H08079j15110j34559j41377j35236j21457j07587r8836r5426r3234q6921
$$ 808079 692969 558410 417033 281797 160340 52753 -46083 -141509 -234743 -321664
36764c21664p3639n6018m3095m8064q2727j51062k45816l50488m45774n16757
$$ -321664 -395303 -451321 -494416 -542480 -625207 -776269 -1022085 -1372573 -1818347 -2335104
36754b335104n57027n67931n54081n18628m61951l84669k92141j96028j11068
$$ -2335104 -2892131 -3460062 -4014143 -4532771 -4994722 -5379391 -5671532 -5867560 -5978628
36745e978628m9326j5698o736j1764j4945J580N2568J43479K66646M02823N28037
$$ -5978628 -6027954 -6043652 -6050388 -6062152 -6077097 -6075517 -6022949 -5879470 -5612824 -5210001 -4681964
36734d681964O22319O76048O91500O79767O54800O27079N99363N66380N18915
$$ -4681964 -4059645 -3383597 -2692097 -2012330 -1357530 -730451 -131088 435292 954207
36725I54207M50389L61946K62477J63786P5068J307n4194q6934r2019o8382k2689
$$ 954207 1404596 1766542 2029019 2192805 2267873 2269180 2214986 2128052 2036033 1967651 1944962
36714A944962L0994P6153J00616J01001Q2611N5631L0350J3465N993K890m939
$$ 1944962 1975956 2052109 2152725 2253726 2336337 2391968 2422318 2435783 2441776 2444666 2439727
36703B439727k6235o4836j17905j77903k36378k86997l26749l55646l75366l87397
$$ 2439727 2413492 2348656 2230751 2052848 1816470 1529473 1202724 847078 471712 84315
36693H4315l91700l86732l70695l42846l04016k56503k03820j50246r9958n5677
$$ 84315 -307385 -694117 -1064812 -1407658 -1711674 -1968177 -2171997 -2322243 -2422201 -2477878
36683b477878j7402J8105N6461J03324J61468K28845K99145L64617M19132M59524
$$ -2477878 -2495280 -2477175 -2420714 -2317390 -2155922 -1927077 -1627932 -1263315 -844183 -384659
36673c84659M84851M95082M90381M70868M35867L83025L08729K10812R2295l6582
$$ -384659 100192 595274 1085655 1556523 1992390 2375415 2684144 2894956 2987251 2950669
36663B950669j60031k61439l28416l55614l44751l02884k40116j67277r4200k9189
$$ 2950669 2790638 2529199 2200783 1845169 1500418 1197534 957418 790141 695941 666752
36653F66752K0711N0097N7256M6217K6103P437j907J674J8167M5064P7972J11397
$$ 666752 687463 737560 794816 841033 867136 874573 872666 874340 892507 937571 1015543 1126940
36641A126940J40120J60529J71102J71793J62599J42053J06698N2445k2995j18458
$$ 1126940 1267060 1427589 1598691 1770484 1933083 2075136 2181834 2234279 2211284 2092826
36631B092826k29154l47056m60882n56641o20211o41571o18067n54358m59317
$$ 2092826 1863672 1516616 1055734 499093 -121118 -762689 -1380756 -1935114 -2394431
36622b394431l42067k09781o8201P5875K11946L25021L97708M15044L70424K69975
$$ -2394431 -2736498 -2946279 -3014480 -2938605 -2726659 -2401638 -2003930 -1588886 -1218462 -948487
36612i48487J32952j2661j37510k18086k41228k05488j20348m435J17404K19294
$$ -948487 -815535 -828196 -965706 -1183792 -1425020 -1630508 -1750856 -1755291 -1637887 -1418593
36602a418593K81843K99433K82776K54016K36121K42230K70263L04929L25403
$$ -1418593 -1136750 -837317 -554541 -300525 -64404 177826 448089 753018 1078421
36593A078421L14458K64785J80232P3026l9943j40076k09873k36655k16411j55582
$$ 1078421 1392879 1657664 1837896 1910922 1870979 1730903 1521030 1284375 1067964 912382
36583I12382o9678K0390R2820J29446J19775O3491k9742j43426k59219l61776
$$ 912382 842704 863094 955914 1085360 1205135 1268626 1238884 1095458 836239 474463
36573D74463m41479m94478n20902n23066n04827m71552m29545l84391l39329k94824
$$ 474463 32984 -461494 -982396 -1505462 -2010289 -2481841 -2911386 -3295777 -3635106 -3929930
36563c929930k49864k04052j59231j19753r1203p7775p9112q8046r0960p1626
$$ -3929930 -4179794 -4383846 -4543077 -4662830 -4754033 -4831808 -4910920 -4998966 -5089926 -5161552
36553e161552j7496P4082J92817L17537M23095M89171N07022M81321M27043L63274
$$ -5161552 -5179048 -5104966 -4912149 -4594612 -4171517 -3682346 -3175324 -2694003 -2266960 -1903686
36543a903686L06367K64975K38869K22171K08888J97074J89104J88576J96587
$$ -1903686 -1597319 -1332344 -1093475 -871304 -662416 -465342 -276238 -87662 108925
36534A08925K09815K21253K22815K08424J76325J30137P8527L3382O481N296K9747
$$ 108925 318740 539993 762808 971232 1147557 1277694 1356221 1389603 1396084 1401380 1431127
36523A431127P1724J18086J56101J78900J87691J88928J87928J83663J68763J34665
$$ 1431127 1502851 1620937 1777038 1955938 2143629 2332557 2520485 2704148 2872911 3007576
36513C007576P7736K107q1817j61411k25922k68984k89032k88108k70122k39679
$$ 3007576 3085312 3087419 3005602 2844191 2618269 2349285 2060253 1772145 1502023 1262344
36503A262344k01731j61337j22673q7382n3691j7728K3238O7758J09668J40369
$$ 1262344 1060613 899276 776603 689221 635530 617802 641040 708798 818466 958835
36493I58835J52309J41555J08613N7975k647o3128j12627j42558j49691j36940
$$ 958835 1111144 1252699 1361312 1419287 1416640 1353512 1240885 1098327 948636 811696
36483H11696j10825p7447l9832J958M8566R8412J45601J80411J92946J77953J37326
$$ 811696 700871 623424 583592 585550 634116 732528 878129 1058540 1251486 1429439 1566765
36472A566765P8859J3076m9477j00172j34319j52901j62132j70316j83565k03053
$$ 1566765 1645624 1658700 1609223 1509051 1374732 1221831 1059699 889383 705818 502765
36462E02765k25124k43647k53237k52008k43146k34704k36916k57368k96311l45411
$$ 502765 277641 33994 -219243 -471251 -714397 -949101 -1186017 -1443385 -1739696 -2085107
36452b085107l91200m21060m28018m12280l79680l38360k95100k52582k08751
$$ -2085107 -2476307 -2897367 -3325385 -3737665 -4117345 -4455705 -4750805 -5003387 -5212138
36443e212138j58420r6577k2090N9834J38118J99449K33160K34833K07376J59602
$$ -5212138 -5370558 -5467135 -5489225 -5429391 -5291273 -5091824 -4858664 -4623831 -4416455 -4256853
36433d256853J02737M5728q235o1320j16766j74165k28063k70437k94532k97202
$$ -4256853 -4154116 -4108388 -4116623 -4177943 -4294709 -4468874 -4696937 -4967374 -5261906 -5559108
36423e559108k78622k40353j83505j08385j5858R0600K03404L11090M00753M61885
$$ -5559108 -5837730 -6078083 -6261588 -6369973 -6385831 -6295231 -6091827 -5780737 -5379984 -4918099
36413d918099M89516M84434M50698L93034L16454K27680J35994N1872j5811o2037
$$ -4918099 -4428583 -3944149 -3493451 -3100417 -2783963 -2556283 -2420289 -2368417 -2384228 -2446265
36403b446265q5942q9258p4358m3331J281N4948J10168J57069J85831J90132J70152
$$ -2446265 -2532207 -2621465 -2695823 -2739154 -2737873 -2682925 -2572757 -2415688 -2229857 -2039725 -1869573
36392a869573J33435R3033O3476N5906P3779J11111J54667J89788K06707K03572
$$ -1869573 -1736138 -1643105 -1579629 -1523723 -1449944 -1338833 -1184166 -994378 -787671 -584099
36382e84099J84954J57836J28382J00686P6782N6681L8347J8399o403l7773p5535
$$ -584099 -399145 -241309 -112927 -12241 64541 121222 159569 177968 171565 133792 58257
36371E8257j17973j61826k01656k29612k36983k17246j68790r5254l484R8714
$$ 58257 -59716 -221542 -423198 -652810 -889793 -1107039 -1275829 -1371083 -1374567 -1275853
36361a275853K02816K98123L71450M10128M06753L61842K82463J78864O2473n3721
$$ -1275853 -1073037 -774914 -403464 6664 413417 775259 1057722 1236586 1299059 1245338
36351A245338j54820k26167k57802k48576k07085j48860r1415m9593l2462m1839
$$ 1245338 1090518 864351 606549 357973 150888 2028 -89387 -138980 -171442 -213281
36341b13281p2119j11768j46676j64806j60444j36059j00637o5298l8748k5052
$$ -213281 -285400 -397168 -543844 -708650 -869094 -1005153 -1105790 -1171088 -1209836 -1234888
36331a234888k3937l1970m3660n3175n7224n7314n8957o8097q7805j17530j54090
$$ -1234888 -1258825 -1290795 -1334455 -1387630 -1444854 -1502168 -1561125 -1629222 -1717027 -1834557 -1988647
36320a988647j92010k23085k37396k27104j90871j35195p1048q352M7776R7008
$$ -1988647 -2180657 -2403742 -2641138 -2868242 -3059113 -3194308 -3265356 -3273708 -3225932 -3128924
36310c128924J41250J81875K18728K51101K79469L05977L32773L59352L81253
$$ -3128924 -2987674 -2805799 -2587071 -2335970 -2056501 -1750524 -1417751 -1058399 -677146
$$ [...]
##END NTUPLES=NMR SPECTRUM
##END=
