##TITLE=31Pdec_LR-731-CR8
 CDCl3, 24 sc
 23.12.2020
##JCAMPDX= 6.0         $$ Bruker NMR JCAMP-DX V2.0
##DATA TYPE= NMR SPECTRUM
##DATA CLASS= NTUPLES
##ORIGIN= UXNMR, Bruker Analytische Messtechnik GmbH
##OWNER= root
$$ XWIN-NMR		Version 3.5
$$ Wed Dec 23 10:13:33 2020 Russian Standard Time (UT+4h)  she@DPX200
##.OBSERVE FREQUENCY= 81.013821
##.OBSERVE NUCLEUS= ^31P
##.ACQUISITION MODE= SIMULTANEOUS
##.ACQUISITION SCHEME= undefined
##.AVERAGES= 24
##.DIGITISER RES= 17
##SPECTROMETER/DATA SYSTEM= spect
##.PULSE SEQUENCE= zgpg30
##.SOLVENT NAME= CDCl3
##.SHIFT REFERENCE= (INTERNAL, CDCl3, 0, 182.463)
##AUDIT TRAIL= $$ (NUMBER, WHEN, WHO, WHERE, WHAT)
$$ ##TITLE= Audit trail, XWIN-NMR		Version 3.5
$$ ##JCAMPDX= 5.01
$$ ##ORIGIN= Bruker BioSpin GmbH
$$ ##OWNER= she
$$ F:/spectra/data/she/nmr/P31/1/pdata/1/auditp.txt
$$ ##AUDIT TRAIL=  $$ (NUMBER, WHEN, WHO, WHERE, WHAT)
(   1,<2020-12-23 10:12:31.39 +0400>,<she>,<DPX200>,
      <created by zg, POWCHK disabled, PULCHK disabled
       configuration hash MD5:
       00 E9 B6 7A A2 85 ED C7 34 08 36 98 17 FE 4E 26
       data hash MD5: 32K
       F1 85 1F 2B 03 01 6A D9 D9 3B 61 BC 58 EE AC 4F>)
(   2,<2020-12-23 10:12:33.43 +0400>,<she>,<DPX200>,
      <Start of raw data processing
       efp BC_mod = 2 LB = 1 FT_mod = 6 PKNL = 1 PHC0 = -2541.136 PHC1 = 275.6008 SI = 64K 
       data hash MD5: 64K
       7F 0B B5 45 8F 1A 21 55 67 36 01 44 A0 E8 35 FF>)
(   3,<2020-12-23 10:13:04.95 +0400>,<she>,<DPX200>,
      <pk PHC0 = 75.03885 PHC1 = -195 
       data hash MD5: 64K
       83 F9 75 69 95 6E C2 5C 40 4D A0 B2 7E 50 4F 6B>)
(   4,<2020-12-23 10:13:07.76 +0400>,<she>,<DPX200>,
      <abs ABSG = 5 
       data hash MD5: 64K
       1A 5E 77 46 CF C2 7E 2A 54 A6 3D 64 AD 45 98 3B>)
$$ ##END=
$$ 
$$ hash MD5
$$ 2C 84 21 B9 1C 7D 4D 0B 04 FF 22 FA DF 05 35 94
##$RELAX= 
##$RELAX= 
##$RELAX= 
##$RELAX= 
##$RELAX= 
##$RELAX= 
##$RELAX= 
##$RELAX= 
$$ Bruker specific parameters
$$ --------------------------
##$DU= <F:/spectra>
##$EXPNO= 1
##$NAME= <P31>
##$PROCNO= 1
##$TYPE= <nmr>
##$USER= <she>
##$AMP= (0..31)
100 100 100 100 100 100 100 100 100 100 100 100 100 100 100 100 100 100 
100 100 100 100 100 100 100 100 100 100 100 100 100 100 
##$AQSEQ= 0
##$AQ_mod= 1
##$AUNM= <au_zg>
##$AUTOPOS= <>
##$BF1= 81.014009
##$BF2= 200.13
##$BF3= 200.13
##$BF4= 200.13
##$BF5= 200.13
##$BF6= 200.13
##$BF7= 200.13
##$BF8= 200.13
##$BYTORDA= 1
##$CFDGTYP= 0
##$CFRGTYP= 5
##$CHEMSTR= <none>
##$CNST= (0..31)
1 1 145 1 1 1 1 1 1 1 1 1 1 1 1 1 1 1 1 1 1 1 1 1 1 1 1 1 1 1 1 1 
##$CPDPRG= <waltz16>
##$CPDPRG1= <>
##$CPDPRG2= <waltz16>
##$CPDPRG3= <>
##$CPDPRG4= <mlev>
##$CPDPRG5= <mlev>
##$CPDPRG6= <mlev>
##$CPDPRG7= <mlev>
##$CPDPRG8= <mlev>
##$CPDPRGB= <>
##$CPDPRGT= <>
##$D= (0..31)
0 1 0 0 0 0 0 0 0 0 0 0.03 2e-05 3e-06 0 0 0 0 0 0 0 0 0 0 0 0 0 0 0 0 
0 0 
##$DATE= 1608703950
##$DBL= (0..7)
120 120 120 11 120 120 24 19 
##$DBP= (0..7)
150 150 150 150 150 150 150 150 
##$DBP07= 0
##$DBPNAM0= <>
##$DBPNAM1= <>
##$DBPNAM2= <>
$$ [...]
##$SUBNAM2= <"">
##$SUBNAM3= <"">
##$SUBNAM4= <"">
##$SUBNAM5= <"">
##$SUBNAM6= <"">
##$SUBNAM7= <"">
##$SUBNAM8= <"">
##$SUBNAM9= <"">
##$SW= 369.568048894756
##$SWIBOX= (0..15)
0 1 3 0 0 0 0 0 0 0 0 0 0 0 0 0 
##$SW_h= 29940.119760479
##$TD= 32768
##$TD0= 1
##$TE= 0
##$TE2= 300
##$TE3= 300
##$TEG= 300
##$TL= (0..7)
0 120 53 12 22 120 120 120 
##$TP= (0..7)
150 150 150 150 150 150 150 150 
##$TP07= 0
##$TPNAME0= <>
##$TPNAME1= <>
##$TPNAME2= <>
##$TPNAME3= <>
##$TPNAME4= <>
##$TPNAME5= <>
##$TPNAME6= <>
##$TPNAME7= <>
##$TPOAL= (0..7)
0.5 0.5 0.5 0.5 0.5 0.5 0.5 0.5 
##$TPOFFS= (0..7)
0 0 0 0 0 0 0 0 
##$TUNHIN= 0
##$TUNHOUT= 0
##$TUNXOUT= 0
##$USERA1= <user>
##$USERA2= <user>
##$USERA3= <user>
##$USERA4= <user>
##$USERA5= <user>
##$V9= 5
##$VALIST= <valist>
##$VCLIST= <CCCCCCCCCCCCCCC>
##$VD= 0
##$VDLIST= <DDDDDDDDDDDDDDD>
##$VPLIST= <PPPPPPPPPPPPPPP>
##$VTLIST= <TTTTTTTTTTTTTTT>
##$WBST= 1024
##$WBSW= 4
##$XGAIN= (0..3)
0 0 0 0 
##$XL= 0
##$YL= 0
##$YMAX_a= 8833
##$YMIN_a= -8165
##$ZGOPTNS= <>
##$ZL1= 120
##$ZL2= 120
##$ZL3= 120
##$ZL4= 120
##$ABSF1= 182.463
##$ABSF2= -187.1042
##$ABSG= 5
##$ABSL= 3
##$ALPHA= 0
##$AQORDER= 0
##$ASSFAC= 0
##$ASSFACI= 0
##$ASSFACX= 0
##$ASSWID= 0
##$AUNMP= <proc_1d>
##$AZFE= 0.1
##$AZFW= 0.5
##$BCFW= 0
##$BC_mod= 2
##$BYTORDP= 0
##$COROFFS= 0
##$CY= -3
##$DATMOD= 1
##$DC= 0
##$DFILT= <>
##$DTYPP= 0
##$F1P= 0
##$F2P= 0
##$FCOR= 1
##$FTSIZE= 65536
##$FT_mod= 6
##$GAMMA= 0
##$GB= 0
##$INTBC= 1
##$INTSCL= 5.30512e-09
##$ISEN= 30
##$LB= 1
##$LEV0= 0
##$LPBIN= 0
##$MAXI= 10000
##$MC2= 0
##$MEAN= 0
##$ME_mod= 0
##$MI= 50
##$NCOEF= 0
##$NC_proc= -9
##$NLEV= 6
##$NOISF1= 182.463
##$NOISF2= 159.3651
##$NSP= 0
##$NTH_PI= 0
##$NZP= 0
##$OFFSET= 182.463
##$PC= 4
##$PHC0= -2466.097
##$PHC1= 80.6008
##$PH_mod= 1
##$PKNL= yes
##$PPARMOD= 0
##$PSCAL= 0
##$PSIGN= 0
##$REVERSE= no
##$SF= 81.014009
##$SI= 65536
##$SIGF1= 159.3651
##$SIGF2= -187.1042
##$SINO= 113.3802
##$SIOLD= 16384
##$SREGLST= <1H.CDCl3>
##$SSB= 0
##$STSI= 65536
##$STSR= 0
##$SW_p= 29940.119760479
##$SYMM= 0
##$S_DEV= 0
##$TDeff= 32768
##$TDoff= 0
##$TI= <>
##$TILT= no
##$TM1= 0
##$TM2= 0
##$TOPLEV= 0
##$USERP1= <user>
##$USERP2= <user>
##$USERP3= <user>
##$USERP4= <user>
##$USERP5= <user>
##$WDW= 1
##$XDIM= 65536
##$YMAX_p= 410894153
##$YMIN_p= -92118559
$$ End of Bruker specific parameters
$$ ---------------------------------
##NTUPLES= NMR SPECTRUM
##VAR_NAME=  FREQUENCY,     SPECTRUM/REAL,   SPECTRUM/IMAG
##SYMBOL=    X,             R,               I
##VAR_TYPE=  INDEPENDENT,   DEPENDENT,       DEPENDENT
##VAR_FORM=  AFFN,          ASDF,            ASDF
##VAR_DIM=   65536,         65536,           65536
##UNITS=     HZ,            ARBITRARY UNITS, ARBITRARY UNITS
##FACTOR=    0.456856943014862, 1,           1
##FIRST=     14782.0589164895, 0,            0
##LAST=      -15158.0608439895, 0,           0
##MIN=       -15158.0608439895, -92118559,   0
##MAX=       14782.0589164895, 410894153,    0
$$ Real data points
##PAGE= N=1
##DATA TABLE= (X++(R..R)), XYDATA
$$ [...]
$$ plain form
44711 15979186 19833812 27602004 36332257 42216628 36628745 17195654 -2182249 -5367906
44703 -5367906 4351634 9300053 3254348 -1185303 6484943 18931079 22376992 15215156
44695 15215156 8462221 12315987 26669554 41198653 42461694 25852572 3080192
44688 3080192 -7480174 -868944 9080084 7330569 -5186323 -16094475 -17484430 -11349109
44680 -11349109 -3322448 2031297 1459094 -4870414 -10921024 -8928941 2624570 17035062
44672 17035062 25332678 23257641 14071535 6294263 6811611 14123400 20079446 19664991
44664 19664991 15961061 13270733 9893915 2796166 -3761406 -1393710 10323300 20757288
44656 20757288 19338576 6422986 -8401540 -16119803 -15021783 -9712902 -5048006 -1118665
$$ packed form
44711A5979186L854626P768192Q730253N884371n587883j9433091j9377903l185657
44703e367906R719540M948419o045705m439651P670246J2446136L445913p161836
44695A5215156o752935L853766J4353567J4529099J263041j6609122k2772380
44688C080192j0560366O611230R949028j749515j2516892j0908152j389955O135321
44680a1349109Q026661N353745n72203o329508o050610J992083J1553511J4410492
44672A7035062Q297616k075037r186106p777272N17348P311789N956046m14455
44664A9664991l703930k690328l376818p097749o557572K367696J1717010J0433988
44656B0757288j418712j2915590j4824526p718263J098020N308881M664896L929341
$$ plain form
44648 -1118665 4977726 12528439 16049272 13318210 10234847 12021345 12818795 2510885
44640 2510885 -16143647 -26377562 -17060476 3435284 17426227 16236396 3934944
44633 3934944 -10753949 -19378506 -15574598 -837520 13017205 14745648 6724322 997148
44625 997148 3625474 10269044 16253584 21650393 25009204 21968238 14060387 9614630
44617 9614630 10204629 5519105 -9720239 -22232076 -16156171 1968948 8614041 -6020581
44609 -6020581 -26210858 -33237702 -27162412 -19185963 -13226059 -6130414 -31687 -2187453
44601 -2187453 -13032659 -23543738 -25781964 -19803079 -9755778 324378 5493408 1116863
44593 1116863 -11370231 -23610743 -28146275 -25001416 -19402370 -16078208 -17362360 -23540783
$$ packed form
44648a118665O096391P550713L520833k731062l083363J786498P97450j0307910
44640B510885j8654532j0233915R317086K0495760J3990943j189831j2301452
44633C934944j4688893q624557L803908J4737078J3854725J728443q021326n727174
44625I97148K628326O643570N984540N396809L358811l040966p907851m445757
44617I614630N89999m685524j5239344j2511837O075905J8125119O645093j4634622
44609f020581k0190277p026844O075290P976449N959904P095645O098727k155766
44601b187453j0845206j0511079k238226N978885J0047301J0080156N169030m376545
44593A116863j2487094j2240512m535532L144859N599046L324162j284152o178423
$$ plain form
44585 -23540783 -32063746 -37862952 -36871861 -29306440 -19188587 -11248408 -7599080 -5831348
44577 -5831348 -1129400 7776879 15946806 17991416 14810745 11327124 9942571 11053904
44569 11053904 16996708 27612744 33553423 24474587 5228241 -7521206 -8700728 -12301806
44561 -12301806 -27869968 -42277420 -37736949 -18226857 -2038583 5396248 12626650
44554 12626650 19141960 13018495 -4333082 -12128176 331235 15090493 10875417 -5789012
44546 -5789012 -11836863 -1928006 7155922 4065441 -2710906 -875930 9041017 18274346
44538 18274346 21037343 15842643 3319250 -11837596 -21768880 -22302593 -15491112 -4409668
44530 -4409668 8849114 18789491 17826319 6299278 -4599238 -4877645 3012625 8742453
$$ packed form
44585b3540783q522963n799206R91091P565421J0117853P940179L649328J767732
44577e831348M701948Q906279Q169927K044610l180671l483621j384553J111333
44569A1053904N942804J0616036N940679r078836j9246346j2749447j179522l601078
44561a2301806j5568162j4407452M540471J9510092J6188274P434831P230402
44554A2626650O515310o123465j7351577p795094J2459411J4759258m215076j6664429
44546e789012o047851R908857R083928l090481o776347J834976R916947R233329
44538A8274346K762997n194700j2523393j5156846r931284n33713O811481J1081444
44530d409668J3258782R940377r63172j1527041j0898516k78407P890270N729828
$$ plain form
44522 8742453 6380934 -1100699 -6158298 -2963163 6741708 12097656 2831850 -16539217
44514 -16539217 -28344551 -22047651 -6935475 954687 -1491571 -5208006 -4229544 -987729
44506 -987729 1240392 2182856 1158143 -2946790 -8225790 -11719985 -13164374 -11327700
44498 -11327700 -982442 17427203 29142886 19336969 -4068849 -16008776 -6220357
44491 -6220357 8290982 9218517 1633212 1599444 9778875 12011655 1552654 -12794042
44483 -12794042 -19924636 -17219178 -8174785 1503968 4888905 -1050614 -10335839 -14452445
44475 -14452445 -13654592 -14892279 -19170735 -19312257 -11112998 1382666 13257589 23329728
44467 23329728 29307611 26926342 17971975 11712858 13120830 15320000 8734996 -6745674
$$ packed form
44522H742453k361519p481633n057599L195135R704871N355948r265806j9371067
44514a6539217j1805334O296900J5112176P890162k446258l716435R78462L241815
44506i87729K228121R42464j024713m104933n279000l494195j444389J836674
44498a1327700J0345258J8409645J1715683r805917k3405818j1939927R788419
44491f220357J4511339R27535p585305l3768Q179431K232780j0459001j4346696
44483a2794042p130594K705458R044393R678753L384937n939519r285225m116606
44475a4452445P97853j237687m278456j41522Q199259J2495664J1874923J0072139
44467B3329728N977883k381269q954367o259117J407972K199170o585004j5480670
$$ plain form
44459 -6745674 -22710043 -30698718 -26471895 -11745193 3869794 8736515 2781467 -184480
44451 -184480 9832753 23996016 24781346 7240426 -17401494 -35600352 -40492451 -30721165
44443 -30721165 -11263754 5073096 7665142 1249122 -83031 6713793 10057625 3770005
44435 3770005 -1761463 3362614 10828533 6002774 -8154312 -13447533 -2718830 9538550
44427 9538550 7576158 -5081889 -13549887 -13021814 -11641444 -13925515 -12613826 -1121763
44419 -1121763 13913748 19833252 13890985 4533113 -1426425 -4314160 -3537057 5911445
44411 5911445 22901857 33824142 26502295 7667425 -2866903 4222240 18147752
44404 18147752 23923776 20617362 19491226 28432825 42737120 50100038 43082015 27747160
$$ packed form
44459f745674j5964369p988675M226823J4726702J5614987M866721n955048k965947
44451a84480J0017233J4163263P85330j7540920k4641920j8198858m892099R771286
44443c0721165J9457411J6336850K592046o416020j332153O796824L343832o287620
44435C770005n531468N124077P465919m825759j4157086n293221J0728703J2257380
44427I538550j962392j2658047q467998N28073J380370k284071J311689J1492063
44419a121763J5035511N919504n942267r357872n959538k887735P77103R448502
44411E911445J6990412J0922285p321847j8834870j0534328P089143J3925512
44404A8147752N776024l306414j126136Q941599J4304295P362918p018023j5334855
$$ plain form
44396 27747160 19158008 25271537 36730912 37541535 24509291 9016459 -100245 -5791300
44388 -5791300 -12249956 -15665527 -12438566 -8323139 -10330816 -15168591 -15141853 -11377460
44380 -11377460 -11094196 -14391347 -14696775 -11846078 -13233519 -19380701 -19094163 -5119640
44372 -5119640 12763840 17757775 5797268 -10708611 -17466257 -12000655 -2943495 918884
44364 918884 -640528 -1031689 3623163 8595936 5842509 -6156945 -20367618 -28328683
44356 -28328683 -26854681 -18295883 -6895328 4804133 16858932 27996701 30913131
44349 30913131 16813835 -11672946 -37381195 -44696132 -34992258 -19519619 -2228058
44342 -2228058 19496827 39942123 45379397 32757470 16295101 9429945 9247293 5308063
$$ packed form
44396B7747160q589152O113529J1459375Q10623j3032244j5492832r116704n691055
44388e791300o458656l415571L226961M115427k007677m837775K6738L764393
44380a1377460K83264l297151l05428K850697j387441o147182K86538J3974523
44372e119640J7883480M993935j1960507j6505879o757646N465602R057160L862379
44364I18884j559412l91161M654852M972773k753427j1999454j4210673p961065
44356b8328683J474002Q558798J1400555J1699461J2054799J1137769K916430
44349C0913131j4099296k8486781k5708249p314937R703874J5472639J7291561
44342b228058K1724885K0445296N437274j2621927j6462369o865156j82652l939230
$$ plain form
44334 5308063 -3861705 -10832845 -10719200 -5411678 1021328 6459745 12115634 21157073
44326 21157073 32128129 34780522 21052755 879897 -4894594 8131612 20389472
44319 20389472 15939248 4556154 4181073 12840539 14688001 7204917 3978551 11613103
44311 11613103 20581473 21503759 16887568 12808693 9804362 6192276 2220836 -1990743
44303 -1990743 -6116461 -6919452 -3117374 -1443669 -8325832 -16918972 -14162461 -831470
44295 -831470 8542414 7782084 7090995 14092322 20384404 15156814 1686808 -8475361
44287 -8475361 -9698185 -2919372 10118266 24807162 31819204 25588690 11246737 -2142265
44279 -2142265 -11058788 -16462807 -18966703 -19105624 -16757327 -7514339 12948075 38000303
$$ packed form
44334E308063r169768o971140J13645N307522O433006N438417N655889R041439
44326B1157073J0971056K652393j3727767k0172858n774491J3026206J2257860
44319B0389472m450224j1383094l75081Q659466J847462p483084l226366P634552
44311A1613103Q968370R22286m616191m078875l004331l612086l971440m211579
44303a990743m125718q02991L802078J673705o882163q593140K756511J3330991
44295h31470R373884p60330o91089P001327O292082n227590j3470006j0162169
44287h475361j222824O778813J3037638J4688896P012042o230514j4341953j3389002
44279b142265q916523n404019k503896j38921K348297R242988K0462414K5052228
$$ plain form
44271 38000303 52682146 51267698 42718738 34838746 25054886 12829382 7266527 12339266
44263 12339266 16913934 11182849 1935654 -694125 -164381 -3218481 -4318819 2696032
44255 2696032 7690556 -1479414 -15551496 -15710536 -3400793 3605758 1251625 1672227
44247 1672227 6509511 3042905 -9210782 -12634862 -373031 10696911 5985927 -6983037
44239 -6983037 -15417479 -19683184 -22874340 -19171281 -6820761 1682654 -3033161 -11747482
44231 -11747482 -12118781 -7859869 -8635967 -12398349 -12910464 -14440912 -22598774 -29018489
44223 -29018489 -22047277 -6615766 2400910 1737315 16655 1450070 3598864 6404614
44215 6404614 9192349 4320624 -10883438 -21893945 -14162887 2482417 6047395 -4349102
$$ packed form
44271C8000303J4681843j414448q548960p879992r783860j2225504n562855N072739
44263A2339266M574668n731085r247195k629779N29744l054100j100338P014851
44255B696032M994524r169970j4072082j59040J2309743P006551k354133M20602
44247A672227M837284l466606j2253687l424080J2261831J1069942m710984j2968964
44239f983037q434442m265705l191156L703059J2350520Q503415m715815q714321
44231a1747482l71299M258912p76098l762382n12115j530448q157862o419715
44223b9018489O971212J5431511R016676o63595j720660J433415K148794K805750
44215F404614K787735m871725j5204062j1010507P731058J6645304L564978j0396497
$$ plain form
44207 -4349102 -8956068 -836681 4270930 -4061238 -15170432 -17909113 -17588333 -21436062
44199 -21436062 -23777454 -18543551 -13544187 -19035026 -31273402 -38800793 -37540597 -30316757
44191 -30316757 -19160711 -7199203 -892021 -1663932 -1921982 3105262 6961129 2751938
44183 2751938 -5810860 -12026043 -16205155 -19445162 -16694145 -6393440 1722542 48876
44175 48876 -3837762 -98753 5655006 2591865 -4363811 -1700969 7907822 6982755 -9770395
44166 -9770395 -27644921 -34784539 -36388754 -39874889 -40706852 -32287069 -18992660 -9489299
44158 -9489299 -4415724 737031 5968345 7447239 4224657 -859653 -3639049 598516
44150 598516 13257965 26682520 29270689 20177723 11581511 11930296 15434788 14514864
$$ packed form
44207d349102m606966Q119387N107611q332168j1109194k738681L20780l847729
44199b1436062k341392N233903M999364n490839j2238376p527391J260196P223840
44191c0316757J1156046J1961508O307182p71911k58050N027244L855867m209191
44183B751938q562798o215183m179112l240007K751017J0300705Q115982j673666
44175D8876l886638L739009N753759l063141o955676K662842R608791r25067j6753150
44166i770395j7874526p139618j604215l486135q31963Q419783J3294409R503361
44158i489299N073575N152755N231314J478894l222582n084310k779396M237565
44150E98516J2659449J3424555K588169r092966q596212L48785L504492r19924
$$ plain form
44142 14514864 13557663 20316657 30176777 30778570 19575696 6252688 -1203496 -3453987
44134 -3453987 -3556878 -3011998 -4265070 -8423842 -9927416 -2411505 9038005 11319175
44126 11319175 1883337 -6089756 -2203254 6778832 8556450 3553885 1762407 6006208
44118 6006208 8954065 5685918 -3215 -2597980 -666192 5295357 13814061 19905273
44110 19905273 18528899 12495271 9903710 11471399 8915675 410011 -1956908 10831705
44102 10831705 27650783 29680347 16840865 8056490 13890874 22660588 19860219 9828695
44094 9828695 7859885 17593171 27391235 26751375 16851675 5407066 -631710 3122500
44086 3122500 15839404 28095679 27456754 11048165 -10852722 -25399712 -27741429 -20453337
$$ packed form
44142A4514864r57201O758994R860120O01793j1202874j3323008p456184k250491
44134c453987j02891N44880j253072m158772j503574P515911J1449510K281170
44126A1319175r435838p973093L886502Q982086J777618n002565j791478M243801
44118F006208K947857l268147n689133k594765J931788N961549Q518704O091212
44110A9905273j376374o033628k591561J567689k555724q505664k366919J2788613
44102A0831705J6819078K029564j2839482q784375N834384Q769714k800369j0031524
44094I828695j968810R733286R798064o39860r899700j1444609o038776L754210
44086C122500J2716904J2256275o38925j6408589k1900887j4546990k341717P288092
$$ plain form
44078 -20453337 -8126208 4136949 10683363 7984550 -3027286 -17611344 -28226466
44071 -28226466 -26510662 -10336683 9738659 17474474 8160053 -5982203 -11273385 -8207190
44063 -8207190 -6591673 -10207278 -13739042 -12469916 -7422922 -1189580 4768180 7940174
44055 7940174 5630781 -298114 -3694442 -715033 6547338 13227324 15578043 12238018
44047 12238018 5191933 -845291 -3308417 -5067576 -9376179 -13791011 -14056126 -11118759
44039 -11118759 -7183071 2164078 21302946 40858362 43925452 29426709 15783439
44032 15783439 14657504 14850432 3187472 -11814903 -13664336 -6133427 -7495809 -19756308
44024 -19756308 -24977212 -14915901 -4022212 -5444125 -12119574 -12769449 -11074982 -14681696
$$ packed form
44078b0453337J2327129J2263157O546414k698813j1011836j4584058j0615122
44071b8226466J715804J6173979K0075342P735815r314421j4142256n291182L066195
44063h207190J615517l615605l531764J269126N046994O233342N957760L171994
44055G940174k309393n928895l396328K979409P262371O679986K350719l340025
44047A2238018p046085o037224k463126j759159m308603m414832k65115K937367
44039a1118759L935688R347149J9138868J9555416L067090j4498743j3643270
44032A5783439j125935J92928j1662960j5002375j849433P530909j362382j2260499
44024a9756308n220904J0061311J0893689j421913o675449o49875J694467l606714
$$ plain form
44016 -14681696 -17663853 -10870506 -1232059 -2737513 -13039964 -17389375 -13896971 -15573604
44008 -15573604 -25078067 -26785451 -11414869 7791895 14040480 9526090 7553048 12247105
44000 12247105 18429945 23823559 28208654 25698477 11161334 -8105770 -18800762 -17997407
43992 -17997407 -12597331 -5240241 6752047 19771780 25062040 22509942 20139224 18564932
43984 18564932 10872292 871033 3609645 19726891 27296537 12689864 -6361180
43977 -6361180 -6624930 4733511 3334787 -10826887 -12288045 7964572 26100490 20657395
43969 20657395 2117393 -7196332 -5494675 -5861069 -10139270 -8607679 -605311 3345758
43961 3345758 25426 -1552157 3677677 8419430 4768059 -5524299 -16428533 -25083868
$$ packed form
44016a4681696k982157O793347R638447j505454j0302451m349411L492404j676633
44008a5573604r504463j707384J5370582J9206764O248585m514390j973042M694057
44000A2247105O182840N393614M385095k510177j4537143j9267104j0694992Q03355
43992a7997407N400076P357090J1992288J3019733N290260k552098k370718j574292
43984A8564932p692640j0001259K738612J6117246P569646j4606673j9051044
43977f361180k63750J1358441j398724j4161674j461158K0252617J8135918n443095
43969B0657395j8540002r313725J701657l66394m278201J531591Q002368L951069
43961C345758l320332j577583N229834M741753l651371j0292358j0904234q655335
$$ plain form
43953 -25083868 -30468519 -32252041 -34306913 -41797015 -50781231 -48302244 -28818146 -5066834
43945 -5066834 4114377 -5693646 -20863218 -24769395 -13104621 4112842 13211256 10375963
43937 10375963 4537773 4730034 7173826 1482842 -11627431 -19034782 -14344448 -7635156
43929 -7635156 -9554967 -14981407 -11852975 394512 11457551 14780734 11633979 4307814
43921 4307814 -4174636 -6105495 3738371 17439643 21183015 13513954 6011799 5458848
43913 5458848 7095765 7365506 10104389 14996409 12740272 155162 -10582998 -8283675
43905 -8283675 -229558 -1690317 -13288100 -20937536 -16153198 -5214985 2123844 3612214
43897 3612214 2599050 2555841 5365236 9625874 10022033 3693906 -2979989 -513126 9948356
$$ packed form
43953b5083868n384651j783522k054872p490102q984216K478987J9484098K3751312
43945e066834R181211r808023j5169572l906177J1664774J7217463R098414k835293
43937A0375963n838190J92261K443792n690984j3110273p407351M690334O709292
43929g635156j919811n426440L128432J2247487J1063039L323183l146755p326165
43921D307814q482450j930859R843866J3701272L743372p669061p502155n52951
43913E458848J636917K69741K738883M892020k256137j2585110j0738160K299323
43905h283675Q054117j460759j1597783p649436M784338J0938213P338829J488370
43897C612214j013164m3209K809395M260638L96159o328127o673895K466863J0461482
$$ plain form
43888 9948356 15909599 9106972 -4054350 -11180212 -8468055 -2491497 -303468 -1998980
43880 -1998980 -2618716 1022943 5915779 5248406 -4085557 -17009195 -24720964 -22805095
43872 -22805095 -13351819 -928567 10416299 17685856 20776281 23574281 29399236 35511392
43864 35511392 35975412 29668822 21147774 13813351 7335262 2234594 1053818 2898225
43856 2898225 2133838 -4472312 -13381645 -19406999 -20815051 -16939645 -6245906 8695984
43848 8695984 18743577 16566224 5569190 -4038079 -6291740 -2746793 2624289 6505656
43840 6505656 5664210 -929755 -9000243 -12508269 -11024508 -9795883 -11962223 -14816884
43832 -14816884 -15165456 -14439710 -15688337 -17911965 -16671087 -9992174 -1595450 2266304
$$ packed form
43888I948356N961243o802627j3161322p125862K712157N976558K188029j695512
43880a998980o19736L641659M892836o67373r333963j2923638p711769J915869
43872b2805095R453276J2423252J1344866P269557L090425K798000N824955O112156
43864C5511392M64020o306590q521048p334423o478089n100668j180776J844407
43856B898225p64387o606150q909333o025354j408052L875406J0693739J4941890
43848H695984J0047593k177353j0997034r607269k253661L544947N371082L881367
43840F505656q41446o593965q070488l508026J483761J228625k166340k854661
43832a4816884l48572P25746j248627k223628J240878O678913Q396724L861754
$$ plain form
43824 2266304 -1352139 -9231530 -14522100 -12532761 -4894207 1650274 1076893 -6440194
43816 -6440194 -14683744 -17693586 -15869490 -14335302 -15064324 -13651413 -6058879 4567996
43808 4567996 11858830 14465139 14732253 11000632 -570627 -15480422 -21495019 -14864944
43800 -14864944 -8414904 -15954168 -33538205 -44501836 -40281793 -27632345 -16033237
43793 -16033237 -6912686 2166972 9516334 10415734 4064345 -3494754 -3966412 4660506
43785 4660506 14005836 13337371 3597167 -2083931 3712265 11164538 8183116 804176
43777 804176 5318761 22088618 32870969 27286960 16517481 13431700 13683231 8334119
43769 8334119 3141118 9027808 20199936 19576267 4857893 -7208416 -4813751 5669721
$$ packed form
43824B266304l618443p879391n290570J989339P638554O544481n73381p517087
43816f440194q243550l009842J824096J534188p29022J412911P592534J0626875
43808D567996P290834K606309K67114l731621j1571259j4909795o014597O630075
43800a4864944O450040p539264j7584037j0963631M220043J2649448J1599108
43793a6033237R120551R079658P349362Q99400o351389p559099m71658Q626918
43785D660506R345330o68465r740204n681098N796196P452273k981422p378940
43777H04176M514585J6769857J0782351n584009j0769479l085781K51531n349112
43769H334119n193001N886690J1172128o23669j4718374j2066309K394665J0483472
$$ plain form
43761 5669721 15172366 26111776 41955314 54033528 51298564 37255739 25123833
43754 25123833 18878449 10595783 -3419806 -15044542 -16538284 -11913016 -10476033 -14191168
43746 -14191168 -17232852 -15359338 -10515874 -7087904 -7596586 -11696997 -16014673 -15138171
43738 -15138171 -6398745 5335378 10715990 5939744 -1891555 -1734579 9363682 22880072
43730 22880072 27817982 22024380 13728518 12186483 18013918 23754344 23253360 18038473
43722 18038473 13262660 9926875 4890096 -1691148 -3445286 4862296 19318389 29651142
43714 29651142 29820032 23373595 18091855 17685362 19937596 21225701 20509393 18769969
43706 18769969 16626482 14299699 13099490 14312922 16001250 13844472 7273304 1889477
$$ packed form
43761E669721R502645J0939410J5843538J2078214k734964j4042825j2131906
43754B5123833o245384q282666j4015589j1624736j493742M625268J436983l715135
43746a4191168l041684J873514M843464L427970n08682m100411m317676Q76502
43738a5138171Q739426J1734123N380612m776246p831299J56976J1098261J3516390
43730B2880072M937910n793602q295862j542035N827435N740426n00984n214887
43722A8038473m775813l335785n036779o581244j754138Q307582J4456093J0332753
43714B9651142J68890o446437n281740m06493K252234J288105p16308j739424
43706A8769969k143487k326783j200209J213432J688328k156778o571168n383827
$$ plain form
43698 1889477 2187390 4488044 2598695 -1276111 870335 8712039 11441575 3986860
43690 3986860 -3783899 -1648848 5120646 5297579 1464615 6318977 20265584 27308392
43682 27308392 17201453 -644575 -11563923 -13226334 -10751135 -3795858 9901594
43675 9901594 23180513 23859635 10528688 -4581561 -9317956 -2223402 9894559 18417565
43667 18417565 17069257 6621770 -2954261 -694575 12944386 26040764 28630005 21756690
43659 21756690 12460395 5664273 3872538 9412300 21403726 32457309 33364165 22024161
43651 22024161 5988162 -3853892 -1325744 11727748 27519589 37403097 37315629 30652624
43643 30652624 25782420 28362324 34512038 33588741 20699326 4979718 939778 11813776
$$ packed form
43698A889477K97913K300654j889349l874806K146446P841704K729536p454715
43690C986860p770759K135051O769494J76933l832964M854362J3946607P042808
43682B7308392j0106939j7846028j0919348j662411K475199O955277J3697452
43675I901594J3278919O79122j3330947j5110249m736395P094554J2117961Q523006
43667A8417565j348308j0447487r576031K259686J3638961J3096378K589241o873315
43659B1756690r296295o796122j791735N539762J1991426J1053583R06856j1340004
43651B2024161j6035999r842054K528148J3053492J5791841R883508q7468o663005
43643C0652624m870204K579904O149714r23297j2889415j5719608m039940J0873998
$$ plain form
43635 11813776 26830801 35466804 37210732 34682018 26183587 12353134 2854125 5930746
43627 5930746 15090101 16881316 9704032 3350976 698977 -6418373 -19862975 -27264584
43619 -27264584 -19125515 -3598922 5047272 5095420 4694835 6427130 5764725 2392665
43611 2392665 2249693 7516975 12845570 13305757 10006925 6502343 4912864 6705718
43603 6705718 12097274 16978337 15056529 5408732 -5511445 -11585764 -14029035 -18429918
43595 -18429918 -26573157 -33399512 -31884887 -20237051 -4263005 7833357 13223824 15800165
43587 15800165 19439328 22717151 22518469 20263758 20548639 24275153 26828000 23778296
43579 23778296 16203059 9770368 9587842 15479031 21385329 20610921 12873561 4771929
$$ packed form
43635A1813776J5017025Q636003J743928k528714q498431j3830453r499009L076621
43627E930746R159355J791215p177284o353056k651999p117350j3444602p401609
43619b7264584Q139069J5526593Q646194M8148m00585J732295o62405l372060
43611B392665j42972N267282N328595M60187l298832l504582j589479J792854
43603F705718N391556M881063j921808r647797j0920177o074319k443271m400883
43595a8429918q143239o826355J514625J1647836J5974046J2096362N390467K576341
43587A5800165L639163L277823j98682k254711K84881L726514K552847l049704
43579B3778296p575237o432691j82526N891189N906298p74408p737360q101632
$$ plain form
43571 4771929 2252324 4622835 6985151 5650420 -133269 -7847480 -11107402 -4514444
43563 -4514444 7539240 12785397 6908818 1112574 6381721 16440344 17151193 8506259
43555 8506259 3561992 6269338 5564319 -4560865 -13475489 -10475141 -1261686 2913477
43547 2913477 4150957 13237161 29978846 40577209 35266869 19542733 5874350 763736
43539 763736 2370065 6340687 10867535 16872729 23893270 26869824 20669882 8784384
43531 8784384 2012561 4738210 7876520 1218580 -11778615 -18690853 -14077150 -2559436
43523 -2559436 11349499 26488330 38250152 39101328 29111590 17496614 9819773 1694999
43515 1694999 -9792235 -16832792 -11807448 -2170231 -3514602 -17895618 -28654542 -20678817
$$ packed form
43571D771929k519605K370511K362316j334731n783689p714211l259922O592958
43563d514444J2053684N246157n876579n796244N269147J0058623P10849q644934
43555H506259m944267K707346p05019j0125184q914624L000348R213455M175163
43547B913477J237480R086204J6741685J0598363n310340j5724136j3668383n110614
43539G63736J606329L970622M526848O005194P020541K976554o199942j1885498
43531H784384o771823K725649L138310o657940j2997195o912238M613703J1517714
43523b559436J3908935J5138831J1761822Q51176r989738j1614976p676841q124774
43515A694999j1487234p040557N025344R637217j344371j4381016j0758924P975725
$$ plain form
43507 -20678817 527504 15559830 13808634 3382252 -1746558 1243237 3575267 -1842292
43499 -1842292 -12605906 -22639629 -29991935 -35376053 -37160408 -33108848 -25275370 -17972835
43491 -17972835 -11549790 -3200389 6289874 12264073 13605495 14666463 17638993 18740772
43483 18740772 15594678 12875676 14865937 16358172 8500459 -7285141 -18740824 -17853098
43475 -17853098 -10090333 -4900379 -2490334 3149868 10343151 7854485 -9280134 -28506645
43467 -28506645 -32081748 -18887350 -5665850 -4925123 -10202040 -8863824 -1933969 -806861
43459 -806861 -7299468 -9267988 1262983 15889435 21496341 16464575 8114905 -72841
43451 -72841 -9652944 -18399542 -19748050 -12187664 -2508424 2258941 1534565 -1110963 -2188205
$$ packed form
43507b0678817K1206321J5032326j751196j0426382n128810K989795K332030n417559
43499a842292j0763614j0033723p352306n384118j784355M051560P833478P302535
43491a7972835O423045Q349401R490263N974199J341422J060968K972530J101779
43483A8740772l146094k719002J990261J492235p857713j5785600j1455683Q87726
43475a7853098P762765N189954K410045N640202P193283k488666j7134619j9226511
43467b8506645l575103J3194398J3221500P40727n276917J338216O929855J127108
43459h06861o492607j968520J0530971J4626452N606906n031766q349670q187746
43451g2841r580103q746598j348508P560386R679240M767365p24376k645528j077242
$$ plain form
43442 -2188205 824063 7727809 12932636 9640576 -613336 -7672193 -5837914 -2281903
43434 -2281903 -6693665 -16511710 -20384998 -14961909 -9106634 -9208991 -8998309 2434
43426 2434 13860620 20201671 14521839 4889717 576258 3074906 9516666 17871916
43418 17871916 25469067 28007573 24281910 18006752 11772852 3830470 -5484668 -9921538
43410 -9921538 -5915127 -135158 -917902 -5731464 -5551628 869129 6519393 8529537
43402 8529537 10617198 12941111 10944589 6722995 9516206 19604350 23339450 12516175
43394 12516175 -1255880 -2096865 7833265 13479243 9025870 1794215 -3438522 -9976990
43386 -9976990 -17455461 -17408154 -6348543 5566909 6074588 -3516229 -10017877 -3871840
$$ packed form
43442b188205L012268O903746N204827l292060j0253912p058857J834279L556011
43434b281903m411762r818045l873288N423089N855275j02357K10682R000743
43426B434J3858186O341051n679832r632122m313459K498648O441760Q355250
43418A7871916P597151K538506l725663o275158o233900p942382r315138m436870
43410i921538M006411N779969p82744m813562J79836O420757N650264K010144
43402H529537K087661K323913j996522m221594K793211J0088144L735100j0823275
43394A2516175j3772055q40985R930130N645978m453373p231655n232737o538468
43386i976990p478471M7307J1059611J1915452N07679r590817o501648O146037
$$ plain form
43378 -3871840 10918040 21919878 21345572 13263885 7168630 5662920 3344745 -846445
43370 -846445 1760810 15785106 29534998 27838894 14091019 6807216 13860630 23107718
43362 23107718 22076774 14393858 9888442 9085463 6782050 3325726 2283251 1880238
43354 1880238 -1452434 -4115844 498369 10048353 14425327 9795209 3816420 4251870
43346 4251870 8215921 6989175 -1129525 -7263068 -2689957 8728446 12987861 3393744
43338 3393744 -8500353 -6342681 8312502 16894774 9889446 569004 4805869 16840561
43330 16840561 17798637 3597205 -9771305 -9293282 -492976 4497106 4449128 7356909
43322 7356909 16777422 27251536 31936634 29597529 23358769 15502371 5690333 -5418159
$$ packed form
43378c871840J4789880J1001838n74306q081687o095255j505710k318175m191190
43370h46445K607255J4024296J3749892j696104j3747875p283803P053414R247088
43362B3107718j030944p682916m505416q02979k303413l456324j042475m03013
43354A880238l332672k663410M614213R549984M376974m630118n978789M35450
43346D251870L964051j226746q118700o133543M573111J1418403M259415r594117
43338C393744j1894097K157672J4655183Q582272p005328r320442M236865J2034692
43330A6840561R58076j4201432j3368510M78023Q800306M990082m7978K907781
43322G356909R420513J0474114M685098k339105o238760p856398r812038j1108492
$$ plain form
43314 -5418159 -12908199 -11847085 -5568761 -4734602 -14332041 -25817114 -27755523 -21018062
43306 -21018062 -16331383 -18434904 -20648584 -15622948 -4078897 8635050 17691643 18379008
43298 18379008 7959296 -7786998 -15833375 -9351014 3544922 9321455 4769957 -1410023
43290 -1410023 -1229915 3131334 3294207 -4544114 -14607434 -17757540 -12271870 -6140586
43282 -6140586 -6839849 -11637958 -12317095 -7578666 -4565841 -7871006 -13525138 -16008882
43274 -16008882 -15510426 -14963797 -14371006 -11687170 -6370500 511285 7106025 10576345
43266 10576345 9761819 8711772 12412941 17890723 16159533 5522620 -4378670 -5842666
43258 -5842666 -2928789 -2490540 -3207187 -1420774 -800568 -5828826 -10779015 -7185998 509986
$$ packed form
43314e418159p490040J061114O278324Q34159r597439j1485073j938409O737461
43306b1018062M686679k103521k213680N025636J1544051J2713947R056593O87365
43298A8379008j0419712j5746294q046377O482361J2895936N776533m551498o179980
43290a410023J80108M361249J62873p838321j0063320l150106N485670O131284
43282f140586o99263m798109o79137M738429L012825l305165n654132k483744
43274a6008882M98456N46629N92791K683836N316670O881785O594740L470320
43266A0576345q14526j050047L701169N477782j731190j0636913r901290j463996
43258e842666K913877M38249p16647J786413O20206n028258m950189L593017P695984
$$ plain form
43249 509986 80798 -7563216 -6614461 9977317 27516926 28314081 14511468 2846721
43241 2846721 2684419 9430827 16641915 23653638 29688181 29267700 18570957 2323545
43233 2323545 -9884956 -12566587 -7250388 1406609 8933036 11276270 6034374 -4373179
43225 -4373179 -12990183 -14431838 -9850454 -3684893 3137856 13039328 24986441 32507711
43217 32507711 30732864 22265729 13869809 10228762 12888437 21239379 30962683 35356934
43209 35356934 33042387 31183846 35569074 40687266 37051573 26404551 20313482 22707748
43201 22707748 23504071 13865899 -393537 -7237596 -4416981 593115 3043523 4735129
43193 4735129 6047625 2723018 -5990505 -11581653 -4207459 14657715 31520801 34004071
$$ packed form
43249E09986m29188p644014R48755J6591778J7539609P97155j3802613j1664747
43241B846721j62302O746408P211088P011723O034543m20481j0696743j6247412
43233B323545j2208501k681631N316199Q656997P526427K343234n241896j0407553
43225d373179q617004j441655M581384O165561O822749R901472J1947113P521270
43217C2507711j774847q467135q395920l641047K659675Q350942R723304M394251
43209C5356934k314547j858541M385228N118192l635693j0647022o091069K394266
43201B2707748P96323r638172j4259436o844059K820615N010096K450408J691606
43193D735129J312496l324607q713523n591148P374194J8865174J6863086K483270
$$ plain form
43185 34004071 22670435 8216746 -1311020 -6865315 -11817251 -14443619 -11531791 -6065794
43177 -6065794 -4449859 -6737427 -7041592 -4869138 -7645463 -17736351 -25124676 -20707985
43169 -20707985 -10822856 -8345006 -12481212 -9450470 5651840 19729542 19993409 11656702
43161 11656702 8636366 13241644 16093558 13596307 13483736 20749015 28596605 29483283
43153 29483283 27415348 30559545 35851995 31256048 13899355 -2981309 -5201870 5948762
43145 5948762 16711239 16139858 4223944 -11302966 -20678757 -17017848 -1882194 13854003
43137 13854003 19464370 15196373 9961303 8940116 8848929 6103055 3583685 6299974
43129 6299974 14717220 25544844 35462234 40974693 38500400 28939349 19437699 16194068
$$ packed form
43185C4004071j1333636j4453689r527766n554295m951936k626368K911828N465997
43177f065794J615935k287568l04165K172454k776325j0090888p388325M416691
43169b0707985R885129K477850m136206L030742J5102310J4077702K63867q336707
43161A1656702l020336M605278K851914k497251j12571P265279P847590Q86678
43153B9483283k067935L144197N292450m595947j7356693j6880664k220561J1150632
43145E948762J0762477n71381j1915914j5526910r375791L660909J5135654J5736197
43137A3854003N610367m267997n235070j021187r1187k745874k519370K716289
43129F299974Q417246J0827624R917390N512459k474293r561051r501650l243631
$$ plain form
43121 16194068 17434011 17501615 15436015 14149940 12806068 6910693 -3056838 -9427447
43113 -9427447 -6798037 679596 4856568 3287732 84618 -348050 3075376 8812373
43105 8812373 13333566 12460245 5795624 -1271383 -4054186 -5912632 -13354346 -23369976
43097 -23369976 -23024291 -6056645 15809237 24940404 18295649 8694692 6764171 9513553
43089 9513553 8423385 1713928 -5396857 -8125000 -6229441 -3760818 -6547424 -16015776
43081 -16015776 -24500320 -22688463 -13524087 -10542021 -18136713 -22810814 -11721698 8794367
43073 8794367 23659991 30232715 35677309 39285889 34302219 25380352 26017653 36229843
43065 36229843 40090571 30266145 18019655 12044810 5093500 -7900901 -15643545 -8989361
$$ packed form
43121A6194068J239943O7604k065600j286075j343872n895375r967531o370609
43113i427447K629410P477633M176972j568836l203114m32668L423426N736997
43105H812373M521193q73321o664621p067007k782803j858446p441714j0015630
43097b3369976L45685J6967646K1865882R131167o644755r600957j930521K749382
43089I513553j090168o709457p110785k728143J895559K468623k786606r468352
43081a6015776q484544J811857R164376K982066p594692m674101J1089116K0516065
43073H794367J4865624O572724N444594L608580m983670q921867O37301J0212190
43065C6229843L860728r824426j2246490n974845o951310j2994401p742644O654184
$$ plain form
43057 -8989361 1166464 1710880 413148 11251671 26540676 26711900 12734268 4897447
43049 4897447 10221822 15037645 12918081 15807791 29090579 37505384 28808329 14273729
43041 14273729 11238130 18439618 23036397 21606459 20097447 21115427 24169651 31124112
43033 31124112 39251434 36898117 19505426 2222725 1018726 7447016 230088 -20885990
43025 -20885990 -32382082 -20371696 1042543 10959310 6545158 -1387531 -5799846 -6666510
43017 -6666510 -4722172 -1204567 809467 1477184 6137310 16522654 24868830 22947030
43009 22947030 12809350 2301223 -6191977 -15170692 -22761864 -22525699 -13365096 -2836117
43001 -2836117 2182183 3655158 7989592 16133126 21642429 18193374 6476067 -6866286
$$ packed form
43057h989361J0155825N44416j297732J0838523J5289005J71224j3977632p836821
43049D897447N324375M815823k119564K889710J3282788Q414805q697055j4534600
43041A4273729l035599P201488M596779j429938j509012J017980L054224O954461
43033C1124112Q127322k353317j7392691j7282701j203999O428290p216928k1116078
43025b0885990j1496092J2010386K1414239R916767m414152p932689m412315q66664
43017f666510J944338L517605K014034O67717M660126J0385344Q346176j921800
43009B2947030j0137680j0508127q493200q978715p591172K36165R160603J0528979
43001b836117N018300J472975M334434Q143534N509303l449055j1717307j3342353
$$ plain form
42993 -6866286 -15215753 -15836620 -9928200 -1870245 2132155 -1636360 -10269640 -17315883
42985 -17315883 -20732941 -23726512 -26423748 -22925492 -11008313 1198751 5304515 5087675
42977 5087675 10259290 20486812 25420895 20179543 10975888 4248467 -17421 -1786117
42969 -1786117 2117188 10120565 13849519 9504408 3798217 3438109 6589912 10332626
42961 10332626 17345643 26971652 28561170 15379394 -573788 -293437 17988065 37492681
42953 37492681 44347033 39248129 28483826 15842343 6166201 5558569 12102800 14144638
42945 14144638 4228958 -9770923 -12708817 667818 19300809 25423197 11096633
42938 11096633 -11982070 -21043837 -5446628 20582059 34309328 30751819 23898126
$$ packed form
42993f866286q349467o20867N908420Q057955M002400l768515q633280p046243
42985a7315883l417058k993571k697236L498256J1917179J2207064M105764k16840
42977E087675N171615J0227522M934083n241352r203655o727421m265888j768696
42969a786117L903305Q003377L728954m345111n706191l60108L151803L742714
42961A0332626P013017R626009J589518j3181776j5953182K80351J8281502J9504616
42953C7492681O854352n098904j0764303j2641483r676142o07632O544231K041838
42945A4144638r915680j3999881k937894J3376635J8632991O122388j4326564
42938A1096633k3078703r061767J5597209K6028687J3727269l557509o853693
$$ plain form
42931 23898126 24185491 27399250 27385686 25750915 23064290 13716494 -771182 -4775209
42923 -4775209 11588195 32997176 34675015 15286186 -694114 4547995 20193159
42916 20193159 23049873 6704492 -13419214 -19953360 -11297246 583178 5308761 4006806
42908 4006806 4541476 10093091 16200723 18550480 18489374 18787608 18851987 17608088 16770046
42899 16770046 17055185 15058142 8395432 357960 -4744648 -6520432 -4627624 3468839
42891 3468839 14250306 15096699 -118521 -18089970 -21428691 -13176578 -11216164 -19518150
42883 -19518150 -22122535 -9211982 7878597 15707298 17642920 22029514 23734489 12953143
42875 12953143 -4150954 -9369108 3842828 22832336 32904276 32102458 26878680 21509516
$$ packed form
42931B3898126K87365L213759j3564j634771k686625r347796j4487676m004027
42923d775209J6363404K1408981J677839j9388829j5980300N242109J5645164
42916B0193159K856714j6345381k0123706o534146Q656114J1880424M725583j301955
42908D006806N34670N551615O107632K349757o1106K98234O4379j243899q38042
42899A6770046K85139j997043o662710q037472n102608j775784J892808Q096463
42891C468839J0781467Q46393j5215220j7971449l338721Q252113J960414q301986
42883a9518150k604385J2910553J7090579P828701J935622M386594J704975j0781346
42875A2953143j7104097n218154J3211936J8989508J0071940q01818n223778n369164
$$ plain form
42867 21509516 16001831 9826531 3854301 -422271 -2686994 -4856842 -8687121 -12048472
42859 -12048472 -11134076 -7126553 -5072203 -4070789 3733861 19508198 31548301 31182178
42851 31182178 27385075 33820806 46493784 48981776 38869047 32813383 40584526 48514885
42843 48514885 38904282 16587842 3693840 10739389 23797653 22570272 4309337
42836 4309337 -14857699 -20102966 -14302752 -11474945 -16437035 -18019666 -5973900 11756109
42828 11756109 17173091 5737172 -7500252 -7042610 5498906 16472052 16641620 8238690
42820 8238690 123016 467271 11236821 25710948 32982823 27900637 15931659 7398982
42812 7398982 8716425 19164031 32407823 39837456 36349705 25554598 16966245 16128590
$$ packed form
42867B1509516n507685o175300n972230m276572k264723k169848l830279l361351
42859a2048472R14396M007523K054350J001414P804650J5774337J2040103l66123
42851C1182178l797103O435731J2672978K487992j0112729o055664P771143P930359
42843D8514885r610603k2316440j2894002P045549J3058264j227381j8260935
42836D309337j9167036n245267N800214K827807m962090j582631J2045766J7730009
42828A1756109N416982j1435919j3237424M57642J2541516J0973146J69568q402930
42820H238690q115674L44255J0769550J4474127P271875n082186j1968978q532677
42812G398982J317443J0447606J3243792P429633l487751j0795107q588353q37655
$$ plain form
42804 16128590 19351145 19112299 12332681 2459244 -4518339 -5788667 -5165168 -9403871
42796 -9403871 -18358074 -21849623 -11830192 4960427 14233731 12974455 12037930 19327788
42788 19327788 30087060 36468690 37132711 33385289 25283538 16861413 15990331 22421699
42780 22421699 24644366 16300264 7402927 10149428 21095879 27871233 27162619 24172310
42772 24172310 19155522 8224432 -3855911 -5006295 7893434 24138789 32837930
42765 32837930 32928684 27855886 19007826 7970231 -1348065 -6566985 -8479137 -6879517
42757 -6879517 869578 15036905 30317377 38752316 34830616 19767422 3032526 -4079050
42749 -4079050 -361663 3778884 797800 -4143816 -4045634 -2926575 -7299888 -11339826
$$ packed form
42804A6128590L222555k38846o779618r873437o977583j270328O23499m238703
42796i403871q954203l491549J0019431J6790619R273304j259276r36525P289858
42788A9327788J0759272O381630O64021l747422q101751q422125q71082O431368
42780B2421699K222667q344102q897337K746501J0946451O775354p08614k990309
42772B4172310n016788j0931090j2080343j150384J2899729J6245355Q699141
42765C2837930R0754n072798q848060j1037595r318296n218920j912152J599620
42757f879517P749095J4167327J5280472Q434939l921700j5063194j6734896p111576
42749d079050L717387M140547k981084m941616R8182J119059m373313m039938
$$ plain form
42741 -11339826 -4455935 9670822 16527361 12503812 8294643 9689950 10284199 6241806
42733 6241806 3034096 2584818 -1474664 -9259080 -9781270 1054202 11033230 9908522
42725 9908522 4821514 6789032 13286194 16378176 17923257 23106950 27014952 21847592
42717 21847592 11887577 8217943 13055270 20762679 28553295 33798170 27518633 6363112
42709 6363112 -13035736 -8870698 16755971 38612075 38954271 23447547 6341952 -4382873
42701 -4382873 -4351860 8231658 24083565 27104065 15951148 10565144 27784098 58505675
42693 58505675 78063853 73296167 51376959 27167818 10462523 3215273 1910649
42686 1910649 1971778 2432261 5358366 10530713 14557936 16058173 17281914 19949491 24249542
$$ packed form
42741a1339826O883891J4126757O856539m023549m209169J395307N94249m042393
42733F241806l207710m49278m059482p784416n22190J0835472R979028j124708
42725I908522n087008J967518O497162L091982J545081N183693L908002n167360
42717B1847592r960015l669634M837327P707409P790616N244875o279537k1155521
42709F363112j9398848M165038K5626669K1856104L42196j5506724j7105595j0724825
42701d382873L1013J2583518J5851907L020500j1152917n386004J7218954L0721577
42693E8505675J9558178m767686k1919208k4209141j6705295p247250j304624
42686A910649O1129M60483K926105N172347M027223J500237J223741K667577M300051
$$ plain form
42677 24249542 31409663 40610544 44323497 36339699 25089860 27007974 42757121 52517514
42669 52517514 42080983 22167142 12339744 16131349 23932900 31588074 41203706 48556165
42661 48556165 45531445 34640082 27625713 28444365 29323631 25231032 20708962 19470796
42653 19470796 18054057 13947975 10305194 7988315 2470337 -5669044 -6773645 3194303
42645 3194303 12048586 5994860 -9999177 -17589147 -8986317 5305546 13287819 15291699
42637 15291699 17045918 18292704 16176942 14788263 21969736 36776412 47605303 45369831
42629 45369831 33488473 21633850 13903218 8013971 3340517 2877649 6446989 8055249
42621 8055249 3458013 -3484963 -5889956 -2589406 2483032 7664474 14797010 22805743
$$ packed form
42677B4249542P160121R200881L712953p983798j1249839J918114J5749147R760393
42669E2517514j0436531j9913841r827398L791605P801551P655174R615632P352459
42661D8556165l024720j0891363p014369Q18652Q79266m092599m522070j238166
42653A9470796j416739m106082l642781k316879n517978q139381j104601R967948
42645C194303Q854283o053726j5994037p589970Q602830J4291863P982273K003880
42637A5291699J754219J246786k115762j388679P181473J4806676J0828891k235472
42629D5369831j1881358j1854623p730632n889247m673454m62868L569340J608260
42621H055249m597236o942976k404993L300550N072438N181442P132536Q008733
$$ plain form
42613 22805743 25423359 18289834 5548841 -3555878 -3538695 3624421 12123767 17156627
42605 17156627 16749381 11669128 4960400 451717 272237 3714346 8819307 14280938
42597 14280938 18643898 18610138 11462487 891236 -2601721 8494372 28645376 42942971
42589 42942971 41905891 29622734 16695561 9581090 8819120 12323340 15479170 11911260
42581 11911260 727399 -8865323 -7137375 2344302 5858904 -2173569 -11604749 -10561255
42573 -10561255 262879 12623023 23008785 31354313 32263878 19228772 -1914176
42566 -1914176 -14637035 -11166463 -2045879 -991413 -7866043 -14127823 -18231685 -24297058
42558 -24297058 -28440253 -19625012 3141186 25236720 33327447 29604808 23650479 18602940
$$ packed form
42613B2805743K617616p133525j2740993r104719J7183P163116Q499346N032860
42605A7156627m07246n080253o708728m508683j79480L442109N104961N461631
42597A4280938M362960l3760p147651j0571251l492957J1096093K0151004J4297595
42589D2942971j037080j2283157j2927173p114471p61970L504220L155830l567910
42581A1911260j1183861r592722J727948R481677L514602q032473r431180J043494
42573a0561255J0824134J2360144J0385762Q345528R09565j3035106k1142948
42566a914176j2722859L470572R120584J054466o874630o261780m103862o065373
42558b4297058m143195Q815241K2766198K2095534Q090727l722639n954329n047539
$$ plain form
42550 18602940 13635170 12979190 21013311 31406824 32603106 24081654 16934839 17039580
42542 17039580 17654020 11656659 1742802 -6097974 -11000697 -13643485 -11563056 -4437058
42534 -4437058 1967452 3666628 5012106 10868256 17597561 19269392 17846932 18583026
42526 18583026 19477603 15171110 8474792 7153407 10274881 9223055 3339854 2830341
42518 2830341 12220231 21435287 19561857 9543437 2625091 4411148 12743174 23751062
42510 23751062 32941125 34531512 27059489 17352236 12989759 13048164 11627378 7580475
42502 7580475 4294611 2129440 -1433463 -4609042 -1573382 8754272 19803592 24641153
42494 24641153 21699449 13037247 2632993 -2610805 3073978 15913669 23764520 19964951
$$ packed form
42550A8602940m967770o55980Q034121J0393513J196282q521452p146815J04741
42542A7039580O14440n997361r913857p840776m902723k642788K080429P125998
42534d437058O404510J699176J345478N856150O729305J671831j422460P36094
42526A8583026Q94577m306493o696318j321385L121474j051826n883201n09513
42518B830341R389890R215056j873430j0018420o918346J786057Q332026J1007888
42510B3751062R190063J590387p472023r707253m362477N8405j420786m046903
42502G580475l285864k165171l562903l175579L035660J0327654J1049320M837561
42494B4641153k941704q662202j0404254n243798N684783J2839691P850851l799569
$$ plain form
42486 19964951 11631299 9644432 14697203 19259489 19972872 20091845 20259802 15562671
42478 15562671 4954039 -3035130 658521 14362346 28133672 34972829 35015506 30881108
42470 30881108 24767493 19843734 18859614 20353117 21045767 22724193 30596929 42431792
42462 42431792 46305342 34808226 16366302 5305307 4140905 4076158 1290790 2608900
42454 2608900 12844697 25548145 31262470 28442947 20874232 10199804 -1980680 -8954246
42446 -8954246 -4584116 6795444 13979771 13156203 11531236 14835324 18488983 16003059
42438 16003059 10713320 11988859 21478669 30010348 29310547 21389871 13695370 9406503
42430 9406503 6840847 5634209 7680938 11978463 14162370 13363088 14809485 21675789
$$ packed form
42486A9964951q333652j986867N052771M562286P13383J18973J67957m697131
42478A5562671j0608632p989169L693651J3703825J3771326O839157M2677m134398
42470C0881108o113615m923759r84120J493503O92650J678426P872736J1834863
42462D2431792L873550j1497116j8441924j1060995j164402o4747k785368J318110
42454B608900J0235797J2703448N714325k819523p568715j0674428j2180484o973566
42446h954246M370130J1379560P184327q23568j624967L304088L653659k485924
42438A6003059n289739J275539R489810Q531679o99801p920676p694501m288867
42430I406503k565656j206638K046729M297525K183907p99282J446397O866304
$$ plain form
42422 21675789 27747591 23786681 10483973 -172767 2132098 15140677 27598374
42415 27598374 31053931 26338204 20156218 17392399 17008299 15299968 12380469 12721667
42407 12721667 17848797 22197837 20442908 16119254 16816862 22076503 23526117 17944716
42399 17944716 12414686 13305038 17088943 16976856 13230297 11278611 13377266 17434177
42391 17434177 21427028 24619960 26894552 30174025 37031129 44763778 45696591 37389742
42383 37389742 27025651 21061024 17664605 15866934 23000492 41520082 56018024 49477758
42375 49477758 29683523 22111579 35065289 49248089 47395233 37409820 35945823 43054593
42367 43054593 47093919 46018738 49305661 62504710 81561421 100258177 113788563
$$ packed form
42422B1675789O071802l960910j3302708j0656740K304865J3008579J2457697
42415B7598374L455557m715727o181986k763819l84100j708331k919499L41198
42407A2721667N127130M349040j754929m323654O97608N259641J449614n581401
42399A7944716n530030Q90352L783905j12087l746559j951686K098655M056911
42391A7434177L992851L192932K274592L279473O857104P732649R32813q306849
42383C7389742j0364091n964627l396419j797671P133558J8519590J4497942o540266
42375D9477758j9794235p571944J2953710J4182800j852856r985413j463997P108770
42367D3054593M039326j075181L286923J3199049J9056711J8696756J3530386
$$ plain form
42360 113788563 117328009 110163802 99714468 93971911 92536068 92180712 96414665 109534391
42352 109534391 125294613 133598559 136157400 142373052 150842316 150590703 143044505 145844851
42344 145844851 167059551 190389473 197626585 194504559 200451206 220440250 242358840
42337 242358840 258995755 277412856 304994890 338337023 369459135 393828764 408611883
42330 408611883 410894153 401974297 387358366 368721916 341530088 304534192 266059655
42323 266059655 235844964 214937468 198715399 185789805 177562343 171662781 162923065
42316 162923065 150122576 135221746 116401380 90148011 62420652 48498582 54598372
42309 54598372 65890003 62560887 45153849 33018473 36986046 45852178 45530842 39910018
$$ packed form
42360A13788563L539446p164207j0449334n742557j435843l55356M233953J3119726
42352A09534391J5760222Q303946K558841O215652Q469264k51613p546198K800346
42344A45844851K1214700K3329922P237112l122026N946647J9989044K1918590
42337B42358840J6636915J8417101K7582034L3342133L1122112K4369629J4783119
42330D08611883K282270q919856j4615931j8636450k7191828l6995896l8474537
42323B66059655l0214691k0907496j6222069j2925594q227462n899562q739716
42316A62923065j2800489j4900830j8820366k6253369k7727359j3922070O099790
42309E4598372J1291631l329116j7407038j2135376L967573Q866132l21336n620824
$$ plain form
42301 39910018 41399959 48623044 48567240 38633489 30694758 30814570 30527034 24985810 24820997
42292 24820997 37958528 51346525 46758672 28349199 17645202 23289914 32165646
42285 32165646 31448525 23371598 14237431 4426503 -3237968 1079149 19911796 39459044
42277 39459044 45414519 40414049 36303880 36668124 37589168 38879231 42505688 44765076
42269 44765076 42063327 40313259 45874441 50734107 41388463 21473651 10294210 16995776
42261 16995776 30604605 38988515 43229285 47832450 51035019 53110962 61600690 77842773
42253 77842773 88603954 82567429 67176374 57609090 55805021 52803460 46956586 46482881
42245 46482881 55344976 68013868 78331392 84328884 84638080 79083628 73023605 72988222
$$ packed form
42301C9910018J489941P223085n5804r933751p938731J19812k87536n541224j64813
42292B4820997J3137531J3387997m587853j8409473j0703997N644712Q875732
42285C2165646p17121q076927r134167r810928p664471M317117J8832647J9547248
42277C9459044N955475n000470m110169L64244R21044J290063L626457K259388
42269D4765076k701749j750068N561182M859666r345644j9914812j1179441O701566
42261A6995776J3608829Q383910M240770M603165L202569K075943Q489728J6242083
42253G7842773J0761181o036525j5391055r567284j804069l001561n846874m73705
42245D6482881Q862095J2668892J0317524N997492L09196n554452o060023l5383
$$ plain form
42237 72988222 77609149 79859433 77841023 76372441 78726769 83725391 89521840 93203492
42229 93203492 89616096 79501964 75419840 88057024 108702848 118405287 113841784 109532597
42221 109532597 113688511 118770852 119862472 123955470 132469592 132211353 116498195 100204020
42213 100204020 98601455 104120769 101285465 93306728 93215676 96589254 86825409 65369097
42205 65369097 52987613 58052251 65500563 63619863 61053198 67190158 74566558 74691137
42197 74691137 75749472 87609745 100786292 99426918 88437473 87553757 99831400 105641959
42189 105641959 92270279 72522337 64744464 66643165 61234230 42612115 23365798
42182 23365798 16840517 21916537 28425848 30767557 30959438 31960668 34373287 39421587
$$ packed form
42237G2988222M620927K250284k018410j468582K354328M998622N796449L681652
42229I3203492l587396j0114132m082124J2637184K0645824R702439m563503m309187
42221A09532597M155914N082341J091620M092998Q514122k58239j5713158j6294175
42213A00204020j602565N519314k835304p978737r1052L373578r763845k1456312
42205F5369097j2381484N064638P448312j880700k566665O136960P376400J24579
42197G4691137J058335J1860273J3176547j359374j0989445q83716J2277643N810559
42189A05641959j3371680j9747942p777873J898701n408935j8622115j9246317
42182B3365798o525281N076020O509311K341709J91881J001230K412619N048300
$$ plain form
42174 39421587 48971206 60025528 64356224 58199220 48418285 43108404 39506895 29761345
42166 29761345 17142917 15205204 27924900 41781140 44149414 40101439 42129858 51442080
42158 51442080 60849698 69946106 83286556 95979365 96084760 82938221 69493132 63000244
42150 63000244 56655942 45982836 39844883 45522976 54279580 54491998 51028574 57070296
42142 57070296 71265459 78615131 73653082 67543298 68793132 71124185 68000599 67500302
42134 67500302 80969132 102729112 113401316 103550960 85093315 76704126 83835609
42127 83835609 96614781 103965025 105474167 109120326 119716149 132016364 136345591 129736576
42119 129736576 118941063 112497540 113002940 118073564 124783897 130036451 130022731 124438363
$$ packed form
42174C9421587R549619J1054322M330696o157004r780935n309881l601509r745550
42166B9761345j2618428j937713J2719696J3856240K368274m047975K028419R312222
42158E1442080R407618R096408J3340450J2692809J05395j3146539j3445089o492888
42150F3000244o344302j0673106o137953N678093Q756604K12418l463424O041722
42142E7070296J4195163P349672m962049o109784J249834K331053l123586n00297
42134F7500302J3468830K1759980J0672204r850356j8457645q389189P131483
42127H3835609J2779172P350244J509142L646159J0595823J2300215M329227o609015
42119A29736576j0795513o443523N05400N070624O710333N252554j3720n584368
$$ plain form
42111 124438363 119893527 123532864 132451332 134566408 122797551 104777512 94511529
42104 94511529 95926652 98840055 91971169 76974378 67236761 73317497 91390627 106970170
42096 106970170 109415966 101506374 94508630 95582403 102164489 108315240 113223286 120613704
42088 120613704 130768486 136915789 131874394 117017983 102060277 95541052 97340060
42081 97340060 101330071 103367610 104574674 107843685 113977793 121835614 130123408 137840489
42073 137840489 144363890 150498869 158838429 171936008 189772302 208493456 221086525
42066 221086525 221039705 208798787 195035406 193424552 207069245 224200253 230524432 224543052
42058 224543052 217562217 219903400 231397107 245518660 257966139 268544954 277745697
$$ packed form
42111A24438363m544836L639337Q918468K115076j1768857j8020039j0265983
42104I4511529J415123K913403o868886j4996791r737617O080736J8073130J5579543
42096A06970170K445796p909592o997744J073773O582086O150751M908046P390418
42088A20613704J0154782O147303n041395j4856411j4957706o519225J799008
42081I7340060L990011K037539J207064L269011O134108P857821Q287794P717081
42073A37840489O523401O134979Q339560J3097579J7836294J8721154J2593069
42066B21086525m6820j2240918j3763381j610854J3644693J7131008O324179n981380
42058B24543052o980835K341183J1493707J4121553J2447479J0578815R200743
$$ plain form
42051 277745697 284840607 288061675 284154849 269324308 244243106 217766747 201109683
42044 201109683 195910492 191235401 176260630 154201930 138637580 135970728 137832116
42037 137832116 134050517 126925426 125582957 130033137 130866333 125256432 122670308 129597336
42029 129597336 137233310 132648963 117089196 104137587 101973077 105952922 108065616 105449166
42021 105449166 98851681 90742319 87260719 94561576 109204737 118235480 114026471 104987617
42013 104987617 105996560 120041563 134162498 133662668 117381450 98056152 88562877
42006 88562877 88811474 87815695 79006330 69430789 69859049 79620760 88410591 91143527
41998 91143527 91740798 91773889 86440509 76290201 72329039 80886581 90892694 86609105
$$ packed form
42051B77745697P094910L221068l906826j4830541k5081202k6476359j6657064
42044B01109683n199191m675091j4974771k2058700j5564350k666852J861388
42037A37832116l781599p125091j342469M450180Q33196n609901k586124O927028
42029A29597336P635974m584347j5559767j2951609k164510L979845K112694k616450
42021A05449166o597485q109362l481600P300857J4643161R030743m209009r038854
42013A04987617J008943J4045003J4120935m99830j6281218j9325298r493275
42006H8562877K48597r95779q809365r575541M28260R761711Q789831K732936
41998I1143527N97271L3091n333380j0150308l961162Q557542J0006113m283589
$$ plain form
41990 86609105 69169836 55412039 56565281 67036334 74742609 74787591 70807608 68175624
41982 68175624 68230350 66710508 57967532 43003766 31176338 30104747 36168744 39568081
41974 39568081 36375966 30270185 24957278 21658621 22449016 28513598 35240803 36120139
41966 36120139 31897751 29400714 31495130 35396215 40452557 48497721 55480584 53333302
41958 53333302 44159589 42410100 56103489 73988427 79621558 72224835 64766945 65550338
41950 65550338 70931381 74097768 72009347 64126684 52979937 47055347 54417502 69842274
41942 69842274 75650390 61287288 37281977 22934275 23193462 26220935 23514937 21736552
41934 21736552 28893857 37943669 35618489 23798744 18618432 27097536 38387393 43458772
$$ packed form
41990H6609105j7439269j3757797J153242J0471053P706275M4982l979983k631984
41982F8175624N4726j519842q742976j4963766j1827428j071591O063997L399337
41974C9568081l192115o105781n312907l298657P90395O064582O727205Q79336
41966C6120139m222388k497037K094416L901085N056342Q045164O982863k147282
41958E3333302r173713j749489J3693389J7884938N633131p396723p457890P83393
41950F5550338N381043L166387k088421p882663j1146747n924590P362155J5424772
41942F9842274N808116j4363102k4005311j4347702K59187L027473k705998j778385
41934B1736552P157305R049812k325180j1819745n180312Q479104J1289857N071379
$$ plain form
41926 43458772 49363993 63361544 75130775 70398491 54579328 45333059 45670368 43340840
41918 43340840 36204137 37554948 51737985 64138103 64001552 59773179 60979960 61212714
41910 61212714 52770246 43731008 44140464 47194231 42518713 38605894 50884974 72407151
41902 72407151 78356743 60158523 35639000 22730454 21457649 26570602 39374288
41895 39374288 57344259 66808566 58609576 42293144 33995770 36675072 41804545 44823883
41887 44823883 47989122 50159848 44436306 28794306 12797435 8787782 17403904 25960969
41879 25960969 24189125 19003666 26314618 46531012 58018679 42831409 11246032
41872 11246032 -10580024 -12126249 -4701965 -39663 1460587 1600828 516254 4923032
$$ packed form
41926D3458772N905221J3997551J1769231m732284j5819163r246269L37309k329528
41918D3340840p136703J350811J4183037J2400118j36551m228373J206781K32754
41910F1212714q442468r039238M09456L053767m675518l912819J2279080K1522177
41902G2407151N949592j8198220k4519523j2908546j272805N112953J2803686
41895C9374288J7969971R464307q198990j6316432q297374K679302N129473L019338
41887D4823883L165239K170726n723542j5642000j5996871m009653Q616122Q557065
41879B5960969j771844n185459P310952K0216394J1487667j5187270l1585377
41872A1246032k1826056j546225P424284M662302J500250J40241j084574M406778
$$ plain form
41864 4923032 23357256 47448143 54708168 38956465 22451946 26140421 41630326
41857 41630326 46517784 35676191 21376193 11343812 4071144 810247 5583403 15118995
41849 15118995 22357207 27675511 34073840 35215160 23450697 7435748 4944887 17166107
41841 17166107 26183552 21030045 10980206 8121393 11025473 12544082 11514414 9145904
41833 9145904 4278781 -374461 2945408 14482297 22703761 20616388 16865753 21044441
41825 21044441 26929361 22453893 9955475 2871582 4978186 6226947 55958 -6865835
41817 -6865835 -6071311 87624 2828367 -550099 -3756810 -506142 6283676 6171215
41809 6171215 -6478207 -23272302 -29748739 -23415956 -17118178 -20530895 -25815194 -19722779
$$ packed form
41864D923032J8434224K4090887P260025j5751703j6504519L688475J5489905
41857D1630326M887458j0841593j4299998j0032381p272668l260897M773156R535592
41849A5118995P238212N318304O398329J141320j1764463j6014949k490861J2221220
41841A7166107R017445n153507j0049839k858813K904080J518609j029668k368510
41833I145904m867123m653242L319869J1536889Q221464k087373l750635M178688
41825B1044441N884920m475468j2498418p083893K106604J248761o170989o921793
41817f865835P94524O158935K740743l378466l206711L250668O789818j12461
41809F171215j2649422j6794095o476437O332783O297778l412717n284299O092415
$$ plain form
41801 -19722779 -4394493 5088643 2278749 -3288633 -2416703 1091290 -115489 -3257349
41793 -3257349 331063 11316936 20870552 22368078 18298184 14578796 12726462 9770083
41785 9770083 3202199 -6030800 -14057454 -16238925 -10241473 1180302 11273097 15299091
41777 15299091 15180957 15568566 15348311 7783933 -7795754 -19132835 -12957940 7262933
41769 7262933 23131194 22418133 11142940 1740816 -2608783 -5612020 -6940723 -3253815
41761 -3253815 3149803 6255847 6061261 7872177 12227432 14398126 14582514 18871125
41753 18871125 27279102 30558721 24200005 16918482 17720203 21338797 15888356 1317130
41745 1317130 -9265842 -6174147 6388692 16773944 16802248 6169837 -7865452 -14110981
$$ packed form
41801a9722779J5328286R483136k809894n567382Q71930L507993j206779l141860
41793c257349L588412J0985873R553616J497526m069894l719388j852334k956379
41785I770083o567884r232999q026654k181471N997452J1421775J0092795M025994
41777A5299091j18134L87609k20255p564378j5579687j1337081O174895K0220873
41769G262933J5868261p13061j1275193r402124m349599l003237j328703L686908
41761c253815O403618L106044j94586J810916M355255K170694J84388M288611
41753A8871125Q407977L279619o358716p281523Q01721L618594n450441j4571226
41745A317130j0582972L091695J2562839J0385252K8304j0632411j4035289o245529
$$ plain form
41737 -14110981 -6423519 8797435 18410705 17693536 15607828 22777435 38280757 51707563
41729 51707563 55373712 50555526 43123930 37107248 32879844 28427620 20781304 8338456
41721 8338456 -5615565 -12534622 -5706428 10061542 19030317 9752434 -10777737 -23559250
41713 -23559250 -19402244 -8582319 -5769267 -11773715 -16648501 -16020532 -14863670 -15879620
41705 -15879620 -13894598 -5256237 4120422 5273365 -2536684 -10980314 -11357705 -1866431
41697 -1866431 12051825 22596310 25570710 22168936 15010002 5138738 -4687322 -8007876
41689 -8007876 -2219267 4529740 2134629 -6887611 -11137354 -8805750 -10522774 -20180460
41681 -20180460 -25727313 -17360524 -4291118 -2287115 -11876668 -20445703 -20460525 -13828776
$$ packed form
41737a4110981P687462J5220954R613270p17169k085708P169607J5503322J3426806
41729E1707563L666149m818186p431596o016682m227404m452224p646316j2442848
41721H338456j3954021o919057O828194J5767970Q968775r277883k0530171j2781513
41713b3559250M157006J0819925K813052o004448m874786O27969J156862j015950
41705a5879620J985022Q638361R376659J152943p810049q443630l77391R491274
41697a866431J3918256J0544485K974400l401774p158934r871264r826060l320554
41689h007876N788609O749007k395111r022240m249743K331604j717024r657686
41681b0180460n546853Q366789J3069406K004003r589553q569035j4822O631749
$$ plain form
41673 -13828776 -2798502 10289983 16671722 8289412 -8699178 -20008727 -23016525
41666 -23016525 -27237384 -34169057 -32641651 -19777461 -11128839 -19468640 -34793199 -37382017
41658 -37382017 -23073165 -3879421 10758472 20905228 27035047 26021321 17474477
41651 17474477 5950958 -4499051 -12420363 -16065126 -14518883 -11662139 -13098681 -18402530
41643 -18402530 -21283784 -18071404 -11610813 -6066998 -2028894 1888044 5630604 7466265
41635 7466265 5882492 1270140 -4116021 -8927832 -14882598 -22793624 -26712162 -18405752
41627 -18405752 -405784 12409813 9972683 -9060 -3369233 1206995 3068614 -3479676
41619 -3479676 -13146177 -19658333 -22112142 -20616954 -14799793 -8735754 -8988628 -14658783
$$ packed form
41673a3828776J1030274J3088485O381739q382310j6988590j1309549l007798
41666b3016525m220859o931673J527406J2864190Q648622q339801j5324559k588818
41658c7382017J4308852J9193744J4637893J0146756O129819j013726q546844
41651A7474477j1523519j0450009p921312l644763J546243K856744j436542n303849
41643a8402530k881254L212380O460591N543815M038104L916938L742560J835661
41635G466265j583773m612352n386161m811811n954766p911026l918538Q306410
41627a8405752J7999968J2815597k437130r981743l360173M576228J861619o548290
41619c479676r666501o512156k453809J495188N817161O064039k52874n670155
$$ plain form
41611 -14658783 -16681733 -10328608 -1475833 3355027 6373263 12828317 21590056 27438452
41603 27438452 29032290 28855356 27637222 24156084 19387286 16139052 14400783 10255424
41595 10255424 257246 -14172465 -26623095 -30074257 -23114851 -12211787 -5819564 -5680181
41587 -5680181 -5854540 -409317 10538256 22531332 31132464 33471423 28512304 17900823
41579 17900823 5540662 -4260060 -7937766 -4060552 4122062 9967886 10838284 11555781
41571 11555781 16026702 19172081 14428327 6218757 5068336 11224531 14602686 12481152
41563 12481152 14336181 23822751 28513902 16908075 -3948655 -18600024 -23412989 -24652169
41555 -24652169 -22082852 -9147257 11193227 24681240 23792059 17579628 18443876 26330828
$$ packed form
41611a4658783k022950O353125Q852775M830860L018236O455054Q761739N848396
41603B7438452J593838j76934j218134l481138m768798l248234j738269m145359
41595A0255424r998178j4429711j2450630l451162O959406J0903064O392223J39383
41587e680181j74359N445223J0947573J1993076Q601132K338959m959119j0611481
41579A7900823j2360161r800722l677706L877214Q182614N845824Q70398P17497
41571A1555781M470921L145379m743754q209570j150421O156195L378155k121534
41563A2481152J855029R486570M691151j1605827k0856730j4651369m812965j239180
41555b4652169K569317J2935595K0340484J3488013q89181o212431Q64248P886952
$$ plain form
41547 26330828 31674078 29033309 21746362 15053834 9649779 2526952 -8349644 -21113738
41539 -21113738 -30970088 -33888961 -29950885 -23543691 -19886637 -20196900 -20259068 -15827611
41531 -15827611 -9913196 -10853576 -20713065 -30482158 -31741470 -27772581 -25176287 -19860545
41523 -19860545 -3948756 15722359 21866693 12217792 4848938 11459444 20381826 16111341
41515 16111341 2430783 -6259295 -5670005 -531499 7572736 17327782 21117178 15782883
41507 15782883 12218285 19584677 28410998 25871828 18774961 21184094 27224720 20828948
41499 20828948 8022932 11246432 30137324 36986051 18530055 -4830191 -12242758
41492 -12242758 -8989720 -6140728 851390 14255840 17274216 -1470544 -23843437 -26989594
$$ packed form
41547B6330828N343250k640769p286947o692528n404055p122827j0876596j2764094
41539b1113738r856350k918873L938076O407194L657054l10263o2168M431457
41531a5827611N914415r40380r859489r769093j259312L968889K596294N315742
41523a9860545J5911789J9671115O144334r648901p368854O610506Q922382m270485
41515A6111341j3680558q690078N89290N138506Q104235R755046L789396n334295
41507A5782883l564598P366392Q826321k539170p096867K409133O040626o395772
41499B0828948j2806016L223500J8890892O848727j8455996k3360246p412567
41492a2242758L253038K848992O992118J3404450L018376j8744760k2372893l146157
$$ plain form
41484 -26989594 -18439978 -20887832 -32818730 -32463457 -15703953 -1894951 -1516856 -3415155
41476 -3415155 2126676 10299270 17113592 26954873 37605424 36848988 23228236 13514135
41468 13514135 19170167 29818397 30898963 24504159 20318799 17221120 8369196 -2716986
41460 -2716986 -5682497 53381 4252381 656319 -6533394 -10853602 -10621019 -7353416
41452 -7353416 -3162862 -475709 -213861 -166681 1828949 4167471 4075717 2445024 2325376
41443 2325376 3464235 2302089 -2117862 -5476352 -3400831 1782534 2113578 -6293125
41435 -6293125 -15915367 -14650429 -1583991 9374632 6439157 -4120061 -6627783 2191337
41427 2191337 9810251 6573929 -2518116 -8333633 -10796280 -14985417 -20042984 -19600678
$$ packed form
41484b6989594Q549616k447854j1930898L55273J6759504J3809002L78095j898299
41476c415155N541831Q172594O814322R841281J0650551p56436j3620752r714101
41468A3514135N656032J0648230J080566o394804m185360l097679q851924j1086182
41460b716986k965511N735878M199000l596062p189713m320208K32583L267603
41452g353416M190554K687153K61848M7180J995630K338522r1754j630693j19648
41443B325376J138859j162146m419951l358490K075521N183365L31044q406703
41435f293125r622242J264938J3066438J0958623k935475j0559218k507722Q819120
41427B191337P618914l236322r092045n815517k462647m189137n057567M42306
$$ plain form
41419 -19600678 -11418567 -1139859 3830350 1942532 -1259539 -8193 3061386 -1018181
41411 -1018181 -13075022 -19202258 -7846179 10552436 14531196 2210500 -4865003 6467064
41403 6467064 21208947 18709506 1959620 -9759523 -8984757 -5526017 -7949848 -14004463
41395 -14004463 -18859972 -20950205 -18747940 -11290380 -3109981 -1161835 -6181192 -12690061
41387 -12690061 -16259716 -15339336 -9110345 -140900 4820926 4136575 6081358 15128151
41379 15128151 20000755 8664876 -9771483 -14608719 -3249359 6434823 4481417 393762
41371 393762 1367391 -1351324 -14090709 -25773821 -24965258 -18466573 -17947493 -19137992
41363 -19137992 -11269874 649498 1595767 -8544276 -13500788 -4913852 7337883 12269029
$$ packed form
41419a9600678Q182111J0278708M970209j887818l202071J251346L069579m079567
41411a018181j2056841o127236J1356079J8398615L978760j2320696p075503J1332067
41403F467064J4741883k499441j6749886j1719143P74766L458740k423831o054615
41395a4004463m855509k090233K202265P457560Q180399J948146n019357o508869
41387a2690061l569655R20380O228991Q969445M961826o84351J944783R046793
41379A5128151M872604j1335879j8436359m837236J1359360R684182j953406m087655
41371C93762R73629k718715j2739385j1683112Q08563O498685N19080j190499
41363a9137992P868118J1919372R46269j0140043m956512Q586936J2251735M931146
$$ plain form
41355 12269029 11783808 12187236 12604510 9023116 2833068 -1439472 -3024180 -4628217
41347 -4628217 -7678500 -10964971 -12276738 -9902408 -4318439 1345948 4707461 7206680
41339 7206680 10756149 12806550 9463095 2969485 719045 5848088 13236404 16110669
41331 16110669 13092281 7847608 4797636 5376666 5799806 -283949 -13113627 -22620477
41323 -22620477 -18513505 -3616481 9204398 13009318 12210289 11394453 7830145 -773632
41315 -773632 -8830199 -9685348 -5004907 -1098438 624276 3067339 5342693 2099476
41307 2099476 -8082965 -18418832 -20573372 -13933582 -6485381 -6413201 -13580289 -20335699
41299 -20335699 -20448084 -14561282 -5886392 4629770 14337903 14993137 1581703 -16489243
$$ packed form
41355A2269029m85221M03428M17274l581394o190048m272540j584708j604037
41347d628217l050283l286471j311767K374330N583969N664387L361513K499219
41339G206680L549469K050401l343455o493610k250440N129043P388316K874265
41331A6110669l018388n244673l049972N79030M23140o083755j2829678r506850
41323b2620477M106972J4897024J2820879L804920p99029q15836l564308q603777
41315g73632q056567q55149M680441L906469J722714K443063K275354l243217
41307B099476j0182441j0335867k154540O639790P448201P2180p167088o755410
41299b0335699j12385N886802Q674890J0516162R708133O55234j3411434j8070946
$$ plain form
41291 -16489243 -23060117 -15640113 -8391403 -11291402 -16460982 -11688715 1416027 11845485
41283 11845485 15355771 16126874 16205178 13650763 9832975 8970503 9758776 5548577 -5298419
41274 -5298419 -15429413 -16825924 -8745264 3342563 12528357 14094199 8910845 3547038
41266 3547038 3045439 4051504 -407945 -10042850 -16705990 -14993870 -8094179 -2075892
41258 -2075892 619633 362345 -2537294 -7318941 -11618757 -12171932 -6112936 6285502
41250 6285502 17695682 16414990 -921505 -21175396 -26346649 -13564019 2604722
41243 2604722 7809181 1519593 -7137238 -9898347 -4190180 5979206 11939508 8646866
41235 8646866 1808437 648649 4118112 3133757 -3092308 -4804685 287457 -395599
$$ packed form
41291a6489243o570874P420004P248710k899999n169580M772267J3104742J0429458
41283A1845485L510286P71103P8304k554415l817788q62472P88273m210199j0846996
41274e298419j0130994j396511Q080660J2087827R185794J565842n183354n363807
41266C547038n01599J006065m459449r634905o663140J712120O899691O018287
41258b075892K695525k57288k899639m781647m299816n53175O058996J2398438
41250F285502J1410180j280692j7336495k0253891n171253J2782630J6168741
41243B604722N204459o289588q656831k761109N708167J0169386N960302l292642
41235H646866o838429j159788L469463r84355o226065j712377N092142o83056
$$ plain form
41227 -395599 -14729470 -29264862 -24769356 -3058287 14118815 11560515 -4211194 -16160944
41219 -16160944 -14198000 -236135 16439409 25656422 22628014 10725831 -2695352
41212 -2695352 -12419188 -16465772 -14801678 -10455192 -8719035 -11115103 -12961223 -10588933
41204 -10588933 -6899246 -5173335 -2567710 3551689 8037827 5851623 3326568 9776755
41196 9776755 19357689 15111024 -5577037 -22425514 -16876297 4000844 17714097 14375028
41188 14375028 3780343 -2941486 -6775942 -12403036 -15651817 -8242799 7334795 16630124
41180 16630124 10162659 -4513000 -13385789 -14403045 -16917097 -24406681 -28933061 -25949564
41172 -25949564 -23160689 -26608637 -27530716 -15225228 2710123 7356234 -5074927 -17464744
$$ packed form
41227c95599j4333871j4535392M495506K1711069J7177102k558300j5771709j1949750
41219a6160944J962944J3961865J6675544R217013l028408j1902183j3421183
41212b695352r723836m046584J664094M346486J736157k396068j846120K372290
41204a0588933L689687J725911K605625O119399M486138k186204k525055O450187
41196I776755R580934m246665k0688061j6848477N549217K0877141J3713253l339069
41188A4375028j0594685o721829l834456n627094l248781P409018J5577594R295329
41180A6630124o467465j4675659q872789j017256k514052p489584m526380K983497
41172b5949564K788875l447948r22079J2305488J7935351M646111j2431161j2389817
$$ plain form
41164 -17464744 -15517042 -5455992 -2168242 -8745371 -15514849 -14069068 -4630071 8579807
41156 8579807 22805898 35767788 41844875 33366407 9977400 -13926443 -19424797 -5970235
41148 -5970235 4171701 -5848953 -22043794 -17247322 9334749 28947694 22527301
41141 22527301 4355088 -2216485 3690712 6454670 -608812 -11217535 -20215907 -26656053
41133 -26656053 -26921501 -18892400 -11065108 -14306633 -24725952 -27293605 -17980995 -10176165
41125 -10176165 -14992244 -25605478 -27699985 -18305416 -6781693 -694504 2121250 7234839
41117 7234839 14327547 17354930 13024164 5385620 -842888 -8529693 -22993139 -38702962
41109 -38702962 -40598211 -23925004 -4589038 -984115 -10938192 -16958862 -11156898 -3148805
$$ packed form
41164a7464744J947702J0061050L287750o577129o769478J445781R438997J3209878
41156H579807J4226091J2961890O077087q478468k3389007k3903843n498354J3454562
41148e970235J0141936j0020654j6194841M796472K6582071J9612945o420393
41141B2527301j8172213o571573N907197K763958p063482j0608723q998372o440146
41133b6656053k65448Q029101P827292l241525j0419319k567653R312610P804830
41125a0176165m816079j0613234k094507R394569J1523723O087189K815754N113589
41117G234839P092708L027383m330766p638544o228508p686805j4463446j5709823
41109c8702962j895249J6673207J9335966L604923r954077o020670N801964Q008093
$$ plain form
41101 -3148805 -2918432 -7660081 -10049306 -10327281 -13136490 -17558263 -17588279 -11286034 -4129240
41092 -4129240 -2183998 -4854340 -6805174 -6570151 -9585081 -19243386 -27765495 -23332229
41084 -23332229 -6845828 7263614 10440992 10461918 15941520 20983263 16618810 8693886
41076 8693886 8869350 13129161 7395747 -6470254 -9854840 3313304 15247136 11042903
41068 11042903 314850 -109684 8275949 12283839 9693817 9189649 12935940 14824904
41060 14824904 14075852 16091995 19310685 14459356 -231171 -14089414 -18108695 -14956918
41052 -14956918 -11214365 -8351499 -6260914 -7701498 -12437793 -12715206 -2165612 13724308
41044 13724308 22737627 20192360 12551894 7663104 6997254 8211456 10403224 14354906
$$ packed form
41101c148805K30373m741649k389225k77975k809209m421773l0016O302245P156794
41092d129240J945242k670342j950834K35023l014930r658305q522109M433266
41084b3332229J6486401J4109442L177378K0926N479602N041743m364453p924924
41076H693886J75464M259811n733414j3866001l384586J3168144J1933832m204233
41068A1042903j0728053m24534Q385633M007890k590022n04168L746291J888964
41060A4824904p49052K016143L218690m851329j4690527j3858243m019281L151777
41052a4956918L742553K862866K090585j440584m736295k77413J0549594J5889920
41044A3724308R013319k545267p640466m888790o65850J214202K191768L951682
$$ plain form
41036 14354906 20070844 25763734 27832158 21952071 7585607 -7542291 -11851236 -2458284
41028 -2458284 9630479 11588254 4122725 -1087563 1292112 3026207 -4947024 -19623460
41020 -19623460 -31388325 -37205894 -40917673 -43024419 -38625795 -26498211 -13542180 -7521376
41012 -7521376 -9505120 -15419071 -21393303 -25482282 -27006380 -26472470 -24849143 -22126203
41004 -22126203 -17713834 -11938159 -5971948 -1799433 -3421642 -14101914 -29001245 -35918388
40996 -35918388 -30254985 -24504116 -32797799 -49009843 -53341009 -41199792 -30579041 -35154572
40988 -35154572 -44143839 -39121223 -20149711 -2719713 4181615 3895627 372472 -5911368
40980 -5911368 -11139442 -9179230 -925128 6628520 11749488 19457938 30125177 35904900
$$ packed form
41036A4354906N715938N692890K068424n880087j4366464j5127898m308945R392952
41028b458284J2088763J957775p465529n210288K379675J734095p973231j4676436
41020a9623460j1764865n817569l711779k106746M398624J2127584J2956031O020804
41012g521376j983744n913951n974232m088979j524098N33910J623327K722940
41004b2126203M412369N775675N966211M172515j622209j0680272j4899331o917143
40996c5918388N663403N750869q293683j6212044m331166J2141217J0620751m575531
40988c5154572q989267N022616J8971512J7429998O901328k85988l523155o283840
40980e911368n228074J960212Q254102P553648N120968P708450J0667239N779723
$$ plain form
40972 35904900 32284954 25484684 23422402 25026182 23746351 17803322 11737978 9582705
40964 9582705 10817206 13096321 16110430 20970081 25813597 24400750 13077308 -869924
40956 -869924 -4343370 4268793 9804239 -65712 -15642490 -16779758 -889983 14098444
40948 14098444 15795867 11653563 11548729 10614265 1053435 -9658946 -8007624 2987048
40940 2987048 6701354 -1292209 -5857459 4211630 18639875 20972145 12224640 7497216
40932 7497216 13374455 20863070 21034064 16835177 15260469 15634886 11927607 2771350
40924 2771350 -6567623 -11070042 -11303647 -12517247 -19719787 -31444386 -37712843 -28969706
40916 -28969706 -9628355 3113407 -941083 -11894381 -13465406 -4568630 2562328 2205702
$$ packed form
40972C5904900l619946o800270k062282J603780j279831n943029o065344k155273
40964I582705J234501K279115L014109M859651M843516j412847j1323442j3947232
40956h69924l473446Q612163N535446r869951j5576778j137268J5889775J4988427
40948A4098444J697423m142304j04834r34464r560830j0712381J651322J0994672
40940B987048L714306p993563m565250J0069089J4428245K332270q747505m727424
40932G497216N877239P488615J70994m198887j574708L74417l707279r156257
40924B771350r338973m502419k33605j213600p202540j1724599o268457Q743137
40916b8969706J9341351J2741762m054490j0953298j571025Q896776P130958l56626
$$ plain form
40908 2205702 782176 2998481 5370462 6230007 9514780 13798076 10193125 -1496594
40900 -1496594 -6667188 3965132 18575482 20448929 10993708 2840146 -2335850 -12119414
40892 -12119414 -23123567 -20873470 -2151836 17926693 25791067 23913709 20576275 16677929
40884 16677929 9322033 -453883 -10338609 -20717480 -30868122 -37023656 -38076450 -37035317
40876 -37035317 -33742542 -23705216 -8200805 2625745 2650973 -1249565 271868 5431664
40868 5431664 5412714 -2223779 -11084053 -14114310 -8764396 3297693 16632517 24255502
40860 24255502 23263749 16713575 8909202 3014914 3559423 13229599 24322656 23198594
40852 23198594 9535253 1449430 11850691 27936359 26715869 5553080 -16818611
$$ packed form
40908B205702j423526K216305K371981Q59545L284773M283296l604951j1689719
40900a496594n170594J0632320J4610350J873447r455221q153562n175996r783564
40892a2119414j1004153K250097J8721634K0078529P864374j877358l337434l898346
40884A6677929p355896r775916r884726j0378871j0150642o155534j052794J041133
40876c7035317L292775J0037326J5504411J0826550K5228l900538J521433N159796
40868E431664j8950p636493q860274l030257N349914J2062089J3334824P622985
40860B4255502r91753o550174p804373n894288N44509R670176J1093057j124062
40852B3198594j3663341q085823J0401261J6085668j220490k1162789k2371691
$$ plain form
40845 -16818611 -27351110 -31509796 -37295670 -41325845 -37757791 -30170480 -25456190 -22461151
40837 -22461151 -15465187 -5000994 3265070 8686430 16175829 25227778 25823552 10439922
40829 10439922 -13277864 -27881238 -24601690 -11909590 -3715853 -3365649 -3523104 1350516
40821 1350516 9076285 15850750 21156037 24447814 23234025 18337407 16089657 20386908
40813 20386908 25895172 24155296 14717523 6145122 6784144 17031076 29583276 35886244
40805 35886244 33985301 30134312 29757348 28507423 19022615 5773469 2379839 10826770
40797 10826770 15509547 5790236 -7046680 -7156253 1292634 2397064 -5110424 -8198510
40789 -8198510 -4460727 -6785383 -18814074 -24362741 -11697392 5522454 5244909 -12569378
$$ packed form
40845a6818611j0532499m158686n785874m030175L568054P587311M714290K995039
40837b2461151O995964J0464193Q266064N421360P489399R051949N95774j5383630
40829A0439922k3717786j4603374L279548J2692100Q193737L50204j57455M873620
40821A350516P725769O774465N305287L291777j213789m896618k247750M297251
40813B0386908N508264j739876r437773q572401O39022J0246932J2552200O302968
40805C5886244j900943l850989l76964j249925r484808j3249146l393630Q446931
40797A0826770M682777r719311j2836916j09573Q448887J104430p507488l088086
40789h198510L737783k324656j2028691n548667J2665349J7219846k77545j7814287
$$ plain form
40781 -12569378 -25665793 -17144083 6639565 25370948 24582098 6002634 -16060600
40774 -16060600 -27466970 -26299462 -22139628 -22049285 -20594059 -8053626 13830643 30728597
40766 30728597 31805196 22265165 16241323 19238517 22383075 15561949 2091194 -4923964
40758 -4923964 -3697 7307337 4968879 -7043085 -18889735 -22799882 -17469672 -4900270
40750 -4900270 9787657 17820532 14161861 5381422 3298242 10193126 16185198 11803218
40742 11803218 -2025937 -16507995 -22659291 -17383041 -6882642 -2183697 -5998497 -7710061
40734 -7710061 1457287 13415448 14155678 5491036 1828067 6979556 10180796 6164198
40726 6164198 1938743 -136548 -7656617 -19399540 -19859305 -3621471 12134591 13493547
$$ packed form
40781a2569378j3096415Q521710K3783648J8731383p88850j8579464k2063234
40774a6060600j1406370J167508M159834R0343J455226J2540433K1884269J6897954
40766C0728597J076599r540031o023842K997194L144558o821126j3470755p015158
40758d923964M920267P311034k338458j2011964j1846650l910147N330210J2569402
40750d900270J4687927Q032875l658671q780439k083180O894884N992072m381980
40742A1803218j3829155j4482058o151296N276250J0500399M698945l814800j711564
40734g710061R167348J1958161P40230q664642l662969N151489L201240m016598
40726F164198m225455k075291p520069j1742923m59765J6237834J5756062J358956
$$ plain form
40718 13493547 11793030 22199571 34840286 29225584 7637270 -9398401 -15171740
40711 -15171740 -19865025 -23689156 -13110658 11546776 28601553 24654084 12394932
40704 12394932 7990042 8052809 2476136 -4610079 -3119926 3693566 5220857 3209920
40696 3209920 8730088 20581703 22432706 5564243 -17061906 -26128165 -18379365 -6557626
40688 -6557626 -659335 2204114 7537472 10668939 2473423 -13711842 -21452735 -12740476
40680 -12740476 -1445820 -5461699 -20977891 -27413373 -16514727 -2372517 697918
40673 697918 -2931620 -342510 11049792 23100752 28270516 23828900 11051550 -2408419
40665 -2408419 -5309801 4064139 12542095 7720561 -5452893 -11777700 -5399578 6181441
$$ packed form
40718A3493547j700517J0406541J2640715n614702k1588314j7035671n773339
40711a5171740m693285l824131J0578498K4657434J7054777l947469j2259152
40704A2394932m404890O2767n576673p086215J490153O813492J527291k010937
40696C209920N520168J1851615J851003j6868463k2626149r066259P748800J1821739
40688f557626N898291K863449N333358L131467q195516j6185265p740893Q712259
40680a2740476J1294656m015879j5516192o435482J0898646J4142210L070435
40673F97918l629538K589110J1392302J2050960N169764m441616j2777350j3459969
40665b408419k901382R373940Q477956m821534j3173454o324807O378122J1581019
$$ plain form
40657 6181441 14283862 16307750 13244848 8700732 8578572 13333338 12873172 -1219913
40649 -1219913 -20371036 -27403230 -20279827 -14904759 -21309691 -29628109 -26228402 -13171970
40641 -13171970 -2631807 464575 281299 -662935 -3759724 -7062751 -4527336 6044531
40633 6044531 19602990 29289509 31652907 26949850 18445321 11474789 9466130 10354831
40625 10354831 9292430 4219304 -3503735 -11634565 -16141498 -10569883 6484314 23539751
40617 23539751 24560409 8771378 -5368257 -2458245 9225537 8443316 -10150965 -28632890
40609 -28632890 -29552922 -17129014 -8262180 -9833404 -14702646 -16751388 -18221765 -20558565
40601 -20558565 -19006599 -12404387 -9879550 -18582021 -29602953 -26780347 -8589789 8978793
$$ packed form
40657F181441Q102421K023888l062902m544116j22160M754766m60166j4093085
40649a219913j9151123p032194P123403N375068o404932q318418L399707J3056432
40641a3171970J0540163L096382j83276r44234l096789l303027K535415J0571867
40633F044531J3558459R686519K363398m703057q504529o970532k008659Q88701
40625A0354831j062401n073126p723039q130830m506933N571615J7054197J7055437
40617B3539751J020658j5789031j4139635K910012J1683782p82221j8594281j8481925
40609b8632890r20032J2423908Q866834j571224m869242k048742j470377k336800
40601b0558565J551966O602212K524837q702471j1020932K822606J8190558J7568582
$$ plain form
40593 8978793 13073228 7679159 2429914 -2827630 -13966880 -29031499 -38842022 -39630949
40585 -39630949 -36505226 -34138867 -31777967 -28894004 -28309661 -30389322 -30129297 -24138351
40577 -24138351 -15851848 -9792127 -5234168 -474170 973134 -4774240 -13360728 -16031102
40569 -16031102 -12070433 -10353465 -16704892 -25853975 -29137430 -25381882 -20218522 -18115928
40561 -18115928 -19287576 -22053969 -23956909 -21985997 -15979991 -11215944 -13258331 -19549262
40553 -19549262 -20164580 -9404641 5533183 10413548 -1305759 -21030516 -33021827
40546 -33021827 -29406761 -16522861 -6545399 -4681125 -6406818 -5852785 -2932398 -1038242
40538 -1038242 -1179929 -1153415 1427839 7696277 17314996 27249105 32688431 32004667 28701623
$$ packed form
40593H978793M094435n394069n249245n257544j1139250j5064619r810523p88927
40585c9630949L125723K366359K360900K883963N84343k079661K60025N990946
40577b4138351Q286503O059721M557959M759998J447304n747374q586488k670374
40569a6031102L960669J716968o351427r149083l283455L755548N163360K102594
40561a8115928j171648k766393j902940J970912O006006M764047k042387o290931
40553a9549262o15318J0759939J4937824M880365j1719307j9724757j1991311
40546c3021827L615066J2883900R977462J864274j725693N54033K920387J894156
40538a038242j41687K6514K581254O268438R618719R934109N439326o83764l303044
$$ plain form
40529 28701623 25121840 17044961 215231 -19055218 -26962401 -17663577 -2013 13408871
40521 13408871 18083220 15432217 5248594 -12300128 -29944399 -36403208 -27692968 -11198144
40513 -11198144 2325970 7483613 4956333 -1940727 -9062430 -12410795 -10146792 -3733218
40505 -3733218 3056472 5564451 -203068 -14510748 -31587562 -42777305 -43749261 -37797083
40497 -37797083 -31383453 -27580128 -24537763 -19221862 -11591890 -5135274 -3001627 -3394535
40489 -3394535 -599322 7495825 15052245 15550829 12310110 15638698 27888404 37761917
40481 37761917 34016211 19789428 7097813 858562 -3485017 -7953476 -7521798 -513984
40473 -513984 4787650 49550 -11122759 -16988683 -11084096 2788897 16563228 23850797
$$ packed form
40529B8701623l579783q076879j6829730j9270449p907183R298824J7661564J3410884
40521A3408871M674349k651003j0183623j7548722j7644271o458809Q710240J6494824
40513a1198144J3524114N157643k527280o897060p121703l348365K264003O413574
40505c733218O789690K507979n767519j4307680j7076814j1189743r71956N952178
40497c7797083O413630L803325L042365N315901P629972O456616K133647l92908
40489c394535K795213Q095147P556420M98584l240719L328588J2249706R873513
40481C7761917l745706j4226783j2691615o239251m343579m468459M31678P007814
40473e13984N301634m738100j1172309n865924N904587J3872993J3774331P287569
$$ plain form
40465 23850797 21677836 12206855 3188214 2101792 8528660 15110050 16262523 12978923
40457 12978923 9028537 5949330 2955615 -375521 -2208935 1211072 11536760 23363248
40449 23363248 27350232 22188128 18781198 25726689 35031495 32673064 21148270 17739413
40441 17739413 27858624 34805104 24034746 5265804 -1155952 8847702 22435900
40434 22435900 29620526 29998297 23777158 10771091 -2241093 -6618658 -5226914 -8220204
40426 -8220204 -14645641 -12459906 -74597 7484605 1177815 -7544608 -5546514 982507
40418 982507 -1334709 -8441465 -3504995 16160796 33030991 32962714 21961508 14188631
40410 14188631 13298942 12989693 9722981 6838520 7964655 12151276 15496970 14171185
$$ packed form
40465B3850797k172961r470981r018641j086422O426868O581390J152473l283600
40457A2978923l950386l079207k993715l331136j833414L420007J0325688J1826488
40449B3363248L986984n162104l406930O945491R304806k358431j1524794l408857
40441A7739413J0119211O946480j0770358j8768942o421756J0003654J3588198
40434B2435900P184626L77771o221139j3006067j3012184m377565J391744k993290
40426h220204o425437K185735J2385309P559202o306790q722423J998094O529021
40418I82507k317216p106756M936470J9665791J6870195o8277j1001206p772877
40410A4188631q89689l09249l266712k884461J126135M186621L345694j325785
$$ plain form
40402 14171185 6079156 -7306058 -20048663 -25121898 -20594384 -11867968 -6417052 -6791381
40394 -6791381 -10589781 -16491183 -25733892 -35484914 -36309338 -23008034 -5262077 1361541
40386 1361541 -4422187 -7635685 1642031 14509766 17550053 12846512 13503699 23304509
40378 23304509 31873773 29947556 19853191 8792415 6057 -5312784 -3643066 7206637
40370 7206637 22004666 30114181 24380541 7287049 -11101178 -21141618 -20819279 -15654668
40362 -15654668 -11610688 -9500628 -7302935 -5634981 -7919359 -15610385 -25430389 -31434360
40354 -31434360 -29528758 -21807853 -16907875 -22339033 -33994566 -36950295 -20889132 7076476
40346 7076476 28138623 28612595 9506626 -15943542 -30470703 -24145945 -4705263 6856596
$$ packed form
40402A4171185q092029j3385214j2742605n073235M527514Q726416N450916l74329
40394f791381l798400n901402r242709r751022q24424J3301304J7745957O623618
40386A361541n783728l213498R277716J2867735L040287m703541O57187R800810
40378B3304509Q569264j926217j0094365j1060776q786358n318841J669718J0849703
40370G206637J4798029Q109515n733640j7093492j8388227j0040440L22339N164611
40362a5654668M043980K110060K197693J667954k284378p691026r820004o003971
40354c1434360J905602P720905M899978n431158j1655533k955729J6061163K7965608
40346G076476K1062147M73972j9105969k5450168j4527161O324758J9440682J1561859
$$ plain form
40338 6856596 -1429958 -17081993 -18133995 -1534342 13373129 10177618 -6236374 -19949059
40330 -19949059 -22986304 -17900414 -8779603 1766593 9456581 9796314 3626232 -2853460
40322 -2853460 -4864576 -3893856 -4686782 -8165684 -8969779 -1688643 11094100 20271036
40314 20271036 20664399 16237566 13230705 12990484 14347057 16646800 15337375 1947788
40306 1947788 -22721048 -41205177 -36489209 -13703719 6262630 12696537 12937517 16002325
40298 16002325 21974320 28662968 35225730 36450715 26606741 12539687 9425285 18583607
40290 18583607 23183605 12475428 -3112919 -8664386 -3174227 7395925 21242637
40283 21242637 33352912 30576619 8978664 -14107716 -20462724 -14683854 -12349945 -13512409
$$ packed form
40338F856596q286554j5652035j052002J6599653J4907471l195511j6413992j3712685
40330a9949059l037245N085890R120811J0546196P689988L39733o170082o479692
40322b853460k011116R70720p92926l478902q04095P281136J2782743R176936
40314B0271036L93363m426833l006861k40221J356573K299743j309425j3389587
40306A947788k4668836j8484129M715968K2785490J9966349O433907K40980L064808
40298A6002325N971995O688648O562762J224985r843974j4067054l114402R158322
40290A8583607M599998j0708177j5588347n551467N490159J0570152J3846712
40283B1242637J2110275k776293k1597955k3086380o355008N778870K333909j162464
$$ plain form
40275 -13512409 -6398990 8254256 16444095 13063683 6663261 1543717 -7538686 -19972884
40267 -19972884 -24582669 -15629415 -1153529 9291114 14535405 15891984 12169183 5119805
40259 5119805 1022327 2913344 8050692 13957273 18925924 17273706 4819423 -10609060
40251 -10609060 -15734759 -9989921 -5245215 -6527212 -6731550 -2728624 -1301440 -4084107
40243 -4084107 -2048828 7585455 13638191 9417778 5025417 9945562 15844197 10170122
40235 10170122 -2896895 -9326390 -6063208 -1288334 1029151 3680288 6457030 5758488
40227 5758488 2620883 2084450 6424385 15676549 29910651 43218635 42457376 23104726
40219 23104726 781333 -5635428 1543811 4410371 -3437739 -10124417 -5894186 4315076
$$ packed form
40275a3512409P113419J4653246Q189839l380412o400422n119544r082403j2434198
40267a9972884m609785Q953254J4475886J0444643N244291J356579l722801p049378
40259E119805m097478J891017N137348N906581M968651j652218j2454283j5428483
40251a0609060n125699N744838M744706j281997k04338M002926J427184k782667
40243d084107K035279R634283O052736m220413m392361M920145N898635n674075
40235A0170122j3067017o429495L263182M774874K317485K651137K776742o98542
40227E758488l137605n36433M339935R252164J4234102J3307984p61259j9352650
40219B3104726k2323393o416761P179239K866560p848110o686678M230231J0209262
$$ plain form
40211 4315076 11969309 16068072 18097574 15934381 8888567 2115753 1161993 6598819
40203 6598819 15987705 25620892 29034988 20606427 3584851 -10432462 -12475018 -3645129
40195 -3645129 7671112 11688415 2794747 -13789515 -22895683 -15377414 -1801943 -483410
40187 -483410 -12740388 -21853625 -17672350 -8783149 -5802605 -5999628 -2551216 2311928
40179 2311928 3649769 4398266 8220261 8323978 -4094731 -23425259 -33607290 -28352867
40171 -28352867 -17439567 -11628438 -10009105 -5405197 3852410 11422673 9435724 -4330861
40163 -4330861 -23824404 -38758245 -42873138 -37932743 -29097048 -19563667 -12201083 -11967741
40155 -11967741 -20744507 -31824293 -36012770 -33011695 -30869023 -33784999 -36876074 -35118626
$$ packed form
40211D315076P654233M098763K029502k163193p045814o772814r53760N436826
40203F598819R388886R633187L414096q428561j7021576j4017313k042556Q829889
40195c645129J1316241M017303q893668j6584262r106168P518269J3575471J318533
40187d83410j2256978r113237M181275Q889201K980544j97023L448412M863144
40179B311928J337841P48497L821995J03717j2418709j9330528j0182031N254423
40171b8352867J0913300N811129J619333M603908R257607P570263j986949j3766585
40163d330861j9493543j4933841m114893M940395Q835695R533381P362584K33342
40155a1967741q776766j1079786m188477L001075K142672k915976l091075J757448
$$ plain form
40147 -35118626 -31293815 -30519086 -30927260 -25545015 -12519397 1286265 7800213 5705325
40139 5705325 -312331 -5551923 -8255775 -8366957 -6707042 -5455078 -6233962 -6606619 -1843640
40130 -1843640 7358175 12363432 6391736 -5338095 -11342697 -9261873 -8011691 -12321027
40122 -12321027 -13500665 -2793255 11443242 10260594 -11870615 -38696121 -51611751
40115 -51611751 -50141221 -46349835 -44066217 -34457909 -13456838 6977056 12479300 5022868
40107 5022868 -1779315 -3435899 -8733132 -21262770 -29427637 -22504826 -6911881 4121325
40099 4121325 9989746 19169198 30894729 35291754 31031852 27536080 27231674 21206524
40091 21206524 8095928 1452102 8150306 13296715 654870 -22178792 -35126831
$$ packed form
40147c5118626L824811P74729m08174N382245J3025618J3805662O513948k094888
40139E705325o017656n239592k703852j11182J659915J251964p78884l72657M762979
40130a843640R201815N005257n971696j1729831o004602K080824J250182m309336
40122a2321027j179638J0707410J4236497j182648k2131209k6825506j2915630
40115e1611751J470530L791386K283618R608308K1001071K0433894N502244p456432
40107E022868o802183j656584n297233j2529638q164867O922811J5592945J1033206
40099D121325N868421R179452J1725531M397025m259902l495772l04406o025150
40091B1206524j3110596o643826O698204N146409j2641845k2833662j2948039
$$ plain form
40084 -35126831 -35295506 -37321873 -46248585 -48373827 -32848782 -7753702 11440265 18521457
40076 18521457 15865772 6827766 -4273368 -11668290 -14005913 -15575092 -17553387 -14492317
40068 -14492317 -4157821 6143755 9145770 7289210 6195617 4641136 -713866 -5656622
40060 -5656622 -3499506 2506519 1763254 -8748678 -20987584 -28139288 -31693287 -33835510
40052 -33835510 -31111665 -20785596 -8224366 -2635601 -7552767 -17914015 -24016720 -17850366
40044 -17850366 -521916 15157808 15776752 3916537 -3261293 3740208 14123631 13691013
40036 13691013 5915345 4294478 9436266 9179074 546411 -4978458 -1898565 -480927
40028 -480927 -8009757 -14276068 -7295601 7557566 17265162 20925110 25003552 26366655
$$ packed form
40084c5126831j68675k026367q926712k125242J5525045K5095080J9193967P081192
40076A8521457k655685r038006j1101134p394922k337623j569179j978295L061070
40068a4492317J0334496J0301576L002015j856560j093593j554481n355002m942756
40060e656622K157116O006025p43265j0511932j2238906p151704l553999k142223
40052c3835510K723845J0326069J2561230N588765m917166j0361248o102705O166354
40044a7850366J7328450J5679724O18944j1860215p177830P001501J0383423m32618
40036A3691013p775668j620867N141788k57192q632663n524869L079893J417638
40028d80927p528830o266311O980467J4853167R707596L659948M078442J363103
$$ plain form
40020 26366655 17865413 7092508 10032372 24803041 30411897 16688420 -1211012
40013 -1211012 -5249005 3604564 14205226 21345520 22409619 11382543 -10224618 -26559257
40005 -26559257 -25499322 -15821726 -13191577 -16946771 -15817150 -10143585 -11027883 -20157334
39997 -20157334 -27391486 -28252478 -28182152 -28560848 -24065795 -16446679 -15608962 -22344475 -24051197
39988 -24051197 -13727236 -659387 4480929 3456953 1972010 -1506284 -9522090 -17486212
39980 -17486212 -20891499 -22875944 -25956282 -24120031 -13044464 -1379668 -593274 -7809414
39972 -7809414 -9607410 -520357 12303634 21790187 28659106 35311848 39537624 37112918
39964 37112918 27246851 14592194 7196726 10123145 18890492 22725697 16908783 7364814
$$ packed form
40020B6366655q501242j0772905K939864J4770669N608856j3723477j7899432
40013a211012m037993Q853569J0600662P140294J064099j1027076k1607161j6334639
40005b6559257J059935R677596K630149l755194J129621N673565q84298r129451
39997b0157334p234152q60992P0326l78696M495053P619116Q37717o735513j706722
39988b4051197J0323961J3067849N140316j023976j484943l478294q015806p964122
39980a7486212l405287j984445l080338J836251J1075567J1664796P86394p216140
39972g809414j797996R087053J2823991R486553O868919O652742M225776k424706
39964C7112918r866067j2654657p395468K926419Q767347L835205n816914r543969
$$ plain form
39956 7364814 500446 -4262893 -6830962 -193012 18437285 36514694 38126769 24363729
$$ packed form
39956G364814o864368m763339k568069O637950J8630297J8077409J612075j3763040
$$ [...]
##END NTUPLES=NMR SPECTRUM
##END=
